lucene-dev mailing list archives

Site index · List index
Message view « Date » · « Thread »
Top « Date » · « Thread »
From Apache Jenkins Server <jenk...@builds.apache.org>
Subject [JENKINS] Lucene-Solr-NightlyTests-7.x - Build # 215 - Still unstable
Date Mon, 07 May 2018 14:31:34 GMT
Build: https://builds.apache.org/job/Lucene-Solr-NightlyTests-7.x/215/

1 tests failed.
FAILED:  org.apache.solr.cloud.autoscaling.SearchRateTriggerTest.testTrigger

Error Message:
expected:<1> but was:<2>

Stack Trace:
java.lang.AssertionError: expected:<1> but was:<2>
	at __randomizedtesting.SeedInfo.seed([2BF31B11BE1CE9D:61740733822EBDB0]:0)
	at org.junit.Assert.fail(Assert.java:93)
	at org.junit.Assert.failNotEquals(Assert.java:647)
	at org.junit.Assert.assertEquals(Assert.java:128)
	at org.junit.Assert.assertEquals(Assert.java:472)
	at org.junit.Assert.assertEquals(Assert.java:456)
	at org.apache.solr.cloud.autoscaling.SearchRateTriggerTest.testTrigger(SearchRateTriggerTest.java:133)
	at sun.reflect.NativeMethodAccessorImpl.invoke0(Native Method)
	at sun.reflect.NativeMethodAccessorImpl.invoke(NativeMethodAccessorImpl.java:62)
	at sun.reflect.DelegatingMethodAccessorImpl.invoke(DelegatingMethodAccessorImpl.java:43)
	at java.lang.reflect.Method.invoke(Method.java:498)
	at com.carrotsearch.randomizedtesting.RandomizedRunner.invoke(RandomizedRunner.java:1737)
	at com.carrotsearch.randomizedtesting.RandomizedRunner$8.evaluate(RandomizedRunner.java:934)
	at com.carrotsearch.randomizedtesting.RandomizedRunner$9.evaluate(RandomizedRunner.java:970)
	at com.carrotsearch.randomizedtesting.RandomizedRunner$10.evaluate(RandomizedRunner.java:984)
	at com.carrotsearch.randomizedtesting.rules.SystemPropertiesRestoreRule$1.evaluate(SystemPropertiesRestoreRule.java:57)
	at org.apache.lucene.util.TestRuleSetupTeardownChained$1.evaluate(TestRuleSetupTeardownChained.java:49)
	at org.apache.lucene.util.AbstractBeforeAfterRule$1.evaluate(AbstractBeforeAfterRule.java:45)
	at org.apache.lucene.util.TestRuleThreadAndTestName$1.evaluate(TestRuleThreadAndTestName.java:48)
	at org.apache.lucene.util.TestRuleIgnoreAfterMaxFailures$1.evaluate(TestRuleIgnoreAfterMaxFailures.java:64)
	at org.apache.lucene.util.TestRuleMarkFailure$1.evaluate(TestRuleMarkFailure.java:47)
	at com.carrotsearch.randomizedtesting.rules.StatementAdapter.evaluate(StatementAdapter.java:36)
	at com.carrotsearch.randomizedtesting.ThreadLeakControl$StatementRunner.run(ThreadLeakControl.java:368)
	at com.carrotsearch.randomizedtesting.ThreadLeakControl.forkTimeoutingTask(ThreadLeakControl.java:817)
	at com.carrotsearch.randomizedtesting.ThreadLeakControl$3.evaluate(ThreadLeakControl.java:468)
	at com.carrotsearch.randomizedtesting.RandomizedRunner.runSingleTest(RandomizedRunner.java:943)
	at com.carrotsearch.randomizedtesting.RandomizedRunner$5.evaluate(RandomizedRunner.java:829)
	at com.carrotsearch.randomizedtesting.RandomizedRunner$6.evaluate(RandomizedRunner.java:879)
	at com.carrotsearch.randomizedtesting.RandomizedRunner$7.evaluate(RandomizedRunner.java:890)
	at com.carrotsearch.randomizedtesting.rules.StatementAdapter.evaluate(StatementAdapter.java:36)
	at com.carrotsearch.randomizedtesting.rules.SystemPropertiesRestoreRule$1.evaluate(SystemPropertiesRestoreRule.java:57)
	at org.apache.lucene.util.AbstractBeforeAfterRule$1.evaluate(AbstractBeforeAfterRule.java:45)
	at com.carrotsearch.randomizedtesting.rules.StatementAdapter.evaluate(StatementAdapter.java:36)
	at org.apache.lucene.util.TestRuleStoreClassName$1.evaluate(TestRuleStoreClassName.java:41)
	at com.carrotsearch.randomizedtesting.rules.NoShadowingOrOverridesOnMethodsRule$1.evaluate(NoShadowingOrOverridesOnMethodsRule.java:40)
	at com.carrotsearch.randomizedtesting.rules.NoShadowingOrOverridesOnMethodsRule$1.evaluate(NoShadowingOrOverridesOnMethodsRule.java:40)
	at com.carrotsearch.randomizedtesting.rules.StatementAdapter.evaluate(StatementAdapter.java:36)
	at com.carrotsearch.randomizedtesting.rules.StatementAdapter.evaluate(StatementAdapter.java:36)
	at com.carrotsearch.randomizedtesting.rules.StatementAdapter.evaluate(StatementAdapter.java:36)
	at org.apache.lucene.util.TestRuleAssertionsRequired$1.evaluate(TestRuleAssertionsRequired.java:53)
	at org.apache.lucene.util.TestRuleMarkFailure$1.evaluate(TestRuleMarkFailure.java:47)
	at org.apache.lucene.util.TestRuleIgnoreAfterMaxFailures$1.evaluate(TestRuleIgnoreAfterMaxFailures.java:64)
	at org.apache.lucene.util.TestRuleIgnoreTestSuites$1.evaluate(TestRuleIgnoreTestSuites.java:54)
	at com.carrotsearch.randomizedtesting.rules.StatementAdapter.evaluate(StatementAdapter.java:36)
	at com.carrotsearch.randomizedtesting.ThreadLeakControl$StatementRunner.run(ThreadLeakControl.java:368)
	at java.lang.Thread.run(Thread.java:748)




Build Log:
[...truncated 15457 lines...]
   [junit4] Suite: org.apache.solr.cloud.autoscaling.SearchRateTriggerTest
   [junit4]   2> 8438141 INFO  (SUITE-SearchRateTriggerTest-seed#[2BF31B11BE1CE9D]-worker) [    ] o.a.s.SolrTestCaseJ4 SecureRandom sanity checks: test.solr.allowed.securerandom=null & java.security.egd=file:/dev/./urandom
   [junit4]   2> Creating dataDir: /home/jenkins/jenkins-slave/workspace/Lucene-Solr-NightlyTests-7.x/checkout/solr/build/solr-core/test/J0/temp/solr.cloud.autoscaling.SearchRateTriggerTest_2BF31B11BE1CE9D-001/init-core-data-001
   [junit4]   2> 8438141 INFO  (SUITE-SearchRateTriggerTest-seed#[2BF31B11BE1CE9D]-worker) [    ] o.a.s.SolrTestCaseJ4 Using PointFields (NUMERIC_POINTS_SYSPROP=true) w/NUMERIC_DOCVALUES_SYSPROP=false
   [junit4]   2> 8438143 INFO  (SUITE-SearchRateTriggerTest-seed#[2BF31B11BE1CE9D]-worker) [    ] o.a.s.SolrTestCaseJ4 Randomized ssl (false) and clientAuth (false) via: @org.apache.solr.util.RandomizeSSL(reason=, ssl=NaN, value=NaN, clientAuth=NaN)
   [junit4]   2> 8438143 INFO  (SUITE-SearchRateTriggerTest-seed#[2BF31B11BE1CE9D]-worker) [    ] o.a.s.c.MiniSolrCloudCluster Starting cluster of 4 servers in /home/jenkins/jenkins-slave/workspace/Lucene-Solr-NightlyTests-7.x/checkout/solr/build/solr-core/test/J0/temp/solr.cloud.autoscaling.SearchRateTriggerTest_2BF31B11BE1CE9D-001/tempDir-001
   [junit4]   2> 8438143 INFO  (SUITE-SearchRateTriggerTest-seed#[2BF31B11BE1CE9D]-worker) [    ] o.a.s.c.ZkTestServer STARTING ZK TEST SERVER
   [junit4]   2> 8438164 INFO  (Thread-12052) [    ] o.a.s.c.ZkTestServer client port:0.0.0.0/0.0.0.0:0
   [junit4]   2> 8438164 INFO  (Thread-12052) [    ] o.a.s.c.ZkTestServer Starting server
   [junit4]   2> 8438167 ERROR (Thread-12052) [    ] o.a.z.s.ZooKeeperServer ZKShutdownHandler is not registered, so ZooKeeper server won't take any action on ERROR or SHUTDOWN server state changes
   [junit4]   2> 8438257 INFO  (SUITE-SearchRateTriggerTest-seed#[2BF31B11BE1CE9D]-worker) [    ] o.a.s.c.ZkTestServer start zk server on port:33006
   [junit4]   2> 8438322 INFO  (zkConnectionManagerCallback-7228-thread-1) [    ] o.a.s.c.c.ConnectionManager zkClient has connected
   [junit4]   2> 8438325 INFO  (jetty-launcher-7225-thread-1) [    ] o.e.j.s.Server jetty-9.4.8.v20171121, build timestamp: 2017-11-21T16:27:37-05:00, git hash: 82b8fb23f757335bb3329d540ce37a2a2615f0a8
   [junit4]   2> 8438326 INFO  (jetty-launcher-7225-thread-2) [    ] o.e.j.s.Server jetty-9.4.8.v20171121, build timestamp: 2017-11-21T16:27:37-05:00, git hash: 82b8fb23f757335bb3329d540ce37a2a2615f0a8
   [junit4]   2> 8438339 INFO  (jetty-launcher-7225-thread-3) [    ] o.e.j.s.Server jetty-9.4.8.v20171121, build timestamp: 2017-11-21T16:27:37-05:00, git hash: 82b8fb23f757335bb3329d540ce37a2a2615f0a8
   [junit4]   2> 8438347 INFO  (jetty-launcher-7225-thread-4) [    ] o.e.j.s.Server jetty-9.4.8.v20171121, build timestamp: 2017-11-21T16:27:37-05:00, git hash: 82b8fb23f757335bb3329d540ce37a2a2615f0a8
   [junit4]   2> 8438379 INFO  (jetty-launcher-7225-thread-1) [    ] o.e.j.s.session DefaultSessionIdManager workerName=node0
   [junit4]   2> 8438379 INFO  (jetty-launcher-7225-thread-1) [    ] o.e.j.s.session No SessionScavenger set, using defaults
   [junit4]   2> 8438379 INFO  (jetty-launcher-7225-thread-1) [    ] o.e.j.s.session Scavenging every 600000ms
   [junit4]   2> 8438379 INFO  (jetty-launcher-7225-thread-1) [    ] o.e.j.s.h.ContextHandler Started o.e.j.s.ServletContextHandler@57729c01{/solr,null,AVAILABLE}
   [junit4]   2> 8438380 INFO  (jetty-launcher-7225-thread-1) [    ] o.e.j.s.AbstractConnector Started ServerConnector@2c6cf94a{HTTP/1.1,[http/1.1]}{127.0.0.1:43108}
   [junit4]   2> 8438380 INFO  (jetty-launcher-7225-thread-1) [    ] o.e.j.s.Server Started @8438586ms
   [junit4]   2> 8438380 INFO  (jetty-launcher-7225-thread-1) [    ] o.a.s.c.s.e.JettySolrRunner Jetty properties: {hostContext=/solr, hostPort=43108}
   [junit4]   2> 8438380 ERROR (jetty-launcher-7225-thread-1) [    ] o.a.s.u.StartupLoggingUtils Missing Java Option solr.log.dir. Logging may be missing or incomplete.
   [junit4]   2> 8438380 INFO  (jetty-launcher-7225-thread-1) [    ] o.a.s.s.SolrDispatchFilter Using logger factory org.apache.logging.slf4j.Log4jLoggerFactory
   [junit4]   2> 8438380 INFO  (jetty-launcher-7225-thread-1) [    ] o.a.s.s.SolrDispatchFilter  ___      _       Welcome to Apache Solr™ version 7.4.0
   [junit4]   2> 8438380 INFO  (jetty-launcher-7225-thread-1) [    ] o.a.s.s.SolrDispatchFilter / __| ___| |_ _   Starting in cloud mode on port null
   [junit4]   2> 8438380 INFO  (jetty-launcher-7225-thread-1) [    ] o.a.s.s.SolrDispatchFilter \__ \/ _ \ | '_|  Install dir: null
   [junit4]   2> 8438380 INFO  (jetty-launcher-7225-thread-1) [    ] o.a.s.s.SolrDispatchFilter |___/\___/_|_|    Start time: 2018-05-07T12:59:16.712Z
   [junit4]   2> 8438381 INFO  (jetty-launcher-7225-thread-3) [    ] o.e.j.s.session DefaultSessionIdManager workerName=node0
   [junit4]   2> 8438381 INFO  (jetty-launcher-7225-thread-3) [    ] o.e.j.s.session No SessionScavenger set, using defaults
   [junit4]   2> 8438381 INFO  (jetty-launcher-7225-thread-3) [    ] o.e.j.s.session Scavenging every 600000ms
   [junit4]   2> 8438382 INFO  (jetty-launcher-7225-thread-3) [    ] o.e.j.s.h.ContextHandler Started o.e.j.s.ServletContextHandler@adfc4bc{/solr,null,AVAILABLE}
   [junit4]   2> 8438382 INFO  (jetty-launcher-7225-thread-3) [    ] o.e.j.s.AbstractConnector Started ServerConnector@7c88716d{HTTP/1.1,[http/1.1]}{127.0.0.1:43164}
   [junit4]   2> 8438382 INFO  (jetty-launcher-7225-thread-3) [    ] o.e.j.s.Server Started @8438588ms
   [junit4]   2> 8438382 INFO  (jetty-launcher-7225-thread-3) [    ] o.a.s.c.s.e.JettySolrRunner Jetty properties: {hostContext=/solr, hostPort=43164}
   [junit4]   2> 8438382 ERROR (jetty-launcher-7225-thread-3) [    ] o.a.s.u.StartupLoggingUtils Missing Java Option solr.log.dir. Logging may be missing or incomplete.
   [junit4]   2> 8438382 INFO  (jetty-launcher-7225-thread-3) [    ] o.a.s.s.SolrDispatchFilter Using logger factory org.apache.logging.slf4j.Log4jLoggerFactory
   [junit4]   2> 8438382 INFO  (jetty-launcher-7225-thread-3) [    ] o.a.s.s.SolrDispatchFilter  ___      _       Welcome to Apache Solr™ version 7.4.0
   [junit4]   2> 8438382 INFO  (jetty-launcher-7225-thread-3) [    ] o.a.s.s.SolrDispatchFilter / __| ___| |_ _   Starting in cloud mode on port null
   [junit4]   2> 8438382 INFO  (jetty-launcher-7225-thread-3) [    ] o.a.s.s.SolrDispatchFilter \__ \/ _ \ | '_|  Install dir: null
   [junit4]   2> 8438382 INFO  (jetty-launcher-7225-thread-3) [    ] o.a.s.s.SolrDispatchFilter |___/\___/_|_|    Start time: 2018-05-07T12:59:16.714Z
   [junit4]   2> 8438465 INFO  (jetty-launcher-7225-thread-2) [    ] o.e.j.s.session DefaultSessionIdManager workerName=node0
   [junit4]   2> 8438465 INFO  (jetty-launcher-7225-thread-2) [    ] o.e.j.s.session No SessionScavenger set, using defaults
   [junit4]   2> 8438465 INFO  (jetty-launcher-7225-thread-2) [    ] o.e.j.s.session Scavenging every 600000ms
   [junit4]   2> 8438465 INFO  (jetty-launcher-7225-thread-2) [    ] o.e.j.s.h.ContextHandler Started o.e.j.s.ServletContextHandler@36d89cfb{/solr,null,AVAILABLE}
   [junit4]   2> 8438465 INFO  (jetty-launcher-7225-thread-2) [    ] o.e.j.s.AbstractConnector Started ServerConnector@713d0884{HTTP/1.1,[http/1.1]}{127.0.0.1:42924}
   [junit4]   2> 8438465 INFO  (jetty-launcher-7225-thread-2) [    ] o.e.j.s.Server Started @8438671ms
   [junit4]   2> 8438465 INFO  (jetty-launcher-7225-thread-2) [    ] o.a.s.c.s.e.JettySolrRunner Jetty properties: {hostContext=/solr, hostPort=42924}
   [junit4]   2> 8438466 ERROR (jetty-launcher-7225-thread-2) [    ] o.a.s.u.StartupLoggingUtils Missing Java Option solr.log.dir. Logging may be missing or incomplete.
   [junit4]   2> 8438466 INFO  (jetty-launcher-7225-thread-2) [    ] o.a.s.s.SolrDispatchFilter Using logger factory org.apache.logging.slf4j.Log4jLoggerFactory
   [junit4]   2> 8438466 INFO  (jetty-launcher-7225-thread-2) [    ] o.a.s.s.SolrDispatchFilter  ___      _       Welcome to Apache Solr™ version 7.4.0
   [junit4]   2> 8438466 INFO  (jetty-launcher-7225-thread-2) [    ] o.a.s.s.SolrDispatchFilter / __| ___| |_ _   Starting in cloud mode on port null
   [junit4]   2> 8438466 INFO  (jetty-launcher-7225-thread-2) [    ] o.a.s.s.SolrDispatchFilter \__ \/ _ \ | '_|  Install dir: null
   [junit4]   2> 8438466 INFO  (jetty-launcher-7225-thread-2) [    ] o.a.s.s.SolrDispatchFilter |___/\___/_|_|    Start time: 2018-05-07T12:59:16.798Z
   [junit4]   2> 8438485 INFO  (zkConnectionManagerCallback-7234-thread-1) [    ] o.a.s.c.c.ConnectionManager zkClient has connected
   [junit4]   2> 8438485 INFO  (jetty-launcher-7225-thread-2) [    ] o.a.s.s.SolrDispatchFilter solr.xml found in ZooKeeper. Loading...
   [junit4]   2> 8438525 INFO  (jetty-launcher-7225-thread-4) [    ] o.e.j.s.session DefaultSessionIdManager workerName=node0
   [junit4]   2> 8438525 INFO  (jetty-launcher-7225-thread-4) [    ] o.e.j.s.session No SessionScavenger set, using defaults
   [junit4]   2> 8438525 INFO  (jetty-launcher-7225-thread-4) [    ] o.e.j.s.session Scavenging every 600000ms
   [junit4]   2> 8438538 INFO  (jetty-launcher-7225-thread-4) [    ] o.e.j.s.h.ContextHandler Started o.e.j.s.ServletContextHandler@597b179{/solr,null,AVAILABLE}
   [junit4]   2> 8438538 INFO  (jetty-launcher-7225-thread-4) [    ] o.e.j.s.AbstractConnector Started ServerConnector@60bcc603{HTTP/1.1,[http/1.1]}{127.0.0.1:45424}
   [junit4]   2> 8438538 INFO  (jetty-launcher-7225-thread-4) [    ] o.e.j.s.Server Started @8438744ms
   [junit4]   2> 8438538 INFO  (jetty-launcher-7225-thread-4) [    ] o.a.s.c.s.e.JettySolrRunner Jetty properties: {hostContext=/solr, hostPort=45424}
   [junit4]   2> 8438538 ERROR (jetty-launcher-7225-thread-4) [    ] o.a.s.u.StartupLoggingUtils Missing Java Option solr.log.dir. Logging may be missing or incomplete.
   [junit4]   2> 8438538 INFO  (jetty-launcher-7225-thread-4) [    ] o.a.s.s.SolrDispatchFilter Using logger factory org.apache.logging.slf4j.Log4jLoggerFactory
   [junit4]   2> 8438538 INFO  (jetty-launcher-7225-thread-4) [    ] o.a.s.s.SolrDispatchFilter  ___      _       Welcome to Apache Solr™ version 7.4.0
   [junit4]   2> 8438538 INFO  (jetty-launcher-7225-thread-4) [    ] o.a.s.s.SolrDispatchFilter / __| ___| |_ _   Starting in cloud mode on port null
   [junit4]   2> 8438538 INFO  (jetty-launcher-7225-thread-4) [    ] o.a.s.s.SolrDispatchFilter \__ \/ _ \ | '_|  Install dir: null
   [junit4]   2> 8438538 INFO  (jetty-launcher-7225-thread-4) [    ] o.a.s.s.SolrDispatchFilter |___/\___/_|_|    Start time: 2018-05-07T12:59:16.870Z
   [junit4]   2> 8438583 INFO  (zkConnectionManagerCallback-7232-thread-1) [    ] o.a.s.c.c.ConnectionManager zkClient has connected
   [junit4]   2> 8438583 INFO  (zkConnectionManagerCallback-7230-thread-1) [    ] o.a.s.c.c.ConnectionManager zkClient has connected
   [junit4]   2> 8438587 INFO  (jetty-launcher-7225-thread-1) [    ] o.a.s.s.SolrDispatchFilter solr.xml found in ZooKeeper. Loading...
   [junit4]   2> 8438587 INFO  (jetty-launcher-7225-thread-3) [    ] o.a.s.s.SolrDispatchFilter solr.xml found in ZooKeeper. Loading...
   [junit4]   2> 8438632 INFO  (jetty-launcher-7225-thread-1) [    ] o.a.s.c.ZkContainer Zookeeper client=127.0.0.1:33006/solr
   [junit4]   2> 8438633 INFO  (zkConnectionManagerCallback-7240-thread-1) [    ] o.a.s.c.c.ConnectionManager zkClient has connected
   [junit4]   2> 8438659 INFO  (zkConnectionManagerCallback-7236-thread-1) [    ] o.a.s.c.c.ConnectionManager zkClient has connected
   [junit4]   2> 8438663 INFO  (zkConnectionManagerCallback-7242-thread-1) [    ] o.a.s.c.c.ConnectionManager zkClient has connected
   [junit4]   2> 8438693 INFO  (jetty-launcher-7225-thread-4) [    ] o.a.s.s.SolrDispatchFilter solr.xml found in ZooKeeper. Loading...
   [junit4]   2> 8438747 INFO  (jetty-launcher-7225-thread-3) [    ] o.a.s.c.ZkContainer Zookeeper client=127.0.0.1:33006/solr
   [junit4]   2> 8438835 INFO  (jetty-launcher-7225-thread-2) [    ] o.a.s.c.ZkContainer Zookeeper client=127.0.0.1:33006/solr
   [junit4]   2> 8438863 INFO  (zkConnectionManagerCallback-7248-thread-1) [    ] o.a.s.c.c.ConnectionManager zkClient has connected
   [junit4]   2> 8438891 WARN  (NIOServerCxn.Factory:0.0.0.0/0.0.0.0:0) [    ] o.a.z.s.NIOServerCnxn Unable to read additional data from client sessionid 0x101def1d2fa0007, likely client has closed socket
   [junit4]   2> 8438958 INFO  (jetty-launcher-7225-thread-4) [    ] o.a.s.c.ZkContainer Zookeeper client=127.0.0.1:33006/solr
   [junit4]   2> 8438959 INFO  (zkConnectionManagerCallback-7252-thread-1) [    ] o.a.s.c.c.ConnectionManager zkClient has connected
   [junit4]   2> 8439017 INFO  (zkConnectionManagerCallback-7258-thread-1) [    ] o.a.s.c.c.ConnectionManager zkClient has connected
   [junit4]   2> 8439018 INFO  (zkConnectionManagerCallback-7256-thread-1) [    ] o.a.s.c.c.ConnectionManager zkClient has connected
   [junit4]   2> 8439098 INFO  (jetty-launcher-7225-thread-1) [n:127.0.0.1:43108_solr    ] o.a.s.c.Overseer Overseer (id=null) closing
   [junit4]   2> 8439107 INFO  (zkConnectionManagerCallback-7260-thread-1) [    ] o.a.s.c.c.ConnectionManager zkClient has connected
   [junit4]   2> 8439139 INFO  (jetty-launcher-7225-thread-1) [n:127.0.0.1:43108_solr    ] o.a.s.c.OverseerElectionContext I am going to be the leader 127.0.0.1:43108_solr
   [junit4]   2> 8439143 INFO  (zkConnectionManagerCallback-7262-thread-1) [    ] o.a.s.c.c.ConnectionManager zkClient has connected
   [junit4]   2> 8439228 INFO  (jetty-launcher-7225-thread-1) [n:127.0.0.1:43108_solr    ] o.a.s.c.Overseer Overseer (id=72584199222722566-127.0.0.1:43108_solr-n_0000000000) starting
   [junit4]   2> 8439231 INFO  (jetty-launcher-7225-thread-3) [n:127.0.0.1:43164_solr    ] o.a.s.c.Overseer Overseer (id=null) closing
   [junit4]   2> 8439249 INFO  (jetty-launcher-7225-thread-3) [n:127.0.0.1:43164_solr    ] o.a.s.c.ZkController Register node as live in ZooKeeper:/live_nodes/127.0.0.1:43164_solr
   [junit4]   2> 8439394 INFO  (zkCallback-7257-thread-1) [    ] o.a.s.c.c.ZkStateReader Updated live nodes from ZooKeeper... (0) -> (1)
   [junit4]   2> 8439406 INFO  (zkCallback-7241-thread-1) [    ] o.a.s.c.c.ZkStateReader Updated live nodes from ZooKeeper... (0) -> (1)
   [junit4]   2> 8439812 INFO  (jetty-launcher-7225-thread-4) [n:127.0.0.1:45424_solr    ] o.a.s.c.c.ZkStateReader Updated live nodes from ZooKeeper... (0) -> (1)
   [junit4]   2> 8439812 INFO  (jetty-launcher-7225-thread-2) [n:127.0.0.1:42924_solr    ] o.a.s.c.c.ZkStateReader Updated live nodes from ZooKeeper... (0) -> (1)
   [junit4]   2> 8439812 INFO  (zkConnectionManagerCallback-7273-thread-1) [    ] o.a.s.c.c.ConnectionManager zkClient has connected
   [junit4]   2> 8439826 INFO  (jetty-launcher-7225-thread-1) [n:127.0.0.1:43108_solr    ] o.a.s.c.c.ZkStateReader Updated live nodes from ZooKeeper... (0) -> (1)
   [junit4]   2> 8439827 INFO  (jetty-launcher-7225-thread-1) [n:127.0.0.1:43108_solr    ] o.a.s.c.s.i.ZkClientClusterStateProvider Cluster at 127.0.0.1:33006/solr ready
   [junit4]   2> 8439827 INFO  (jetty-launcher-7225-thread-4) [n:127.0.0.1:45424_solr    ] o.a.s.c.Overseer Overseer (id=null) closing
   [junit4]   2> 8439828 INFO  (jetty-launcher-7225-thread-2) [n:127.0.0.1:42924_solr    ] o.a.s.c.Overseer Overseer (id=null) closing
   [junit4]   2> 8439841 INFO  (jetty-launcher-7225-thread-4) [n:127.0.0.1:45424_solr    ] o.a.s.c.TransientSolrCoreCacheDefault Allocating transient cache for 2147483647 transient cores
   [junit4]   2> 8439841 INFO  (jetty-launcher-7225-thread-4) [n:127.0.0.1:45424_solr    ] o.a.s.c.ZkController Register node as live in ZooKeeper:/live_nodes/127.0.0.1:45424_solr
   [junit4]   2> 8439895 INFO  (zkCallback-7241-thread-1) [    ] o.a.s.c.c.ZkStateReader Updated live nodes from ZooKeeper... (1) -> (2)
   [junit4]   2> 8439914 INFO  (zkCallback-7261-thread-1) [    ] o.a.s.c.c.ZkStateReader Updated live nodes from ZooKeeper... (1) -> (2)
   [junit4]   2> 8439914 INFO  (zkCallback-7257-thread-1) [    ] o.a.s.c.c.ZkStateReader Updated live nodes from ZooKeeper... (1) -> (2)
   [junit4]   2> 8439915 INFO  (jetty-launcher-7225-thread-1) [n:127.0.0.1:43108_solr    ] o.a.s.c.TransientSolrCoreCacheDefault Allocating transient cache for 2147483647 transient cores
   [junit4]   2> 8439915 INFO  (jetty-launcher-7225-thread-1) [n:127.0.0.1:43108_solr    ] o.a.s.c.ZkController Register node as live in ZooKeeper:/live_nodes/127.0.0.1:43108_solr
   [junit4]   2> 8439916 INFO  (jetty-launcher-7225-thread-2) [n:127.0.0.1:42924_solr    ] o.a.s.c.TransientSolrCoreCacheDefault Allocating transient cache for 2147483647 transient cores
   [junit4]   2> 8439916 INFO  (jetty-launcher-7225-thread-2) [n:127.0.0.1:42924_solr    ] o.a.s.c.ZkController Register node as live in ZooKeeper:/live_nodes/127.0.0.1:42924_solr
   [junit4]   2> 8439916 INFO  (zkCallback-7261-thread-1) [    ] o.a.s.c.c.ZkStateReader Updated live nodes from ZooKeeper... (2) -> (3)
   [junit4]   2> 8439916 INFO  (zkCallback-7257-thread-1) [    ] o.a.s.c.c.ZkStateReader Updated live nodes from ZooKeeper... (2) -> (3)
   [junit4]   2> 8439929 INFO  (zkCallback-7259-thread-1) [    ] o.a.s.c.c.ZkStateReader Updated live nodes from ZooKeeper... (1) -> (2)
   [junit4]   2> 8439938 INFO  (zkCallback-7241-thread-1) [    ] o.a.s.c.c.ZkStateReader Updated live nodes from ZooKeeper... (2) -> (3)
   [junit4]   2> 8440093 INFO  (zkCallback-7259-thread-2) [    ] o.a.s.c.c.ZkStateReader Updated live nodes from ZooKeeper... (2) -> (4)
   [junit4]   2> 8440166 INFO  (zkCallback-7261-thread-1) [    ] o.a.s.c.c.ZkStateReader Updated live nodes from ZooKeeper... (3) -> (4)
   [junit4]   2> 8440186 INFO  (zkCallback-7257-thread-1) [    ] o.a.s.c.c.ZkStateReader Updated live nodes from ZooKeeper... (3) -> (4)
   [junit4]   2> 8440202 INFO  (zkCallback-7272-thread-1) [    ] o.a.s.c.c.ZkStateReader Updated live nodes from ZooKeeper... (1) -> (2)
   [junit4]   2> 8440222 INFO  (zkCallback-7272-thread-2) [    ] o.a.s.c.c.ZkStateReader Updated live nodes from ZooKeeper... (2) -> (4)
   [junit4]   2> 8440254 INFO  (OverseerStateUpdate-72584199222722566-127.0.0.1:43108_solr-n_0000000000) [    ] o.a.s.c.c.ZkStateReader Updated live nodes from ZooKeeper... (3) -> (4)
   [junit4]   2> 8440340 INFO  (jetty-launcher-7225-thread-3) [n:127.0.0.1:43164_solr    ] o.a.s.m.r.SolrJmxReporter JMX monitoring for 'solr_43164.solr.node' (registry 'solr.node') enabled at server: com.sun.jmx.mbeanserver.JmxMBeanServer@2d509795
   [junit4]   2> 8440435 INFO  (jetty-launcher-7225-thread-3) [n:127.0.0.1:43164_solr    ] o.a.s.m.r.SolrJmxReporter JMX monitoring for 'solr_43164.solr.jvm' (registry 'solr.jvm') enabled at server: com.sun.jmx.mbeanserver.JmxMBeanServer@2d509795
   [junit4]   2> 8440436 INFO  (jetty-launcher-7225-thread-3) [n:127.0.0.1:43164_solr    ] o.a.s.m.r.SolrJmxReporter JMX monitoring for 'solr_43164.solr.jetty' (registry 'solr.jetty') enabled at server: com.sun.jmx.mbeanserver.JmxMBeanServer@2d509795
   [junit4]   2> 8440437 INFO  (jetty-launcher-7225-thread-3) [n:127.0.0.1:43164_solr    ] o.a.s.c.CorePropertiesLocator Found 0 core definitions underneath /home/jenkins/jenkins-slave/workspace/Lucene-Solr-NightlyTests-7.x/checkout/solr/build/solr-core/test/J0/temp/solr.cloud.autoscaling.SearchRateTriggerTest_2BF31B11BE1CE9D-001/tempDir-001/node3/.
   [junit4]   2> 8440616 INFO  (zkConnectionManagerCallback-7278-thread-1) [    ] o.a.s.c.c.ConnectionManager zkClient has connected
   [junit4]   2> 8440617 INFO  (jetty-launcher-7225-thread-3) [n:127.0.0.1:43164_solr    ] o.a.s.c.c.ZkStateReader Updated live nodes from ZooKeeper... (0) -> (4)
   [junit4]   2> 8440617 INFO  (jetty-launcher-7225-thread-3) [n:127.0.0.1:43164_solr    ] o.a.s.c.s.i.ZkClientClusterStateProvider Cluster at 127.0.0.1:33006/solr ready
   [junit4]   2> 8440816 INFO  (jetty-launcher-7225-thread-1) [n:127.0.0.1:43108_solr    ] o.a.s.m.r.SolrJmxReporter JMX monitoring for 'solr_43108.solr.node' (registry 'solr.node') enabled at server: com.sun.jmx.mbeanserver.JmxMBeanServer@2d509795
   [junit4]   2> 8440852 INFO  (jetty-launcher-7225-thread-4) [n:127.0.0.1:45424_solr    ] o.a.s.m.r.SolrJmxReporter JMX monitoring for 'solr_45424.solr.node' (registry 'solr.node') enabled at server: com.sun.jmx.mbeanserver.JmxMBeanServer@2d509795
   [junit4]   2> 8440855 INFO  (jetty-launcher-7225-thread-1) [n:127.0.0.1:43108_solr    ] o.a.s.m.r.SolrJmxReporter JMX monitoring for 'solr_43108.solr.jvm' (registry 'solr.jvm') enabled at server: com.sun.jmx.mbeanserver.JmxMBeanServer@2d509795
   [junit4]   2> 8440872 INFO  (jetty-launcher-7225-thread-1) [n:127.0.0.1:43108_solr    ] o.a.s.m.r.SolrJmxReporter JMX monitoring for 'solr_43108.solr.jetty' (registry 'solr.jetty') enabled at server: com.sun.jmx.mbeanserver.JmxMBeanServer@2d509795
   [junit4]   2> 8440873 INFO  (jetty-launcher-7225-thread-1) [n:127.0.0.1:43108_solr    ] o.a.s.c.CorePropertiesLocator Found 0 core definitions underneath /home/jenkins/jenkins-slave/workspace/Lucene-Solr-NightlyTests-7.x/checkout/solr/build/solr-core/test/J0/temp/solr.cloud.autoscaling.SearchRateTriggerTest_2BF31B11BE1CE9D-001/tempDir-001/node1/.
   [junit4]   2> 8440941 INFO  (jetty-launcher-7225-thread-4) [n:127.0.0.1:45424_solr    ] o.a.s.m.r.SolrJmxReporter JMX monitoring for 'solr_45424.solr.jvm' (registry 'solr.jvm') enabled at server: com.sun.jmx.mbeanserver.JmxMBeanServer@2d509795
   [junit4]   2> 8440941 INFO  (jetty-launcher-7225-thread-4) [n:127.0.0.1:45424_solr    ] o.a.s.m.r.SolrJmxReporter JMX monitoring for 'solr_45424.solr.jetty' (registry 'solr.jetty') enabled at server: com.sun.jmx.mbeanserver.JmxMBeanServer@2d509795
   [junit4]   2> 8440942 INFO  (jetty-launcher-7225-thread-4) [n:127.0.0.1:45424_solr    ] o.a.s.c.CorePropertiesLocator Found 0 core definitions underneath /home/jenkins/jenkins-slave/workspace/Lucene-Solr-NightlyTests-7.x/checkout/solr/build/solr-core/test/J0/temp/solr.cloud.autoscaling.SearchRateTriggerTest_2BF31B11BE1CE9D-001/tempDir-001/node4/.
   [junit4]   2> 8441014 INFO  (zkConnectionManagerCallback-7283-thread-1) [    ] o.a.s.c.c.ConnectionManager zkClient has connected
   [junit4]   2> 8441015 INFO  (jetty-launcher-7225-thread-4) [n:127.0.0.1:45424_solr    ] o.a.s.c.c.ZkStateReader Updated live nodes from ZooKeeper... (0) -> (4)
   [junit4]   2> 8441015 INFO  (jetty-launcher-7225-thread-4) [n:127.0.0.1:45424_solr    ] o.a.s.c.s.i.ZkClientClusterStateProvider Cluster at 127.0.0.1:33006/solr ready
   [junit4]   2> 8441198 INFO  (jetty-launcher-7225-thread-2) [n:127.0.0.1:42924_solr    ] o.a.s.m.r.SolrJmxReporter JMX monitoring for 'solr_42924.solr.node' (registry 'solr.node') enabled at server: com.sun.jmx.mbeanserver.JmxMBeanServer@2d509795
   [junit4]   2> 8441292 INFO  (jetty-launcher-7225-thread-2) [n:127.0.0.1:42924_solr    ] o.a.s.m.r.SolrJmxReporter JMX monitoring for 'solr_42924.solr.jvm' (registry 'solr.jvm') enabled at server: com.sun.jmx.mbeanserver.JmxMBeanServer@2d509795
   [junit4]   2> 8441292 INFO  (jetty-launcher-7225-thread-2) [n:127.0.0.1:42924_solr    ] o.a.s.m.r.SolrJmxReporter JMX monitoring for 'solr_42924.solr.jetty' (registry 'solr.jetty') enabled at server: com.sun.jmx.mbeanserver.JmxMBeanServer@2d509795
   [junit4]   2> 8441293 INFO  (jetty-launcher-7225-thread-2) [n:127.0.0.1:42924_solr    ] o.a.s.c.CorePropertiesLocator Found 0 core definitions underneath /home/jenkins/jenkins-slave/workspace/Lucene-Solr-NightlyTests-7.x/checkout/solr/build/solr-core/test/J0/temp/solr.cloud.autoscaling.SearchRateTriggerTest_2BF31B11BE1CE9D-001/tempDir-001/node2/.
   [junit4]   2> 8441348 INFO  (zkConnectionManagerCallback-7288-thread-1) [    ] o.a.s.c.c.ConnectionManager zkClient has connected
   [junit4]   2> 8441349 INFO  (jetty-launcher-7225-thread-2) [n:127.0.0.1:42924_solr    ] o.a.s.c.c.ZkStateReader Updated live nodes from ZooKeeper... (0) -> (4)
   [junit4]   2> 8441350 INFO  (jetty-launcher-7225-thread-2) [n:127.0.0.1:42924_solr    ] o.a.s.c.s.i.ZkClientClusterStateProvider Cluster at 127.0.0.1:33006/solr ready
   [junit4]   2> 8441765 INFO  (zkConnectionManagerCallback-7290-thread-1) [    ] o.a.s.c.c.ConnectionManager zkClient has connected
   [junit4]   2> 8441802 INFO  (zkConnectionManagerCallback-7295-thread-1) [    ] o.a.s.c.c.ConnectionManager zkClient has connected
   [junit4]   2> 8441804 INFO  (SUITE-SearchRateTriggerTest-seed#[2BF31B11BE1CE9D]-worker) [    ] o.a.s.c.c.ZkStateReader Updated live nodes from ZooKeeper... (0) -> (4)
   [junit4]   2> 8441804 INFO  (SUITE-SearchRateTriggerTest-seed#[2BF31B11BE1CE9D]-worker) [    ] o.a.s.c.s.i.ZkClientClusterStateProvider Cluster at 127.0.0.1:33006/solr ready
   [junit4]   2> 8442215 INFO  (TEST-SearchRateTriggerTest.testTrigger-seed#[2BF31B11BE1CE9D]) [    ] o.a.s.SolrTestCaseJ4 ###Starting testTrigger
   [junit4]   2> 8442233 INFO  (TEST-SearchRateTriggerTest.testTrigger-seed#[2BF31B11BE1CE9D]) [    ] o.a.s.c.c.ZkStateReader Updated live nodes from ZooKeeper... (0) -> (4)
   [junit4]   2> 8442256 INFO  (qtp1681400294-40045) [n:127.0.0.1:43108_solr    ] o.a.s.h.a.CollectionsHandler Invoked Collection Action :create with params replicationFactor=2&collection.configName=conf&maxShardsPerNode=1&name=SearchRateTriggerTest-collection1&nrtReplicas=2&action=CREATE&numShards=2&wt=javabin&version=2 and sendToOCPQueue=true
   [junit4]   2> 8442278 INFO  (OverseerThreadFactory-10085-thread-1) [    ] o.a.s.c.a.c.CreateCollectionCmd Create collection SearchRateTriggerTest-collection1
   [junit4]   2> 8442510 INFO  (OverseerStateUpdate-72584199222722566-127.0.0.1:43108_solr-n_0000000000) [    ] o.a.s.c.o.SliceMutator createReplica() {
   [junit4]   2>   "operation":"ADDREPLICA",
   [junit4]   2>   "collection":"SearchRateTriggerTest-collection1",
   [junit4]   2>   "shard":"shard1",
   [junit4]   2>   "core":"SearchRateTriggerTest-collection1_shard1_replica_n1",
   [junit4]   2>   "state":"down",
   [junit4]   2>   "base_url":"http://127.0.0.1:43108/solr",
   [junit4]   2>   "type":"NRT",
   [junit4]   2>   "waitForFinalState":"false"} 
   [junit4]   2> 8442513 INFO  (OverseerStateUpdate-72584199222722566-127.0.0.1:43108_solr-n_0000000000) [    ] o.a.s.c.o.SliceMutator createReplica() {
   [junit4]   2>   "operation":"ADDREPLICA",
   [junit4]   2>   "collection":"SearchRateTriggerTest-collection1",
   [junit4]   2>   "shard":"shard1",
   [junit4]   2>   "core":"SearchRateTriggerTest-collection1_shard1_replica_n3",
   [junit4]   2>   "state":"down",
   [junit4]   2>   "base_url":"http://127.0.0.1:42924/solr",
   [junit4]   2>   "type":"NRT",
   [junit4]   2>   "waitForFinalState":"false"} 
   [junit4]   2> 8442515 INFO  (OverseerStateUpdate-72584199222722566-127.0.0.1:43108_solr-n_0000000000) [    ] o.a.s.c.o.SliceMutator createReplica() {
   [junit4]   2>   "operation":"ADDREPLICA",
   [junit4]   2>   "collection":"SearchRateTriggerTest-collection1",
   [junit4]   2>   "shard":"shard2",
   [junit4]   2>   "core":"SearchRateTriggerTest-collection1_shard2_replica_n5",
   [junit4]   2>   "state":"down",
   [junit4]   2>   "base_url":"http://127.0.0.1:43164/solr",
   [junit4]   2>   "type":"NRT",
   [junit4]   2>   "waitForFinalState":"false"} 
   [junit4]   2> 8442539 INFO  (OverseerStateUpdate-72584199222722566-127.0.0.1:43108_solr-n_0000000000) [    ] o.a.s.c.o.SliceMutator createReplica() {
   [junit4]   2>   "operation":"ADDREPLICA",
   [junit4]   2>   "collection":"SearchRateTriggerTest-collection1",
   [junit4]   2>   "shard":"shard2",
   [junit4]   2>   "core":"SearchRateTriggerTest-collection1_shard2_replica_n7",
   [junit4]   2>   "state":"down",
   [junit4]   2>   "base_url":"http://127.0.0.1:45424/solr",
   [junit4]   2>   "type":"NRT",
   [junit4]   2>   "waitForFinalState":"false"} 
   [junit4]   2> 8442800 INFO  (qtp1681400294-40049) [n:127.0.0.1:43108_solr    x:SearchRateTriggerTest-collection1_shard1_replica_n1] o.a.s.h.a.CoreAdminOperation core create command qt=/admin/cores&coreNodeName=core_node2&collection.configName=conf&newCollection=true&name=SearchRateTriggerTest-collection1_shard1_replica_n1&action=CREATE&numShards=2&collection=SearchRateTriggerTest-collection1&shard=shard1&wt=javabin&version=2&replicaType=NRT
   [junit4]   2> 8442837 INFO  (qtp504598832-40067) [n:127.0.0.1:42924_solr    x:SearchRateTriggerTest-collection1_shard1_replica_n3] o.a.s.h.a.CoreAdminOperation core create command qt=/admin/cores&coreNodeName=core_node4&collection.configName=conf&newCollection=true&name=SearchRateTriggerTest-collection1_shard1_replica_n3&action=CREATE&numShards=2&collection=SearchRateTriggerTest-collection1&shard=shard1&wt=javabin&version=2&replicaType=NRT
   [junit4]   2> 8442902 INFO  (qtp1465371886-40056) [n:127.0.0.1:43164_solr    x:SearchRateTriggerTest-collection1_shard2_replica_n5] o.a.s.h.a.CoreAdminOperation core create command qt=/admin/cores&coreNodeName=core_node6&collection.configName=conf&newCollection=true&name=SearchRateTriggerTest-collection1_shard2_replica_n5&action=CREATE&numShards=2&collection=SearchRateTriggerTest-collection1&shard=shard2&wt=javabin&version=2&replicaType=NRT
   [junit4]   2> 8442902 INFO  (qtp1465371886-40056) [n:127.0.0.1:43164_solr    x:SearchRateTriggerTest-collection1_shard2_replica_n5] o.a.s.c.TransientSolrCoreCacheDefault Allocating transient cache for 2147483647 transient cores
   [junit4]   2> 8442903 INFO  (qtp337206290-40079) [n:127.0.0.1:45424_solr    x:SearchRateTriggerTest-collection1_shard2_replica_n7] o.a.s.h.a.CoreAdminOperation core create command qt=/admin/cores&coreNodeName=core_node8&collection.configName=conf&newCollection=true&name=SearchRateTriggerTest-collection1_shard2_replica_n7&action=CREATE&numShards=2&collection=SearchRateTriggerTest-collection1&shard=shard2&wt=javabin&version=2&replicaType=NRT
   [junit4]   2> 8444049 INFO  (qtp1465371886-40056) [n:127.0.0.1:43164_solr c:SearchRateTriggerTest-collection1 s:shard2 r:core_node6 x:SearchRateTriggerTest-collection1_shard2_replica_n5] o.a.s.c.SolrConfig Using Lucene MatchVersion: 7.4.0
   [junit4]   2> 8444059 INFO  (qtp337206290-40079) [n:127.0.0.1:45424_solr c:SearchRateTriggerTest-collection1 s:shard2 r:core_node8 x:SearchRateTriggerTest-collection1_shard2_replica_n7] o.a.s.c.SolrConfig Using Lucene MatchVersion: 7.4.0
   [junit4]   2> 8444064 INFO  (qtp1681400294-40049) [n:127.0.0.1:43108_solr c:SearchRateTriggerTest-collection1 s:shard1 r:core_node2 x:SearchRateTriggerTest-collection1_shard1_replica_n1] o.a.s.c.SolrConfig Using Lucene MatchVersion: 7.4.0
   [junit4]   2> 8444102 INFO  (qtp1465371886-40056) [n:127.0.0.1:43164_solr c:SearchRateTriggerTest-collection1 s:shard2 r:core_node6 x:SearchRateTriggerTest-collection1_shard2_replica_n5] o.a.s.s.IndexSchema [SearchRateTriggerTest-collection1_shard2_replica_n5] Schema name=minimal
   [junit4]   2> 8444114 INFO  (qtp337206290-40079) [n:127.0.0.1:45424_solr c:SearchRateTriggerTest-collection1 s:shard2 r:core_node8 x:SearchRateTriggerTest-collection1_shard2_replica_n7] o.a.s.s.IndexSchema [SearchRateTriggerTest-collection1_shard2_replica_n7] Schema name=minimal
   [junit4]   2> 8444121 INFO  (qtp1681400294-40049) [n:127.0.0.1:43108_solr c:SearchRateTriggerTest-collection1 s:shard1 r:core_node2 x:SearchRateTriggerTest-collection1_shard1_replica_n1] o.a.s.s.IndexSchema [SearchRateTriggerTest-collection1_shard1_replica_n1] Schema name=minimal
   [junit4]   2> 8444123 INFO  (qtp1681400294-40049) [n:127.0.0.1:43108_solr c:SearchRateTriggerTest-collection1 s:shard1 r:core_node2 x:SearchRateTriggerTest-collection1_shard1_replica_n1] o.a.s.s.IndexSchema Loaded schema minimal/1.1 with uniqueid field id
   [junit4]   2> 8444123 INFO  (qtp1681400294-40049) [n:127.0.0.1:43108_solr c:SearchRateTriggerTest-collection1 s:shard1 r:core_node2 x:SearchRateTriggerTest-collection1_shard1_replica_n1] o.a.s.c.CoreContainer Creating SolrCore 'SearchRateTriggerTest-collection1_shard1_replica_n1' using configuration from collection SearchRateTriggerTest-collection1, trusted=true
   [junit4]   2> 8444123 INFO  (qtp1681400294-40049) [n:127.0.0.1:43108_solr c:SearchRateTriggerTest-collection1 s:shard1 r:core_node2 x:SearchRateTriggerTest-collection1_shard1_replica_n1] o.a.s.m.r.SolrJmxReporter JMX monitoring for 'solr_43108.solr.core.SearchRateTriggerTest-collection1.shard1.replica_n1' (registry 'solr.core.SearchRateTriggerTest-collection1.shard1.replica_n1') enabled at server: com.sun.jmx.mbeanserver.JmxMBeanServer@2d509795
   [junit4]   2> 8444129 INFO  (qtp337206290-40079) [n:127.0.0.1:45424_solr c:SearchRateTriggerTest-collection1 s:shard2 r:core_node8 x:SearchRateTriggerTest-collection1_shard2_replica_n7] o.a.s.s.IndexSchema Loaded schema minimal/1.1 with uniqueid field id
   [junit4]   2> 8444129 INFO  (qtp337206290-40079) [n:127.0.0.1:45424_solr c:SearchRateTriggerTest-collection1 s:shard2 r:core_node8 x:SearchRateTriggerTest-collection1_shard2_replica_n7] o.a.s.c.CoreContainer Creating SolrCore 'SearchRateTriggerTest-collection1_shard2_replica_n7' using configuration from collection SearchRateTriggerTest-collection1, trusted=true
   [junit4]   2> 8444137 INFO  (qtp1465371886-40056) [n:127.0.0.1:43164_solr c:SearchRateTriggerTest-collection1 s:shard2 r:core_node6 x:SearchRateTriggerTest-collection1_shard2_replica_n5] o.a.s.s.IndexSchema Loaded schema minimal/1.1 with uniqueid field id
   [junit4]   2> 8444137 INFO  (qtp1465371886-40056) [n:127.0.0.1:43164_solr c:SearchRateTriggerTest-collection1 s:shard2 r:core_node6 x:SearchRateTriggerTest-collection1_shard2_replica_n5] o.a.s.c.CoreContainer Creating SolrCore 'SearchRateTriggerTest-collection1_shard2_replica_n5' using configuration from collection SearchRateTriggerTest-collection1, trusted=true
   [junit4]   2> 8444138 INFO  (qtp1465371886-40056) [n:127.0.0.1:43164_solr c:SearchRateTriggerTest-collection1 s:shard2 r:core_node6 x:SearchRateTriggerTest-collection1_shard2_replica_n5] o.a.s.m.r.SolrJmxReporter JMX monitoring for 'solr_43164.solr.core.SearchRateTriggerTest-collection1.shard2.replica_n5' (registry 'solr.core.SearchRateTriggerTest-collection1.shard2.replica_n5') enabled at server: com.sun.jmx.mbeanserver.JmxMBeanServer@2d509795
   [junit4]   2> 8444138 INFO  (qtp1465371886-40056) [n:127.0.0.1:43164_solr c:SearchRateTriggerTest-collection1 s:shard2 r:core_node6 x:SearchRateTriggerTest-collection1_shard2_replica_n5] o.a.s.c.SolrCore solr.RecoveryStrategy.Builder
   [junit4]   2> 8444138 INFO  (qtp1465371886-40056) [n:127.0.0.1:43164_solr c:SearchRateTriggerTest-collection1 s:shard2 r:core_node6 x:SearchRateTriggerTest-collection1_shard2_replica_n5] o.a.s.c.SolrCore [[SearchRateTriggerTest-collection1_shard2_replica_n5] ] Opening new SolrCore at [/home/jenkins/jenkins-slave/workspace/Lucene-Solr-NightlyTests-7.x/checkout/solr/build/solr-core/test/J0/temp/solr.cloud.autoscaling.SearchRateTriggerTest_2BF31B11BE1CE9D-001/tempDir-001/node3/SearchRateTriggerTest-collection1_shard2_replica_n5], dataDir=[/home/jenkins/jenkins-slave/workspace/Lucene-Solr-NightlyTests-7.x/checkout/solr/build/solr-core/test/J0/temp/solr.cloud.autoscaling.SearchRateTriggerTest_2BF31B11BE1CE9D-001/tempDir-001/node3/./SearchRateTriggerTest-collection1_shard2_replica_n5/data/]
   [junit4]   2> 8444173 INFO  (qtp337206290-40079) [n:127.0.0.1:45424_solr c:SearchRateTriggerTest-collection1 s:shard2 r:core_node8 x:SearchRateTriggerTest-collection1_shard2_replica_n7] o.a.s.m.r.SolrJmxReporter JMX monitoring for 'solr_45424.solr.core.SearchRateTriggerTest-collection1.shard2.replica_n7' (registry 'solr.core.SearchRateTriggerTest-collection1.shard2.replica_n7') enabled at server: com.sun.jmx.mbeanserver.JmxMBeanServer@2d509795
   [junit4]   2> 8444173 INFO  (qtp337206290-40079) [n:127.0.0.1:45424_solr c:SearchRateTriggerTest-collection1 s:shard2 r:core_node8 x:SearchRateTriggerTest-collection1_shard2_replica_n7] o.a.s.c.SolrCore solr.RecoveryStrategy.Builder
   [junit4]   2> 8444173 INFO  (qtp337206290-40079) [n:127.0.0.1:45424_solr c:SearchRateTriggerTest-collection1 s:shard2 r:core_node8 x:SearchRateTriggerTest-collection1_shard2_replica_n7] o.a.s.c.SolrCore [[SearchRateTriggerTest-collection1_shard2_replica_n7] ] Opening new SolrCore at [/home/jenkins/jenkins-slave/workspace/Lucene-Solr-NightlyTests-7.x/checkout/solr/build/solr-core/test/J0/temp/solr.cloud.autoscaling.SearchRateTriggerTest_2BF31B11BE1CE9D-001/tempDir-001/node4/SearchRateTriggerTest-collection1_shard2_replica_n7], dataDir=[/home/jenkins/jenkins-slave/workspace/Lucene-Solr-NightlyTests-7.x/checkout/solr/build/solr-core/test/J0/temp/solr.cloud.autoscaling.SearchRateTriggerTest_2BF31B11BE1CE9D-001/tempDir-001/node4/./SearchRateTriggerTest-collection1_shard2_replica_n7/data/]
   [junit4]   2> 8444211 INFO  (qtp1681400294-40049) [n:127.0.0.1:43108_solr c:SearchRateTriggerTest-collection1 s:shard1 r:core_node2 x:SearchRateTriggerTest-collection1_shard1_replica_n1] o.a.s.c.SolrCore solr.RecoveryStrategy.Builder
   [junit4]   2> 8444211 INFO  (qtp1681400294-40049) [n:127.0.0.1:43108_solr c:SearchRateTriggerTest-collection1 s:shard1 r:core_node2 x:SearchRateTriggerTest-collection1_shard1_replica_n1] o.a.s.c.SolrCore [[SearchRateTriggerTest-collection1_shard1_replica_n1] ] Opening new SolrCore at [/home/jenkins/jenkins-slave/workspace/Lucene-Solr-NightlyTests-7.x/checkout/solr/build/solr-core/test/J0/temp/solr.cloud.autoscaling.SearchRateTriggerTest_2BF31B11BE1CE9D-001/tempDir-001/node1/SearchRateTriggerTest-collection1_shard1_replica_n1], dataDir=[/home/jenkins/jenkins-slave/workspace/Lucene-Solr-NightlyTests-7.x/checkout/solr/build/solr-core/test/J0/temp/solr.cloud.autoscaling.SearchRateTriggerTest_2BF31B11BE1CE9D-001/tempDir-001/node1/./SearchRateTriggerTest-collection1_shard1_replica_n1/data/]
   [junit4]   2> 8444216 INFO  (qtp504598832-40067) [n:127.0.0.1:42924_solr c:SearchRateTriggerTest-collection1 s:shard1 r:core_node4 x:SearchRateTriggerTest-collection1_shard1_replica_n3] o.a.s.c.SolrConfig Using Lucene MatchVersion: 7.4.0
   [junit4]   2> 8444512 INFO  (qtp504598832-40067) [n:127.0.0.1:42924_solr c:SearchRateTriggerTest-collection1 s:shard1 r:core_node4 x:SearchRateTriggerTest-collection1_shard1_replica_n3] o.a.s.s.IndexSchema [SearchRateTriggerTest-collection1_shard1_replica_n3] Schema name=minimal
   [junit4]   2> 8444515 INFO  (qtp504598832-40067) [n:127.0.0.1:42924_solr c:SearchRateTriggerTest-collection1 s:shard1 r:core_node4 x:SearchRateTriggerTest-collection1_shard1_replica_n3] o.a.s.s.IndexSchema Loaded schema minimal/1.1 with uniqueid field id
   [junit4]   2> 8444515 INFO  (qtp504598832-40067) [n:127.0.0.1:42924_solr c:SearchRateTriggerTest-collection1 s:shard1 r:core_node4 x:SearchRateTriggerTest-collection1_shard1_replica_n3] o.a.s.c.CoreContainer Creating SolrCore 'SearchRateTriggerTest-collection1_shard1_replica_n3' using configuration from collection SearchRateTriggerTest-collection1, trusted=true
   [junit4]   2> 8444515 INFO  (qtp504598832-40067) [n:127.0.0.1:42924_solr c:SearchRateTriggerTest-collection1 s:shard1 r:core_node4 x:SearchRateTriggerTest-collection1_shard1_replica_n3] o.a.s.m.r.SolrJmxReporter JMX monitoring for 'solr_42924.solr.core.SearchRateTriggerTest-collection1.shard1.replica_n3' (registry 'solr.core.SearchRateTriggerTest-collection1.shard1.replica_n3') enabled at server: com.sun.jmx.mbeanserver.JmxMBeanServer@2d509795
   [junit4]   2> 8444515 INFO  (qtp504598832-40067) [n:127.0.0.1:42924_solr c:SearchRateTriggerTest-collection1 s:shard1 r:core_node4 x:SearchRateTriggerTest-collection1_shard1_replica_n3] o.a.s.c.SolrCore solr.RecoveryStrategy.Builder
   [junit4]   2> 8444515 INFO  (qtp504598832-40067) [n:127.0.0.1:42924_solr c:SearchRateTriggerTest-collection1 s:shard1 r:core_node4 x:SearchRateTriggerTest-collection1_shard1_replica_n3] o.a.s.c.SolrCore [[SearchRateTriggerTest-collection1_shard1_replica_n3] ] Opening new SolrCore at [/home/jenkins/jenkins-slave/workspace/Lucene-Solr-NightlyTests-7.x/checkout/solr/build/solr-core/test/J0/temp/solr.cloud.autoscaling.SearchRateTriggerTest_2BF31B11BE1CE9D-001/tempDir-001/node2/SearchRateTriggerTest-collection1_shard1_replica_n3], dataDir=[/home/jenkins/jenkins-slave/workspace/Lucene-Solr-NightlyTests-7.x/checkout/solr/build/solr-core/test/J0/temp/solr.cloud.autoscaling.SearchRateTriggerTest_2BF31B11BE1CE9D-001/tempDir-001/node2/./SearchRateTriggerTest-collection1_shard1_replica_n3/data/]
   [junit4]   2> 8445115 INFO  (qtp1465371886-40056) [n:127.0.0.1:43164_solr c:SearchRateTriggerTest-collection1 s:shard2 r:core_node6 x:SearchRateTriggerTest-collection1_shard2_replica_n5] o.a.s.u.UpdateHandler Using UpdateLog implementation: org.apache.solr.update.UpdateLog
   [junit4]   2> 8445115 INFO  (qtp1465371886-40056) [n:127.0.0.1:43164_solr c:SearchRateTriggerTest-collection1 s:shard2 r:core_node6 x:SearchRateTriggerTest-collection1_shard2_replica_n5] o.a.s.u.UpdateLog Initializing UpdateLog: dataDir=null defaultSyncLevel=FLUSH numRecordsToKeep=100 maxNumLogsToKeep=10 numVersionBuckets=65536
   [junit4]   2> 8445117 INFO  (qtp1465371886-40056) [n:127.0.0.1:43164_solr c:SearchRateTriggerTest-collection1 s:shard2 r:core_node6 x:SearchRateTriggerTest-collection1_shard2_replica_n5] o.a.s.u.CommitTracker Hard AutoCommit: disabled
   [junit4]   2> 8445117 INFO  (qtp1465371886-40056) [n:127.0.0.1:43164_solr c:SearchRateTriggerTest-collection1 s:shard2 r:core_node6 x:SearchRateTriggerTest-collection1_shard2_replica_n5] o.a.s.u.CommitTracker Soft AutoCommit: disabled
   [junit4]   2> 8445118 INFO  (qtp1465371886-40056) [n:127.0.0.1:43164_solr c:SearchRateTriggerTest-collection1 s:shard2 r:core_node6 x:SearchRateTriggerTest-collection1_shard2_replica_n5] o.a.s.s.SolrIndexSearcher Opening [Searcher@14fb2700[SearchRateTriggerTest-collection1_shard2_replica_n5] main]
   [junit4]   2> 8445119 INFO  (qtp1465371886-40056) [n:127.0.0.1:43164_solr c:SearchRateTriggerTest-collection1 s:shard2 r:core_node6 x:SearchRateTriggerTest-collection1_shard2_replica_n5] o.a.s.r.ManagedResourceStorage Configured ZooKeeperStorageIO with znodeBase: /configs/conf
   [junit4]   2> 8445132 INFO  (qtp1465371886-40056) [n:127.0.0.1:43164_solr c:SearchRateTriggerTest-collection1 s:shard2 r:core_node6 x:SearchRateTriggerTest-collection1_shard2_replica_n5] o.a.s.r.ManagedResourceStorage Loaded null at path _rest_managed.json using ZooKeeperStorageIO:path=/configs/conf
   [junit4]   2> 8445132 INFO  (qtp1465371886-40056) [n:127.0.0.1:43164_solr c:SearchRateTriggerTest-collection1 s:shard2 r:core_node6 x:SearchRateTriggerTest-collection1_shard2_replica_n5] o.a.s.h.ReplicationHandler Commits will be reserved for 10000ms.
   [junit4]   2> 8445132 INFO  (qtp1465371886-40056) [n:127.0.0.1:43164_solr c:SearchRateTriggerTest-collection1 s:shard2 r:core_node6 x:SearchRateTriggerTest-collection1_shard2_replica_n5] o.a.s.u.UpdateLog Could not find max version in index or recent updates, using new clock 1599810267737227264
   [junit4]   2> 8445135 INFO  (searcherExecutor-10095-thread-1-processing-n:127.0.0.1:43164_solr x:SearchRateTriggerTest-collection1_shard2_replica_n5 c:SearchRateTriggerTest-collection1 s:shard2 r:core_node6) [n:127.0.0.1:43164_solr c:SearchRateTriggerTest-collection1 s:shard2 r:core_node6 x:SearchRateTriggerTest-collection1_shard2_replica_n5] o.a.s.c.SolrCore [SearchRateTriggerTest-collection1_shard2_replica_n5] Registered new searcher Searcher@14fb2700[SearchRateTriggerTest-collection1_shard2_replica_n5] main{ExitableDirectoryReader(UninvertingDirectoryReader())}
   [junit4]   2> 8445205 INFO  (qtp504598832-40067) [n:127.0.0.1:42924_solr c:SearchRateTriggerTest-collection1 s:shard1 r:core_node4 x:SearchRateTriggerTest-collection1_shard1_replica_n3] o.a.s.u.UpdateHandler Using UpdateLog implementation: org.apache.solr.update.UpdateLog
   [junit4]   2> 8445205 INFO  (qtp504598832-40067) [n:127.0.0.1:42924_solr c:SearchRateTriggerTest-collection1 s:shard1 r:core_node4 x:SearchRateTriggerTest-collection1_shard1_replica_n3] o.a.s.u.UpdateLog Initializing UpdateLog: dataDir=null defaultSyncLevel=FLUSH numRecordsToKeep=100 maxNumLogsToKeep=10 numVersionBuckets=65536
   [junit4]   2> 8445206 INFO  (qtp504598832-40067) [n:127.0.0.1:42924_solr c:SearchRateTriggerTest-collection1 s:shard1 r:core_node4 x:SearchRateTriggerTest-collection1_shard1_replica_n3] o.a.s.u.CommitTracker Hard AutoCommit: disabled
   [junit4]   2> 8445206 INFO  (qtp504598832-40067) [n:127.0.0.1:42924_solr c:SearchRateTriggerTest-collection1 s:shard1 r:core_node4 x:SearchRateTriggerTest-collection1_shard1_replica_n3] o.a.s.u.CommitTracker Soft AutoCommit: disabled
   [junit4]   2> 8445208 INFO  (qtp504598832-40067) [n:127.0.0.1:42924_solr c:SearchRateTriggerTest-collection1 s:shard1 r:core_node4 x:SearchRateTriggerTest-collection1_shard1_replica_n3] o.a.s.s.SolrIndexSearcher Opening [Searcher@5f50496[SearchRateTriggerTest-collection1_shard1_replica_n3] main]
   [junit4]   2> 8445225 INFO  (qtp1681400294-40049) [n:127.0.0.1:43108_solr c:SearchRateTriggerTest-collection1 s:shard1 r:core_node2 x:SearchRateTriggerTest-collection1_shard1_replica_n1] o.a.s.u.UpdateHandler Using UpdateLog implementation: org.apache.solr.update.UpdateLog
   [junit4]   2> 8445225 INFO  (qtp1681400294-40049) [n:127.0.0.1:43108_solr c:SearchRateTriggerTest-collection1 s:shard1 r:core_node2 x:SearchRateTriggerTest-collection1_shard1_replica_n1] o.a.s.u.UpdateLog Initializing UpdateLog: dataDir=null defaultSyncLevel=FLUSH numRecordsToKeep=100 maxNumLogsToKeep=10 numVersionBuckets=65536
   [junit4]   2> 8445226 INFO  (qtp1681400294-40049) [n:127.0.0.1:43108_solr c:SearchRateTriggerTest-collection1 s:shard1 r:core_node2 x:SearchRateTriggerTest-collection1_shard1_replica_n1] o.a.s.u.CommitTracker Hard AutoCommit: disabled
   [junit4]   2> 8445226 INFO  (qtp1681400294-40049) [n:127.0.0.1:43108_solr c:SearchRateTriggerTest-collection1 s:shard1 r:core_node2 x:SearchRateTriggerTest-collection1_shard1_replica_n1] o.a.s.u.CommitTracker Soft AutoCommit: disabled
   [junit4]   2> 8445242 INFO  (qtp504598832-40067) [n:127.0.0.1:42924_solr c:SearchRateTriggerTest-collection1 s:shard1 r:core_node4 x:SearchRateTriggerTest-collection1_shard1_replica_n3] o.a.s.r.ManagedResourceStorage Configured ZooKeeperStorageIO with znodeBase: /configs/conf
   [junit4]   2> 8445243 INFO  (qtp504598832-40067) [n:127.0.0.1:42924_solr c:SearchRateTriggerTest-collection1 s:shard1 r:core_node4 x:SearchRateTriggerTest-collection1_shard1_replica_n3] o.a.s.r.ManagedResourceStorage Loaded null at path _rest_managed.json using ZooKeeperStorageIO:path=/configs/conf
   [junit4]   2> 8445244 INFO  (qtp504598832-40067) [n:127.0.0.1:42924_solr c:SearchRateTriggerTest-collection1 s:shard1 r:core_node4 x:SearchRateTriggerTest-collection1_shard1_replica_n3] o.a.s.h.ReplicationHandler Commits will be reserved for 10000ms.
   [junit4]   2> 8445244 INFO  (qtp504598832-40067) [n:127.0.0.1:42924_solr c:SearchRateTriggerTest-collection1 s:shard1 r:core_node4 x:SearchRateTriggerTest-collection1_shard1_replica_n3] o.a.s.u.UpdateLog Could not find max version in index or recent updates, using new clock 1599810267854667776
   [junit4]   2> 8445244 INFO  (qtp1465371886-40056) [n:127.0.0.1:43164_solr c:SearchRateTriggerTest-collection1 s:shard2 r:core_node6 x:SearchRateTriggerTest-collection1_shard2_replica_n5] o.a.s.c.ZkShardTerms Successful update of terms at /collections/SearchRateTriggerTest-collection1/terms/shard2 to Terms{values={core_node6=0}, version=0}
   [junit4]   2> 8445258 INFO  (searcherExecutor-10096-thread-1-processing-n:127.0.0.1:42924_solr x:SearchRateTriggerTest-collection1_shard1_replica_n3 c:SearchRateTriggerTest-collection1 s:shard1 r:core_node4) [n:127.0.0.1:42924_solr c:SearchRateTriggerTest-collection1 s:shard1 r:core_node4 x:SearchRateTriggerTest-collection1_shard1_replica_n3] o.a.s.c.SolrCore [SearchRateTriggerTest-collection1_shard1_replica_n3] Registered new searcher Searcher@5f50496[SearchRateTriggerTest-collection1_shard1_replica_n3] main{ExitableDirectoryReader(UninvertingDirectoryReader())}
   [junit4]   2> 8445262 INFO  (qtp1681400294-40049) [n:127.0.0.1:43108_solr c:SearchRateTriggerTest-collection1 s:shard1 r:core_node2 x:SearchRateTriggerTest-collection1_shard1_replica_n1] o.a.s.s.SolrIndexSearcher Opening [Searcher@4ade0831[SearchRateTriggerTest-collection1_shard1_replica_n1] main]
   [junit4]   2> 8445263 INFO  (qtp1681400294-40049) [n:127.0.0.1:43108_solr c:SearchRateTriggerTest-collection1 s:shard1 r:core_node2 x:SearchRateTriggerTest-collection1_shard1_replica_n1] o.a.s.r.ManagedResourceStorage Configured ZooKeeperStorageIO with znodeBase: /configs/conf
   [junit4]   2> 8445263 INFO  (qtp1681400294-40049) [n:127.0.0.1:43108_solr c:SearchRateTriggerTest-collection1 s:shard1 r:core_node2 x:SearchRateTriggerTest-collection1_shard1_replica_n1] o.a.s.r.ManagedResourceStorage Loaded null at path _rest_managed.json using ZooKeeperStorageIO:path=/configs/conf
   [junit4]   2> 8445264 INFO  (qtp1681400294-40049) [n:127.0.0.1:43108_solr c:SearchRateTriggerTest-collection1 s:shard1 r:core_node2 x:SearchRateTriggerTest-collection1_shard1_replica_n1] o.a.s.h.ReplicationHandler Commits will be reserved for 10000ms.
   [junit4]   2> 8445264 INFO  (qtp1681400294-40049) [n:127.0.0.1:43108_solr c:SearchRateTriggerTest-collection1 s:shard1 r:core_node2 x:SearchRateTriggerTest-collection1_shard1_replica_n1] o.a.s.u.UpdateLog Could not find max version in index or recent updates, using new clock 1599810267875639296
   [junit4]   2> 8445278 INFO  (searcherExecutor-10093-thread-1-processing-n:127.0.0.1:43108_solr x:SearchRateTriggerTest-collection1_shard1_replica_n1 c:SearchRateTriggerTest-collection1 s:shard1 r:core_node2) [n:127.0.0.1:43108_solr c:SearchRateTriggerTest-collection1 s:shard1 r:core_node2 x:SearchRateTriggerTest-collection1_shard1_replica_n1] o.a.s.c.SolrCore [SearchRateTriggerTest-collection1_shard1_replica_n1] Registered new searcher Searcher@4ade0831[SearchRateTriggerTest-collection1_shard1_replica_n1] main{ExitableDirectoryReader(UninvertingDirectoryReader())}
   [junit4]   2> 8445280 INFO  (qtp1465371886-40056) [n:127.0.0.1:43164_solr c:SearchRateTriggerTest-collection1 s:shard2 r:core_node6 x:SearchRateTriggerTest-collection1_shard2_replica_n5] o.a.s.c.ShardLeaderElectionContext Waiting until we see more replicas up for shard shard2: total=2 found=1 timeoutin=9999ms
   [junit4]   2> 8445346 INFO  (qtp337206290-40079) [n:127.0.0.1:45424_solr c:SearchRateTriggerTest-collection1 s:shard2 r:core_node8 x:SearchRateTriggerTest-collection1_shard2_replica_n7] o.a.s.u.UpdateHandler Using UpdateLog implementation: org.apache.solr.update.UpdateLog
   [junit4]   2> 8445346 INFO  (qtp337206290-40079) [n:127.0.0.1:45424_solr c:SearchRateTriggerTest-collection1 s:shard2 r:core_node8 x:SearchRateTriggerTest-collection1_shard2_replica_n7] o.a.s.u.UpdateLog Initializing UpdateLog: dataDir=null defaultSyncLevel=FLUSH numRecordsToKeep=100 maxNumLogsToKeep=10 numVersionBuckets=65536
   [junit4]   2> 8445360 INFO  (qtp337206290-40079) [n:127.0.0.1:45424_solr c:SearchRateTriggerTest-collection1 s:shard2 r:core_node8 x:SearchRateTriggerTest-collection1_shard2_replica_n7] o.a.s.u.CommitTracker Hard AutoCommit: disabled
   [junit4]   2> 8445360 INFO  (qtp337206290-40079) [n:127.0.0.1:45424_solr c:SearchRateTriggerTest-collection1 s:shard2 r:core_node8 x:SearchRateTriggerTest-collection1_shard2_replica_n7] o.a.s.u.CommitTracker Soft AutoCommit: disabled
   [junit4]   2> 8445367 INFO  (qtp504598832-40067) [n:127.0.0.1:42924_solr c:SearchRateTriggerTest-collection1 s:shard1 r:core_node4 x:SearchRateTriggerTest-collection1_shard1_replica_n3] o.a.s.c.ZkShardTerms Successful update of terms at /collections/SearchRateTriggerTest-collection1/terms/shard1 to Terms{values={core_node4=0}, version=0}
   [junit4]   2> 8445380 INFO  (qtp337206290-40079) [n:127.0.0.1:45424_solr c:SearchRateTriggerTest-collection1 s:shard2 r:core_node8 x:SearchRateTriggerTest-collection1_shard2_replica_n7] o.a.s.s.SolrIndexSearcher Opening [Searcher@24d5a056[SearchRateTriggerTest-collection1_shard2_replica_n7] main]
   [junit4]   2> 8445460 INFO  (qtp337206290-40079) [n:127.0.0.1:45424_solr c:SearchRateTriggerTest-collection1 s:shard2 r:core_node8 x:SearchRateTriggerTest-collection1_shard2_replica_n7] o.a.s.r.ManagedResourceStorage Configured ZooKeeperStorageIO with znodeBase: /configs/conf
   [junit4]   2> 8445469 INFO  (qtp1681400294-40049) [n:127.0.0.1:43108_solr c:SearchRateTriggerTest-collection1 s:shard1 r:core_node2 x:SearchRateTriggerTest-collection1_shard1_replica_n1] o.a.s.c.ZkShardTerms Successful update of terms at /collections/SearchRateTriggerTest-collection1/terms/shard1 to Terms{values={core_node2=0, core_node4=0}, version=1}
   [junit4]   2> 8445485 INFO  (qtp1681400294-40049) [n:127.0.0.1:43108_solr c:SearchRateTriggerTest-collection1 s:shard1 r:core_node2 x:SearchRateTriggerTest-collection1_shard1_replica_n1] o.a.s.c.ShardLeaderElectionContext Waiting until we see more replicas up for shard shard1: total=2 found=1 timeoutin=9999ms
   [junit4]   2> 8445497 INFO  (qtp337206290-40079) [n:127.0.0.1:45424_solr c:SearchRateTriggerTest-collection1 s:shard2 r:core_node8 x:SearchRateTriggerTest-collection1_shard2_replica_n7] o.a.s.r.ManagedResourceStorage Loaded null at path _rest_managed.json using ZooKeeperStorageIO:path=/configs/conf
   [junit4]   2> 8445498 INFO  (qtp337206290-40079) [n:127.0.0.1:45424_solr c:SearchRateTriggerTest-collection1 s:shard2 r:core_node8 x:SearchRateTriggerTest-collection1_shard2_replica_n7] o.a.s.h.ReplicationHandler Commits will be reserved for 10000ms.
   [junit4]   2> 8445498 INFO  (qtp337206290-40079) [n:127.0.0.1:45424_solr c:SearchRateTriggerTest-collection1 s:shard2 r:core_node8 x:SearchRateTriggerTest-collection1_shard2_replica_n7] o.a.s.u.UpdateLog Could not find max version in index or recent updates, using new clock 1599810268121006080
   [junit4]   2> 8445499 INFO  (searcherExecutor-10094-thread-1-processing-n:127.0.0.1:45424_solr x:SearchRateTriggerTest-collection1_shard2_replica_n7 c:SearchRateTriggerTest-collection1 s:shard2 r:core_node8) [n:127.0.0.1:45424_solr c:SearchRateTriggerTest-collection1 s:shard2 r:core_node8 x:SearchRateTriggerTest-collection1_shard2_replica_n7] o.a.s.c.SolrCore [SearchRateTriggerTest-collection1_shard2_replica_n7] Registered new searcher Searcher@24d5a056[SearchRateTriggerTest-collection1_shard2_replica_n7] main{ExitableDirectoryReader(UninvertingDirectoryReader())}
   [junit4]   2> 8445537 INFO  (qtp337206290-40079) [n:127.0.0.1:45424_solr c:SearchRateTriggerTest-collection1 s:shard2 r:core_node8 x:SearchRateTriggerTest-collection1_shard2_replica_n7] o.a.s.c.ZkShardTerms Successful update of terms at /collections/SearchRateTriggerTest-collection1/terms/shard2 to Terms{values={core_node6=0, core_node8=0}, version=1}
   [junit4]   2> 8445923 INFO  (qtp1465371886-40056) [n:127.0.0.1:43164_solr c:SearchRateTriggerTest-collection1 s:shard2 r:core_node6 x:SearchRateTriggerTest-collection1_shard2_replica_n5] o.a.s.c.ShardLeaderElectionContext Enough replicas found to continue.
   [junit4]   2> 8445923 INFO  (qtp1465371886-40056) [n:127.0.0.1:43164_solr c:SearchRateTriggerTest-collection1 s:shard2 r:core_node6 x:SearchRateTriggerTest-collection1_shard2_replica_n5] o.a.s.c.ShardLeaderElectionContext I may be the new leader - try and sync
   [junit4]   2> 8445923 INFO  (qtp1465371886-40056) [n:127.0.0.1:43164_solr c:SearchRateTriggerTest-collection1 s:shard2 r:core_node6 x:SearchRateTriggerTest-collection1_shard2_replica_n5] o.a.s.c.SyncStrategy Sync replicas to http://127.0.0.1:43164/solr/SearchRateTriggerTest-collection1_shard2_replica_n5/
   [junit4]   2> 8445958 INFO  (qtp1465371886-40056) [n:127.0.0.1:43164_solr c:SearchRateTriggerTest-collection1 s:shard2 r:core_node6 x:SearchRateTriggerTest-collection1_shard2_replica_n5] o.a.s.u.PeerSync PeerSync: core=SearchRateTriggerTest-collection1_shard2_replica_n5 url=http://127.0.0.1:43164/solr START replicas=[http://127.0.0.1:45424/solr/SearchRateTriggerTest-collection1_shard2_replica_n7/] nUpdates=100
   [junit4]   2> 8445993 INFO  (qtp1681400294-40049) [n:127.0.0.1:43108_solr c:SearchRateTriggerTest-collection1 s:shard1 r:core_node2 x:SearchRateTriggerTest-collection1_shard1_replica_n1] o.a.s.c.ShardLeaderElectionContext Enough replicas found to continue.
   [junit4]   2> 8445993 INFO  (qtp1681400294-40049) [n:127.0.0.1:43108_solr c:SearchRateTriggerTest-collection1 s:shard1 r:core_node2 x:SearchRateTriggerTest-collection1_shard1_replica_n1] o.a.s.c.ShardLeaderElectionContext I may be the new leader - try and sync
   [junit4]   2> 8445993 INFO  (qtp1681400294-40049) [n:127.0.0.1:43108_solr c:SearchRateTriggerTest-collection1 s:shard1 r:core_node2 x:SearchRateTriggerTest-collection1_shard1_replica_n1] o.a.s.c.SyncStrategy Sync replicas to http://127.0.0.1:43108/solr/SearchRateTriggerTest-collection1_shard1_replica_n1/
   [junit4]   2> 8445994 INFO  (qtp1681400294-40049) [n:127.0.0.1:43108_solr c:SearchRateTriggerTest-collection1 s:shard1 r:core_node2 x:SearchRateTriggerTest-collection1_shard1_replica_n1] o.a.s.u.PeerSync PeerSync: core=SearchRateTriggerTest-collection1_shard1_replica_n1 url=http://127.0.0.1:43108/solr START replicas=[http://127.0.0.1:42924/solr/SearchRateTriggerTest-collection1_shard1_replica_n3/] nUpdates=100
   [junit4]   2> 8446015 INFO  (qtp504598832-40071) [n:127.0.0.1:42924_solr c:SearchRateTriggerTest-collection1 s:shard1 r:core_node4 x:SearchRateTriggerTest-collection1_shard1_replica_n3] o.a.s.c.S.Request [SearchRateTriggerTest-collection1_shard1_replica_n3]  webapp=/solr path=/get params={distrib=false&qt=/get&fingerprint=false&getVersions=100&wt=javabin&version=2} status=0 QTime=1
   [junit4]   2> 8446022 INFO  (qtp337206290-40083) [n:127.0.0.1:45424_solr c:SearchRateTriggerTest-collection1 s:shard2 r:core_node8 x:SearchRateTriggerTest-collection1_shard2_replica_n7] o.a.s.c.S.Request [SearchRateTriggerTest-collection1_shard2_replica_n7]  webapp=/solr path=/get params={distrib=false&qt=/get&fingerprint=false&getVersions=100&wt=javabin&version=2} status=0 QTime=0
   [junit4]   2> 8446285 INFO  (qtp1465371886-40056) [n:127.0.0.1:43164_solr c:SearchRateTriggerTest-collection1 s:shard2 r:core_node6 x:SearchRateTriggerTest-collection1_shard2_replica_n5] o.a.s.u.PeerSync PeerSync: core=SearchRateTriggerTest-collection1_shard2_replica_n5 url=http://127.0.0.1:43164/solr DONE.  We have no versions.  sync failed.
   [junit4]   2> 8446285 INFO  (qtp1465371886-40056) [n:127.0.0.1:43164_solr c:SearchRateTriggerTest-collection1 s:shard2 r:core_node6 x:SearchRateTriggerTest-collection1_shard2_replica_n5] o.a.s.c.SyncStrategy Leader's attempt to sync with shard failed, moving to the next candidate
   [junit4]   2> 8446285 INFO  (qtp1465371886-40056) [n:127.0.0.1:43164_solr c:SearchRateTriggerTest-collection1 s:shard2 r:core_node6 x:SearchRateTriggerTest-collection1_shard2_replica_n5] o.a.s.c.ShardLeaderElectionContext We failed sync, but we have no versions - we can't sync in that case - we were active before, so become leader anyway
   [junit4]   2> 8446285 INFO  (qtp1465371886-40056) [n:127.0.0.1:43164_solr c:SearchRateTriggerTest-collection1 s:shard2 r:core_node6 x:SearchRateTriggerTest-collection1_shard2_replica_n5] o.a.s.c.ShardLeaderElectionContext Found all replicas participating in election, clear LIR
   [junit4]   2> 8446288 INFO  (qtp1465371886-40056) [n:127.0.0.1:43164_solr c:SearchRateTriggerTest-collection1 s:shard2 r:core_node6 x:SearchRateTriggerTest-collection1_shard2_replica_n5] o.a.s.c.ShardLeaderElectionContext I am the new leader: http://127.0.0.1:43164/solr/SearchRateTriggerTest-collection1_shard2_replica_n5/ shard2
   [junit4]   2> 8446314 INFO  (qtp1681400294-40049) [n:127.0.0.1:43108_solr c:SearchRateTriggerTest-collection1 s:shard1 r:core_node2 x:SearchRateTriggerTest-collection1_shard1_replica_n1] o.a.s.u.PeerSync PeerSync: core=SearchRateTriggerTest-collection1_shard1_replica_n1 url=http://127.0.0.1:43108/solr DONE.  We have no versions.  sync failed.
   [junit4]   2> 8446314 INFO  (qtp1681400294-40049) [n:127.0.0.1:43108_solr c:SearchRateTriggerTest-collection1 s:shard1 r:core_node2 x:SearchRateTriggerTest-collection1_shard1_replica_n1] o.a.s.c.SyncStrategy Leader's attempt to sync with shard failed, moving to the next candidate
   [junit4]   2> 8446314 INFO  (qtp1681400294-40049) [n:127.0.0.1:43108_solr c:SearchRateTriggerTest-collection1 s:shard1 r:core_node2 x:SearchRateTriggerTest-collection1_shard1_replica_n1] o.a.s.c.ShardLeaderElectionContext We failed sync, but we have no versions - we can't sync in that case - we were active before, so become leader anyway
   [junit4]   2> 8446314 INFO  (qtp1681400294-40049) [n:127.0.0.1:43108_solr c:SearchRateTriggerTest-collection1 s:shard1 r:core_node2 x:SearchRateTriggerTest-collection1_shard1_replica_n1] o.a.s.c.ShardLeaderElectionContext Found all replicas participating in election, clear LIR
   [junit4]   2> 8446324 INFO  (qtp1681400294-40049) [n:127.0.0.1:43108_solr c:SearchRateTriggerTest-collection1 s:shard1 r:core_node2 x:SearchRateTriggerTest-collection1_shard1_replica_n1] o.a.s.c.ShardLeaderElectionContext I am the new leader: http://127.0.0.1:43108/solr/SearchRateTriggerTest-collection1_shard1_replica_n1/ shard1
   [junit4]   2> 8446558 INFO  (qtp1681400294-40049) [n:127.0.0.1:43108_solr c:SearchRateTriggerTest-collection1 s:shard1 r:core_node2 x:SearchRateTriggerTest-collection1_shard1_replica_n1] o.a.s.c.ZkController I am the leader, no recovery necessary
   [junit4]   2> 8446558 INFO  (qtp1465371886-40056) [n:127.0.0.1:43164_solr c:SearchRateTriggerTest-collection1 s:shard2 r:core_node6 x:SearchRateTriggerTest-collection1_shard2_replica_n5] o.a.s.c.ZkController I am the leader, no recovery necessary
   [junit4]   2> 8446560 INFO  (qtp1465371886-40056) [n:127.0.0.1:43164_solr c:SearchRateTriggerTest-collection1 s:shard2 r:core_node6 x:SearchRateTriggerTest-collection1_shard2_replica_n5] o.a.s.s.HttpSolrCall [admin] webapp=null path=/admin/cores params={qt=/admin/cores&coreNodeName=core_node6&collection.configName=conf&newCollection=true&name=SearchRateTriggerTest-collection1_shard2_replica_n5&action=CREATE&numShards=2&collection=SearchRateTriggerTest-collection1&shard=shard2&wt=javabin&version=2&replicaType=NRT} status=0 QTime=3658
   [junit4]   2> 8446631 INFO  (qtp1681400294-40049) [n:127.0.0.1:43108_solr c:SearchRateTriggerTest-collection1 s:shard1 r:core_node2 x:SearchRateTriggerTest-collection1_shard1_replica_n1] o.a.s.s.HttpSolrCall [admin] webapp=null path=/admin/cores params={qt=/admin/cores&coreNodeName=core_node2&collection.configName=conf&newCollection=true&name=SearchRateTriggerTest-collection1_shard1_replica_n1&action=CREATE&numShards=2&collection=SearchRateTriggerTest-collection1&shard=shard1&wt=javabin&version=2&replicaType=NRT} status=0 QTime=3831
   [junit4]   2> 8446719 INFO  (qtp504598832-40067) [n:127.0.0.1:42924_solr c:SearchRateTriggerTest-collection1 s:shard1 r:core_node4 x:SearchRateTriggerTest-collection1_shard1_replica_n3] o.a.s.s.HttpSolrCall [admin] webapp=null path=/admin/cores params={qt=/admin/cores&coreNodeName=core_node4&collection.configName=conf&newCollection=true&name=SearchRateTriggerTest-collection1_shard1_replica_n3&action=CREATE&numShards=2&collection=SearchRateTriggerTest-collection1&shard=shard1&wt=javabin&version=2&replicaType=NRT} status=0 QTime=3882
   [junit4]   2> 8446826 INFO  (qtp337206290-40079) [n:127.0.0.1:45424_solr c:SearchRateTriggerTest-collection1 s:shard2 r:core_node8 x:SearchRateTriggerTest-collection1_shard2_replica_n7] o.a.s.s.HttpSolrCall [admin] webapp=null path=/admin/cores params={qt=/admin/cores&coreNodeName=core_node8&collection.configName=conf&newCollection=true&name=SearchRateTriggerTest-collection1_shard2_replica_n7&action=CREATE&numShards=2&collection=SearchRateTriggerTest-collection1&shard=shard2&wt=javabin&version=2&replicaType=NRT} status=0 QTime=3923
   [junit4]   2> 8446926 INFO  (zkCallback-7241-thread-2) [    ] o.a.s.c.c.ZkStateReader A cluster state change: [WatchedEvent state:SyncConnected type:NodeDataChanged path:/collections/SearchRateTriggerTest-collection1/state.json] for collection [SearchRateTriggerTest-collection1] has occurred - updating... (live nodes size: [4])
   [junit4]   2> 8446930 INFO  (zkCallback-7261-thread-1) [    ] o.a.s.c.c.ZkStateReader A cluster state change: [WatchedEvent state:SyncConnected type:NodeDataChanged path:/collections/SearchRateTriggerTest-collection1/state.json] for collection [SearchRateTriggerTest-collection1] has occurred - updating... (live nodes size: [4])
   [junit4]   2> 8446943 INFO  (zkCallback-7259-thread-2) [    ] o.a.s.c.c.ZkStateReader A cluster state change: [WatchedEvent state:SyncConnected type:NodeDataChanged path:/collections/SearchRateTriggerTest-collection1/state.json] for collection [SearchRateTriggerTest-collection1] has occurred - updating... (live nodes size: [4])
   [junit4]   2> 8446951 INFO  (zkCallback-7257-thread-1) [    ] o.a.s.c.c.ZkStateReader A cluster state change: [WatchedEvent state:SyncConnected type:NodeDataChanged path:/collections/SearchRateTriggerTest-collection1/state.json] for collection [SearchRateTriggerTest-collection1] has occurred - updating... (live nodes size: [4])
   [junit4]   2> 8446959 INFO  (qtp1681400294-40045) [n:127.0.0.1:43108_solr    ] o.a.s.h.a.CollectionsHandler Wait for new collection to be active for at most 30 seconds. Check all shard replicas
   [junit4]   2> 8446959 INFO  (qtp1681400294-40045) [n:127.0.0.1:43108_solr    ] o.a.s.s.HttpSolrCall [admin] webapp=null path=/admin/collections params={replicationFactor=2&collection.configName=conf&maxShardsPerNode=1&name=SearchRateTriggerTest-collection1&nrtReplicas=2&action=CREATE&numShards=2&wt=javabin&version=2} status=0 QTime=4703
   [junit4]   2> 8446960 INFO  (qtp1681400294-40047) [n:127.0.0.1:43108_solr    ] o.a.s.h.a.CollectionsHandler Invoked Collection Action :create with params replicationFactor=2&collection.configName=conf&maxShardsPerNode=1&name=SearchRateTriggerTest-collection2&nrtReplicas=2&action=CREATE&numShards=2&wt=javabin&version=2 and sendToOCPQueue=true
   [junit4]   2> 8446997 WARN  (OverseerCollectionConfigSetProcessor-72584199222722566-127.0.0.1:43108_solr-n_0000000000) [    ] o.a.s.c.LockTree lock_is_leaked at[SearchRateTriggerTest-collection1]
   [junit4]   2> 8446998 INFO  (OverseerCollectionConfigSetProcessor-72584199222722566-127.0.0.1:43108_solr-n_0000000000) [    ] o.a.s.c.OverseerTaskQueue Response ZK path: /overseer/collection-queue-work/qnr-0000000000 doesn't exist.  Requestor may have disconnected from ZooKeeper
   [junit4]   2> 8446998 INFO  (OverseerThreadFactory-10085-thread-2) [    ] o.a.s.c.a.c.CreateCollectionCmd Create collection SearchRateTriggerTest-collection2
   [junit4]   2> 8446999 INFO  (OverseerThreadFactory-10085-thread-1) [    ] o.a.s.c.LockTree Unlocked multiple times : SearchRateTriggerTest-collection1
   [junit4]   2> 8447301 INFO  (OverseerStateUpdate-72584199222722566-127.0.0.1:43108_solr-n_0000000000) [    ] o.a.s.c.o.SliceMutator createReplica() {
   [junit4]   2>   "operation":"ADDREPLICA",
   [junit4]   2>   "collection":"SearchRateTriggerTest-collection2",
   [junit4]   2>   "shard":"shard1",
   [junit4]   2>   "core":"SearchRateTriggerTest-collection2_shard1_replica_n1",
   [junit4]   2>   "state":"down",
   [junit4]   2>   "base_url":"http://127.0.0.1:45424/solr",
   [junit4]   2>   "type":"NRT",
   [junit4]   2>   "waitForFinalState":"false"} 
   [junit4]   2> 8447315 INFO  (OverseerStateUpdate-72584199222722566-127.0.0.1:43108_solr-n_0000000000) [    ] o.a.s.c.o.SliceMutator createReplica() {
   [junit4]   2>   "operation":"ADDREPLICA",
   [junit4]   2>   "collection":"SearchRateTriggerTest-collection2",
   [junit4]   2>   "shard":"shard1",
   [junit4]   2>   "core":"SearchRateTriggerTest-collection2_shard1_replica_n2",
   [junit4]   2>   "state":"down",
   [junit4]   2>   "base_url":"http://127.0.0.1:43108/solr",
   [junit4]   2>   "type":"NRT",
   [junit4]   2>   "waitForFinalState":"false"} 
   [junit4]   2> 8447336 INFO  (OverseerStateUpdate-72584199222722566-127.0.0.1:43108_solr-n_0000000000) [    ] o.a.s.c.o.SliceMutator createReplica() {
   [junit4]   2>   "operation":"ADDREPLICA",
   [junit4]   2>   "collection":"SearchRateTriggerTest-collection2",
   [junit4]   2>   "shard":"shard2",
   [junit4]   2>   "core":"SearchRateTriggerTest-collection2_shard2_replica_n4",
   [junit4]   2>   "state":"down",
   [junit4]   2>   "base_url":"http://127.0.0.1:43164/solr",
   [junit4]   2>   "type":"NRT",
   [junit4]   2>   "waitForFinalState":"false"} 
   [junit4]   2> 8447337 INFO  (OverseerStateUpdate-72584199222722566-127.0.0.1:43108_solr-n_0000000000) [    ] o.a.s.c.o.SliceMutator createReplica() {
   [junit4]   2>   "operation":"ADDREPLICA",
   [junit4]   2>   "collection":"SearchRateTriggerTest-collection2",
   [junit4]   2>   "shard":"shard2",
   [junit4]   2>   "core":"SearchRateTriggerTest-collection2_shard2_replica_n5",
   [junit4]   2>   "state":"down",
   [junit4]   2>   "base_url":"http://127.0.0.1:42924/solr",
   [junit4]   2>   "type":"NRT",
   [junit4]   2>   "waitForFinalState":"false"} 
   [junit4]   2> 8447553 INFO  (qtp337206290-40081) [n:127.0.0.1:45424_solr    x:SearchRateTriggerTest-collection2_shard1_replica_n1] o.a.s.h.a.CoreAdminOperation core create command qt=/admin/cores&coreNodeName=core_node3&collection.configName=conf&newCollection=true&name=SearchRateTriggerTest-collection2_shard1_replica_n1&action=CREATE&numShards=2&collection=SearchRateTriggerTest-collection2&shard=shard1&wt=javabin&version=2&replicaType=NRT
   [junit4]   2> 8447554 INFO  (qtp504598832-40069) [n:127.0.0.1:42924_solr    x:SearchRateTriggerTest-collection2_shard2_replica_n5] o.a.s.h.a.CoreAdminOperation core create command qt=/admin/cores&coreNodeName=core_node8&collection.configName=conf&newCollection=true&name=SearchRateTriggerTest-collection2_shard2_replica_n5&action=CREATE&numShards=2&collection=SearchRateTriggerTest-collection2&shard=shard2&wt=javabin&version=2&replicaType=NRT
   [junit4]   2> 8447557 INFO  (qtp1465371886-40058) [n:127.0.0.1:43164_solr    x:SearchRateTriggerTest-collection2_shard2_replica_n4] o.a.s.h.a.CoreAdminOperation core create command qt=/admin/cores&coreNodeName=core_node7&collection.configName=conf&newCollection=true&name=SearchRateTriggerTest-collection2_shard2_replica_n4&action=CREATE&numShards=2&collection=SearchRateTriggerTest-collection2&shard=shard2&wt=javabin&version=2&replicaType=NRT
   [junit4]   2> 8447573 INFO  (qtp1681400294-40044) [n:127.0.0.1:43108_solr    x:SearchRateTriggerTest-collection2_shard1_replica_n2] o.a.s.h.a.CoreAdminOperation core create command qt=/admin/cores&coreNodeName=core_node6&collection.configName=conf&newCollection=true&name=SearchRateTriggerTest-collection2_shard1_replica_n2&action=CREATE&numShards=2&collection=SearchRateTriggerTest-collection2&shard=shard1&wt=javabin&version=2&replicaType=NRT
   [junit4]   2> 8448660 INFO  (qtp504598832-40069) [n:127.0.0.1:42924_solr c:SearchRateTriggerTest-collection2 s:shard2 r:core_node8 x:SearchRateTriggerTest-collection2_shard2_replica_n5] o.a.s.c.SolrConfig Using Lucene MatchVersion: 7.4.0
   [junit4]   2> 8448730 INFO  (qtp504598832-40069) [n:127.0.0.1:42924_solr c:SearchRateTriggerTest-collection2 s:shard2 r:core_node8 x:SearchRateTriggerTest-collection2_shard2_replica_n5] o.a.s.s.IndexSchema [SearchRateTriggerTest-collection2_shard2_replica_n5] Schema name=minimal
   [junit4]   2> 8448732 INFO  (qtp337206290-40081) [n:127.0.0.1:45424_solr c:SearchRateTriggerTest-collection2 s:shard1 r:core_node3 x:SearchRateTriggerTest-collection2_shard1_replica_n1] o.a.s.c.SolrConfig Using Lucene MatchVersion: 7.4.0
   [junit4]   2> 8449027 INFO  (qtp504598832-40069) [n:127.0.0.1:42924_solr c:SearchRateTriggerTest-collection2 s:shard2 r:core_node8 x:SearchRateTriggerTest-collection2_shard2_replica_n5] o.a.s.s.IndexSchema Loaded schema minimal/1.1 with uniqueid field id
   [junit4]   2> 8449027 INFO  (qtp504598832-40069) [n:127.0.0.1:42924_solr c:SearchRateTriggerTest-collection2 s:shard2 r:core_node8 x:SearchRateTriggerTest-collection2_shard2_replica_n5] o.a.s.c.CoreContainer Creating SolrCore 'SearchRateTriggerTest-collection2_shard2_replica_n5' using configuration from collection SearchRateTriggerTest-collection2, trusted=true
   [junit4]   2> 8449028 INFO  (qtp504598832-40069) [n:127.0.0.1:42924_solr c:SearchRateTriggerTest-collection2 s:shard2 r:core_node8 x:SearchRateTriggerTest-collection2_shard2_replica_n5] o.a.s.m.r.SolrJmxReporter JMX monitoring for 'solr_42924.solr.core.SearchRateTriggerTest-collection2.shard2.replica_n5' (registry 'solr.core.SearchRateTriggerTest-collection2.shard2.replica_n5') enabled at server: com.sun.jmx.mbeanserver.JmxMBeanServer@2d509795
   [junit4]   2> 8449028 INFO  (qtp504598832-40069) [n:127.0.0.1:42924_solr c:SearchRateTriggerTest-collection2 s:shard2 r:core_node8 x:SearchRateTriggerTest-collection2_shard2_replica_n5] o.a.s.c.SolrCore solr.RecoveryStrategy.Builder
   [junit4]   2> 8449028 INFO  (qtp504598832-40069) [n:127.0.0.1:42924_solr c:SearchRateTriggerTest-collection2 s:shard2 r:core_node8 x:SearchRateTriggerTest-collection2_shard2_replica_n5] o.a.s.c.SolrCore [[SearchRateTriggerTest-collection2_shard2_replica_n5] ] Opening new SolrCore at [/home/jenkins/jenkins-slave/workspace/Lucene-Solr-NightlyTests-7.x/checkout/solr/build/solr-core/test/J0/temp/solr.cloud.autoscaling.SearchRateTriggerTest_2BF31B11BE1CE9D-001/tempDir-001/node2/SearchRateTriggerTest-collection2_shard2_replica_n5], dataDir=[/home/jenkins/jenkins-slave/workspace/Lucene-Solr-NightlyTests-7.x/checkout/solr/build/solr-core/test/J0/temp/solr.cloud.autoscaling.SearchRateTriggerTest_2BF31B11BE1CE9D-001/tempDir-001/node2/./SearchRateTriggerTest-collection2_shard2_replica_n5/data/]
   [junit4]   2> 8449036 INFO  (qtp337206290-40081) [n:127.0.0.1:45424_solr c:SearchRateTriggerTest-collection2 s:shard1 r:core_node3 x:SearchRateTriggerTest-collection2_shard1_replica_n1] o.a.s.s.IndexSchema [SearchRateTriggerTest-collection2_shard1_replica_n1] Schema name=minimal
   [junit4]   2> 8449038 INFO  (qtp337206290-40081) [n:127.0.0.1:45424_solr c:SearchRateTriggerTest-collection2 s:shard1 r:core_node3 x:SearchRateTriggerTest-collection2_shard1_replica_n1] o.a.s.s.IndexSchema Loaded schema minimal/1.1 with uniqueid field id
   [junit4]   2> 8449038 INFO  (qtp337206290-40081) [n:127.0.0.1:45424_solr c:SearchRateTriggerTest-collection2 s:shard1 r:core_node3 x:SearchRateTriggerTest-collection2_shard1_replica_n1] o.a.s.c.CoreContainer Creating SolrCore 'SearchRateTriggerTest-collection2_shard1_replica_n1' using configuration from collection SearchRateTriggerTest-collection2, trusted=true
   [junit4]   2> 8449038 INFO  (qtp337206290-40081) [n:127.0.0.1:45424_solr c:SearchRateTriggerTest-collection2 s:shard1 r:core_node3 x:SearchRateTriggerTest-collection2_shard1_replica_n1] o.a.s.m.r.SolrJmxReporter JMX monitoring for 'solr_45424.solr.core.SearchRateTriggerTest-collection2.shard1.replica_n1' (registry 'solr.core.SearchRateTriggerTest-collection2.shard1.replica_n1') enabled at server: com.sun.jmx.mbeanserver.JmxMBeanServer@2d509795
   [junit4]   2> 8449038 INFO  (qtp337206290-40081) [n:127.0.0.1:45424_solr c:SearchRateTriggerTest-collection2 s:shard1 r:core_node3 x:SearchRateTriggerTest-collection2_shard1_replica_n1] o.a.s.c.SolrCore solr.RecoveryStrategy.Builder
   [junit4]   2> 8449038 INFO  (qtp337206290-40081) [n:127.0.0.1:45424_solr c:SearchRateTriggerTest-collection2 s:shard1 r:core_node3 x:SearchRateTriggerTest-collection2_shard1_replica_n1] o.a.s.c.SolrCore [[SearchRateTriggerTest-collection2_shard1_replica_n1] ] Opening new SolrCore at [/home/jenkins/jenkins-slave/workspace/Lucene-Solr-NightlyTests-7.x/checkout/solr/build/solr-core/test/J0/temp/solr.cloud.autoscaling.SearchRateTriggerTest_2BF31B11BE1CE9D-001/tempDir-001/node4/SearchRateTriggerTest-collection2_shard1_replica_n1], dataDir=[/home/jenkins/jenkins-slave/workspace/Lucene-Solr-NightlyTests-7.x/checkout/solr/build/solr-core/test/J0/temp/solr.cloud.autoscaling.SearchRateTriggerTest_2BF31B11BE1CE9D-001/tempDir-001/node4/./SearchRateTriggerTest-collection2_shard1_replica_n1/data/]
   [junit4]   2> 8449136 INFO  (qtp1681400294-40044) [n:127.0.0.1:43108_solr c:SearchRateTriggerTest-collection2 s:shard1 r:core_node6 x:SearchRateTriggerTest-collection2_shard1_replica_n2] o.a.s.c.SolrConfig Using Lucene MatchVersion: 7.4.0
   [junit4]   2> 8449139 INFO  (qtp1465371886-40058) [n:127.0.0.1:43164_solr c:SearchRateTriggerTest-collection2 s:shard2 r:core_node7 x:SearchRateTriggerTest-collection2_shard2_replica_n4] o.a.s.c.SolrConfig Using Lucene MatchVersion: 7.4.0
   [junit4]   2> 8449189 INFO  (qtp1465371886-40058) [n:127.0.0.1:43164_solr c:SearchRateTriggerTest-collection2 s:shard2 r:core_node7 x:SearchRateTriggerTest-collection2_shard2_replica_n4] o.a.s.s.IndexSchema [SearchRateTriggerTest-collection2_shard2_replica_n4] Schema name=minimal
   [junit4]   2> 8449207 INFO  (qtp1681400294-40044) [n:127.0.0.1:43108_solr c:SearchRateTriggerTest-collection2 s:shard1 r:core_node6 x:SearchRateTriggerTest-collection2_shard1_replica_n2] o.a.s.s.IndexSchema [SearchRateTriggerTest-collection2_shard1_replica_n2] Schema name=minimal
   [junit4]   2> 8449209 INFO  (qtp1681400294-40044) [n:127.0.0.1:43108_solr c:SearchRateTriggerTest-collection2 s:shard1 r:core_node6 x:SearchRateTriggerTest-collection2_shard1_replica_n2] o.a.s.s.IndexSchema Loaded schema minimal/1.1 with uniqueid field id
   [junit4]   2> 8449209 INFO  (qtp1681400294-40044) [n:127.0.0.1:43108_solr c:SearchRateTriggerTest-collection2 s:shard1 r:core_node6 x:SearchRateTriggerTest-collection2_shard1_replica_n2] o.a.s.c.CoreContainer Creating SolrCore 'SearchRateTriggerTest-collection2_shard1_replica_n2' using configuration from collection SearchRateTriggerTest-collection2, trusted=true
   [junit4]   2> 8449210 INFO  (qtp1681400294-40044) [n:127.0.0.1:43108_solr c:SearchRateTriggerTest-collection2 s:shard1 r:core_node6 x:SearchRateTriggerTest-collection2_shard1_replica_n2] o.a.s.m.r.SolrJmxReporter JMX monitoring for 'solr_43108.solr.core.SearchRateTriggerTest-collection2.shard1.replica_n2' (registry 'solr.core.SearchRateTriggerTest-collection2.shard1.replica_n2') enabled at server: com.sun.jmx.mbeanserver.JmxMBeanServer@2d509795
   [junit4]   2> 8449225 INFO  (qtp1465371886-40058) [n:127.0.0.1:43164_solr c:SearchRateTriggerTest-collection2 s:shard2 r:core_node7 x:SearchRateTriggerTest-collection2_shard2_replica_n4] o.a.s.s.IndexSchema Loaded schema minimal/1.1 with uniqueid field id
   [junit4]   2> 8449242 INFO  (qtp1465371886-40058) [n:127.0.0.1:43164_solr c:SearchRateTriggerTest-collection2 s:shard2 r:core_node7 x:SearchRateTriggerTest-collection2_shard2_replica_n4] o.a.s.c.CoreContainer Creating SolrCore 'SearchRateTriggerTest-collection2_shard2_replica_n4' using configuration from collection SearchRateTriggerTest-collection2, trusted=true
   [junit4]   2> 8449243 INFO  (qtp1465371886-40058) [n:127.0.0.1:43164_solr c:SearchRateTriggerTest-collection2 s:shard2 r:core_node7 x:SearchRateTriggerTest-collection2_shard2_replica_n4] o.a.s.m.r.SolrJmxReporter JMX monitoring for 'solr_43164.solr.core.SearchRateTriggerTest-collection2.shard2.replica_n4' (registry 'solr.core.SearchRateTriggerTest-collection2.shard2.replica_n4') enabled at server: com.sun.jmx.mbeanserver.JmxMBeanServer@2d509795
   [junit4]   2> 8449243 INFO  (qtp1465371886-40058) [n:127.0.0.1:43164_solr c:SearchRateTriggerTest-collection2 s:shard2 r:core_node7 x:SearchRateTriggerTest-collection2_shard2_replica_n4] o.a.s.c.SolrCore solr.RecoveryStrategy.Builder
   [junit4]   2> 8449243 INFO  (qtp1465371886-40058) [n:127.0.0.1:43164_solr c:SearchRateTriggerTest-collection2 s:shard2 r:core_node7 x:SearchRateTriggerTest-collection2_shard2_replica_n4] o.a.s.c.SolrCore [[SearchRateTriggerTest-collection2_shard2_replica_n4] ] Opening new SolrCore at [/home/jenkins/jenkins-slave/workspace/Lucene-Solr-NightlyTests-7.x/checkout/solr/build/solr-core/test/J0/temp/solr.cloud.autoscaling.SearchRateTriggerTest_2BF31B11BE1CE9D-001/tempDir-001/node3/SearchRateTriggerTest-collection2_shard2_replica_n4], dataDir=[/home/jenkins/jenkins-slave/workspace/Lucene-Solr-NightlyTests-7.x/checkout/solr/build/solr-core/test/J0/temp/solr.cloud.autoscaling.SearchRateTriggerTest_2BF31B11BE1CE9D-001/tempDir-001/node3/./SearchRateTriggerTest-collection2_shard2_replica_n4/data/]
   [junit4]   2> 8449246 INFO  (qtp1681400294-40044) [n:127.0.0.1:43108_solr c:SearchRateTriggerTest-collection2 s:shard1 r:core_node6 x:SearchRateTriggerTest-collection2_shard1_replica_n2] o.a.s.c.SolrCore solr.RecoveryStrategy.Builder
   [junit4]   2> 8449246 INFO  (qtp1681400294-40044) [n:127.0.0.1:43108_solr c:SearchRateTriggerTest-collection2 s:shard1 r:core_node6 x:SearchRateTriggerTest-collection2_shard1_replica_n2] o.a.s.c.SolrCore [[SearchRateTriggerTest-collection2_shard1_replica_n2] ] Opening new SolrCore at [/home/jenkins/jenkins-slave/workspace/Lucene-Solr-NightlyTests-7.x/checkout/solr/build/solr-core/test/J0/temp/solr.cloud.autoscaling.SearchRateTriggerTest_2BF31B11BE1CE9D-001/tempDir-001/node1/SearchRateTriggerTest-collection2_shard1_replica_n2], dataDir=[/home/jenkins/jenkins-slave/workspace/Lucene-Solr-NightlyTests-7.x/checkout/solr/build/solr-core/test/J0/temp/solr.cloud.autoscaling.SearchRateTriggerTest_2BF31B11BE1CE9D-001/tempDir-001/node1/./SearchRateTriggerTest-collection2_shard1_replica_n2/data/]
   [junit4]   2> 8449576 INFO  (qtp504598832-40069) [n:127.0.0.1:42924_solr c:SearchRateTriggerTest-collection2 s:shard2 r:core_node8 x:SearchRateTriggerTest-collection2_shard2_replica_n5] o.a.s.u.UpdateHandler Using UpdateLog implementation: org.apache.solr.update.UpdateLog
   [junit4]   2> 8449576 INFO  (qtp504598832-40069) [n:127.0.0.1:42924_solr c:SearchRateTriggerTest-collection2 s:shard2 r:core_node8 x:SearchRateTriggerTest-collection2_shard2_replica_n5] o.a.s.u.UpdateLog Initializing UpdateLog: dataDir=null defaultSyncLevel=FLUSH numRecordsToKeep=100 maxNumLogsToKeep=10 numVersionBuckets=65536
   [junit4]   2> 8449934 INFO  (qtp504598832-40069) [n:127.0.0.1:42924_solr c:SearchRateTriggerTest-collection2 s:shard2 r:core_node8 x:SearchRateTriggerTest-collection2_shard2_replica_n5] o.a.s.u.CommitTracker Hard AutoCommit: disabled
   [junit4]   2> 8449934 INFO  (qtp504598832-40069) [n:127.0.0.1:42924_solr c:SearchRateTriggerTest-collection2 s:shard2 r:core_node8 x:SearchRateTriggerTest-collection2_shard2_replica_n5] o.a.s.u.CommitTracker Soft AutoCommit: disabled
   [junit4]   2> 8449956 INFO  (qtp337206290-40081) [n:127.0.0.1:45424_solr c:SearchRateTriggerTest-collection2 s:shard1 r:core_node3 x:SearchRateTriggerTest-collection2_shard1_replica_n1] o.a.s.u.UpdateHandler Using UpdateLog implementation: org.apache.solr.update.UpdateLog
   [junit4]   2> 8449956 INFO  (qtp337206290-40081) [n:127.0.0.1:45424_solr c:SearchRateTriggerTest-collection2 s:shard1 r:core_node3 x:SearchRateTriggerTest-collection2_shard1_replica_n1] o.a.s.u.UpdateLog Initializing UpdateLog: dataDir=null defaultSyncLevel=FLUSH numRecordsToKeep=100 maxNumLogsToKeep=10 numVersionBuckets=65536
   [junit4]   2> 8449971 INFO  (qtp504598832-40069) [n:127.0.0.1:42924_solr c:SearchRateTriggerTest-collection2 s:shard2 r:core_node8 x:SearchRateTriggerTest-collection2_shard2_replica_n5] o.a.s.s.SolrIndexSearcher Opening [Searcher@2e4065a2[SearchRateTriggerTest-collection2_shard2_replica_n5] main]
   [junit4]   2> 8449973 INFO  (qtp337206290-40081) [n:127.0.0.1:45424_solr c:SearchRateTriggerTest-collection2 s:shard1 r:core_node3 x:SearchRateTriggerTest-collection2_shard1_replica_n1] o.a.s.u.CommitTracker Hard AutoCommit: disabled
   [junit4]   2> 8449973 INFO  (qtp337206290-40081) [n:127.0.0.1:45424_solr c:SearchRateTriggerTest-collection2 s:shard1 r:core_node3 x:SearchRateTriggerTest-collection2_shard1_replica_n1] o.a.s.u.CommitTracker Soft AutoCommit: disabled
   [junit4]   2> 8449975 INFO  (qtp337206290-40081) [n:127.0.0.1:45424_solr c:SearchRateTriggerTest-collection2 s:shard1 r:core_node3 x:SearchRateTriggerTest-collection2_shard1_replica_n1] o.a.s.s.SolrIndexSearcher Opening [Searcher@20997af0[SearchRateTriggerTest-collection2_shard1_replica_n1] main]
   [junit4]   2> 8449990 INFO  (qtp504598832-40069) [n:127.0.0.1:42924_solr c:SearchRateTriggerTest-collection2 s:shard2 r:core_node8 x:SearchRateTriggerTest-collection2_shard2_replica_n5] o.a.s.r.ManagedResourceStorage Configured ZooKeeperStorageIO with znodeBase: /configs/conf
   [junit4]   2> 8449990 INFO  (qtp337206290-40081) [n:127.0.0.1:45424_solr c:SearchRateTriggerTest-collection2 s:shard1 r:core_node3 x:SearchRateTriggerTest-collection2_shard1_replica_n1] o.a.s.r.ManagedResourceStorage Configured ZooKeeperStorageIO with znodeBase: /configs/conf
   [junit4]   2> 8449990 INFO  (qtp504598832-40069) [n:127.0.0.1:42924_solr c:SearchRateTriggerTest-collection2 s:shard2 r:core_node8 x:SearchRateTriggerTest-collection2_shard2_replica_n5] o.a.s.r.ManagedResourceStorage Loaded null at path _rest_managed.json using ZooKeeperStorageIO:path=/configs/conf
   [junit4]   2> 8449991 INFO  (qtp504598832-40069) [n:127.0.0.1:42924_solr c:SearchRateTriggerTest-collection2 s:shard2 r:core_node8 x:SearchRateTriggerTest-collection2_shard2_replica_n5] o.a.s.h.ReplicationHandler Commits will be reserved for 10000ms.
   [junit4]   2> 8449991 INFO  (qtp504598832-40069) [n:127.0.0.1:42924_solr c:SearchRateTrigger

[...truncated too long message...]

-check:
[loadresource] Do not set property disallowed.ivy.jars.list as its length is 0.

-ivy-fail-disallowed-ivy-version:

ivy-fail:

ivy-configure:
[ivy:configure] :: loading settings :: file = /home/jenkins/jenkins-slave/workspace/Lucene-Solr-NightlyTests-7.x/checkout/lucene/top-level-ivy-settings.xml

resolve:

ivy-availability-check:
[loadresource] Do not set property disallowed.ivy.jars.list as its length is 0.

-ivy-fail-disallowed-ivy-version:

ivy-fail:

ivy-configure:
[ivy:configure] :: loading settings :: file = /home/jenkins/jenkins-slave/workspace/Lucene-Solr-NightlyTests-7.x/checkout/lucene/top-level-ivy-settings.xml

resolve:

ivy-availability-check:
[loadresource] Do not set property disallowed.ivy.jars.list as its length is 0.

-ivy-fail-disallowed-ivy-version:

ivy-fail:

ivy-configure:
[ivy:configure] :: loading settings :: file = /home/jenkins/jenkins-slave/workspace/Lucene-Solr-NightlyTests-7.x/checkout/lucene/top-level-ivy-settings.xml

resolve:

jar-checksums:
    [mkdir] Created dir: /home/jenkins/jenkins-slave/workspace/Lucene-Solr-NightlyTests-7.x/checkout/lucene/null1554089890
     [copy] Copying 40 files to /home/jenkins/jenkins-slave/workspace/Lucene-Solr-NightlyTests-7.x/checkout/lucene/null1554089890
   [delete] Deleting directory /home/jenkins/jenkins-slave/workspace/Lucene-Solr-NightlyTests-7.x/checkout/lucene/null1554089890

resolve-example:

ivy-availability-check:
[loadresource] Do not set property disallowed.ivy.jars.list as its length is 0.

-ivy-fail-disallowed-ivy-version:

ivy-fail:

ivy-configure:
[ivy:configure] :: loading settings :: file = /home/jenkins/jenkins-slave/workspace/Lucene-Solr-NightlyTests-7.x/checkout/lucene/top-level-ivy-settings.xml

resolve:

resolve-server:

ivy-availability-check:
[loadresource] Do not set property disallowed.ivy.jars.list as its length is 0.

-ivy-fail-disallowed-ivy-version:

ivy-fail:

ivy-fail:

ivy-configure:
[ivy:configure] :: loading settings :: file = /home/jenkins/jenkins-slave/workspace/Lucene-Solr-NightlyTests-7.x/checkout/lucene/top-level-ivy-settings.xml

resolve:

resolve:

ivy-availability-check:
[loadresource] Do not set property disallowed.ivy.jars.list as its length is 0.

-ivy-fail-disallowed-ivy-version:

ivy-fail:

ivy-fail:

ivy-configure:
[ivy:configure] :: loading settings :: file = /home/jenkins/jenkins-slave/workspace/Lucene-Solr-NightlyTests-7.x/checkout/lucene/top-level-ivy-settings.xml

resolve:

ivy-availability-check:
[loadresource] Do not set property disallowed.ivy.jars.list as its length is 0.

-ivy-fail-disallowed-ivy-version:

ivy-fail:

ivy-fail:

ivy-configure:
[ivy:configure] :: loading settings :: file = /home/jenkins/jenkins-slave/workspace/Lucene-Solr-NightlyTests-7.x/checkout/lucene/top-level-ivy-settings.xml

resolve:

ivy-availability-check:
[loadresource] Do not set property disallowed.ivy.jars.list as its length is 0.

-ivy-fail-disallowed-ivy-version:

ivy-fail:

ivy-configure:
[ivy:configure] :: loading settings :: file = /home/jenkins/jenkins-slave/workspace/Lucene-Solr-NightlyTests-7.x/checkout/lucene/top-level-ivy-settings.xml

resolve:

ivy-availability-check:
[loadresource] Do not set property disallowed.ivy.jars.list as its length is 0.

-ivy-fail-disallowed-ivy-version:

ivy-fail:

ivy-fail:

ivy-configure:
[ivy:configure] :: loading settings :: file = /home/jenkins/jenkins-slave/workspace/Lucene-Solr-NightlyTests-7.x/checkout/lucene/top-level-ivy-settings.xml

resolve:

ivy-availability-check:
[loadresource] Do not set property disallowed.ivy.jars.list as its length is 0.

-ivy-fail-disallowed-ivy-version:

ivy-fail:

ivy-configure:
[ivy:configure] :: loading settings :: file = /home/jenkins/jenkins-slave/workspace/Lucene-Solr-NightlyTests-7.x/checkout/lucene/top-level-ivy-settings.xml

resolve:

ivy-availability-check:
[loadresource] Do not set property disallowed.ivy.jars.list as its length is 0.

-ivy-fail-disallowed-ivy-version:

ivy-fail:

ivy-fail:

ivy-configure:
[ivy:configure] :: loading settings :: file = /home/jenkins/jenkins-slave/workspace/Lucene-Solr-NightlyTests-7.x/checkout/lucene/top-level-ivy-settings.xml

resolve:

ivy-availability-check:
[loadresource] Do not set property disallowed.ivy.jars.list as its length is 0.

-ivy-fail-disallowed-ivy-version:

ivy-fail:

ivy-fail:

ivy-configure:
[ivy:configure] :: loading settings :: file = /home/jenkins/jenkins-slave/workspace/Lucene-Solr-NightlyTests-7.x/checkout/lucene/top-level-ivy-settings.xml

resolve:

ivy-availability-check:
[loadresource] Do not set property disallowed.ivy.jars.list as its length is 0.

-ivy-fail-disallowed-ivy-version:

ivy-fail:

ivy-fail:

ivy-configure:
[ivy:configure] :: loading settings :: file = /home/jenkins/jenkins-slave/workspace/Lucene-Solr-NightlyTests-7.x/checkout/lucene/top-level-ivy-settings.xml

resolve:

ivy-availability-check:
[loadresource] Do not set property disallowed.ivy.jars.list as its length is 0.

-ivy-fail-disallowed-ivy-version:

ivy-fail:

ivy-fail:

ivy-configure:
[ivy:configure] :: loading settings :: file = /home/jenkins/jenkins-slave/workspace/Lucene-Solr-NightlyTests-7.x/checkout/lucene/top-level-ivy-settings.xml

resolve:

ivy-availability-check:
[loadresource] Do not set property disallowed.ivy.jars.list as its length is 0.

-ivy-fail-disallowed-ivy-version:

ivy-fail:

ivy-fail:

ivy-configure:
[ivy:configure] :: loading settings :: file = /home/jenkins/jenkins-slave/workspace/Lucene-Solr-NightlyTests-7.x/checkout/lucene/top-level-ivy-settings.xml

resolve:

ivy-availability-check:
[loadresource] Do not set property disallowed.ivy.jars.list as its length is 0.

-ivy-fail-disallowed-ivy-version:

ivy-fail:

ivy-fail:

ivy-configure:
[ivy:configure] :: loading settings :: file = /home/jenkins/jenkins-slave/workspace/Lucene-Solr-NightlyTests-7.x/checkout/lucene/top-level-ivy-settings.xml

resolve:

ivy-availability-check:
[loadresource] Do not set property disallowed.ivy.jars.list as its length is 0.

-ivy-fail-disallowed-ivy-version:

ivy-fail:

ivy-fail:

ivy-configure:
[ivy:configure] :: loading settings :: file = /home/jenkins/jenkins-slave/workspace/Lucene-Solr-NightlyTests-7.x/checkout/lucene/top-level-ivy-settings.xml

resolve:

ivy-availability-check:
[loadresource] Do not set property disallowed.ivy.jars.list as its length is 0.

-ivy-fail-disallowed-ivy-version:

ivy-fail:

ivy-fail:

ivy-configure:
[ivy:configure] :: loading settings :: file = /home/jenkins/jenkins-slave/workspace/Lucene-Solr-NightlyTests-7.x/checkout/lucene/top-level-ivy-settings.xml

resolve:

ivy-availability-check:
[loadresource] Do not set property disallowed.ivy.jars.list as its length is 0.

-ivy-fail-disallowed-ivy-version:

ivy-fail:

ivy-fail:

ivy-configure:
[ivy:configure] :: loading settings :: file = /home/jenkins/jenkins-slave/workspace/Lucene-Solr-NightlyTests-7.x/checkout/lucene/top-level-ivy-settings.xml

resolve:

ivy-availability-check:
[loadresource] Do not set property disallowed.ivy.jars.list as its length is 0.

-ivy-fail-disallowed-ivy-version:

ivy-fail:

ivy-fail:

ivy-configure:
[ivy:configure] :: loading settings :: file = /home/jenkins/jenkins-slave/workspace/Lucene-Solr-NightlyTests-7.x/checkout/lucene/top-level-ivy-settings.xml

resolve:

ivy-availability-check:
[loadresource] Do not set property disallowed.ivy.jars.list as its length is 0.

-ivy-fail-disallowed-ivy-version:

ivy-fail:

ivy-fail:

ivy-configure:
[ivy:configure] :: loading settings :: file = /home/jenkins/jenkins-slave/workspace/Lucene-Solr-NightlyTests-7.x/checkout/lucene/top-level-ivy-settings.xml

resolve:

jar-checksums:
    [mkdir] Created dir: /home/jenkins/jenkins-slave/workspace/Lucene-Solr-NightlyTests-7.x/checkout/solr/null1550247168
     [copy] Copying 246 files to /home/jenkins/jenkins-slave/workspace/Lucene-Solr-NightlyTests-7.x/checkout/solr/null1550247168
   [delete] Deleting directory /home/jenkins/jenkins-slave/workspace/Lucene-Solr-NightlyTests-7.x/checkout/solr/null1550247168

check-working-copy:
[ivy:cachepath] :: resolving dependencies :: org.eclipse.jgit#org.eclipse.jgit-caller;working
[ivy:cachepath] 	confs: [default]
[ivy:cachepath] 	found org.eclipse.jgit#org.eclipse.jgit;4.6.0.201612231935-r in public
[ivy:cachepath] 	found com.jcraft#jsch;0.1.53 in public
[ivy:cachepath] 	found com.googlecode.javaewah#JavaEWAH;1.1.6 in public
[ivy:cachepath] 	found org.apache.httpcomponents#httpclient;4.3.6 in public
[ivy:cachepath] 	found org.apache.httpcomponents#httpcore;4.3.3 in public
[ivy:cachepath] 	found commons-logging#commons-logging;1.1.3 in public
[ivy:cachepath] 	found commons-codec#commons-codec;1.6 in public
[ivy:cachepath] 	found org.slf4j#slf4j-api;1.7.2 in public
[ivy:cachepath] :: resolution report :: resolve 50ms :: artifacts dl 13ms
	---------------------------------------------------------------------
	|                  |            modules            ||   artifacts   |
	|       conf       | number| search|dwnlded|evicted|| number|dwnlded|
	---------------------------------------------------------------------
	|      default     |   8   |   0   |   0   |   0   ||   8   |   0   |
	---------------------------------------------------------------------
[wc-checker] Initializing working copy...
[wc-checker] SLF4J: Failed to load class "org.slf4j.impl.StaticLoggerBinder".
[wc-checker] SLF4J: Defaulting to no-operation (NOP) logger implementation
[wc-checker] SLF4J: See http://www.slf4j.org/codes.html#StaticLoggerBinder for further details.
[wc-checker] Checking working copy status...

-jenkins-base:

BUILD SUCCESSFUL
Total time: 658 minutes 34 seconds
Archiving artifacts
WARN: No artifacts found that match the file pattern "**/*.events,heapdumps/**,**/hs_err_pid*". Configuration error?
WARN: java.lang.InterruptedException: no matches found within 10000
Recording test results
Build step 'Publish JUnit test result report' changed build result to UNSTABLE
Email was triggered for: Unstable (Test Failures)
Sending email for trigger: Unstable (Test Failures)

Mime
View raw message