lucene-dev mailing list archives

Site index · List index
Message view « Date » · « Thread »
Top « Date » · « Thread »
From Policeman Jenkins Server <jenk...@thetaphi.de>
Subject [JENKINS] Lucene-Solr-7.x-Windows (64bit/jdk1.8.0_172) - Build # 612 - Still Unstable!
Date Fri, 25 May 2018 01:51:04 GMT
Build: https://jenkins.thetaphi.de/job/Lucene-Solr-7.x-Windows/612/
Java: 64bit/jdk1.8.0_172 -XX:+UseCompressedOops -XX:+UseConcMarkSweepGC

1 tests failed.
FAILED:  org.apache.solr.update.MaxSizeAutoCommitTest.deleteTest

Error Message:
Tlog size exceeds the max size bound. Tlog path: C:\Users\jenkins\workspace\Lucene-Solr-7.x-Windows\solr\build\solr-core\test\J0\temp\solr.update.MaxSizeAutoCommitTest_1D557C9C97F6BEEF-001\init-core-data-001\tlog\tlog.0000000000000000002, tlog size: 1301

Stack Trace:
java.lang.AssertionError: Tlog size exceeds the max size bound. Tlog path: C:\Users\jenkins\workspace\Lucene-Solr-7.x-Windows\solr\build\solr-core\test\J0\temp\solr.update.MaxSizeAutoCommitTest_1D557C9C97F6BEEF-001\init-core-data-001\tlog\tlog.0000000000000000002, tlog size: 1301
	at __randomizedtesting.SeedInfo.seed([1D557C9C97F6BEEF:D1B9963EC58871E]:0)
	at org.junit.Assert.fail(Assert.java:93)
	at org.junit.Assert.assertTrue(Assert.java:43)
	at org.apache.solr.update.MaxSizeAutoCommitTest.getTlogFileSizes(MaxSizeAutoCommitTest.java:379)
	at org.apache.solr.update.MaxSizeAutoCommitTest.deleteTest(MaxSizeAutoCommitTest.java:200)
	at sun.reflect.NativeMethodAccessorImpl.invoke0(Native Method)
	at sun.reflect.NativeMethodAccessorImpl.invoke(NativeMethodAccessorImpl.java:62)
	at sun.reflect.DelegatingMethodAccessorImpl.invoke(DelegatingMethodAccessorImpl.java:43)
	at java.lang.reflect.Method.invoke(Method.java:498)
	at com.carrotsearch.randomizedtesting.RandomizedRunner.invoke(RandomizedRunner.java:1737)
	at com.carrotsearch.randomizedtesting.RandomizedRunner$8.evaluate(RandomizedRunner.java:934)
	at com.carrotsearch.randomizedtesting.RandomizedRunner$9.evaluate(RandomizedRunner.java:970)
	at com.carrotsearch.randomizedtesting.RandomizedRunner$10.evaluate(RandomizedRunner.java:984)
	at com.carrotsearch.randomizedtesting.rules.SystemPropertiesRestoreRule$1.evaluate(SystemPropertiesRestoreRule.java:57)
	at org.apache.lucene.util.TestRuleSetupTeardownChained$1.evaluate(TestRuleSetupTeardownChained.java:49)
	at org.apache.lucene.util.AbstractBeforeAfterRule$1.evaluate(AbstractBeforeAfterRule.java:45)
	at org.apache.lucene.util.TestRuleThreadAndTestName$1.evaluate(TestRuleThreadAndTestName.java:48)
	at org.apache.lucene.util.TestRuleIgnoreAfterMaxFailures$1.evaluate(TestRuleIgnoreAfterMaxFailures.java:64)
	at org.apache.lucene.util.TestRuleMarkFailure$1.evaluate(TestRuleMarkFailure.java:47)
	at com.carrotsearch.randomizedtesting.rules.StatementAdapter.evaluate(StatementAdapter.java:36)
	at com.carrotsearch.randomizedtesting.ThreadLeakControl$StatementRunner.run(ThreadLeakControl.java:368)
	at com.carrotsearch.randomizedtesting.ThreadLeakControl.forkTimeoutingTask(ThreadLeakControl.java:817)
	at com.carrotsearch.randomizedtesting.ThreadLeakControl$3.evaluate(ThreadLeakControl.java:468)
	at com.carrotsearch.randomizedtesting.RandomizedRunner.runSingleTest(RandomizedRunner.java:943)
	at com.carrotsearch.randomizedtesting.RandomizedRunner$5.evaluate(RandomizedRunner.java:829)
	at com.carrotsearch.randomizedtesting.RandomizedRunner$6.evaluate(RandomizedRunner.java:879)
	at com.carrotsearch.randomizedtesting.RandomizedRunner$7.evaluate(RandomizedRunner.java:890)
	at com.carrotsearch.randomizedtesting.rules.StatementAdapter.evaluate(StatementAdapter.java:36)
	at com.carrotsearch.randomizedtesting.rules.SystemPropertiesRestoreRule$1.evaluate(SystemPropertiesRestoreRule.java:57)
	at org.apache.lucene.util.AbstractBeforeAfterRule$1.evaluate(AbstractBeforeAfterRule.java:45)
	at com.carrotsearch.randomizedtesting.rules.StatementAdapter.evaluate(StatementAdapter.java:36)
	at org.apache.lucene.util.TestRuleStoreClassName$1.evaluate(TestRuleStoreClassName.java:41)
	at com.carrotsearch.randomizedtesting.rules.NoShadowingOrOverridesOnMethodsRule$1.evaluate(NoShadowingOrOverridesOnMethodsRule.java:40)
	at com.carrotsearch.randomizedtesting.rules.NoShadowingOrOverridesOnMethodsRule$1.evaluate(NoShadowingOrOverridesOnMethodsRule.java:40)
	at com.carrotsearch.randomizedtesting.rules.StatementAdapter.evaluate(StatementAdapter.java:36)
	at com.carrotsearch.randomizedtesting.rules.StatementAdapter.evaluate(StatementAdapter.java:36)
	at com.carrotsearch.randomizedtesting.rules.StatementAdapter.evaluate(StatementAdapter.java:36)
	at org.apache.lucene.util.TestRuleAssertionsRequired$1.evaluate(TestRuleAssertionsRequired.java:53)
	at org.apache.lucene.util.TestRuleMarkFailure$1.evaluate(TestRuleMarkFailure.java:47)
	at org.apache.lucene.util.TestRuleIgnoreAfterMaxFailures$1.evaluate(TestRuleIgnoreAfterMaxFailures.java:64)
	at org.apache.lucene.util.TestRuleIgnoreTestSuites$1.evaluate(TestRuleIgnoreTestSuites.java:54)
	at com.carrotsearch.randomizedtesting.rules.StatementAdapter.evaluate(StatementAdapter.java:36)
	at com.carrotsearch.randomizedtesting.ThreadLeakControl$StatementRunner.run(ThreadLeakControl.java:368)
	at java.lang.Thread.run(Thread.java:748)




Build Log:
[...truncated 15284 lines...]
   [junit4] Suite: org.apache.solr.update.MaxSizeAutoCommitTest
   [junit4]   2> Creating dataDir: C:\Users\jenkins\workspace\Lucene-Solr-7.x-Windows\solr\build\solr-core\test\J0\temp\solr.update.MaxSizeAutoCommitTest_1D557C9C97F6BEEF-001\init-core-data-001
   [junit4]   2> 3485461 WARN  (SUITE-MaxSizeAutoCommitTest-seed#[1D557C9C97F6BEEF]-worker) [    ] o.a.s.SolrTestCaseJ4 startTrackingSearchers: numOpens=14 numCloses=14
   [junit4]   2> 3485461 INFO  (SUITE-MaxSizeAutoCommitTest-seed#[1D557C9C97F6BEEF]-worker) [    ] o.a.s.SolrTestCaseJ4 Using PointFields (NUMERIC_POINTS_SYSPROP=true) w/NUMERIC_DOCVALUES_SYSPROP=true
   [junit4]   2> 3485465 INFO  (SUITE-MaxSizeAutoCommitTest-seed#[1D557C9C97F6BEEF]-worker) [    ] o.a.s.SolrTestCaseJ4 Randomized ssl (false) and clientAuth (false) via: @org.apache.solr.util.RandomizeSSL(reason=, value=NaN, ssl=NaN, clientAuth=NaN)
   [junit4]   2> 3485465 INFO  (SUITE-MaxSizeAutoCommitTest-seed#[1D557C9C97F6BEEF]-worker) [    ] o.a.s.SolrTestCaseJ4 SecureRandom sanity checks: test.solr.allowed.securerandom=null & java.security.egd=file:/dev/./urandom
   [junit4]   2> 3485467 INFO  (TEST-MaxSizeAutoCommitTest.testRedundantDeletes-seed#[1D557C9C97F6BEEF]) [    ] o.a.s.SolrTestCaseJ4 ###Starting testRedundantDeletes
   [junit4]   2> 3486208 INFO  (TEST-MaxSizeAutoCommitTest.testRedundantDeletes-seed#[1D557C9C97F6BEEF]) [    ] o.a.s.SolrTestCaseJ4 ####initCore
   [junit4]   2> 3486209 INFO  (TEST-MaxSizeAutoCommitTest.testRedundantDeletes-seed#[1D557C9C97F6BEEF]) [    ] o.a.s.c.SolrResourceLoader [null] Added 2 libs to classloader, from paths: [/C:/Users/jenkins/workspace/Lucene-Solr-7.x-Windows/solr/core/src/test-files/solr/collection1/lib, /C:/Users/jenkins/workspace/Lucene-Solr-7.x-Windows/solr/core/src/test-files/solr/collection1/lib/classes]
   [junit4]   2> 3486257 INFO  (TEST-MaxSizeAutoCommitTest.testRedundantDeletes-seed#[1D557C9C97F6BEEF]) [    ] o.a.s.c.SolrConfig Using Lucene MatchVersion: 7.4.0
   [junit4]   2> 3486267 INFO  (TEST-MaxSizeAutoCommitTest.testRedundantDeletes-seed#[1D557C9C97F6BEEF]) [    ] o.a.s.s.IndexSchema [null] Schema name=test
   [junit4]   2> 3486347 INFO  (TEST-MaxSizeAutoCommitTest.testRedundantDeletes-seed#[1D557C9C97F6BEEF]) [    ] o.a.s.s.IndexSchema Loaded schema test/1.0 with uniqueid field id
   [junit4]   2> 3486430 INFO  (TEST-MaxSizeAutoCommitTest.testRedundantDeletes-seed#[1D557C9C97F6BEEF]) [    ] o.a.s.m.r.SolrJmxReporter JMX monitoring for 'solr.node' (registry 'solr.node') enabled at server: com.sun.jmx.mbeanserver.JmxMBeanServer@712b983
   [junit4]   2> 3486436 INFO  (TEST-MaxSizeAutoCommitTest.testRedundantDeletes-seed#[1D557C9C97F6BEEF]) [    ] o.a.s.m.r.SolrJmxReporter JMX monitoring for 'solr.jvm' (registry 'solr.jvm') enabled at server: com.sun.jmx.mbeanserver.JmxMBeanServer@712b983
   [junit4]   2> 3486437 INFO  (TEST-MaxSizeAutoCommitTest.testRedundantDeletes-seed#[1D557C9C97F6BEEF]) [    ] o.a.s.m.r.SolrJmxReporter JMX monitoring for 'solr.jetty' (registry 'solr.jetty') enabled at server: com.sun.jmx.mbeanserver.JmxMBeanServer@712b983
   [junit4]   2> 3486442 INFO  (coreLoadExecutor-12518-thread-1) [    ] o.a.s.c.TransientSolrCoreCacheDefault Allocating transient cache for 2147483647 transient cores
   [junit4]   2> 3486443 INFO  (coreLoadExecutor-12518-thread-1) [    x:collection1] o.a.s.c.SolrResourceLoader [null] Added 2 libs to classloader, from paths: [/C:/Users/jenkins/workspace/Lucene-Solr-7.x-Windows/solr/core/src/test-files/solr/collection1/lib, /C:/Users/jenkins/workspace/Lucene-Solr-7.x-Windows/solr/core/src/test-files/solr/collection1/lib/classes]
   [junit4]   2> 3486522 INFO  (coreLoadExecutor-12518-thread-1) [    x:collection1] o.a.s.c.SolrConfig Using Lucene MatchVersion: 7.4.0
   [junit4]   2> 3486535 INFO  (coreLoadExecutor-12518-thread-1) [    x:collection1] o.a.s.s.IndexSchema [collection1] Schema name=test
   [junit4]   2> 3486653 INFO  (coreLoadExecutor-12518-thread-1) [    x:collection1] o.a.s.s.IndexSchema Loaded schema test/1.0 with uniqueid field id
   [junit4]   2> 3486668 INFO  (coreLoadExecutor-12518-thread-1) [    x:collection1] o.a.s.c.CoreContainer Creating SolrCore 'collection1' using configuration from instancedir C:\Users\jenkins\workspace\Lucene-Solr-7.x-Windows\solr\core\src\test-files\solr\collection1, trusted=true
   [junit4]   2> 3486668 INFO  (coreLoadExecutor-12518-thread-1) [    x:collection1] o.a.s.m.r.SolrJmxReporter JMX monitoring for 'solr.core.collection1' (registry 'solr.core.collection1') enabled at server: com.sun.jmx.mbeanserver.JmxMBeanServer@712b983
   [junit4]   2> 3486668 INFO  (coreLoadExecutor-12518-thread-1) [    x:collection1] o.a.s.c.SolrCore solr.RecoveryStrategy.Builder
   [junit4]   2> 3486669 INFO  (coreLoadExecutor-12518-thread-1) [    x:collection1] o.a.s.c.SolrCore [[collection1] ] Opening new SolrCore at [C:\Users\jenkins\workspace\Lucene-Solr-7.x-Windows\solr\core\src\test-files\solr\collection1], dataDir=[C:\Users\jenkins\workspace\Lucene-Solr-7.x-Windows\solr\build\solr-core\test\J0\temp\solr.update.MaxSizeAutoCommitTest_1D557C9C97F6BEEF-001\init-core-data-001\]
   [junit4]   2> 3486670 INFO  (coreLoadExecutor-12518-thread-1) [    x:collection1] o.a.s.u.RandomMergePolicy RandomMergePolicy wrapping class org.apache.lucene.index.TieredMergePolicy: [TieredMergePolicy: maxMergeAtOnce=28, maxMergeAtOnceExplicit=47, maxMergedSegmentMB=10.4775390625, floorSegmentMB=1.9560546875, forceMergeDeletesPctAllowed=5.205185536421363, segmentsPerTier=32.0, maxCFSSegmentSizeMB=8.796093022207999E12, noCFSRatio=0.0
   [junit4]   2> 3486677 WARN  (coreLoadExecutor-12518-thread-1) [    x:collection1] o.a.s.c.RequestHandlers INVALID paramSet a in requestHandler {type = requestHandler,name = /dump,class = DumpRequestHandler,attributes = {initParams=a, name=/dump, class=DumpRequestHandler},args = {defaults={a=A,b=B}}}
   [junit4]   2> 3486761 INFO  (coreLoadExecutor-12518-thread-1) [    x:collection1] o.a.s.u.UpdateHandler Using UpdateLog implementation: org.apache.solr.update.UpdateLog
   [junit4]   2> 3486761 INFO  (coreLoadExecutor-12518-thread-1) [    x:collection1] o.a.s.u.UpdateLog Initializing UpdateLog: dataDir= defaultSyncLevel=FLUSH numRecordsToKeep=100 maxNumLogsToKeep=10 numVersionBuckets=65536
   [junit4]   2> 3486762 INFO  (coreLoadExecutor-12518-thread-1) [    x:collection1] o.a.s.u.CommitTracker Hard AutoCommit: disabled
   [junit4]   2> 3486762 INFO  (coreLoadExecutor-12518-thread-1) [    x:collection1] o.a.s.u.CommitTracker Soft AutoCommit: disabled
   [junit4]   2> 3486763 INFO  (coreLoadExecutor-12518-thread-1) [    x:collection1] o.a.s.u.RandomMergePolicy RandomMergePolicy wrapping class org.apache.lucene.index.TieredMergePolicy: [TieredMergePolicy: maxMergeAtOnce=11, maxMergeAtOnceExplicit=33, maxMergedSegmentMB=44.0966796875, floorSegmentMB=2.0087890625, forceMergeDeletesPctAllowed=6.968527383187393, segmentsPerTier=13.0, maxCFSSegmentSizeMB=8.796093022207999E12, noCFSRatio=1.0
   [junit4]   2> 3486763 INFO  (coreLoadExecutor-12518-thread-1) [    x:collection1] o.a.s.s.SolrIndexSearcher Opening [Searcher@6395b3e[collection1] main]
   [junit4]   2> 3486764 WARN  (coreLoadExecutor-12518-thread-1) [    x:collection1] o.a.s.r.ManagedResourceStorage Cannot write to config directory C:\Users\jenkins\workspace\Lucene-Solr-7.x-Windows\solr\core\src\test-files\solr\collection1\conf; switching to use InMemory storage instead.
   [junit4]   2> 3486764 INFO  (coreLoadExecutor-12518-thread-1) [    x:collection1] o.a.s.h.ReplicationHandler Commits will be reserved for 10000ms.
   [junit4]   2> 3486764 INFO  (coreLoadExecutor-12518-thread-1) [    x:collection1] o.a.s.u.UpdateLog Could not find max version in index or recent updates, using new clock 1601396957495951360
   [junit4]   2> 3486765 INFO  (searcherExecutor-12519-thread-1-processing-x:collection1) [    x:collection1] o.a.s.c.SolrCore [collection1] Registered new searcher Searcher@6395b3e[collection1] main{ExitableDirectoryReader(UninvertingDirectoryReader())}
   [junit4]   2> 3486767 INFO  (TEST-MaxSizeAutoCommitTest.testRedundantDeletes-seed#[1D557C9C97F6BEEF]) [    ] o.a.s.SolrTestCaseJ4 ####initCore end
   [junit4]   2> 3486774 INFO  (commitScheduler-12522-thread-1) [    ] o.a.s.u.DirectUpdateHandler2 start commit{,optimize=false,openSearcher=false,waitSearcher=true,expungeDeletes=false,softCommit=false,prepareCommit=false}
   [junit4]   2> 3486775 INFO  (commitScheduler-12522-thread-1) [    ] o.a.s.u.SolrIndexWriter Calling setCommitData with IW:org.apache.solr.update.SolrIndexWriter@1332b73 commitCommandVersion:0
   [junit4]   2> 3486778 INFO  (TEST-MaxSizeAutoCommitTest.testRedundantDeletes-seed#[1D557C9C97F6BEEF]) [    ] o.a.s.u.p.LogUpdateProcessorFactory [collection1] {add=[0 (1601396957501194240), 1 (1601396957502242816), 2 (1601396957503291392), 3 (1601396957503291393), 4 (1601396957503291394), 5 (1601396957503291395), 6 (1601396957503291396), 7 (1601396957503291397), 8 (1601396957503291398), 9 (1601396957503291399), ... (150 adds)]} 0 10
   [junit4]   2> 3486781 INFO  (commitScheduler-12522-thread-1) [    ] o.a.s.s.SolrIndexSearcher Opening [Searcher@50ad759e[collection1] realtime]
   [junit4]   2> 3486782 INFO  (commitScheduler-12522-thread-1) [    ] o.a.s.u.DirectUpdateHandler2 end_commit_flush
   [junit4]   2> 3487183 INFO  (TEST-MaxSizeAutoCommitTest.testRedundantDeletes-seed#[1D557C9C97F6BEEF]) [    ] o.a.s.u.p.LogUpdateProcessorFactory [collection1] {delete=[100 (-1601396957935304704)]} 0 201
   [junit4]   2> 3487183 INFO  (TEST-MaxSizeAutoCommitTest.testRedundantDeletes-seed#[1D557C9C97F6BEEF]) [    ] o.a.s.u.p.LogUpdateProcessorFactory [collection1] {delete=[100 (-1601396957935304705)]} 0 201
   [junit4]   2> 3487183 INFO  (TEST-MaxSizeAutoCommitTest.testRedundantDeletes-seed#[1D557C9C97F6BEEF]) [    ] o.a.s.u.p.LogUpdateProcessorFactory [collection1] {delete=[100 (-1601396957935304706)]} 0 201
   [junit4]   2> 3487183 INFO  (TEST-MaxSizeAutoCommitTest.testRedundantDeletes-seed#[1D557C9C97F6BEEF]) [    ] o.a.s.u.p.LogUpdateProcessorFactory [collection1] {delete=[100 (-1601396957935304707)]} 0 201
   [junit4]   2> 3487184 INFO  (TEST-MaxSizeAutoCommitTest.testRedundantDeletes-seed#[1D557C9C97F6BEEF]) [    ] o.a.s.u.p.LogUpdateProcessorFactory [collection1] {delete=[100 (-1601396957936353280)]} 0 201
   [junit4]   2> 3487184 INFO  (TEST-MaxSizeAutoCommitTest.testRedundantDeletes-seed#[1D557C9C97F6BEEF]) [    ] o.a.s.u.p.LogUpdateProcessorFactory [collection1] {delete=[100 (-1601396957936353281)]} 0 202
   [junit4]   2> 3487184 INFO  (TEST-MaxSizeAutoCommitTest.testRedundantDeletes-seed#[1D557C9C97F6BEEF]) [    ] o.a.s.u.p.LogUpdateProcessorFactory [collection1] {delete=[100 (-1601396957936353282)]} 0 202
   [junit4]   2> 3487184 INFO  (TEST-MaxSizeAutoCommitTest.testRedundantDeletes-seed#[1D557C9C97F6BEEF]) [    ] o.a.s.u.p.LogUpdateProcessorFactory [collection1] {delete=[100 (-1601396957936353283)]} 0 202
   [junit4]   2> 3487184 INFO  (TEST-MaxSizeAutoCommitTest.testRedundantDeletes-seed#[1D557C9C97F6BEEF]) [    ] o.a.s.u.p.LogUpdateProcessorFactory [collection1] {delete=[100 (-1601396957936353284)]} 0 202
   [junit4]   2> 3487184 INFO  (TEST-MaxSizeAutoCommitTest.testRedundantDeletes-seed#[1D557C9C97F6BEEF]) [    ] o.a.s.u.p.LogUpdateProcessorFactory [collection1] {delete=[100 (-1601396957936353285)]} 0 202
   [junit4]   2> 3487184 INFO  (TEST-MaxSizeAutoCommitTest.testRedundantDeletes-seed#[1D557C9C97F6BEEF]) [    ] o.a.s.u.p.LogUpdateProcessorFactory [collection1] {delete=[100 (-1601396957936353286)]} 0 202
   [junit4]   2> 3487184 INFO  (TEST-MaxSizeAutoCommitTest.testRedundantDeletes-seed#[1D557C9C97F6BEEF]) [    ] o.a.s.u.p.LogUpdateProcessorFactory [collection1] {delete=[100 (-1601396957936353287)]} 0 202
   [junit4]   2> 3487184 INFO  (TEST-MaxSizeAutoCommitTest.testRedundantDeletes-seed#[1D557C9C97F6BEEF]) [    ] o.a.s.u.p.LogUpdateProcessorFactory [collection1] {delete=[100 (-1601396957936353288)]} 0 202
   [junit4]   2> 3487184 INFO  (TEST-MaxSizeAutoCommitTest.testRedundantDeletes-seed#[1D557C9C97F6BEEF]) [    ] o.a.s.u.p.LogUpdateProcessorFactory [collection1] {delete=[100 (-1601396957936353289)]} 0 202
   [junit4]   2> 3487184 INFO  (TEST-MaxSizeAutoCommitTest.testRedundantDeletes-seed#[1D557C9C97F6BEEF]) [    ] o.a.s.u.p.LogUpdateProcessorFactory [collection1] {delete=[100 (-1601396957936353290)]} 0 204
   [junit4]   2> 3487186 INFO  (commitScheduler-12522-thread-1) [    ] o.a.s.u.DirectUpdateHandler2 start commit{,optimize=false,openSearcher=false,waitSearcher=true,expungeDeletes=false,softCommit=false,prepareCommit=false}
   [junit4]   2> 3487186 INFO  (commitScheduler-12522-thread-1) [    ] o.a.s.u.SolrIndexWriter Calling setCommitData with IW:org.apache.solr.update.SolrIndexWriter@1332b73 commitCommandVersion:0
   [junit4]   2> 3487188 INFO  (TEST-MaxSizeAutoCommitTest.testRedundantDeletes-seed#[1D557C9C97F6BEEF]) [    ] o.a.s.u.p.LogUpdateProcessorFactory [collection1] {delete=[100 (-1601396957938450432)]} 0 206
   [junit4]   2> 3487188 INFO  (TEST-MaxSizeAutoCommitTest.testRedundantDeletes-seed#[1D557C9C97F6BEEF]) [    ] o.a.s.u.p.LogUpdateProcessorFactory [collection1] {delete=[100 (-1601396957940547584)]} 0 206
   [junit4]   2> 3487188 INFO  (TEST-MaxSizeAutoCommitTest.testRedundantDeletes-seed#[1D557C9C97F6BEEF]) [    ] o.a.s.u.p.LogUpdateProcessorFactory [collection1] {delete=[100 (-1601396957940547585)]} 0 207
   [junit4]   2> 3487188 INFO  (TEST-MaxSizeAutoCommitTest.testRedundantDeletes-seed#[1D557C9C97F6BEEF]) [    ] o.a.s.u.p.LogUpdateProcessorFactory [collection1] {delete=[100 (-1601396957940547586)]} 0 207
   [junit4]   2> 3487188 INFO  (TEST-MaxSizeAutoCommitTest.testRedundantDeletes-seed#[1D557C9C97F6BEEF]) [    ] o.a.s.u.p.LogUpdateProcessorFactory [collection1] {delete=[100 (-1601396957940547587)]} 0 207
   [junit4]   2> 3487189 INFO  (TEST-MaxSizeAutoCommitTest.testRedundantDeletes-seed#[1D557C9C97F6BEEF]) [    ] o.a.s.u.p.LogUpdateProcessorFactory [collection1] {delete=[100 (-1601396957940547588)]} 0 207
   [junit4]   2> 3487189 INFO  (TEST-MaxSizeAutoCommitTest.testRedundantDeletes-seed#[1D557C9C97F6BEEF]) [    ] o.a.s.u.p.LogUpdateProcessorFactory [collection1] {delete=[100 (-1601396957941596160)]} 0 207
   [junit4]   2> 3487189 INFO  (TEST-MaxSizeAutoCommitTest.testRedundantDeletes-seed#[1D557C9C97F6BEEF]) [    ] o.a.s.u.p.LogUpdateProcessorFactory [collection1] {delete=[100 (-1601396957941596161)]} 0 207
   [junit4]   2> 3487189 INFO  (TEST-MaxSizeAutoCommitTest.testRedundantDeletes-seed#[1D557C9C97F6BEEF]) [    ] o.a.s.u.p.LogUpdateProcessorFactory [collection1] {delete=[100 (-1601396957941596162)]} 0 207
   [junit4]   2> 3487189 INFO  (TEST-MaxSizeAutoCommitTest.testRedundantDeletes-seed#[1D557C9C97F6BEEF]) [    ] o.a.s.u.p.LogUpdateProcessorFactory [collection1] {delete=[100 (-1601396957941596163)]} 0 207
   [junit4]   2> 3487189 INFO  (TEST-MaxSizeAutoCommitTest.testRedundantDeletes-seed#[1D557C9C97F6BEEF]) [    ] o.a.s.u.p.LogUpdateProcessorFactory [collection1] {delete=[100 (-1601396957941596164)]} 0 207
   [junit4]   2> 3487189 INFO  (TEST-MaxSizeAutoCommitTest.testRedundantDeletes-seed#[1D557C9C97F6BEEF]) [    ] o.a.s.u.p.LogUpdateProcessorFactory [collection1] {delete=[100 (-1601396957941596165)]} 0 207
   [junit4]   2> 3487189 INFO  (TEST-MaxSizeAutoCommitTest.testRedundantDeletes-seed#[1D557C9C97F6BEEF]) [    ] o.a.s.u.p.LogUpdateProcessorFactory [collection1] {delete=[100 (-1601396957941596166)]} 0 207
   [junit4]   2> 3487189 INFO  (TEST-MaxSizeAutoCommitTest.testRedundantDeletes-seed#[1D557C9C97F6BEEF]) [    ] o.a.s.u.p.LogUpdateProcessorFactory [collection1] {delete=[100 (-1601396957941596167)]} 0 207
   [junit4]   2> 3487189 INFO  (TEST-MaxSizeAutoCommitTest.testRedundantDeletes-seed#[1D557C9C97F6BEEF]) [    ] o.a.s.u.p.LogUpdateProcessorFactory [collection1] {delete=[100 (-1601396957941596168)]} 0 207
   [junit4]   2> 3487189 INFO  (TEST-MaxSizeAutoCommitTest.testRedundantDeletes-seed#[1D557C9C97F6BEEF]) [    ] o.a.s.u.p.LogUpdateProcessorFactory [collection1] {delete=[100 (-1601396957941596169)]} 0 207
   [junit4]   2> 3487189 INFO  (TEST-MaxSizeAutoCommitTest.testRedundantDeletes-seed#[1D557C9C97F6BEEF]) [    ] o.a.s.u.p.LogUpdateProcessorFactory [collection1] {delete=[100 (-1601396957941596170)]} 0 207
   [junit4]   2> 3487189 INFO  (TEST-MaxSizeAutoCommitTest.testRedundantDeletes-seed#[1D557C9C97F6BEEF]) [    ] o.a.s.u.p.LogUpdateProcessorFactory [collection1] {delete=[100 (-1601396957941596171)]} 0 207
   [junit4]   2> 3487189 INFO  (TEST-MaxSizeAutoCommitTest.testRedundantDeletes-seed#[1D557C9C97F6BEEF]) [    ] o.a.s.u.p.LogUpdateProcessorFactory [collection1] {delete=[100 (-1601396957941596172)]} 0 207
   [junit4]   2> 3487189 INFO  (TEST-MaxSizeAutoCommitTest.testRedundantDeletes-seed#[1D557C9C97F6BEEF]) [    ] o.a.s.u.p.LogUpdateProcessorFactory [collection1] {delete=[100 (-1601396957941596173)]} 0 207
   [junit4]   2> 3487189 INFO  (TEST-MaxSizeAutoCommitTest.testRedundantDeletes-seed#[1D557C9C97F6BEEF]) [    ] o.a.s.u.p.LogUpdateProcessorFactory [collection1] {delete=[100 (-1601396957941596174)]} 0 207
   [junit4]   2> 3487189 INFO  (TEST-MaxSizeAutoCommitTest.testRedundantDeletes-seed#[1D557C9C97F6BEEF]) [    ] o.a.s.u.p.LogUpdateProcessorFactory [collection1] {delete=[100 (-1601396957941596175)]} 0 207
   [junit4]   2> 3487189 INFO  (TEST-MaxSizeAutoCommitTest.testRedundantDeletes-seed#[1D557C9C97F6BEEF]) [    ] o.a.s.u.p.LogUpdateProcessorFactory [collection1] {delete=[100 (-1601396957941596176)]} 0 207
   [junit4]   2> 3487189 INFO  (TEST-MaxSizeAutoCommitTest.testRedundantDeletes-seed#[1D557C9C97F6BEEF]) [    ] o.a.s.u.p.LogUpdateProcessorFactory [collection1] {delete=[100 (-1601396957941596177)]} 0 207
   [junit4]   2> 3487189 INFO  (TEST-MaxSizeAutoCommitTest.testRedundantDeletes-seed#[1D557C9C97F6BEEF]) [    ] o.a.s.u.p.LogUpdateProcessorFactory [collection1] {delete=[100 (-1601396957941596178)]} 0 207
   [junit4]   2> 3487189 INFO  (TEST-MaxSizeAutoCommitTest.testRedundantDeletes-seed#[1D557C9C97F6BEEF]) [    ] o.a.s.u.p.LogUpdateProcessorFactory [collection1] {delete=[100 (-1601396957941596179)]} 0 208
   [junit4]   2> 3487190 INFO  (TEST-MaxSizeAutoCommitTest.testRedundantDeletes-seed#[1D557C9C97F6BEEF]) [    ] o.a.s.u.p.LogUpdateProcessorFactory [collection1] {delete=[100 (-1601396957941596180)]} 0 208
   [junit4]   2> 3487190 INFO  (TEST-MaxSizeAutoCommitTest.testRedundantDeletes-seed#[1D557C9C97F6BEEF]) [    ] o.a.s.u.p.LogUpdateProcessorFactory [collection1] {delete=[100 (-1601396957942644736)]} 0 208
   [junit4]   2> 3487190 INFO  (TEST-MaxSizeAutoCommitTest.testRedundantDeletes-seed#[1D557C9C97F6BEEF]) [    ] o.a.s.u.p.LogUpdateProcessorFactory [collection1] {delete=[100 (-1601396957942644737)]} 0 208
   [junit4]   2> 3487190 INFO  (TEST-MaxSizeAutoCommitTest.testRedundantDeletes-seed#[1D557C9C97F6BEEF]) [    ] o.a.s.u.p.LogUpdateProcessorFactory [collection1] {delete=[100 (-1601396957942644738)]} 0 208
   [junit4]   2> 3487190 INFO  (TEST-MaxSizeAutoCommitTest.testRedundantDeletes-seed#[1D557C9C97F6BEEF]) [    ] o.a.s.u.p.LogUpdateProcessorFactory [collection1] {delete=[100 (-1601396957942644739)]} 0 208
   [junit4]   2> 3487190 INFO  (TEST-MaxSizeAutoCommitTest.testRedundantDeletes-seed#[1D557C9C97F6BEEF]) [    ] o.a.s.u.p.LogUpdateProcessorFactory [collection1] {delete=[100 (-1601396957942644740)]} 0 208
   [junit4]   2> 3487191 INFO  (TEST-MaxSizeAutoCommitTest.testRedundantDeletes-seed#[1D557C9C97F6BEEF]) [    ] o.a.s.u.p.LogUpdateProcessorFactory [collection1] {delete=[100 (-1601396957942644741)]} 0 209
   [junit4]   2> 3487191 INFO  (TEST-MaxSizeAutoCommitTest.testRedundantDeletes-seed#[1D557C9C97F6BEEF]) [    ] o.a.s.u.p.LogUpdateProcessorFactory [collection1] {delete=[100 (-1601396957943693312)]} 0 209
   [junit4]   2> 3487191 INFO  (TEST-MaxSizeAutoCommitTest.testRedundantDeletes-seed#[1D557C9C97F6BEEF]) [    ] o.a.s.u.p.LogUpdateProcessorFactory [collection1] {delete=[100 (-1601396957943693313)]} 0 209
   [junit4]   2> 3487192 INFO  (commitScheduler-12522-thread-1) [    ] o.a.s.s.SolrIndexSearcher Opening [Searcher@6708fe69[collection1] realtime]
   [junit4]   2> 3487192 INFO  (commitScheduler-12522-thread-1) [    ] o.a.s.u.DirectUpdateHandler2 end_commit_flush
   [junit4]   2> 3487399 INFO  (TEST-MaxSizeAutoCommitTest.testRedundantDeletes-seed#[1D557C9C97F6BEEF]) [    ] o.a.s.u.p.LogUpdateProcessorFactory [collection1] {delete=[100 (-1601396958161797120)]} 0 418
   [junit4]   2> 3487399 INFO  (TEST-MaxSizeAutoCommitTest.testRedundantDeletes-seed#[1D557C9C97F6BEEF]) [    ] o.a.s.u.p.LogUpdateProcessorFactory [collection1] {delete=[100 (-1601396958161797121)]} 0 418
   [junit4]   2> 3487400 INFO  (TEST-MaxSizeAutoCommitTest.testRedundantDeletes-seed#[1D557C9C97F6BEEF]) [    ] o.a.s.u.p.LogUpdateProcessorFactory [collection1] {delete=[100 (-1601396958161797122)]} 0 418
   [junit4]   2> 3487400 INFO  (TEST-MaxSizeAutoCommitTest.testRedundantDeletes-seed#[1D557C9C97F6BEEF]) [    ] o.a.s.u.p.LogUpdateProcessorFactory [collection1] {delete=[100 (-1601396958162845696)]} 0 419
   [junit4]   2> 3487400 INFO  (TEST-MaxSizeAutoCommitTest.testRedundantDeletes-seed#[1D557C9C97F6BEEF]) [    ] o.a.s.u.p.LogUpdateProcessorFactory [collection1] {delete=[100 (-1601396958162845697)]} 0 419
   [junit4]   2> 3487400 INFO  (TEST-MaxSizeAutoCommitTest.testRedundantDeletes-seed#[1D557C9C97F6BEEF]) [    ] o.a.s.u.p.LogUpdateProcessorFactory [collection1] {delete=[100 (-1601396958162845698)]} 0 419
   [junit4]   2> 3487400 INFO  (TEST-MaxSizeAutoCommitTest.testRedundantDeletes-seed#[1D557C9C97F6BEEF]) [    ] o.a.s.u.p.LogUpdateProcessorFactory [collection1] {delete=[100 (-1601396958162845699)]} 0 419
   [junit4]   2> 3487400 INFO  (TEST-MaxSizeAutoCommitTest.testRedundantDeletes-seed#[1D557C9C97F6BEEF]) [    ] o.a.s.u.p.LogUpdateProcessorFactory [collection1] {delete=[100 (-1601396958162845700)]} 0 419
   [junit4]   2> 3487400 INFO  (TEST-MaxSizeAutoCommitTest.testRedundantDeletes-seed#[1D557C9C97F6BEEF]) [    ] o.a.s.u.p.LogUpdateProcessorFactory [collection1] {delete=[100 (-1601396958162845701)]} 0 419
   [junit4]   2> 3487400 INFO  (TEST-MaxSizeAutoCommitTest.testRedundantDeletes-seed#[1D557C9C97F6BEEF]) [    ] o.a.s.u.p.LogUpdateProcessorFactory [collection1] {delete=[100 (-1601396958162845702)]} 0 419
   [junit4]   2> 3487400 INFO  (TEST-MaxSizeAutoCommitTest.testRedundantDeletes-seed#[1D557C9C97F6BEEF]) [    ] o.a.s.u.p.LogUpdateProcessorFactory [collection1] {delete=[100 (-1601396958162845703)]} 0 419
   [junit4]   2> 3487400 INFO  (TEST-MaxSizeAutoCommitTest.testRedundantDeletes-seed#[1D557C9C97F6BEEF]) [    ] o.a.s.u.p.LogUpdateProcessorFactory [collection1] {delete=[100 (-1601396958162845704)]} 0 419
   [junit4]   2> 3487400 INFO  (TEST-MaxSizeAutoCommitTest.testRedundantDeletes-seed#[1D557C9C97F6BEEF]) [    ] o.a.s.u.p.LogUpdateProcessorFactory [collection1] {delete=[100 (-1601396958162845705)]} 0 419
   [junit4]   2> 3487400 INFO  (TEST-MaxSizeAutoCommitTest.testRedundantDeletes-seed#[1D557C9C97F6BEEF]) [    ] o.a.s.u.p.LogUpdateProcessorFactory [collection1] {delete=[100 (-1601396958162845706)]} 0 419
   [junit4]   2> 3487400 INFO  (TEST-MaxSizeAutoCommitTest.testRedundantDeletes-seed#[1D557C9C97F6BEEF]) [    ] o.a.s.u.p.LogUpdateProcessorFactory [collection1] {delete=[100 (-1601396958162845707)]} 0 419
   [junit4]   2> 3487400 INFO  (TEST-MaxSizeAutoCommitTest.testRedundantDeletes-seed#[1D557C9C97F6BEEF]) [    ] o.a.s.u.p.LogUpdateProcessorFactory [collection1] {delete=[100 (-1601396958162845708)]} 0 419
   [junit4]   2> 3487400 INFO  (TEST-MaxSizeAutoCommitTest.testRedundantDeletes-seed#[1D557C9C97F6BEEF]) [    ] o.a.s.u.p.LogUpdateProcessorFactory [collection1] {delete=[100 (-1601396958162845709)]} 0 419
   [junit4]   2> 3487400 INFO  (TEST-MaxSizeAutoCommitTest.testRedundantDeletes-seed#[1D557C9C97F6BEEF]) [    ] o.a.s.u.p.LogUpdateProcessorFactory [collection1] {delete=[100 (-1601396958162845710)]} 0 419
   [junit4]   2> 3487400 INFO  (TEST-MaxSizeAutoCommitTest.testRedundantDeletes-seed#[1D557C9C97F6BEEF]) [    ] o.a.s.u.p.LogUpdateProcessorFactory [collection1] {delete=[100 (-1601396958162845711)]} 0 419
   [junit4]   2> 3487400 INFO  (TEST-MaxSizeAutoCommitTest.testRedundantDeletes-seed#[1D557C9C97F6BEEF]) [    ] o.a.s.u.p.LogUpdateProcessorFactory [collection1] {delete=[100 (-1601396958162845712)]} 0 419
   [junit4]   2> 3487400 INFO  (TEST-MaxSizeAutoCommitTest.testRedundantDeletes-seed#[1D557C9C97F6BEEF]) [    ] o.a.s.u.p.LogUpdateProcessorFactory [collection1] {delete=[100 (-1601396958162845713)]} 0 419
   [junit4]   2> 3487400 INFO  (TEST-MaxSizeAutoCommitTest.testRedundantDeletes-seed#[1D557C9C97F6BEEF]) [    ] o.a.s.u.p.LogUpdateProcessorFactory [collection1] {delete=[100 (-1601396958162845714)]} 0 419
   [junit4]   2> 3487400 INFO  (TEST-MaxSizeAutoCommitTest.testRedundantDeletes-seed#[1D557C9C97F6BEEF]) [    ] o.a.s.u.p.LogUpdateProcessorFactory [collection1] {delete=[100 (-1601396958162845715)]} 0 419
   [junit4]   2> 3487400 INFO  (TEST-MaxSizeAutoCommitTest.testRedundantDeletes-seed#[1D557C9C97F6BEEF]) [    ] o.a.s.u.p.LogUpdateProcessorFactory [collection1] {delete=[100 (-1601396958162845716)]} 0 419
   [junit4]   2> 3487400 INFO  (TEST-MaxSizeAutoCommitTest.testRedundantDeletes-seed#[1D557C9C97F6BEEF]) [    ] o.a.s.u.p.LogUpdateProcessorFactory [collection1] {delete=[100 (-1601396958162845717)]} 0 420
   [junit4]   2> 3487400 INFO  (TEST-MaxSizeAutoCommitTest.testRedundantDeletes-seed#[1D557C9C97F6BEEF]) [    ] o.a.s.u.p.LogUpdateProcessorFactory [collection1] {delete=[100 (-1601396958162845718)]} 0 420
   [junit4]   2> 3487400 INFO  (TEST-MaxSizeAutoCommitTest.testRedundantDeletes-seed#[1D557C9C97F6BEEF]) [    ] o.a.s.u.p.LogUpdateProcessorFactory [collection1] {delete=[100 (-1601396958162845719)]} 0 420
   [junit4]   2> 3487400 INFO  (TEST-MaxSizeAutoCommitTest.testRedundantDeletes-seed#[1D557C9C97F6BEEF]) [    ] o.a.s.u.p.LogUpdateProcessorFactory [collection1] {delete=[100 (-1601396958162845720)]} 0 420
   [junit4]   2> 3487402 INFO  (TEST-MaxSizeAutoCommitTest.testRedundantDeletes-seed#[1D557C9C97F6BEEF]) [    ] o.a.s.u.p.LogUpdateProcessorFactory [collection1] {delete=[100 (-1601396958164942848)]} 0 420
   [junit4]   2> 3487402 INFO  (TEST-MaxSizeAutoCommitTest.testRedundantDeletes-seed#[1D557C9C97F6BEEF]) [    ] o.a.s.u.p.LogUpdateProcessorFactory [collection1] {delete=[100 (-1601396958164942849)]} 0 420
   [junit4]   2> 3487402 INFO  (TEST-MaxSizeAutoCommitTest.testRedundantDeletes-seed#[1D557C9C97F6BEEF]) [    ] o.a.s.u.p.LogUpdateProcessorFactory [collection1] {delete=[100 (-1601396958164942850)]} 0 420
   [junit4]   2> 3487402 INFO  (TEST-MaxSizeAutoCommitTest.testRedundantDeletes-seed#[1D557C9C97F6BEEF]) [    ] o.a.s.u.p.LogUpdateProcessorFactory [collection1] {delete=[100 (-1601396958164942851)]} 0 420
   [junit4]   2> 3487402 INFO  (TEST-MaxSizeAutoCommitTest.testRedundantDeletes-seed#[1D557C9C97F6BEEF]) [    ] o.a.s.u.p.LogUpdateProcessorFactory [collection1] {delete=[100 (-1601396958164942852)]} 0 420
   [junit4]   2> 3487402 INFO  (TEST-MaxSizeAutoCommitTest.testRedundantDeletes-seed#[1D557C9C97F6BEEF]) [    ] o.a.s.u.p.LogUpdateProcessorFactory [collection1] {delete=[100 (-1601396958164942853)]} 0 420
   [junit4]   2> 3487405 INFO  (commitScheduler-12522-thread-1) [    ] o.a.s.u.DirectUpdateHandler2 start commit{,optimize=false,openSearcher=false,waitSearcher=true,expungeDeletes=false,softCommit=false,prepareCommit=false}
   [junit4]   2> 3487405 INFO  (commitScheduler-12522-thread-1) [    ] o.a.s.u.SolrIndexWriter Calling setCommitData with IW:org.apache.solr.update.SolrIndexWriter@1332b73 commitCommandVersion:0
   [junit4]   2> 3487407 INFO  (TEST-MaxSizeAutoCommitTest.testRedundantDeletes-seed#[1D557C9C97F6BEEF]) [    ] o.a.s.u.p.LogUpdateProcessorFactory [collection1] {delete=[100 (-1601396958169137152)]} 0 425
   [junit4]   2> 3487407 INFO  (TEST-MaxSizeAutoCommitTest.testRedundantDeletes-seed#[1D557C9C97F6BEEF]) [    ] o.a.s.u.p.LogUpdateProcessorFactory [collection1] {delete=[100 (-1601396958170185728)]} 0 425
   [junit4]   2> 3487408 INFO  (TEST-MaxSizeAutoCommitTest.testRedundantDeletes-seed#[1D557C9C97F6BEEF]) [    ] o.a.s.u.p.LogUpdateProcessorFactory [collection1] {delete=[100 (-1601396958170185729)]} 0 426
   [junit4]   2> 3487408 INFO  (TEST-MaxSizeAutoCommitTest.testRedundantDeletes-seed#[1D557C9C97F6BEEF]) [    ] o.a.s.u.p.LogUpdateProcessorFactory [collection1] {delete=[100 (-1601396958171234304)]} 0 426
   [junit4]   2> 3487408 INFO  (TEST-MaxSizeAutoCommitTest.testRedundantDeletes-seed#[1D557C9C97F6BEEF]) [    ] o.a.s.u.p.LogUpdateProcessorFactory [collection1] {delete=[100 (-1601396958171234305)]} 0 426
   [junit4]   2> 3487408 INFO  (TEST-MaxSizeAutoCommitTest.testRedundantDeletes-seed#[1D557C9C97F6BEEF]) [    ] o.a.s.u.p.LogUpdateProcessorFactory [collection1] {delete=[100 (-1601396958171234306)]} 0 426
   [junit4]   2> 3487408 INFO  (TEST-MaxSizeAutoCommitTest.testRedundantDeletes-seed#[1D557C9C97F6BEEF]) [    ] o.a.s.u.p.LogUpdateProcessorFactory [collection1] {delete=[100 (-1601396958171234307)]} 0 426
   [junit4]   2> 3487408 INFO  (TEST-MaxSizeAutoCommitTest.testRedundantDeletes-seed#[1D557C9C97F6BEEF]) [    ] o.a.s.u.p.LogUpdateProcessorFactory [collection1] {delete=[100 (-1601396958171234308)]} 0 426
   [junit4]   2> 3487408 INFO  (TEST-MaxSizeAutoCommitTest.testRedundantDeletes-seed#[1D557C9C97F6BEEF]) [    ] o.a.s.u.p.LogUpdateProcessorFactory [collection1] {delete=[100 (-1601396958171234309)]} 0 426
   [junit4]   2> 3487408 INFO  (TEST-MaxSizeAutoCommitTest.testRedundantDeletes-seed#[1D557C9C97F6BEEF]) [    ] o.a.s.u.p.LogUpdateProcessorFactory [collection1] {delete=[100 (-1601396958171234310)]} 0 426
   [junit4]   2> 3487408 INFO  (TEST-MaxSizeAutoCommitTest.testRedundantDeletes-seed#[1D557C9C97F6BEEF]) [    ] o.a.s.u.p.LogUpdateProcessorFactory [collection1] {delete=[100 (-1601396958171234311)]} 0 426
   [junit4]   2> 3487408 INFO  (TEST-MaxSizeAutoCommitTest.testRedundantDeletes-seed#[1D557C9C97F6BEEF]) [    ] o.a.s.u.p.LogUpdateProcessorFactory [collection1] {delete=[100 (-1601396958171234312)]} 0 426
   [junit4]   2> 3487408 INFO  (TEST-MaxSizeAutoCommitTest.testRedundantDeletes-seed#[1D557C9C97F6BEEF]) [    ] o.a.s.u.p.LogUpdateProcessorFactory [collection1] {delete=[100 (-1601396958171234313)]} 0 426
   [junit4]   2> 3487408 INFO  (TEST-MaxSizeAutoCommitTest.testRedundantDeletes-seed#[1D557C9C97F6BEEF]) [    ] o.a.s.u.p.LogUpdateProcessorFactory [collection1] {delete=[100 (-1601396958171234314)]} 0 426
   [junit4]   2> 3487408 INFO  (TEST-MaxSizeAutoCommitTest.testRedundantDeletes-seed#[1D557C9C97F6BEEF]) [    ] o.a.s.u.p.LogUpdateProcessorFactory [collection1] {delete=[100 (-1601396958171234315)]} 0 427
   [junit4]   2> 3487408 INFO  (TEST-MaxSizeAutoCommitTest.testRedundantDeletes-seed#[1D557C9C97F6BEEF]) [    ] o.a.s.u.p.LogUpdateProcessorFactory [collection1] {delete=[100 (-1601396958171234316)]} 0 427
   [junit4]   2> 3487409 INFO  (commitScheduler-12522-thread-1) [    ] o.a.s.s.SolrIndexSearcher Opening [Searcher@2caecb46[collection1] realtime]
   [junit4]   2> 3487409 INFO  (commitScheduler-12522-thread-1) [    ] o.a.s.u.DirectUpdateHandler2 end_commit_flush
   [junit4]   2> 3487611 INFO  (TEST-MaxSizeAutoCommitTest.testRedundantDeletes-seed#[1D557C9C97F6BEEF]) [    ] o.a.s.u.p.LogUpdateProcessorFactory [collection1] {delete=[100 (-1601396958384095232)]} 0 629
   [junit4]   2> 3487611 INFO  (TEST-MaxSizeAutoCommitTest.testRedundantDeletes-seed#[1D557C9C97F6BEEF]) [    ] o.a.s.u.p.LogUpdateProcessorFactory [collection1] {delete=[100 (-1601396958384095233)]} 0 629
   [junit4]   2> 3487611 INFO  (TEST-MaxSizeAutoCommitTest.testRedundantDeletes-seed#[1D557C9C97F6BEEF]) [    ] o.a.s.u.p.LogUpdateProcessorFactory [collection1] {delete=[100 (-1601396958384095234)]} 0 629
   [junit4]   2> 3487611 INFO  (TEST-MaxSizeAutoCommitTest.testRedundantDeletes-seed#[1D557C9C97F6BEEF]) [    ] o.a.s.u.p.LogUpdateProcessorFactory [collection1] {delete=[100 (-1601396958384095235)]} 0 629
   [junit4]   2> 3487611 INFO  (TEST-MaxSizeAutoCommitTest.testRedundantDeletes-seed#[1D557C9C97F6BEEF]) [    ] o.a.s.u.p.LogUpdateProcessorFactory [collection1] {delete=[100 (-1601396958384095236)]} 0 630
   [junit4]   2> 3487611 INFO  (TEST-MaxSizeAutoCommitTest.testRedundantDeletes-seed#[1D557C9C97F6BEEF]) [    ] o.a.s.u.p.LogUpdateProcessorFactory [collection1] {delete=[100 (-1601396958384095237)]} 0 630
   [junit4]   2> 3487611 INFO  (TEST-MaxSizeAutoCommitTest.testRedundantDeletes-seed#[1D557C9C97F6BEEF]) [    ] o.a.s.u.p.LogUpdateProcessorFactory [collection1] {delete=[100 (-1601396958384095238)]} 0 630
   [junit4]   2> 3487611 INFO  (TEST-MaxSizeAutoCommitTest.testRedundantDeletes-seed#[1D557C9C97F6BEEF]) [    ] o.a.s.u.p.LogUpdateProcessorFactory [collection1] {delete=[100 (-1601396958384095239)]} 0 630
   [junit4]   2> 3487611 INFO  (TEST-MaxSizeAutoCommitTest.testRedundantDeletes-seed#[1D557C9C97F6BEEF]) [    ] o.a.s.u.p.LogUpdateProcessorFactory [collection1] {delete=[100 (-1601396958384095240)]} 0 630
   [junit4]   2> 3487611 INFO  (TEST-MaxSizeAutoCommitTest.testRedundantDeletes-seed#[1D557C9C97F6BEEF]) [    ] o.a.s.u.p.LogUpdateProcessorFactory [collection1] {delete=[100 (-1601396958384095241)]} 0 630
   [junit4]   2> 3487611 INFO  (TEST-MaxSizeAutoCommitTest.testRedundantDeletes-seed#[1D557C9C97F6BEEF]) [    ] o.a.s.u.p.LogUpdateProcessorFactory [collection1] {delete=[100 (-1601396958384095242)]} 0 630
   [junit4]   2> 3487614 INFO  (TEST-MaxSizeAutoCommitTest.testRedundantDeletes-seed#[1D557C9C97F6BEEF]) [    ] o.a.s.u.p.LogUpdateProcessorFactory [collection1] {delete=[100 (-1601396958384095243)]} 0 633
   [junit4]   2> 3487614 INFO  (TEST-MaxSizeAutoCommitTest.testRedundantDeletes-seed#[1D557C9C97F6BEEF]) [    ] o.a.s.u.p.LogUpdateProcessorFactory [collection1] {delete=[100 (-1601396958387240960)]} 0 633
   [junit4]   2> 3487614 INFO  (TEST-MaxSizeAutoCommitTest.testRedundantDeletes-seed#[1D557C9C97F6BEEF]) [    ] o.a.s.u.p.LogUpdateProcessorFactory [collection1] {delete=[100 (-1601396958387240961)]} 0 633
   [junit4]   2> 3487614 INFO  (TEST-MaxSizeAutoCommitTest.testRedundantDeletes-seed#[1D557C9C97F6BEEF]) [    ] o.a.s.u.p.LogUpdateProcessorFactory [collection1] {delete=[100 (-1601396958387240962)]} 0 633
   [junit4]   2> 3487614 INFO  (TEST-MaxSizeAutoCommitTest.testRedundantDeletes-seed#[1D557C9C97F6BEEF]) [    ] o.a.s.u.p.LogUpdateProcessorFactory [collection1] {delete=[100 (-1601396958387240963)]} 0 633
   [junit4]   2> 3487614 INFO  (TEST-MaxSizeAutoCommitTest.testRedundantDeletes-seed#[1D557C9C97F6BEEF]) [    ] o.a.s.u.p.LogUpdateProcessorFactory [collection1] {delete=[100 (-1601396958387240964)]} 0 633
   [junit4]   2> 3487614 INFO  (TEST-MaxSizeAutoCommitTest.testRedundantDeletes-seed#[1D557C9C97F6BEEF]) [    ] o.a.s.u.p.LogUpdateProcessorFactory [collection1] {delete=[100 (-1601396958387240965)]} 0 633
   [junit4]   2> 3487615 INFO  (TEST-MaxSizeAutoCommitTest.testRedundantDeletes-seed#[1D557C9C97F6BEEF]) [    ] o.a.s.u.p.LogUpdateProcessorFactory [collection1] {delete=[100 (-1601396958388289536)]} 0 633
   [junit4]   2> 3487615 INFO  (TEST-MaxSizeAutoCommitTest.testRedundantDeletes-seed#[1D557C9C97F6BEEF]) [    ] o.a.s.u.p.LogUpdateProcessorFactory [collection1] {delete=[100 (-1601396958388289537)]} 0 633
   [junit4]   2> 3487616 INFO  (TEST-MaxSizeAutoCommitTest.testRedundantDeletes-seed#[1D557C9C97F6BEEF]) [    ] o.a.s.u.p.LogUpdateProcessorFactory [collection1] {delete=[100 (-1601396958389338112)]} 0 634
   [junit4]   2> 3487616 INFO  (TEST-MaxSizeAutoCommitTest.testRedundantDeletes-seed#[1D557C9C97F6BEEF]) [    ] o.a.s.u.p.LogUpdateProcessorFactory [collection1] {delete=[100 (-1601396958389338113)]} 0 635
   [junit4]   2> 3487616 INFO  (TEST-MaxSizeAutoCommitTest.testRedundantDeletes-seed#[1D557C9C97F6BEEF]) [    ] o.a.s.u.p.LogUpdateProcessorFactory [collection1] {delete=[100 (-1601396958389338114)]} 0 635
   [junit4]   2> 3487616 INFO  (TEST-MaxSizeAutoCommitTest.testRedundantDeletes-seed#[1D557C9C97F6BEEF]) [    ] o.a.s.u.p.LogUpdateProcessorFactory [collection1] {delete=[100 (-1601396958389338115)]} 0 635
   [junit4]   2> 3487616 INFO  (TEST-MaxSizeAutoCommitTest.testRedundantDeletes-seed#[1D557C9C97F6BEEF]) [    ] o.a.s.u.p.LogUpdateProcessorFactory [collection1] {delete=[100 (-1601396958389338116)]} 0 635
   [junit4]   2> 3487616 INFO  (TEST-MaxSizeAutoCommitTest.testRedundantDeletes-seed#[1D557C9C97F6BEEF]) [    ] o.a.s.u.p.LogUpdateProcessorFactory [collection1] {delete=[100 (-1601396958389338117)]} 0 635
   [junit4]   2> 3487616 INFO  (TEST-MaxSizeAutoCommitTest.testRedundantDeletes-seed#[1D557C9C97F6BEEF]) [    ] o.a.s.u.p.LogUpdateProcessorFactory [collection1] {delete=[100 (-1601396958389338118)]} 0 635
   [junit4]   2> 3487616 INFO  (TEST-MaxSizeAutoCommitTest.testRedundantDeletes-seed#[1D557C9C97F6BEEF]) [    ] o.a.s.u.p.LogUpdateProcessorFactory [collection1] {delete=[100 (-1601396958389338119)]} 0 635
   [junit4]   2> 3487616 INFO  (TEST-MaxSizeAutoCommitTest.testRedundantDeletes-seed#[1D557C9C97F6BEEF]) [    ] o.a.s.u.p.LogUpdateProcessorFactory [collection1] {delete=[100 (-1601396958389338120)]} 0 635
   [junit4]   2> 3487616 INFO  (TEST-MaxSizeAutoCommitTest.testRedundantDeletes-seed#[1D557C9C97F6BEEF]) [    ] o.a.s.u.p.LogUpdateProcessorFactory [collection1] {delete=[100 (-1601396958389338121)]} 0 635
   [junit4]   2> 3487616 INFO  (TEST-MaxSizeAutoCommitTest.testRedundantDeletes-seed#[1D557C9C97F6BEEF]) [    ] o.a.s.u.p.LogUpdateProcessorFactory [collection1] {delete=[100 (-1601396958389338122)]} 0 635
   [junit4]   2> 3487616 INFO  (TEST-MaxSizeAutoCommitTest.testRedundantDeletes-seed#[1D557C9C97F6BEEF]) [    ] o.a.s.u.p.LogUpdateProcessorFactory [collection1] {delete=[100 (-1601396958389338123)]} 0 635
   [junit4]   2> 3487616 INFO  (TEST-MaxSizeAutoCommitTest.testRedundantDeletes-seed#[1D557C9C97F6BEEF]) [    ] o.a.s.u.p.LogUpdateProcessorFactory [collection1] {delete=[100 (-1601396958389338124)]} 0 635
   [junit4]   2> 3487616 INFO  (TEST-MaxSizeAutoCommitTest.testRedundantDeletes-seed#[1D557C9C97F6BEEF]) [    ] o.a.s.u.p.LogUpdateProcessorFactory [collection1] {delete=[100 (-1601396958389338125)]} 0 635
   [junit4]   2> 3487617 INFO  (TEST-MaxSizeAutoCommitTest.testRedundantDeletes-seed#[1D557C9C97F6BEEF]) [    ] o.a.s.u.p.LogUpdateProcessorFactory [collection1] {delete=[100 (-1601396958389338126)]} 0 635
   [junit4]   2> 3487617 INFO  (TEST-MaxSizeAutoCommitTest.testRedundantDeletes-seed#[1D557C9C97F6BEEF]) [    ] o.a.s.u.p.LogUpdateProcessorFactory [collection1] {delete=[100 (-1601396958390386688)]} 0 635
   [junit4]   2> 3487617 INFO  (TEST-MaxSizeAutoCommitTest.testRedundantDeletes-seed#[1D557C9C97F6BEEF]) [    ] o.a.s.u.p.LogUpdateProcessorFactory [collection1] {delete=[100 (-1601396958390386689)]} 0 635
   [junit4]   2> 3487617 INFO  (TEST-MaxSizeAutoCommitTest.testRedundantDeletes-seed#[1D557C9C97F6BEEF]) [    ] o.a.s.u.p.LogUpdateProcessorFactory [collection1] {delete=[100 (-1601396958390386690)]} 0 635
   [junit4]   2> 3487617 INFO  (TEST-MaxSizeAutoCommitTest.testRedundantDeletes-seed#[1D557C9C97F6BEEF]) [    ] o.a.s.u.p.LogUpdateProcessorFactory [collection1] {delete=[100 (-1601396958390386691)]} 0 635
   [junit4]   2> 3487617 INFO  (TEST-MaxSizeAutoCommitTest.testRedundantDeletes-seed#[1D557C9C97F6BEEF]) [    ] o.a.s.u.p.LogUpdateProcessorFactory [collection1] {delete=[100 (-1601396958390386692)]} 0 635
   [junit4]   2> 3487617 INFO  (TEST-MaxSizeAutoCommitTest.testRedundantDeletes-seed#[1D557C9C97F6BEEF]) [    ] o.a.s.u.p.LogUpdateProcessorFactory [collection1] {delete=[100 (-1601396958390386693)]} 0 635
   [junit4]   2> 3487617 INFO  (TEST-MaxSizeAutoCommitTest.testRedundantDeletes-seed#[1D557C9C97F6BEEF]) [    ] o.a.s.u.p.LogUpdateProcessorFactory [collection1] {delete=[100 (-1601396958390386694)]} 0 635
   [junit4]   2> 3487617 INFO  (TEST-MaxSizeAutoCommitTest.testRedundantDeletes-seed#[1D557C9C97F6BEEF]) [    ] o.a.s.u.p.LogUpdateProcessorFactory [collection1] {delete=[100 (-1601396958390386695)]} 0 635
   [junit4]   2> 3487617 INFO  (TEST-MaxSizeAutoCommitTest.testRedundantDeletes-seed#[1D557C9C97F6BEEF]) [    ] o.a.s.u.p.LogUpdateProcessorFactory [collection1] {delete=[100 (-1601396958390386696)]} 0 635
   [junit4]   2> 3487617 INFO  (TEST-MaxSizeAutoCommitTest.testRedundantDeletes-seed#[1D557C9C97F6BEEF]) [    ] o.a.s.u.p.LogUpdateProcessorFactory [collection1] {delete=[100 (-1601396958390386697)]} 0 635
   [junit4]   2> 3487617 INFO  (TEST-MaxSizeAutoCommitTest.testRedundantDeletes-seed#[1D557C9C97F6BEEF]) [    ] o.a.s.u.p.LogUpdateProcessorFactory [collection1] {delete=[100 (-1601396958390386698)]} 0 635
   [junit4]   2> 3487617 INFO  (TEST-MaxSizeAutoCommitTest.testRedundantDeletes-seed#[1D557C9C97F6BEEF]) [    ] o.a.s.u.p.LogUpdateProcessorFactory [collection1] {delete=[100 (-1601396958390386699)]} 0 635
   [junit4]   2> 3487617 INFO  (TEST-MaxSizeAutoCommitTest.testRedundantDeletes-seed#[1D557C9C97F6BEEF]) [    ] o.a.s.u.p.LogUpdateProcessorFactory [collection1] {delete=[100 (-1601396958390386700)]} 0 635
   [junit4]   2> 3487617 INFO  (TEST-MaxSizeAutoCommitTest.testRedundantDeletes-seed#[1D557C9C97F6BEEF]) [    ] o.a.s.u.p.LogUpdateProcessorFactory [collection1] {delete=[100 (-1601396958390386701)]} 0 635
   [junit4]   2> 3487617 INFO  (TEST-MaxSizeAutoCommitTest.testRedundantDeletes-seed#[1D557C9C97F6BEEF]) [    ] o.a.s.u.p.LogUpdateProcessorFactory [collection1] {delete=[100 (-1601396958390386702)]} 0 635
   [junit4]   2> 3487619 INFO  (commitScheduler-12522-thread-1) [    ] o.a.s.u.DirectUpdateHandler2 start commit{,optimize=false,openSearcher=false,waitSearcher=true,expungeDeletes=false,softCommit=false,prepareCommit=false}
   [junit4]   2> 3487619 INFO  (commitScheduler-12522-thread-1) [    ] o.a.s.u.SolrIndexWriter Calling setCommitData with IW:org.apache.solr.update.SolrIndexWriter@1332b73 commitCommandVersion:0
   [junit4]   2> 3487623 INFO  (commitScheduler-12522-thread-1) [    ] o.a.s.s.SolrIndexSearcher Opening [Searcher@5d7afb6b[collection1] realtime]
   [junit4]   2> 3487624 INFO  (commitScheduler-12522-thread-1) [    ] o.a.s.u.DirectUpdateHandler2 end_commit_flush
   [junit4]   2> 3487677 INFO  (TEST-MaxSizeAutoCommitTest.testRedundantDeletes-seed#[1D557C9C97F6BEEF]) [    ] o.a.s.u.p.LogUpdateProcessorFactory [collection1] {delete=[100 (-1601396958448058368)]} 0 696
   [junit4]   2> 3487677 INFO  (TEST-MaxSizeAutoCommitTest.testRedundantDeletes-seed#[1D557C9C97F6BEEF]) [    ] o.a.s.u.p.LogUpdateProcessorFactory [collection1] {delete=[100 (-1601396958453301248)]} 0 696
   [junit4]   2> 3487677 INFO  (TEST-MaxSizeAutoCommitTest.testRedundantDeletes-seed#[1D557C9C97F6BEEF]) [    ] o.a.s.u.p.LogUpdateProcessorFactory [collection1] {delete=[100 (-1601396958453301249)]} 0 696
   [junit4]   2> 3487677 INFO  (TEST-MaxSizeAutoCommitTest.testRedundantDeletes-seed#[1D557C9C97F6BEEF]) [    ] o.a.s.u.p.LogUpdateProcessorFactory [collection1] {delete=[100 (-1601396958453301250)]} 0 696
   [junit4]   2> 3487677 INFO  (TEST-MaxSizeAutoCommitTest.testRedundantDeletes-seed#[1D557C9C97F6BEEF]) [    ] o.a.s.u.p.LogUpdateProcessorFactory [collection1] {delete=[100 (-1601396958453301251)]} 0 696
   [junit4]   2> 3487677 INFO  (TEST-MaxSizeAutoCommitTest.testRedundantDeletes-seed#[1D557C9C97F6BEEF]) [    ] o.a.s.u.p.LogUpdateProcessorFactory [collection1] {delete=[100 (-1601396958453301252)]} 0 696
   [junit4]   2> 3487677 INFO  (TEST-MaxSizeAutoCommitTest.testRedundantDeletes-seed#[1D557C9C97F6BEEF]) [    ] o.a.s.u.p.LogUpdateProcessorFactory [collection1] {delete=[100 (-1601396958453301253)]} 0 696
   [junit4]   2> 3487677 INFO  (TEST-MaxSizeAutoCommitTest.testRedundantDeletes-seed#[1D557C9C97F6BEEF]) [    ] o.a.s.u.p.LogUpdateProcessorFactory [collection1] {delete=[100 (-1601396958453301254)]} 0 696
   [junit4]   2> 3487678 INFO  (TEST-MaxSizeAutoCommitTest.testRedundantDeletes-seed#[1D557C9C97F6BEEF]) [    ] o.a.s.u.p.LogUpdateProcessorFactory [collection1] {delete=[100 (-1601396958453301255)]} 0 696
   [junit4]   2> 3487678 INFO  (TEST-MaxSizeAutoCommitTest.testRedundantDeletes-seed#[1D557C9C97F6BEEF]) [    ] o.a.s.u.p.LogUpdateProcessorFactory [collection1] {delete=[100 (-1601396958454349824)]} 0 696
   [junit4]   2> 3487678 INFO  (TEST-MaxSizeAutoCommitTest.testRedundantDeletes-seed#[1D557C9C97F6BEEF]) [    ] o.a.s.u.p.LogUpdateProcessorFactory [collection1] {delete=[100 (-1601396958454349825)]} 0 696
   [junit4]   2> 3487678 INFO  (TEST-MaxSizeAutoCommitTest.testRedundantDeletes-seed#[1D557C9C97F6BEEF]) [    ] o.a.s.u.p.LogUpdateProcessorFactory [collection1] {delete=[100 (-1601396958454349826)]} 0 696
   [junit4]   2> 3487678 INFO  (TEST-MaxSizeAutoCommitTest.testRedundantDeletes-seed#[1D557C9C97F6BEEF]) [    ] o.a.s.u.p.LogUpdateProcessorFactory [collection1] {delete=[100 (-1601396958454349827)]} 0 696
   [junit4]   2> 3487678 INFO  (TEST-MaxSizeAutoCommitTest.testRedundantDeletes-seed#[1D557C9C97F6BEEF]) [    ] o.a.s.u.p.LogUpdateProcessorFactory [collection1] {delete=[100 (-1601396958454349828)]} 0 696
   [junit4]   2> 3487678 INFO  (TEST-MaxSizeAutoCommitTest.testRedundantDeletes-seed#[1D557C9C97F6BEEF]) [    ] o.a.s.u.p.LogUpdateProcessorFactory [collection1] {delete=[100 (-1601396958454349829)]} 0 696
   [junit4]   2> 3487678 INFO  (TEST-MaxSizeAutoCommitTest.testRedundantDeletes-seed#[1D557C9C97F6BEEF]) [    ] o.a.s.u.p.LogUpdateProcessorFactory [collection1] {delete=[100 (-1601396958454349830)]} 0 697
   [junit4]   2> 3487678 INFO  (TEST-MaxSizeAutoCommitTest.testRedundantDeletes-seed#[1D557C9C97F6BEEF]) [    ] o.a.s.u.p.LogUpdateProcessorFactory [collection1] {delete=[100 (-1601396958454349831)]} 0 697
   [junit4]   2> 3487678 INFO  (TEST-MaxSizeAutoCommitTest.testRedundantDeletes-seed#[1D557C9C97F6BEEF]) [    ] o.a.s.u.p.LogUpdateProcessorFactory [collection1] {delete=[100 (-1601396958454349832)]} 0 697
   [junit4]   2> 3487678 INFO  (TEST-MaxSizeAutoCommitTest.testRedundantDeletes-seed#[1D557C9C97F6BEEF]) [    ] o.a.s.u.p.LogUpdateProcessorFactory [collection1] {delete=[100 (-1601396958454349833)]} 0 697
   [junit4]   2> 3487679 INFO  (TEST-MaxSizeAutoCommitTest.testRedundantDeletes-seed#[1D557C9C97F6BEEF]) [    ] o.a.s.u.p.LogUpdateProcessorFactory [collection1] {delete=[100 (-1601396958454349834)]} 0 697
   [junit4]   2> 3487679 INFO  (TEST-MaxSizeAutoCommitTest.testRedundantDeletes-seed#[1D557C9C97F6BEEF]) [    ] o.a.s.u.p.LogUpdateProcessorFactory [collection1] {delete=[100 (-1601396958455398400)]} 0 698
   [junit4]   2> 3487679 INFO  (TEST-MaxSizeAutoCommitTest.testRedundantDeletes-seed#[1D557C9C97F6BEEF]) [    ] o.a.s.u.p.LogUpdateProcessorFactory [collection1] {delete=[100 (-1601396958455398401)]} 0 698
   [junit4]   2> 3487679 INFO  (TEST-MaxSizeAutoCommitTest.testRedundantDeletes-seed#[1D557C9C97F6BEEF]) [    ] o.a.s.u.p.LogUpdateProcessorFactory [collection1] {delete=[100 (-1601396958455398402)]} 0 698
   [junit4]   2> 3487679 INFO  (TEST-MaxSizeAutoCommitTest.testRedundantDeletes-seed#[1D557C9C97F6BEEF]) [    ] o.a.s.u.p.LogUpdateProcessorFactory [collection1] {delete=[100 (-1601396958455398403)]} 0 698
   [junit4]   2> 3487679 INFO  (TEST-MaxSizeAutoCommitTest.testRedundantDeletes-seed#[1D557C9C97F6BEEF]) [    ] o.a.s.u.p.LogUpdateProcessorFactory [collection1] {delete=[100 (-1601396958455398404)]} 0 698
   [junit4]   2> 3487679 INFO  (TEST-MaxSizeAutoCommitTest.testRedundantDeletes-seed#[1D557C9C97F6BEEF]) [    ] o.a.s.u.p.LogUpdateProcessorFactory [collection1] {delete=[100 (-1601396958455398405)]} 0 698
   [junit4]   2> 3487679 INFO  (TEST-MaxSizeAutoCommitTest.testRedundantDeletes-seed#[1D557C9C97F6BEEF]) [    ] o.a.s.u.p.LogUpdateProcessorFactory [collection1] {delete=[100 (-1601396958455398406)]} 0 698
   [junit4]   2> 3487679 INFO  (TEST-MaxSizeAutoCommitTest.testRedundantDeletes-seed#[1D557C9C97F6BEEF]) [    ] o.a.s.u.p.LogUpdateProcessorFactory [collection1] {delete=[100 (-1601396958455398407)]} 0 698
   [junit4]   2> 3487680 INFO  (TEST-MaxSizeAutoCommitTest.testRedundantDeletes-seed#[1D557C9C97F6BEEF]) [    ] o.a.s.u.p.LogUpdateProcessorFactory [collection1] {delete=[100 (-1601396958456446976)]} 0 698
   [junit4]   2> 3487680 INFO  (TEST-MaxSizeAutoCommitTest.testRedundantDeletes-seed#[1D557C9C97F6BEEF]) [    ] o.a.s.u.p.LogUpdateProcessorFactory [collection1] {delete=[100 (-1601396958456446977)]} 0 698
   [junit4]   2> 3487680 INFO  (TEST-MaxSizeAutoCommitTest.testRedundantDeletes-seed#[1D557C9C97F6BEEF]) [    ] o.a.s.u.p.LogUpdateProcessorFactory [collection1] {delete=[100 (-1601396958456446978)]} 0 698
   [junit4]   2> 3487680 INFO  (TEST-MaxSizeAutoCommitTest.testRedundantDeletes-seed#[1D557C9C97F6BEEF]) [    ] o.a.s.u.p.LogUpdateProcessorFactory [collection1] {delete=[100 (-1601396958456446979)]} 0 698
   [junit4]   2> 3487680 INFO  (TEST-MaxSizeAutoCommitTest.testRedundantDeletes-seed#[1D557C9C97F6BEEF]) [    ] o.a.s.u.p.LogUpdateProcessorFactory [collection1] {delete=[100 (-1601396958456446980)]} 0 698
   [junit4]   2> 3487680 INFO  (TEST-MaxSizeAutoCommitTest.testRedundantDeletes-seed#[1D557C9C97F6BEEF]) [    ] o.a.s.u.p.LogUpdateProcessorFactory [collection1] {delete=[100 (-1601396958456446981)]} 0 698
   [junit4]   2> 3487680 INFO  (TEST-MaxSizeAutoCommitTest.testRedundantDeletes-seed#[1D557C9C97F6BEEF]) [    ] o.a.s.u.p.LogUpdateProcessorFactory [collection1] {delete=[100 (-1601396958456446982)]} 0 698
   [junit4]   2> 3487680 INFO  (TEST-MaxSizeAutoCommitTest.testRedundantDeletes-seed#[1D557C9C97F6BEEF]) [    ] o.a.s.u.p.LogUpdateProcessorFactory [collection1] {delete=[100 (-1601396958456446983)]} 0 698
   [junit4]   2> 3487680 INFO  (TEST-MaxSizeAutoCommitTest.testRedundantDeletes-seed#[1D557C9C97F6BEEF]) [    ] o.a.s.u.p.LogUpdateProcessorFactory [collection1] {delete=[100 (-1601396958456446984)]} 0 698
   [junit4]   2> 3487680 INFO  (TEST-MaxSizeAutoCommitTest.testRedundantDeletes-seed#[1D557C9C97F6BEEF]) [    ] o.a.s.u.p.LogUpdateProcessorFactory [collection1] {delete=[100 (-1601396958456446985)]} 0 698
   [junit4]   2> 3487680 INFO  (TEST-MaxSizeAutoCommitTest.testRedundantDeletes-seed#[1D557C9C97F6BEEF]) [    ] o.a.s.u.p.LogUpdateProcessorFactory [collection1] {delete=[100 (-1601396958456446986)]} 0 698
   [junit4]   2> 3487680 INFO  (TEST-MaxSizeAutoCommitTest.testRedundantDeletes-seed#[1D557C9C97F6BEEF]) [    ] o.a.s.u.p.LogUpdateProcessorFactory [collection1] {delete=[100 (-1601396958456446987)]} 0 698
   [junit4]   2> 3487680 INFO  (TEST-MaxSizeAutoCommitTest.testRedundantDeletes-seed#[1D557C9C97F6BEEF]) [    ] o.a.s.u.p.LogUpdateProcessorFactory [collection1] {delete=[100 (-1601396958456446988)]} 0 698
   [junit4]   2> 3487680 INFO  (TEST-MaxSizeAutoCommitTest.testRedundantDeletes-seed#[1D557C9C97F6BEEF]) [    ] o.a.s.u.p.LogUpdateProcessorFactory [collection1] {delete=[100 (-1601396958456446989)]} 0 698
   [junit4]   2> 3487680 INFO  (TEST-MaxSizeAutoCommitTest.testRedundantDeletes-seed#[1D557C9C97F6BEEF]) [    ] o.a.s.u.p.LogUpdateProcessorFactory [collection1] {delete=[100 (-1601396958456446990)]} 0 698
   [junit4]   2> 3487680 INFO  (TEST-MaxSizeAutoCommitTest.testRedundantDeletes-seed#[1D557C9C97F6BEEF]) [    ] o.a.s.u.p.LogUpdateProcessorFactory [collection1] {delete=[100 (-1601396958456446991)]} 0 699
   [junit4]   2> 3487680 INFO  (TEST-MaxSizeAutoCommitTest.testRedundantDeletes-seed#[1D557C9C97F6BEEF]) [    ] o.a.s.u.p.LogUpdateProcessorFactory [collection1] {delete=[100 (-1601396958456446992)]} 0 699
   [junit4]   2> 3487680 INFO  (TEST-MaxSizeAutoCommitTest.testRedundantDeletes-seed#[1D557C9C97F6BEEF]) [    ] o.a.s.u.p.LogUpdateProcessorFactory [collection1] {delete=[100 (-1601396958456446993)]} 0 699
   [junit4]   2> 3487680 INFO  (TEST-MaxSizeAutoCommitTest.testRedundantDeletes-seed#[1D557C9C97F6BEEF]) [    ] o.a.s.u.p.LogUpdateProcessorFactory [collection1] {delete=[100 (-1601396958456446994)]} 0 699
   [junit4]   2> 3487680 INFO  (TEST-MaxSizeAutoCommitTest.testRedundantDeletes-seed#[1D557C9C97F6BEEF]) [    ] o.a.s.u.p.LogUpdateProcessorFactory [collection1] {delete=[100 (-1601396958456446995)]} 0 699
   [junit4]   2> 3487680 INFO  (TEST-MaxSizeAutoCommitTest.testRedundantDeletes-seed#[1D557C9C97F6BEEF]) [    ] o.a.s.u.p.LogUpdateProcessorFactory [collection1] {delete=[100 (-1601396958456446996)]} 0 699
   [junit4]   2> 3487680 INFO  (TEST-MaxSizeAutoCommitTest.testRedundantDeletes-seed#[1D557C9C97F6BEEF]) [    ] o.a.s.u.p.LogUpdateProcessorFactory [collection1] {delete=[100 (-1601396958456446997)]} 0 699
   [junit4]   2> 3487682 INFO  (commitScheduler-12522-thread-1) [    ] o.a.s.u.DirectUpdateHandler2 start commit{,optimize=false,openSearcher=false,waitSearcher=true,expungeDeletes=false,softCommit=false,prepareCommit=false}
   [junit4]   2> 3487682 INFO  (commitScheduler-12522-thread-1) [    ] o.a.s.u.SolrIndexWriter Calling setCommitData with IW:org.apache.solr.update.SolrIndexWriter@1332b73 commitCommandVersion:0
   [junit4]   2> 3487682 INFO  (commitScheduler-12522-thread-1) [    ] o.a.s.s.SolrIndexSearcher Opening [Searcher@71174b1c[collection1] realtime]
   [junit4]   2> 3487682 INFO  (commitScheduler-12522-thread-1) [    ] o.a.s.u.DirectUpdateHandler2 end_commit_flush
   [junit4]   2> 3487732 INFO  (TEST-MaxSizeAutoCommitTest.testRedundantDeletes-seed#[1D557C9C97F6BEEF]) [    ] o.a.s.u.p.LogUpdateProcessorFactory [collection1] {delete=[100 (-1601396958509924352)]} 0 750
   [junit4]   2> 3487732 INFO  (TEST-MaxSizeAutoCommitTest.testRedundantDeletes-seed#[1D557C9C97F6BEEF]) [    ] o.a.s.u.p.LogUpdateProcessorFactory [collection1] {delete=[100 (-1601396958510972928)]} 0 750
   [junit4]   2> 3487732 INFO  (TEST-MaxSizeAutoCommitTest.testRedundantDeletes-seed#[1D557C9C97F6BEEF]) [    ] o.a.s.u.p.LogUpdateProcessorFactory [collection1] {delete=[100 (-1601396958510972929)]} 0 750
   [junit4]   2> 3487737 INFO  (TEST-MaxSizeAutoCommitTest.testRedundantDeletes-seed#[1D557C9C97F6BEEF]) [    ] o.a.s.u.p.LogUpdateProcessorFactory [collection1] {delete=[100 (-1601396958516215808)]} 0 755
   [junit4]   2> 3487737 INFO  (TEST-MaxSizeAutoCommitTest.testRedundantDeletes-seed#[1D557C9C97F6BEEF]) [    ] o.a.s.u.p.LogUpdateProcessorFactory [collection1] {delete=[100 (-1601396958516215809)]} 0 756
   [junit4]   2> 3487737 INFO  (TEST-MaxSizeAutoCommitTest.testRedundantDeletes-seed#[1D557C9C97F6BEEF]) [    ] o.a.s.u.p.LogUpdateProcessorFactory [collection1] {delete=[100 (-1601396958516215810)]} 0 756
   [junit4]   2> 3487737 INFO  (TEST-MaxSizeAutoCommitTest.testRedundantDeletes-seed#[1D557C9C97F6BEEF]) [    ] o.a.s.u.p.LogUpdateProcessorFactory [collection1] {delete=[100 (-1601396958516215811)]} 0 756
   [junit4]   2> 3487737 INFO  (TEST-MaxSizeAutoCommitTest.testRedundantDeletes-seed#[1D557C9C97F6BEEF]) [    ] o.a.s.u.p.LogUpdateProcessorFactory [collection1] {delete=[100 (-1601396958516215812)]} 0 756
   [junit4]   2> 3487737 INFO  (TEST-MaxSizeAutoCommitTest.testRedundantDeletes-seed#[1D557C9C97F6BEEF]) [    ] o.a.s.u.p.LogUpdateProcessorFactory [collection1] {delete=[100 (-1601396958516215813)]} 0 756
   [junit4]   2> 3487737 INFO  (TEST-MaxSizeAutoCommitTest.testRedundantDeletes-seed#[1D557C9C97F6BEEF]) [    ] o.a.s.u.p.LogUpdateProcessorFactory [collection1] {delete=[100 (-1601396958516215814)]} 0 756
   [junit4]   2> 3487737 INFO  (TEST-MaxSizeAutoCommitTest.testRedundantDeletes-seed#[1D557C9C97F6BEEF]) [    ] o.a.s.u.p.LogUpdateProcessorFactory [collection1] {delete=[100 (-1601396958516215815)]} 0 756
   [junit4]   2> 3487737 INFO  (TEST-MaxSizeAutoCommitTest.testRedundantDeletes-seed#[1D557C9C97F6BEEF]) [    ] o.a.s.u.p.LogUpdateProcessorFactory [collection1] {delete=[100 (-1601396958516215816)]} 0 756
   [junit4]   2> 3487737 INFO  (TEST-MaxSizeAutoCommitTest.testRedundantDeletes-seed#[1D557C9C97F6BEEF]) [    ] o.a.s.u.p.LogUpdateProcessorFactory [collection1] {delete=[100 (-1601396958516215817)]} 0 756
   [junit4]   2> 3487737 INFO  (TEST-MaxSizeAutoCommitTest.testRedundantDeletes-seed#[1D557C9C97F6BEEF]) [    ] o.a.s.u.p.LogUpdateProcessorFactory [collection1] {delete=[100 (-1601396958516215818)]} 0 756
   [junit4]   2> 3487737 INFO  (TEST-MaxSizeAutoCommitTest.testRedundantDeletes-seed#[1D557C9C97F6BEEF]) [    ] o.a.s.u.p.LogUpdateProcessorFactory [collection1] {delete=[100 (-1601396958516215819)]} 0 756
   [junit4]   2> 3487737 INFO  (TEST-MaxSizeAutoCommitTest.testRedundantDeletes-seed#[1D557C9C97F6BEEF]) [    ] o.a.s.u.p.LogUpdateProcessorFactory [collection1] {delete=[100 (-1601396958516215820)]} 0 756
   [junit4]   2> 3487737 INFO  (TEST-MaxSizeAutoCommitTest.testRedundantDeletes-seed#[1D557C9C97F6BEEF]) [    ] o.a.s.u.p.LogUpdateProcessorFactory [collection1] {delete=[100 (-1601396958516215821)]} 0 756
   [junit4]   2> 3487737 INFO  (TEST-MaxSizeAutoCommitTest.testRedundantDeletes-seed#[1D557C9C97F6BEEF]) [    ] o.a.s.u.p.LogUpdateProcessorFactory [collection1] {delete=[100 (-1601396958516215822)]} 0 756
   [junit4]   2> 3487737 INFO  (TEST-MaxSizeAutoCommitTest.testRedundantDeletes-seed#[1D557C9C97F6BEEF]) [    ] o.a.s.u.p.LogUpdateProcessorFactory [collection1] {delete=[100 (-1601396958516215823)]} 0 756
   [junit4]   2> 3487738 INFO  (TEST-MaxSizeAutoCommitTest.testRedundantDeletes-seed#[1D557C9C97F6BEEF]) [    ] o.a.s.u.p.LogUpdateProcessorFactory [collection1] {delete=[100 (-1601396958517264384)]} 0 756
   [junit4]   2> 3487738 INFO  (TEST-MaxSizeAutoCommitTest.testRedundantDeletes-seed#[1D557C9C97F6BEEF]) [    ] o.a.s.u.p.LogUpdateProcessorFactory [collection1] {delete=[100 (-1601396958517264385)]} 0 756
   [junit4]   2> 3487738 INFO  (TEST-MaxSizeAutoCommitTest.testRedundantDeletes-seed#[1D557C9C97F6BEEF]) [    ] o.a.s.u.p.LogUpdateProcessorFactory [collection1] {delete=[100 (-1601396958517264386)]} 0 756
   [junit4]   2> 3487738 INFO  (TEST-MaxSizeAutoCommitTest.testRedundantDeletes-seed#[1D557C9C97F6BEEF]) [    ] o.a.s.u.p.LogUpdateProcessorFactory [collection1] {delete=[100 (-1601396958517264387)]} 0 756
   [junit4]   2> 3487738 INFO  (TEST-MaxSizeAutoCommitTest.testRedundantDeletes-seed#[1D557C9C97F6BEEF]) [    ] o.a.s.u.p.LogUpdateProcessorFactory [collection1] {delete=[100 (-1601396958517264388)]} 0 756
   [junit4]   2> 3487738 INFO  (TEST-MaxSizeAutoCommitTest.testRedundantDeletes-seed#[1D557C9C97F6BEEF]) [    ] o.a.s.u.p.LogUpdateProcessorFactory [collection1] {delete=[100 (-1601396958517264389)]} 0 756
   [junit4]   2> 3487738 INFO  (TEST-MaxSizeAutoCommitTest.testRedundantDeletes-seed#[1D557C9C97F6BEEF]) [    ] o.a.s.u.p.LogUpdateProcessorFactory [collection1] {delete=[100 (-1601396958517264390)]} 0 757
   [junit4]   2> 3487738 INFO  (TEST-MaxSizeAutoCommitTest.testRedundantDeletes-seed#[1D557C9C97F6BEEF]) [    ] o.a.s.u.p.LogUpdateProcessorFactory [collection1] {delete=[100 (-1601396958517264391)]} 0 757
   [junit4]   2> 3487739 INFO  (TEST-MaxSizeAutoCommitTest.testRedundantDeletes-seed#[1D557C9C97F6BEEF]) [    ] o.a.s.u.p.LogUpdateProcessorFactory [collection1] {delete=[100 (-1601396958517264392)]} 0 757
   [junit4]   2> 3487739 INFO  (TEST-MaxSizeAutoCommitTest.testRedundantDeletes-seed#[1D557C9C97F6BEEF]) [    ] o.a.s.u.p.LogUpdateProcessorFactory [collection1] {delete=[100 (-1601396958518312960)]} 0 757
   [junit4]   2> 3487739 INFO  (TEST-MaxSizeAutoCommitTest.testRedundantDeletes-seed#[1D557C9C97F6BEEF]) [    ] o.a.s.u.p.LogUpdateProcessorFactory [collection1] {delete=[100 (-1601396958518312961)]} 0 757
   [junit4]   2> 3487739 INFO  (TEST-MaxSizeAutoCommitTest.testRedundantDeletes-seed#[1D557C9C97F6BEEF]) [    ] o.a.s.u.p.LogUpdateProcessorFactory [collection1] {delete=[100 (-1601396958518312962)]} 0 757
   [junit4]   2> 3487739 INFO  (TEST-MaxSizeAutoCommitTest.testRedundantDeletes-seed#[1D557C9C97F6BEEF]) [    ] o.a.s.u.p.LogUpdateProcessorFactory [collection1] {delete=[100 (-1601396958518312963)]} 0 757
   [junit4]   2> 3487739 INFO  (TEST-MaxSizeAutoCommitTest.testRedundantDeletes-seed#[1D557C9C97F6BEEF]) [    ] o.a.s.u.p.LogUpdateProcessorFactory [collection1] {delete=[100 (-1601396958518312964)]} 0 757
   [junit4]   2> 3487739 INFO  (TEST-MaxSizeAutoCommitTest.testRedundantDeletes-seed#[1D557C9C97F6BEEF]) [    ] o.a.s.u.p.LogUpdateProcessorFactory [collection1] {delete=[100 (-1601396958518312965)]} 0 757
   [junit4]   2> 3487739 INFO  (TEST-MaxSizeAutoCommitTest.testRedundantDeletes-seed#[1D557C9C97F6BEEF]) [    ] o.a.s.u.p.LogUpdateProcessorFactory [collection1] {delete=[100 (-1601396958518312966)]} 0 757
   [junit4]   2> 3487739 INFO  (TEST-MaxSizeAutoCommitTest.testRedundantDeletes-seed#[1D557C9C97F6BEEF]) [    ] o.a.s.u.p.LogUpdateProcessorFactory [collection1] {delete=[100 (-1601396958518312967)]} 0 757
   [junit4]   2> 3487739 INFO  (TEST-MaxSizeAutoCommitTest.testRedundantDeletes-seed#[1D557C9C97F6BEEF]) [    ] o.a.s.u.p.LogUpdateProcessorFactory [collection1] {delete=[100 (-1601396958518312968)]} 0 757
   [junit4]   2> 3487739 INFO  (TEST-MaxSizeAutoCommitTest.testRedundantDeletes-seed#[1D557C9C97F6BEEF]) [    ] o.a.s.u.p.LogUpdateProcessorFactory [collection1] {delete=[100 (-1601396958518312969)]} 0 757
   [junit4]   2> 3487739 INFO  (TEST-MaxSizeAutoCommitTest.testRedundantDeletes-seed#[1D557C9C97F6BEEF]) [    ] o.a.s.u.p.LogUpdateProcessorFactory [collection1] {delete=[100 (-1601396958518312970)]} 0 757
   [junit4]   2> 3487739 INFO  (TEST-MaxSizeAutoCommitTest.testRedundantDeletes-seed#[1D557C9C97F6BEEF]) [    ] o.a.s.u.p.LogUpdateProcessorFactory [collection1] {delete=[100 (-1601396958518312971)]} 0 757
   [junit4]   2> 3487739 INFO  (TEST-MaxSizeAutoCommitTest.testRedundantDeletes-seed#[1D557C9C97F6BEEF]) [    ] o.a.s.u.p.LogUpdateProcessorFactory [collection1] {delete=[100 (-1601396958518312972)]} 0 757
   [junit4]   2> 3487739 INFO  (TEST-MaxSizeAutoCommitTest.testRedundantDeletes-seed#[1D557C9C97F6BEEF]) [    ] o.a.s.u.p.LogUpdateProcessorFactory [collection1] {delete=[100 (-1601396958518312973)]} 0 757
   [junit4]   2> 3487739 INFO  (TEST-MaxSizeAutoCommitTest.testRedundantDeletes-seed#[1D557C9C97F6BEEF]) [    ] o.a.s.u.p.LogUpdateProcessorFactory [collection1] {delete=[100 (-1601396958518312974)]} 0 757
   [junit4]   2> 3487739 INFO  (TEST-MaxSizeAutoCommitTest.testRedundantDeletes-seed#[1D557C9C97F6BEEF]) [    ] o.a.s.u.p.LogUpdateProcessorFactory [collection1] {delete=[100 (-1601396958518312975)]} 0 757
   [junit4]   2> 3487739 INFO  (TEST-MaxSizeAutoCommitTest.testRedundantDeletes-seed#[1D557C9C97F6BEEF]) [    ] o.a.s.u.p.LogUpdateProcessorFactory [collection1] {delete=[100 (-1601396958518312976)]} 0 757
   [junit4]   2> 3487739 INFO  (TEST-MaxSizeAutoCommitTest.testRedundantDeletes-seed#[1D557C9C97F6BEEF]) [    ] o.a.s.u.p.LogUpdateProcessorFactory [collection1] {delete=[100 (-1601396958518312977)]} 0 757
   [junit4]   2> 3487739 INFO  (TEST-MaxSizeAutoCommitTest.testRedundantDeletes-seed#[1D557C9C97F6BEEF]) [    ] o.a.s.u.p.LogUpdateProcessorFactory [collection1] {delete=[100 (-1601396958518312978)]} 0 757
   [junit4]   2> 3487739 INFO  (TEST-MaxSizeAutoCommitTest.testRedundantDeletes-seed#[1D557C9C97F6BEEF]) [    ] o.a.s.u.p.LogUpdateProcessorFactory [collection1] {delete=[100 (-1601396958518312979)]} 0 757
   [junit4]   2> 3487739 INFO  (TEST-MaxSizeAutoCommitTest.testRedundantDeletes-seed#[1D557C9C97F6BEEF]) [    ] o.a.s.u.p.LogUpdateProcessorFactory [collection1] {delete=[100 (-1601396958518312980)]} 0 757
   [junit4]   2> 3487739 INFO  (TEST-MaxSizeAutoCommitTest.testRedundantDeletes-seed#[1D557C9C97F6BEEF]) [    ] o.a.s.u.p.LogUpdateProcessorFactory [collection1] {delete=[100 (-1601396958518312981)]} 0 757
   [junit4]   2> 3487747 INFO  (commitScheduler-12522-thread-1) [    ] o.a.s.u.DirectUpdateHandler2 start commit{,optimize=false,openSearcher=false,waitSearcher=true,expungeDeletes=false,softCommit=false,prepareCommit=false}
   [junit4]   2> 3487747 INFO  (commitScheduler-12522-thread-1) [    ] o.a.s.u.SolrIndexWriter Calling setCommitData with IW:org.apache.solr.update.SolrIndexWriter@1332b73 commitCommandVersion:0
   [junit4]   2> 3487747 INFO  (commitScheduler-12522-thread-1) [    ] o.a.s.s.SolrIndexSearcher Opening [Searcher@513f15f5[collection1] realtime]
   [junit4]   2> 3487748 INFO  (commitScheduler-12522-thread-1) [    ] o.a.s.u.DirectUpdateHandler2 end_commit_flush
   [junit4]   2> 3487791 INFO  (TEST-MaxSizeAutoCommitTest.testRedundantDeletes-seed#[1D557C9C97F6BEEF]) [    ] o.a.s.u.p.LogUpdateProcessorFactory [collection1] {delete=[100 (-1601396958571790336)]} 0 809
   [junit4]   2> 3487791 INFO  (TEST-MaxSizeAutoCommitTest.testRedundantDeletes-seed#[1D557C9C97F6BEEF]) [    ] o.a.s.u.p.LogUpdateProcessorFactory [collection1] {delete=[100 (-1601396958572838912)]} 0 809
   [junit4]   2> 3487791 INFO  (TEST-MaxSizeAutoCommitTest.testRedundantDeletes-seed#[1D557C9C97F6BEEF]) [    ] o.a.s.u.p.LogUpdateProcessorFactory [collection1] {delete=[100 (-1601396958572838913)]} 0 809
   [junit4]   2> 3487791 INFO  (TEST-MaxSizeAutoCommitTest.testRedundantDeletes-seed#[1D557C9C97F6BEEF]) [    ] o.a.s.u.p.LogUpdateProcessorFactory [collection1] {delete=[100 (-1601396958572838914)]} 0 809
   [junit4]   2> 3487791 INFO  (TEST-MaxSizeAutoCommitTest.testRedundantDeletes-seed#[1D557C9C97F6BEEF]) [    ] o.a.s.u.p.LogUpdateProcessorFactory [collection1] {delete=[100 (-1601396958572838915)]} 0 809
   [junit4]   2> 3487791 INFO  (TEST-MaxSizeAutoCommitTest.testRedundantDeletes-seed#[1D557C9C97F6BEEF]) [    ] o.a.s.u.p.LogUpdateProcessorFactory [collection1] {delete=[100 (-1601396958572838916)]} 0 809
   [junit4]   2> 3487791 INFO  (TEST-MaxSizeAutoCommitTest.testRedundantDeletes-seed#[1D557C9C97F6BEEF]) [    ] o.a.s.u.p.LogUpdateProcessorFactory [collection1] {delete=[100 (-1601396958572838917)]} 0 809
   [junit4]   2> 3487791 INFO  (TEST-MaxSizeAutoCommitTest.testRedundantDeletes-seed#[1D557C9C97F6BEEF]) [    ] o.a.s.u.p.LogUpdateProcessorFactory [collection1] {delete=[100 (-1601396958572838918)]} 0 809
   [junit4]   2> 3487791 INFO  (TEST-MaxSizeAutoCommitTest.testRedundantDeletes-seed#[1D557C9C97F6BEEF]) [    ] o.a.s.u.p.LogUpdateProcessorFactory [collection1] {delete=[100 (-1601396958572838919)]} 0 810
   [junit4]   2> 3487791 INFO  (TEST-MaxSizeAutoCommitTest.testRedundantDeletes-seed#[1D557C9C97F6BEEF]) [    ] o.a.s.u.p.LogUpdateProcessorFactory [collection1] {delete=[100 (-1601396958572838920)]} 0 810
   [junit4]   2> 3487791 INFO  (TEST-MaxSizeAutoCommitTest.testRedundantDeletes-seed#[1D557C9C97F6BEEF]) [    ] o.a.s.u.p.LogUpdateProcessorFactory [collection1] {delete=[100 (-1601396958572838921)]} 0 810
   [junit4]   2> 3487791 INFO  (TEST-MaxSizeAutoCommitTest.testRedundantDeletes-seed#[1D557C9C97F6BEEF]) [    ] o.a.s.u.p.LogUpdateProcessorFactory [collection1] {delete=[100 (-1601396958572838922)]} 0 810
   [junit4]   2> 3487791 INFO  (TEST-MaxSizeAutoCommitTest.testRedundantDeletes-seed#[1D557C9C97F6BEEF]) [    ] o.a.s.u.p.LogUpdateProcessorFactory [collection1] {delete=[100 (-1601396958572838923)]} 0 810
   [junit4]   2> 3487791 INFO  (TEST-MaxSizeAutoCommitTest.testRedundantDeletes-seed#[1D557C9C97F6BEEF]) [    ] o.a.s.u.p.LogUpdateProcessorFactory [collection1] {delete=[100 (-1601396958572838924)]} 0 810
   [junit4]   2> 3487792 INFO  (TEST-MaxSizeAutoCommitTest.testRedundantDeletes-seed#[1D557C9C97F6BEEF]) [    ] o.a.s.u.p.LogUpdateProcessorFactory [collection1] {delete=[100 (-1601396958572838925)]} 0 810
   [junit4]   2> 3487792 INFO  (TEST-MaxSizeAutoCommitTest.testRedundantDeletes-seed#[1D557C9C97F6BEEF]) [    ] o.a.s.u.p.LogUpdateProcessorFactory [collection1] {delete=[100 (-1601396958573887488)]} 0 810
   [junit4]   2> 3487792 INFO  (TEST-MaxSizeAutoCommitTest.testRedundantDeletes-seed#[1D557C9C97F6BEEF]) [    ] o.a.s.u.p.LogUpdateProcessorFactory [collection1] {delete=[100 (-1601396958573887489)]} 0 810
   [junit4]   2> 3487792 INFO  (TEST-MaxSizeAutoCommitTest.testRedundantDeletes-seed#[1D557C9C97F6BEEF]) [    ] o.a.s.u.p.LogUpdateProcessorFactory [collection1] {delete=[100 (-1601396958573887490)]} 0 810
   [junit4]   2> 3487792 INFO  (TEST-MaxSizeAutoCommitTest.testRedundantDeletes-seed#[1D557C9C97F6BEEF]) [    ] o.a.s.u.p.LogUpdateProcessorFactory [collection1] {delete=[100 (-1601396958573887491)]} 0 810
   [junit4]   2> 3487792 INFO  (TEST-MaxSizeAutoCommitTest.testRedundantDeletes-seed#[1D557C9C97F6BEEF]) [    ] o.a.s.u.p.LogUpdateProcessorFactory [collection1] {delete=[100 (-1601396958573887492)]} 0 810
   [junit4]   2> 3487792 INFO  (TEST-MaxSizeAutoCommitTest.testRedundantDeletes-seed#[1D557C9C97F6BEEF]) [    ] o.a.s.u.p.LogUpdateProcessorFactory [collection1] {delete=[100 (-1601396958573887493)]} 0 810
   [junit4]   2> 3487792 INFO  (TEST-MaxSizeAutoCommitTest.testRedundantDeletes-seed#[1D557C9C97F6BEEF]) [    ] o.a.s.u.p.LogUpdateProcessorFactory [collection1] {delete=[100 (-1601396958573887494)]} 0 810
   [junit4]   2> 3487792 INFO  (TEST-MaxSizeAutoCommitTest.testRedundantDeletes-seed#[1D557C9C97F6BEEF]) [    ] o.a.s.u.p.LogUpdateProcessorFactory [collection1] {delete=[100 (-1601396958573887495)]} 0 810
   [junit4]   2> 3487792 INFO  (TEST-MaxSizeAutoCommitTest.testRedundantDeletes-seed#[1D557C9C97F6BEEF]) [    ] o.a.s.u.p.LogUpdateProcessorFactory [collection1] {delete=[100 (-1601396958573887496)]} 0 810
   [junit4]   2> 3487792 INFO  (TEST-MaxSizeAutoCommitTest.testRedundantDeletes-seed#[1D557C9C97F6BEEF]) [    ] o.a.s.u.p.LogUpdateProcessorFactory [collection1] {delete=[100 (-1601396958573887497)]} 0 810
   [junit4]   2> 3487792 INFO  (TEST-MaxSizeAutoCommitTest.testRedundantDeletes-seed#[1D557C9C97F6BEEF]) [    ] o.a.s.u.p.LogUpdateProcessorFactory [collection1] {delete=[100 (-1601396958573887498)]} 0 810
   [junit4]   2> 3487792 INFO  (TEST-MaxSizeAutoCommitTest.testRedundantDeletes-seed#[1D557C9C97F6BEEF]) [    ] o.a.s.u.p.LogUpdateProcessorFactory [collection1] {delete=[100 (-1601396958573887499)]} 0 810
   [junit4]   2> 3487792 INFO  (TEST-MaxSizeAutoCommitTest.testRedundantDeletes-seed#[1D557C9C97F6BEEF]) [    ] o.a.s.u.p.LogUpdateProcessorFactory [collection1] {delete=[100 (-1601396958573887500)]} 0 810
   [junit4]   2> 3487792 INFO  (TEST-MaxSizeAutoCommitTest.testRedundantDeletes-seed#[1D557C9C97F6BEEF]) [    ] o.a.s.u.p.LogUpdateProcessorFactory [collection1] {delete=[100 (-1601396958573887501)]} 0 810
   [junit4]   2> 3487792 INFO  (TEST-MaxSizeAutoCommitTest.testRedundantDeletes-seed#[1D557C9C97F6BEEF]) [    ] o.a.s.u.p.LogUpdateProcessorFactory [collection1] {delete=[100 (-1601396958573887502)]} 0 810
   [junit4]   2> 3487792 INFO  (TEST-MaxSizeAutoCommitTest.testRedundantDeletes-seed#[1D557C9C97F6BEEF]) [    ] o.a.s.u.p.LogUpdateProcessorFactory [collection1] {delete=[100 (-1601396958573887503)]} 0 810
   [junit4]   2> 3487792 INFO  (TEST-MaxSizeAutoCommitTest.testRedundantDeletes-seed#[1D557C9C97F6BEEF]) [    ] o.a.s.u.p.LogUpdateProcessorFactory [collection1] {delete=[100 (-1601396958573887504)]} 0 811
   [junit4]   2> 3487792 INFO  (TEST-MaxSizeAutoCommitTest.testRedundantDeletes-seed#[1D557C9C97F6BEEF]) [    ] o.a.s.u.p.LogUpdateProcessorFactory [collection1] {delete=[100 (-1601396958573887505)]} 0 811
   [junit4]   2> 3487792 INFO  (TEST-MaxSizeAutoCommitTest.testRedundantDeletes-seed#[1D557C9C97F6BEEF]) [    ] o.a.s.u.p.LogUpdateProcessorFactory [collection1] {delete=[100 (-1601396958573887506)]} 0 811
   [junit4]   2> 3487792 INFO  (TEST-MaxSizeAutoCommitTest.testRedundantDeletes-seed#[1D557C9C97F6BEEF]) [    ] o.a.s.u.p.LogUpdateProcessorFactory [collection1] {delete=[100 (-1601396958573887507)]} 0 811
   [junit4]   2> 3487792 INFO  (TEST-MaxSizeAutoCommitTest.testRedundantDeletes-seed#[1D557C9C97F6BEEF]) [    ] o.a.s.u.p.LogUpdateProcessorFactory [collection1] {delete=[100 (-1601396958573887508)]} 0 811
   [junit4]   2> 3487792 INFO  (TEST-MaxSizeAutoCommitTest.testRedundantDeletes-seed#[1D557C9C97F6BEEF]) [    ] o.a.s.u.p.LogUpdateProcessorFactory [collection1] {delete=[100 (-1601396958573887509)]} 0 811
   [junit4]   2> 3487792 INFO  (TEST-MaxSizeAutoCommitTest.testRedundantDeletes-seed#[1D557C9C97F6BEEF]) [    ] o.a.s.u.p.LogUpdateProcessorFactory [collection1] {delete=[100 (-1601396958573887510)]} 0 811
   [junit4]   2> 3487792 INFO  (TEST-MaxSizeAutoCommitTest.testRedundantDeletes-seed#[1D557C9C97F6BEEF]) [    ] o.a.s.u.p.LogUpdateProcessorFactory [collection1] {delete=[100 (-1601396958573887511)]} 0 811
   [junit4]   2> 3487792 INFO  (TEST-MaxSizeAutoCommitTest.testRedundantDeletes-seed#[1D557C9C97F6BEEF]) [    ] o.a.s.u.p.LogUpdateProcessorFactory [collection1] {delete=[100 (-1601396958573887512)]} 0 811
   [junit4]   2> 3487792 INFO  (TEST-MaxSizeAutoCommitTest.testRedundantDeletes-seed#[1D557C9C97F6BEEF]) [    ] o.a.s.u.p.LogUpdateProcessorFactory [collection1] {delete=[100 (-1601396958573887513)]} 0 811
   [junit4]   2> 3487792 INFO  (TEST-MaxSizeAutoCommitTest.testRedundantDeletes-seed#[1D557C9C97F6BEEF]) [    ] o.a.s.u.p.LogUpdateProcessorFactory [collection1] {delete=[100 (-1601396958573887514)]} 0 811
   [junit4]   2> 3487792 INFO  (TEST-MaxSizeAutoCommitTest.testRedundantDeletes-seed#[1D557C9C97F6BEEF]) [    ] o.a.s.u.p.LogUpdateProcessorFactory [collection1] {delete=[100 (-1601396958573887515)]} 0 811
   [junit4]   2> 3487793 INFO  (TEST-MaxSizeAutoCommitTest.testRedundantDeletes-seed#[1D557C9C97F6BEEF]) [    ] o.a.s.u.p.LogUpdateProcessorFactory [collection1] {delete=[100 (-1601396958573887516)]} 0 811
   [junit4]   2> 3487793 INFO  (TEST-MaxSizeAutoCommitTest.testRedundantDeletes-seed#[1D557C9C97F6BEEF]) [    ] o.a.s.u.p.LogUpdateProcessorFactory [collection1] {delete=[100 (-1601396958574936064)]} 0 811
   [junit4]   2> 3487793 INFO  (TEST-MaxSizeAutoCommitTest.testRedundantDeletes-seed#[1D557C9C97F6BEEF]) [    ] o.a.s.u.p.LogUpdateProcessorFactory [collection1] {delete=[100 (-1601396958574936065)]} 0 811
   [junit4]   2> 3487793 INFO  (TEST-MaxSizeAutoCommitTest.testRedundantDeletes-seed#[1D557C9C97F6BEEF]) [    ] o.a.s.u.p.LogUpdateProcessorFactory [collection1] {delete=[100 (-1601396958574936066)]} 0 811
   [junit4]   2> 3487793 INFO  (TEST-MaxSizeAutoCommitTest.testRedundantDeletes-seed#[1D557C9C97F6BEEF]) [    ] o.a.s.u.p.LogUpdateProcessorFactory [collection1] {delete=[100 (-1601396958574936067)]} 0 811
   [junit4]   2> 3487793 INFO  (TEST-MaxSizeAutoCommitTest.testRedundantDeletes-seed#[1D557C9C97F6BEEF]) [    ] o.a.s.u.p.LogUpdateProcessorFactory [collection1] {delete=[100 (-1601396958574936068)]} 0 811
   [junit4]   2> 3487793 INFO  (TEST-MaxSizeAutoCommitTest.testRedundantDeletes-seed#[1D557C9C97F6BEEF]) [    ] o.a.s.u.p.LogUpdateProcessorFactory [collection1] {delete=[100 (-1601396958574936069)]} 0 811
   [junit4]   2> 3487795 INFO  (commitScheduler-12522-thread-1) [    ] o.a.s.u.DirectUpdateHandler2 start commit{,optimize=false,openSearcher=false,waitSearcher=true,expungeDeletes=false,softCommit=false,prepareCommit=false}
   [junit4]   2> 3487795 INFO  (commitScheduler-12522-thread-1) [    ] o.a.s.u.SolrIndexWriter Calling setCommitData with IW:org.apache.solr.update.SolrIndexWriter@1332b73 commitCommandVersion:0
   [junit4]   2> 3487800 INFO  (commitScheduler-12522-thread-1) [    ] o.a.s.s.SolrIndexSearcher Opening [Searcher@71224d3b[collection1] realtime]
   [junit4]   2> 3487800 INFO  (commitScheduler-12522-thread-1) [    ] o.a.s.u.DirectUpdateHandler2 end_commit_flush
   [junit4]   2> 3487846 INFO  (TEST-MaxSizeAutoCommitTest.testRedundantDeletes-seed#[1D557C9C97F6BEEF]) [    ] o.a.s.u.p.LogUpdateProcessorFactory [collection1] {delete=[100 (-1601396958629462016)]} 0 864
   [junit4]   2> 3487846 INFO  (TEST-MaxSizeAutoCommitTest.testRedundantDeletes-seed#[1D557C9C97F6BEEF]) [    ] o.a.s.u.p.LogUpdateProcessorFactory [collection1] {delete=[100 (-1601396958630510592)]} 0 864
   [junit4]   2> 3487846 INFO  (TEST-MaxSizeAutoCommitTest.testRedundantDeletes-seed#[1D557C9C97F6BEEF]) [    ] o.a.s.u.p.LogUpdateProcessorFactory [collection1] {delete=[100 (-1601396958630510593)]} 0 864
   [junit4]   2> 3487846 INFO  (TEST-MaxSizeAutoCommitTest.testRedundantDeletes-seed#[1D557C9C97F6BEEF]) [    ] o.a.s.u.p.LogUpdateProcessorFactory [collection1] {delete=[100 (-1601396958630510594)]} 0 864
   [junit4]   2> 3487846 INFO  (TEST-MaxSizeAutoCommitTest.testRedundantDeletes-seed#[1D557C9C97F6BEEF]) [    ] o.a.s.u.p.LogUpdateProcessorFactory [collection1] {delete=[100 (-1601396958630510595)]} 0 864
   [junit4]   2> 3487846 INFO  (TEST-MaxSizeAutoCommitTest.testRedundantDeletes-seed#[1D557C9C97F6BEEF]) [    ] o.a.s.u.p.LogUpdateProcessorFactory [collection1] {delete=[100 (-1601396958630510596)]} 0 864
   [junit4]   2> 3487846 INFO  (TEST-MaxSizeAutoCommitTest.testRedundantDeletes-seed#[1D557C9C97F6BEEF]) [    ] o.a.s.u.p.LogUpdateProcessorFactory [collection1] {delete=[100 (-1601396958630510597)]} 0 864
   [junit4]   2> 3487846 INFO  (TEST-MaxSizeAutoCommitTest.testRedundantDeletes-seed#[1D557C9C97F6BEEF]) [    ] o.a.s.u.p.LogUpdateProcessorFactory [collection1] {delete=[100 (-1601396958630510598)]} 0 864
   [junit4]   2> 3487846 INFO  (TEST-MaxSizeAutoCommitTest.testRedundantDeletes-seed#[1D557C9C97F6BEEF]) [    ] o.a.s.u.p.LogUpdateProcessorFactory [collection1] {delete=[100 (-1601396958630510599)]} 0 864
   [junit4]   2> 3487846 INFO  (TEST-MaxSizeAutoCommitTest.testRedundantDeletes-seed#[1D557C9C97F6BEEF]) [    ] o.a.s.u.p.LogUpdateProcessorFactory [collection1] {delete=[100 (-1601396958630510600)]} 0 865
   [junit4]   2> 3487846 INFO  (TEST-MaxSizeAutoCommitTest.testRedundantDeletes-seed#[1D557C9C97F6BEEF]) [    ] o.a.s.u.p.LogUpdateProcessorFactory [collection1] {delete=[100 (-1601396958630510601)]} 0 865
   [junit4]   2> 3487846 INFO  (TEST-MaxSizeAutoCommitTest.testRedundantDeletes-seed#[1D557C9C97F6BEEF]) [    ] o.a.s.u.p.LogUpdateProcessorFactory [collection1] {delete=[100 (-1601396958630510602)]} 0 865
   [junit4]   2> 3487847 INFO  (TEST-MaxSizeAutoCommitTest.testRedundantDeletes-seed#[1D557C9C97F6BEEF]) [    ] o.a.s.u.p.LogUpdateProcessorFactory [collection1] {delete=[100 (-1601396958631559168)]} 0 865
   [junit4]   2> 3487847 INFO  (TEST-MaxSizeAutoCommitTest.testRedundantDeletes-seed#[1D557C9C97F6BEEF]) [    ] o.a.s.u.p.LogUpdateProcessorFactory [collection1] {delete=[100 (-1601396958631559169)]} 0 865
   [junit4]   2> 3487847 INFO  (TEST-MaxSizeAutoCommitTest.testRedundantDeletes-seed#[1D557C9C97F6BEEF]) [    ] o.a.s.u.p.LogUpdateProcessorFactory [collection1] {delete=[100 (-1601396958631559170)]} 0 865
   [junit4]   2> 3487847 INFO  (TEST-MaxSizeAutoCommitTest.testRedundantDeletes-seed#[1D557C9C97F6BEEF]) [    ] o.a.s.u.p.LogUpdateProcessorFactory [collection1] {delete=[100 (-1601396958631559171)]} 0 865
   [junit4]   2> 3487847 INFO  (TEST-MaxSizeAutoCommitTest.testRedundantDeletes-seed#[1D557C9C97F6BEEF]) [    ] o.a.s.u.p.LogUpdateProcessorFactory [collection1] {delete=[100 (-1601396958631559172)]} 0 865
   [junit4]   2> 3487847 INFO  (TEST-MaxSizeAutoCommitTest.testRedundantDeletes-seed#[1D557C9C97F6BEEF]) [    ] o.a.s.u.p.LogUpdateProcessorFactory [collection1] {delete=[100 (-1601396958631559173)]} 0 865
   [junit4]   2> 3487847 INFO  (TEST-MaxSizeAutoCommitTest.testRedundantDeletes-seed#[1D557C9C97F6BEEF]) [    ] o.a.s.u.p.LogUpdateProcessorFactory [collection1] {delete=[100 (-1601396958631559174)]} 0 865
   [junit4]   2> 3487847 INFO  (TEST-MaxSizeAutoCommitTest.testRedundantDeletes-seed#[1D557C9C97F6BEEF]) [    ] o.a.s.u.p.LogUpdateProcessorFactory [collection1] {delete=[100 (-1601396958631559175)]} 0 865
   [junit4]   2> 3487847 INFO  (TEST-MaxSizeAutoCommitTest.testRedundantDeletes-seed#[1D557C9C97F6BEEF]) [    ] o.a.s.u.p.LogUpdateProcessorFactory [collection1] {delete=[100 (-1601396958631559176)]} 0 865
   [junit4]   2> 3487847 INFO  (TEST-MaxSizeAutoCommitTest.testRedundantDeletes-seed#[1D557C9C97F6BEEF]) [    ] o.a.s.u.p.LogUpdateProcessorFactory [collection1] {delete=[100 (-1601396958631559177)]} 0 865
   [junit4]   2> 3487847 INFO  (TEST-MaxSizeAutoCommitTest.testRedundantDeletes-seed#[1D557C9C97F6BEEF]) [    ] o.a.s.u.p.LogUpdateProcessorFactory [collection1] {delete=[100 (-1601396958631559178)]} 0 865
   [junit4]   2> 3487847 INFO  (TEST-MaxSizeAutoCommitTest.testRedundantDeletes-seed#[1D557C9C97F6BEEF]) [    ] o.a.s.u.p.LogUpdateProcessorFactory [collection1] {delete=[100 (-1601396958631559179)]} 0 865
   [junit4]   2> 3487847 INFO  (TEST-MaxSizeAutoCommitTest.testRedundantDeletes-seed#[1D557C9C97F6BEEF]) [    ] o.a.s.u.p.LogUpdateProcessorFactory [collection1] {delete=[100 (-1601396958631559180)]} 0 866
   [junit4]   2> 3487847 INFO  (TEST-MaxSizeAutoCommitTest.testRedundantDeletes-seed#[1D557C9C97F6BEEF]) [    ] o.a.s.u.p.LogUpdateProcessorFactory [collection1] {delete=[100 (-1601396958631559181)]} 0 866
   [junit4]   2> 3487847 INFO  (TEST-MaxSizeAutoCommitTest.testRedundantDeletes-seed#[1D557C9C97F6BEEF]) [    ] o.a.s.u.p.LogUpdateProcessorFactory [collection1] {delete=[100 (-1601396958631559182)]} 0 866
   [junit4]   2> 3487848 INFO  (TEST-MaxSizeAutoCommitTest.testRedundantDeletes-seed#[1D557C9C97F6BEEF]) [    ] o.a.s.u.p.LogUpdateProcessorFactory [collection1] {delete=[100 (-1601396958631559183)]} 0 866
   [junit4]   2> 3487848 INFO  (TEST-MaxSizeAutoCommitTest.testRedundantDeletes-seed#[1D557C9C97F6BEEF]) [    ] o.a.s.u.p.LogUpdateProcessorFactory [collection1] {delete=[100 (-1601396958632607744)]} 0 866
   [junit4]   2> 3487848 INFO  (TEST-MaxSizeAutoCommitTest.testRedundantDeletes-seed#[1D557C9C97F6BEEF]) [    ] o.a.s.u.p.LogUpdateProcessorFactory [collection1] {delete=[100 (-1601396958632607745)]} 0 866
   [junit4]   2> 3487848 INFO  (TEST-MaxSizeAutoCommitTest.testRedundantDeletes-seed#[1D557C9C97F6BEEF]) [    ] o.a.s.u.p.LogUpdateProcessorFactory [collection1] {delete=[100 (-1601396958632607746)]} 0 866
   [junit4]   2> 3487848 INFO  (TEST-MaxSizeAutoCommitTest.testRedundantDeletes-seed#[1D557C9C97F6BEEF]) [    ] o.a.s.u.p.LogUpdateProcessorFactory [collection1] {delete=[100 (-1601396958632607747)]} 0 866
   [junit4]   2> 3487848 INFO  (TEST-MaxSizeAutoCommitTest.testRedundantDeletes-seed#[1D557C9C97F6BEEF]) [    ] o.a.s.u.p.LogUpdateProcessorFactory [collection1] {delete=[100 (-1601396958632607748)]} 0 866
   [junit4]   2> 3487848 INFO  (TEST-MaxSizeAutoCommitTest.testRedundantDeletes-seed#[1D557C9C97F6BEEF]) [    ] o.a.s.u.p.LogUpdateProcessorFactory [collection1] {delete=[100 (-1601396958632607749)]} 0 866
   [junit4]   2> 3487848 INFO  (TEST-MaxSizeAutoCommitTest.testRedundantDeletes-seed#[1D557C9C97F6BEEF]) [    ] o.a.s.u.p.LogUpdateProcessorFactory [collection1] {delete=[100 (-1601396958632607750)]} 0 866
   [junit4]   2> 3487848 INFO  (TEST-MaxSizeAutoCommitTest.testRedundantDeletes-seed#[1D557C9C97F6BEEF]) [    ] o.a.s.u.p.LogUpdateProcessorFactory [collection1] {delete=[100 (-1601396958632607751)]} 0 866
   [junit4]   2> 3487848 INFO  (TEST-MaxSizeAutoCommitTest.testRedundantDeletes-seed#[1D557C9C97F6BEEF]) [    ] o.a.s.u.p.LogUpdateProcessorFactory [collection1] {delete=[100 (-1601396958632607752)]} 0 866
   [junit4]   2> 3487848 INFO  (TEST-MaxSizeAutoCommitTest.testRedundantDeletes-seed#[1D557C9C97F6BEEF]) [    ] o.a.s.u.p.LogUpdateProcessorFactory [collection1] {delete=[100 (-1601396958632607753)]} 0 866
   [junit4]   2> 3487848 INFO  (TEST-MaxSizeAutoCommitTest.testRedundantDeletes-seed#[1D557C9C97F6BEEF]) [    ] o.a.s.u.p.LogUpdateProcessorFactory [collection1] {delete=[100 (-1601396958632607754)]} 0 866
   [junit4]   2> 3487848 INFO  (TEST-MaxSizeAutoCommitTest.testRedundantDeletes-seed#[1D557C9C97F6BEEF]) [    ] o.a.s.u.p.LogUpdateProcessorFactory [collection1] {delete=[100 (-1601396958632607755)]} 0 866
   [junit4]   2> 3487848 INFO  (TEST-MaxSizeAutoCommitTest.testRedundantDeletes-seed#[1D557C9C97F6BEEF]) [    ] o.a.s.u.p.LogUpdateProcessorFactory [collection1] {delete=[100 (-1601396958632607756)]} 0 866
   [junit4]   2> 3487848 INFO  (TEST-MaxSizeAutoCommitTest.testRedundantDeletes-seed#[1D557C9C97F6BEEF]) [    ] o.a.s.u.p.LogUpdateProcessorFactory [collection1] {delete=[100 (-1601396958632607757)]} 0 866
   [junit4]   2> 3487848 INFO  (TEST-MaxSizeAutoCommitTest.testRedundantDeletes-seed#[1D557C9C97F6BEEF]) [    ] o.a.s.u.p.LogUpdateProcessorFactory [collection1] {delete=[100 (-1601396958632607758)]} 0 866
   [junit4]   2> 3487848 INFO  (TEST-MaxSizeAutoCommitTest.testRedundantDeletes-seed#[1D557C9C97F6BEEF]) [    ] o.a.s.u.p.LogUpdateProcessorFactory [collection1] {delete=[100 (-1601396958632607759)]} 0 866
   [junit4]   2> 3487848 INFO  (TEST-MaxSizeAutoCommitTest.testRedundantDeletes-seed#[1D557C9C97F6BEEF]) [    ] o.a.s.u.p.LogUpdateProcessorFactory [collection1] {delete=[100 (-1601396958632607760)]} 0 866
   [junit4]   2> 3487848 INFO  (TEST-MaxSizeAutoCommitTest.testRedundantDeletes-seed#[1D557C9C97F6BEEF]) [    ] o.a.s.u.p.LogUpdateProcessorFactory [collection1] {de

[...truncated too long message...]

s J1 | MaxSizeAutoCommitTest.endToEndTest {seed=[1D557C9C97F6BEEF:B355AF56438652C1]}
   [junit4] OK      10.3s J1 | MaxSizeAutoCommitTest.endToEndTest {seed=[1D557C9C97F6BEEF:3DBC398A12421A0A]}
   [junit4] OK      10.0s J1 | MaxSizeAutoCommitTest.endToEndTest {seed=[1D557C9C97F6BEEF:C52926F7EBC4123]}
   [junit4] OK      9.89s J1 | MaxSizeAutoCommitTest.endToEndTest {seed=[1D557C9C97F6BEEF:409317C2DFB48198]}
   [junit4] OK      2.80s J1 | MaxSizeAutoCommitTest.simpleTest
   [junit4] Completed [2/5] on J1 in 84.97s, 8 tests
   [junit4] 
   [junit4] Duplicate suite name used with XML reports: org.apache.solr.update.MaxSizeAutoCommitTest. This may confuse tools that process XML reports. Set 'ignoreDuplicateSuites' to true to skip this message.
   [junit4] Suite: org.apache.solr.update.MaxSizeAutoCommitTest
   [junit4] OK      6.98s J0 | MaxSizeAutoCommitTest.testRedundantDeletes
   [junit4] OK      2.92s J0 | MaxSizeAutoCommitTest.deleteTest
   [junit4] OK      10.1s J0 | MaxSizeAutoCommitTest.endToEndTest {seed=[1D557C9C97F6BEEF:70313AA774499ED]}
   [junit4] OK      10.1s J0 | MaxSizeAutoCommitTest.endToEndTest {seed=[1D557C9C97F6BEEF:B355AF56438652C1]}
   [junit4] OK      9.97s J0 | MaxSizeAutoCommitTest.endToEndTest {seed=[1D557C9C97F6BEEF:3DBC398A12421A0A]}
   [junit4] OK      10.1s J0 | MaxSizeAutoCommitTest.endToEndTest {seed=[1D557C9C97F6BEEF:C52926F7EBC4123]}
   [junit4] OK      9.84s J0 | MaxSizeAutoCommitTest.endToEndTest {seed=[1D557C9C97F6BEEF:409317C2DFB48198]}
   [junit4] OK      2.68s J0 | MaxSizeAutoCommitTest.simpleTest
   [junit4] Completed [3/5] on J0 in 62.65s, 8 tests
   [junit4] 
   [junit4] Suite: org.apache.solr.update.MaxSizeAutoCommitTest
   [junit4] OK      6.36s J1 | MaxSizeAutoCommitTest.testRedundantDeletes
   [junit4] OK      3.13s J1 | MaxSizeAutoCommitTest.deleteTest
   [junit4] OK      10.1s J1 | MaxSizeAutoCommitTest.endToEndTest {seed=[1D557C9C97F6BEEF:70313AA774499ED]}
   [junit4] OK      10.2s J1 | MaxSizeAutoCommitTest.endToEndTest {seed=[1D557C9C97F6BEEF:B355AF56438652C1]}
   [junit4] OK      10.00s J1 | MaxSizeAutoCommitTest.endToEndTest {seed=[1D557C9C97F6BEEF:3DBC398A12421A0A]}
   [junit4] OK      9.85s J1 | MaxSizeAutoCommitTest.endToEndTest {seed=[1D557C9C97F6BEEF:C52926F7EBC4123]}
   [junit4] OK      9.80s J1 | MaxSizeAutoCommitTest.endToEndTest {seed=[1D557C9C97F6BEEF:409317C2DFB48198]}
   [junit4] OK      2.59s J1 | MaxSizeAutoCommitTest.simpleTest
   [junit4] Completed [4/5] on J1 in 62.07s, 8 tests
   [junit4] 
   [junit4] Suite: org.apache.solr.update.MaxSizeAutoCommitTest
   [junit4] OK      5.85s J0 | MaxSizeAutoCommitTest.testRedundantDeletes
   [junit4] OK      2.30s J0 | MaxSizeAutoCommitTest.deleteTest
   [junit4] OK      9.73s J0 | MaxSizeAutoCommitTest.endToEndTest {seed=[1D557C9C97F6BEEF:70313AA774499ED]}
   [junit4] OK      9.94s J0 | MaxSizeAutoCommitTest.endToEndTest {seed=[1D557C9C97F6BEEF:B355AF56438652C1]}
   [junit4] OK      9.87s J0 | MaxSizeAutoCommitTest.endToEndTest {seed=[1D557C9C97F6BEEF:3DBC398A12421A0A]}
   [junit4] OK      9.90s J0 | MaxSizeAutoCommitTest.endToEndTest {seed=[1D557C9C97F6BEEF:C52926F7EBC4123]}
   [junit4] OK      9.68s J0 | MaxSizeAutoCommitTest.endToEndTest {seed=[1D557C9C97F6BEEF:409317C2DFB48198]}
   [junit4] OK      2.51s J0 | MaxSizeAutoCommitTest.simpleTest
   [junit4] Completed [5/5] on J0 in 59.79s, 8 tests
   [junit4] 
   [junit4] JVM J0:     0.96 ..   209.17 =   208.21s
   [junit4] JVM J1:     0.93 ..   149.28 =   148.35s
   [junit4] Execution time total: 3 minutes 29 seconds
   [junit4] Tests summary: 5 suites, 40 tests
   [junit4] Could not remove temporary path: C:\Users\jenkins\workspace\Lucene-Solr-7.x-Windows\solr\build\solr-core\test\J0 (java.nio.file.DirectoryNotEmptyException: Remaining files: [C:\Users\jenkins\workspace\Lucene-Solr-7.x-Windows\solr\build\solr-core\test\J0\temp])
   [junit4] Could not remove temporary path: C:\Users\jenkins\workspace\Lucene-Solr-7.x-Windows\solr\build\solr-core\test\J1 (java.nio.file.DirectoryNotEmptyException: Remaining files: [C:\Users\jenkins\workspace\Lucene-Solr-7.x-Windows\solr\build\solr-core\test\J1\temp])
     [echo] 5 slowest tests:
[junit4:tophints] 517.81s | org.apache.solr.cloud.BasicDistributedZkTest
[junit4:tophints] 231.44s | org.apache.solr.cloud.TestPullReplicaErrorHandling
[junit4:tophints] 215.07s | org.apache.solr.update.TestInPlaceUpdatesDistrib
[junit4:tophints] 174.90s | org.apache.solr.cloud.autoscaling.SearchRateTriggerIntegrationTest
[junit4:tophints] 128.07s | org.apache.solr.cloud.ZkFailoverTest

-check-totals:

test-nocompile:

BUILD SUCCESSFUL
Total time: 3 minutes 31 seconds
[repro] Failures:
[repro]   0/5 failed: org.apache.solr.update.MaxSizeAutoCommitTest
[repro] Exiting with code 0

C:\Users\jenkins\workspace\Lucene-Solr-7.x-Windows>IF EXIST lucene\build move /y lucene\build lucene\build.repro 
        1 dir(s) moved.

C:\Users\jenkins\workspace\Lucene-Solr-7.x-Windows>IF EXIST solr\build move /y solr\build solr\build.repro 
        1 dir(s) moved.

C:\Users\jenkins\workspace\Lucene-Solr-7.x-Windows>IF EXIST lucene\build.orig move /y lucene\build.orig lucene\build 
        1 dir(s) moved.

C:\Users\jenkins\workspace\Lucene-Solr-7.x-Windows>IF EXIST solr\build.orig move /y solr\build.orig solr\build 
        1 dir(s) moved.

C:\Users\jenkins\workspace\Lucene-Solr-7.x-Windows>exit 0 
Archiving artifacts
Setting ANT_1_8_2_HOME=C:\Users\jenkins\tools\hudson.tasks.Ant_AntInstallation\ANT_1.8.2
java.lang.InterruptedException: no matches found within 10000
	at hudson.FilePath$34.hasMatch(FilePath.java:2678)
	at hudson.FilePath$34.invoke(FilePath.java:2557)
	at hudson.FilePath$34.invoke(FilePath.java:2547)
	at hudson.FilePath$FileCallableWrapper.call(FilePath.java:2918)
Also:   hudson.remoting.Channel$CallSiteStackTrace: Remote call to Windows VBOX
		at hudson.remoting.Channel.attachCallSiteStackTrace(Channel.java:1741)
		at hudson.remoting.UserRequest$ExceptionResponse.retrieve(UserRequest.java:357)
		at hudson.remoting.Channel.call(Channel.java:955)
		at hudson.FilePath.act(FilePath.java:1036)
		at hudson.FilePath.act(FilePath.java:1025)
		at hudson.FilePath.validateAntFileMask(FilePath.java:2547)
		at hudson.tasks.ArtifactArchiver.perform(ArtifactArchiver.java:243)
		at hudson.tasks.BuildStepCompatibilityLayer.perform(BuildStepCompatibilityLayer.java:81)
		at hudson.tasks.BuildStepMonitor$1.perform(BuildStepMonitor.java:20)
		at hudson.model.AbstractBuild$AbstractBuildExecution.perform(AbstractBuild.java:744)
		at hudson.model.AbstractBuild$AbstractBuildExecution.performAllBuildSteps(AbstractBuild.java:690)
		at hudson.model.Build$BuildExecution.post2(Build.java:186)
		at hudson.model.AbstractBuild$AbstractBuildExecution.post(AbstractBuild.java:635)
		at hudson.model.Run.execute(Run.java:1819)
		at hudson.model.FreeStyleBuild.run(FreeStyleBuild.java:43)
		at hudson.model.ResourceController.execute(ResourceController.java:97)
		at hudson.model.Executor.run(Executor.java:429)
Caused: hudson.FilePath$TunneledInterruptedException
	at hudson.FilePath$FileCallableWrapper.call(FilePath.java:2920)
	at hudson.remoting.UserRequest.perform(UserRequest.java:212)
	at hudson.remoting.UserRequest.perform(UserRequest.java:54)
	at hudson.remoting.Request$2.run(Request.java:369)
	at hudson.remoting.InterceptingExecutorService$1.call(InterceptingExecutorService.java:72)
	at java.util.concurrent.FutureTask.run(Unknown Source)
	at java.util.concurrent.ThreadPoolExecutor.runWorker(Unknown Source)
	at java.util.concurrent.ThreadPoolExecutor$Worker.run(Unknown Source)
	at java.lang.Thread.run(Unknown Source)
Caused: java.lang.InterruptedException: java.lang.InterruptedException: no matches found within 10000
	at hudson.FilePath.act(FilePath.java:1038)
	at hudson.FilePath.act(FilePath.java:1025)
	at hudson.FilePath.validateAntFileMask(FilePath.java:2547)
	at hudson.tasks.ArtifactArchiver.perform(ArtifactArchiver.java:243)
	at hudson.tasks.BuildStepCompatibilityLayer.perform(BuildStepCompatibilityLayer.java:81)
	at hudson.tasks.BuildStepMonitor$1.perform(BuildStepMonitor.java:20)
	at hudson.model.AbstractBuild$AbstractBuildExecution.perform(AbstractBuild.java:744)
	at hudson.model.AbstractBuild$AbstractBuildExecution.performAllBuildSteps(AbstractBuild.java:690)
	at hudson.model.Build$BuildExecution.post2(Build.java:186)
	at hudson.model.AbstractBuild$AbstractBuildExecution.post(AbstractBuild.java:635)
	at hudson.model.Run.execute(Run.java:1819)
	at hudson.model.FreeStyleBuild.run(FreeStyleBuild.java:43)
	at hudson.model.ResourceController.execute(ResourceController.java:97)
	at hudson.model.Executor.run(Executor.java:429)
No artifacts found that match the file pattern "**/*.events,heapdumps/**,**/*_pid*.log". Configuration error?
[WARNINGS] Parsing warnings in console log with parser Java Compiler (javac)
Setting ANT_1_8_2_HOME=C:\Users\jenkins\tools\hudson.tasks.Ant_AntInstallation\ANT_1.8.2
Setting ANT_1_8_2_HOME=C:\Users\jenkins\tools\hudson.tasks.Ant_AntInstallation\ANT_1.8.2
<Git Blamer> Using GitBlamer to create author and commit information for all warnings.
<Git Blamer> GIT_COMMIT=23ab3d19ab0239bae4cc0acdbc01a8b65c637d68, workspace=C:\Users\jenkins\workspace\Lucene-Solr-7.x-Windows
[WARNINGS] Computing warning deltas based on reference build #611
Recording test results
Setting ANT_1_8_2_HOME=C:\Users\jenkins\tools\hudson.tasks.Ant_AntInstallation\ANT_1.8.2
Build step 'Publish JUnit test result report' changed build result to UNSTABLE
Email was triggered for: Unstable (Test Failures)
Sending email for trigger: Unstable (Test Failures)
Setting ANT_1_8_2_HOME=C:\Users\jenkins\tools\hudson.tasks.Ant_AntInstallation\ANT_1.8.2
Setting ANT_1_8_2_HOME=C:\Users\jenkins\tools\hudson.tasks.Ant_AntInstallation\ANT_1.8.2
Setting ANT_1_8_2_HOME=C:\Users\jenkins\tools\hudson.tasks.Ant_AntInstallation\ANT_1.8.2
Setting ANT_1_8_2_HOME=C:\Users\jenkins\tools\hudson.tasks.Ant_AntInstallation\ANT_1.8.2

Mime
View raw message