lucene-dev mailing list archives

Site index · List index
Message view « Date » · « Thread »
Top « Date » · « Thread »
From Policeman Jenkins Server <jenk...@thetaphi.de>
Subject [JENKINS] Lucene-Solr-master-Linux (32bit/jdk1.8.0_162) - Build # 21989 - Unstable!
Date Fri, 11 May 2018 00:56:01 GMT
Build: https://jenkins.thetaphi.de/job/Lucene-Solr-master-Linux/21989/
Java: 32bit/jdk1.8.0_162 -server -XX:+UseParallelGC

5 tests failed.
FAILED:  org.apache.solr.cloud.autoscaling.NodeAddedTriggerTest.testRestoreState

Error Message:
Did not expect the processor to fire on first run! event={   "id":"47f58873b62beT73kqs7mn8hl21mqs96yc23eyp",   "source":"node_added_trigger",   "eventTime":1265918109508286,   "eventType":"NODEADDED",   "properties":{     "eventTimes":[1265918109508286],     "nodeNames":["127.0.0.1:42485_solr"]}}

Stack Trace:
java.lang.AssertionError: Did not expect the processor to fire on first run! event={
  "id":"47f58873b62beT73kqs7mn8hl21mqs96yc23eyp",
  "source":"node_added_trigger",
  "eventTime":1265918109508286,
  "eventType":"NODEADDED",
  "properties":{
    "eventTimes":[1265918109508286],
    "nodeNames":["127.0.0.1:42485_solr"]}}
	at __randomizedtesting.SeedInfo.seed([25C0CFAA7104FDBA:EB6E6B39893D85AC]:0)
	at org.junit.Assert.fail(Assert.java:93)
	at org.apache.solr.cloud.autoscaling.NodeAddedTriggerTest.lambda$new$0(NodeAddedTriggerTest.java:49)
	at org.apache.solr.cloud.autoscaling.NodeAddedTrigger.run(NodeAddedTrigger.java:161)
	at org.apache.solr.cloud.autoscaling.NodeAddedTriggerTest.testRestoreState(NodeAddedTriggerTest.java:257)
	at sun.reflect.NativeMethodAccessorImpl.invoke0(Native Method)
	at sun.reflect.NativeMethodAccessorImpl.invoke(NativeMethodAccessorImpl.java:62)
	at sun.reflect.DelegatingMethodAccessorImpl.invoke(DelegatingMethodAccessorImpl.java:43)
	at java.lang.reflect.Method.invoke(Method.java:498)
	at com.carrotsearch.randomizedtesting.RandomizedRunner.invoke(RandomizedRunner.java:1737)
	at com.carrotsearch.randomizedtesting.RandomizedRunner$8.evaluate(RandomizedRunner.java:934)
	at com.carrotsearch.randomizedtesting.RandomizedRunner$9.evaluate(RandomizedRunner.java:970)
	at com.carrotsearch.randomizedtesting.RandomizedRunner$10.evaluate(RandomizedRunner.java:984)
	at com.carrotsearch.randomizedtesting.rules.SystemPropertiesRestoreRule$1.evaluate(SystemPropertiesRestoreRule.java:57)
	at org.apache.lucene.util.TestRuleSetupTeardownChained$1.evaluate(TestRuleSetupTeardownChained.java:49)
	at org.apache.lucene.util.AbstractBeforeAfterRule$1.evaluate(AbstractBeforeAfterRule.java:45)
	at org.apache.lucene.util.TestRuleThreadAndTestName$1.evaluate(TestRuleThreadAndTestName.java:48)
	at org.apache.lucene.util.TestRuleIgnoreAfterMaxFailures$1.evaluate(TestRuleIgnoreAfterMaxFailures.java:64)
	at org.apache.lucene.util.TestRuleMarkFailure$1.evaluate(TestRuleMarkFailure.java:47)
	at com.carrotsearch.randomizedtesting.rules.StatementAdapter.evaluate(StatementAdapter.java:36)
	at com.carrotsearch.randomizedtesting.ThreadLeakControl$StatementRunner.run(ThreadLeakControl.java:368)
	at com.carrotsearch.randomizedtesting.ThreadLeakControl.forkTimeoutingTask(ThreadLeakControl.java:817)
	at com.carrotsearch.randomizedtesting.ThreadLeakControl$3.evaluate(ThreadLeakControl.java:468)
	at com.carrotsearch.randomizedtesting.RandomizedRunner.runSingleTest(RandomizedRunner.java:943)
	at com.carrotsearch.randomizedtesting.RandomizedRunner$5.evaluate(RandomizedRunner.java:829)
	at com.carrotsearch.randomizedtesting.RandomizedRunner$6.evaluate(RandomizedRunner.java:879)
	at com.carrotsearch.randomizedtesting.RandomizedRunner$7.evaluate(RandomizedRunner.java:890)
	at com.carrotsearch.randomizedtesting.rules.StatementAdapter.evaluate(StatementAdapter.java:36)
	at com.carrotsearch.randomizedtesting.rules.SystemPropertiesRestoreRule$1.evaluate(SystemPropertiesRestoreRule.java:57)
	at org.apache.lucene.util.AbstractBeforeAfterRule$1.evaluate(AbstractBeforeAfterRule.java:45)
	at com.carrotsearch.randomizedtesting.rules.StatementAdapter.evaluate(StatementAdapter.java:36)
	at org.apache.lucene.util.TestRuleStoreClassName$1.evaluate(TestRuleStoreClassName.java:41)
	at com.carrotsearch.randomizedtesting.rules.NoShadowingOrOverridesOnMethodsRule$1.evaluate(NoShadowingOrOverridesOnMethodsRule.java:40)
	at com.carrotsearch.randomizedtesting.rules.NoShadowingOrOverridesOnMethodsRule$1.evaluate(NoShadowingOrOverridesOnMethodsRule.java:40)
	at com.carrotsearch.randomizedtesting.rules.StatementAdapter.evaluate(StatementAdapter.java:36)
	at com.carrotsearch.randomizedtesting.rules.StatementAdapter.evaluate(StatementAdapter.java:36)
	at com.carrotsearch.randomizedtesting.rules.StatementAdapter.evaluate(StatementAdapter.java:36)
	at org.apache.lucene.util.TestRuleAssertionsRequired$1.evaluate(TestRuleAssertionsRequired.java:53)
	at org.apache.lucene.util.TestRuleMarkFailure$1.evaluate(TestRuleMarkFailure.java:47)
	at org.apache.lucene.util.TestRuleIgnoreAfterMaxFailures$1.evaluate(TestRuleIgnoreAfterMaxFailures.java:64)
	at org.apache.lucene.util.TestRuleIgnoreTestSuites$1.evaluate(TestRuleIgnoreTestSuites.java:54)
	at com.carrotsearch.randomizedtesting.rules.StatementAdapter.evaluate(StatementAdapter.java:36)
	at com.carrotsearch.randomizedtesting.ThreadLeakControl$StatementRunner.run(ThreadLeakControl.java:368)
	at java.lang.Thread.run(Thread.java:748)


FAILED:  org.apache.solr.cloud.autoscaling.NodeAddedTriggerTest.testRestoreState

Error Message:
Did not expect the processor to fire on first run! event={   "id":"47f5ddd9b437eT73kqs7mn8hl21mqs96yc23eyt",   "source":"node_added_trigger",   "eventTime":1265941033468798,   "eventType":"NODEADDED",   "properties":{     "eventTimes":[1265941033468798],     "nodeNames":["127.0.0.1:37223_solr"]}}

Stack Trace:
java.lang.AssertionError: Did not expect the processor to fire on first run! event={
  "id":"47f5ddd9b437eT73kqs7mn8hl21mqs96yc23eyt",
  "source":"node_added_trigger",
  "eventTime":1265941033468798,
  "eventType":"NODEADDED",
  "properties":{
    "eventTimes":[1265941033468798],
    "nodeNames":["127.0.0.1:37223_solr"]}}
	at __randomizedtesting.SeedInfo.seed([25C0CFAA7104FDBA:EB6E6B39893D85AC]:0)
	at org.junit.Assert.fail(Assert.java:93)
	at org.apache.solr.cloud.autoscaling.NodeAddedTriggerTest.lambda$new$0(NodeAddedTriggerTest.java:49)
	at org.apache.solr.cloud.autoscaling.NodeAddedTrigger.run(NodeAddedTrigger.java:161)
	at org.apache.solr.cloud.autoscaling.NodeAddedTriggerTest.testRestoreState(NodeAddedTriggerTest.java:257)
	at sun.reflect.NativeMethodAccessorImpl.invoke0(Native Method)
	at sun.reflect.NativeMethodAccessorImpl.invoke(NativeMethodAccessorImpl.java:62)
	at sun.reflect.DelegatingMethodAccessorImpl.invoke(DelegatingMethodAccessorImpl.java:43)
	at java.lang.reflect.Method.invoke(Method.java:498)
	at com.carrotsearch.randomizedtesting.RandomizedRunner.invoke(RandomizedRunner.java:1737)
	at com.carrotsearch.randomizedtesting.RandomizedRunner$8.evaluate(RandomizedRunner.java:934)
	at com.carrotsearch.randomizedtesting.RandomizedRunner$9.evaluate(RandomizedRunner.java:970)
	at com.carrotsearch.randomizedtesting.RandomizedRunner$10.evaluate(RandomizedRunner.java:984)
	at com.carrotsearch.randomizedtesting.rules.SystemPropertiesRestoreRule$1.evaluate(SystemPropertiesRestoreRule.java:57)
	at org.apache.lucene.util.TestRuleSetupTeardownChained$1.evaluate(TestRuleSetupTeardownChained.java:49)
	at org.apache.lucene.util.AbstractBeforeAfterRule$1.evaluate(AbstractBeforeAfterRule.java:45)
	at org.apache.lucene.util.TestRuleThreadAndTestName$1.evaluate(TestRuleThreadAndTestName.java:48)
	at org.apache.lucene.util.TestRuleIgnoreAfterMaxFailures$1.evaluate(TestRuleIgnoreAfterMaxFailures.java:64)
	at org.apache.lucene.util.TestRuleMarkFailure$1.evaluate(TestRuleMarkFailure.java:47)
	at com.carrotsearch.randomizedtesting.rules.StatementAdapter.evaluate(StatementAdapter.java:36)
	at com.carrotsearch.randomizedtesting.ThreadLeakControl$StatementRunner.run(ThreadLeakControl.java:368)
	at com.carrotsearch.randomizedtesting.ThreadLeakControl.forkTimeoutingTask(ThreadLeakControl.java:817)
	at com.carrotsearch.randomizedtesting.ThreadLeakControl$3.evaluate(ThreadLeakControl.java:468)
	at com.carrotsearch.randomizedtesting.RandomizedRunner.runSingleTest(RandomizedRunner.java:943)
	at com.carrotsearch.randomizedtesting.RandomizedRunner$5.evaluate(RandomizedRunner.java:829)
	at com.carrotsearch.randomizedtesting.RandomizedRunner$6.evaluate(RandomizedRunner.java:879)
	at com.carrotsearch.randomizedtesting.RandomizedRunner$7.evaluate(RandomizedRunner.java:890)
	at com.carrotsearch.randomizedtesting.rules.StatementAdapter.evaluate(StatementAdapter.java:36)
	at com.carrotsearch.randomizedtesting.rules.SystemPropertiesRestoreRule$1.evaluate(SystemPropertiesRestoreRule.java:57)
	at org.apache.lucene.util.AbstractBeforeAfterRule$1.evaluate(AbstractBeforeAfterRule.java:45)
	at com.carrotsearch.randomizedtesting.rules.StatementAdapter.evaluate(StatementAdapter.java:36)
	at org.apache.lucene.util.TestRuleStoreClassName$1.evaluate(TestRuleStoreClassName.java:41)
	at com.carrotsearch.randomizedtesting.rules.NoShadowingOrOverridesOnMethodsRule$1.evaluate(NoShadowingOrOverridesOnMethodsRule.java:40)
	at com.carrotsearch.randomizedtesting.rules.NoShadowingOrOverridesOnMethodsRule$1.evaluate(NoShadowingOrOverridesOnMethodsRule.java:40)
	at com.carrotsearch.randomizedtesting.rules.StatementAdapter.evaluate(StatementAdapter.java:36)
	at com.carrotsearch.randomizedtesting.rules.StatementAdapter.evaluate(StatementAdapter.java:36)
	at com.carrotsearch.randomizedtesting.rules.StatementAdapter.evaluate(StatementAdapter.java:36)
	at org.apache.lucene.util.TestRuleAssertionsRequired$1.evaluate(TestRuleAssertionsRequired.java:53)
	at org.apache.lucene.util.TestRuleMarkFailure$1.evaluate(TestRuleMarkFailure.java:47)
	at org.apache.lucene.util.TestRuleIgnoreAfterMaxFailures$1.evaluate(TestRuleIgnoreAfterMaxFailures.java:64)
	at org.apache.lucene.util.TestRuleIgnoreTestSuites$1.evaluate(TestRuleIgnoreTestSuites.java:54)
	at com.carrotsearch.randomizedtesting.rules.StatementAdapter.evaluate(StatementAdapter.java:36)
	at com.carrotsearch.randomizedtesting.ThreadLeakControl$StatementRunner.run(ThreadLeakControl.java:368)
	at java.lang.Thread.run(Thread.java:748)


FAILED:  org.apache.solr.cloud.autoscaling.NodeAddedTriggerTest.testRestoreState

Error Message:
Did not expect the processor to fire on first run! event={   "id":"47f6891e5f382T73kqs7mn8hl21mqs96yc23f10",   "source":"node_added_trigger",   "eventTime":1265987007935362,   "eventType":"NODEADDED",   "properties":{     "eventTimes":[1265987007935362],     "nodeNames":["127.0.0.1:41417_solr"]}}

Stack Trace:
java.lang.AssertionError: Did not expect the processor to fire on first run! event={
  "id":"47f6891e5f382T73kqs7mn8hl21mqs96yc23f10",
  "source":"node_added_trigger",
  "eventTime":1265987007935362,
  "eventType":"NODEADDED",
  "properties":{
    "eventTimes":[1265987007935362],
    "nodeNames":["127.0.0.1:41417_solr"]}}
	at __randomizedtesting.SeedInfo.seed([25C0CFAA7104FDBA:EB6E6B39893D85AC]:0)
	at org.junit.Assert.fail(Assert.java:93)
	at org.apache.solr.cloud.autoscaling.NodeAddedTriggerTest.lambda$new$0(NodeAddedTriggerTest.java:49)
	at org.apache.solr.cloud.autoscaling.NodeAddedTrigger.run(NodeAddedTrigger.java:161)
	at org.apache.solr.cloud.autoscaling.NodeAddedTriggerTest.testRestoreState(NodeAddedTriggerTest.java:257)
	at sun.reflect.NativeMethodAccessorImpl.invoke0(Native Method)
	at sun.reflect.NativeMethodAccessorImpl.invoke(NativeMethodAccessorImpl.java:62)
	at sun.reflect.DelegatingMethodAccessorImpl.invoke(DelegatingMethodAccessorImpl.java:43)
	at java.lang.reflect.Method.invoke(Method.java:498)
	at com.carrotsearch.randomizedtesting.RandomizedRunner.invoke(RandomizedRunner.java:1737)
	at com.carrotsearch.randomizedtesting.RandomizedRunner$8.evaluate(RandomizedRunner.java:934)
	at com.carrotsearch.randomizedtesting.RandomizedRunner$9.evaluate(RandomizedRunner.java:970)
	at com.carrotsearch.randomizedtesting.RandomizedRunner$10.evaluate(RandomizedRunner.java:984)
	at com.carrotsearch.randomizedtesting.rules.SystemPropertiesRestoreRule$1.evaluate(SystemPropertiesRestoreRule.java:57)
	at org.apache.lucene.util.TestRuleSetupTeardownChained$1.evaluate(TestRuleSetupTeardownChained.java:49)
	at org.apache.lucene.util.AbstractBeforeAfterRule$1.evaluate(AbstractBeforeAfterRule.java:45)
	at org.apache.lucene.util.TestRuleThreadAndTestName$1.evaluate(TestRuleThreadAndTestName.java:48)
	at org.apache.lucene.util.TestRuleIgnoreAfterMaxFailures$1.evaluate(TestRuleIgnoreAfterMaxFailures.java:64)
	at org.apache.lucene.util.TestRuleMarkFailure$1.evaluate(TestRuleMarkFailure.java:47)
	at com.carrotsearch.randomizedtesting.rules.StatementAdapter.evaluate(StatementAdapter.java:36)
	at com.carrotsearch.randomizedtesting.ThreadLeakControl$StatementRunner.run(ThreadLeakControl.java:368)
	at com.carrotsearch.randomizedtesting.ThreadLeakControl.forkTimeoutingTask(ThreadLeakControl.java:817)
	at com.carrotsearch.randomizedtesting.ThreadLeakControl$3.evaluate(ThreadLeakControl.java:468)
	at com.carrotsearch.randomizedtesting.RandomizedRunner.runSingleTest(RandomizedRunner.java:943)
	at com.carrotsearch.randomizedtesting.RandomizedRunner$5.evaluate(RandomizedRunner.java:829)
	at com.carrotsearch.randomizedtesting.RandomizedRunner$6.evaluate(RandomizedRunner.java:879)
	at com.carrotsearch.randomizedtesting.RandomizedRunner$7.evaluate(RandomizedRunner.java:890)
	at com.carrotsearch.randomizedtesting.rules.StatementAdapter.evaluate(StatementAdapter.java:36)
	at com.carrotsearch.randomizedtesting.rules.SystemPropertiesRestoreRule$1.evaluate(SystemPropertiesRestoreRule.java:57)
	at org.apache.lucene.util.AbstractBeforeAfterRule$1.evaluate(AbstractBeforeAfterRule.java:45)
	at com.carrotsearch.randomizedtesting.rules.StatementAdapter.evaluate(StatementAdapter.java:36)
	at org.apache.lucene.util.TestRuleStoreClassName$1.evaluate(TestRuleStoreClassName.java:41)
	at com.carrotsearch.randomizedtesting.rules.NoShadowingOrOverridesOnMethodsRule$1.evaluate(NoShadowingOrOverridesOnMethodsRule.java:40)
	at com.carrotsearch.randomizedtesting.rules.NoShadowingOrOverridesOnMethodsRule$1.evaluate(NoShadowingOrOverridesOnMethodsRule.java:40)
	at com.carrotsearch.randomizedtesting.rules.StatementAdapter.evaluate(StatementAdapter.java:36)
	at com.carrotsearch.randomizedtesting.rules.StatementAdapter.evaluate(StatementAdapter.java:36)
	at com.carrotsearch.randomizedtesting.rules.StatementAdapter.evaluate(StatementAdapter.java:36)
	at org.apache.lucene.util.TestRuleAssertionsRequired$1.evaluate(TestRuleAssertionsRequired.java:53)
	at org.apache.lucene.util.TestRuleMarkFailure$1.evaluate(TestRuleMarkFailure.java:47)
	at org.apache.lucene.util.TestRuleIgnoreAfterMaxFailures$1.evaluate(TestRuleIgnoreAfterMaxFailures.java:64)
	at org.apache.lucene.util.TestRuleIgnoreTestSuites$1.evaluate(TestRuleIgnoreTestSuites.java:54)
	at com.carrotsearch.randomizedtesting.rules.StatementAdapter.evaluate(StatementAdapter.java:36)
	at com.carrotsearch.randomizedtesting.ThreadLeakControl$StatementRunner.run(ThreadLeakControl.java:368)
	at java.lang.Thread.run(Thread.java:748)


FAILED:  org.apache.solr.cloud.autoscaling.NodeAddedTriggerTest.testRestoreState

Error Message:
Did not expect the processor to fire on first run! event={   "id":"47d104f2d8adbT73kqs7mn8hl21mqs96yc23jz6",   "source":"node_added_trigger",   "eventTime":1263408908176091,   "eventType":"NODEADDED",   "properties":{     "eventTimes":[1263408908176091],     "nodeNames":["127.0.0.1:44035_solr"]}}

Stack Trace:
java.lang.AssertionError: Did not expect the processor to fire on first run! event={
  "id":"47d104f2d8adbT73kqs7mn8hl21mqs96yc23jz6",
  "source":"node_added_trigger",
  "eventTime":1263408908176091,
  "eventType":"NODEADDED",
  "properties":{
    "eventTimes":[1263408908176091],
    "nodeNames":["127.0.0.1:44035_solr"]}}
	at __randomizedtesting.SeedInfo.seed([25C0CFAA7104FDBA:EB6E6B39893D85AC]:0)
	at org.junit.Assert.fail(Assert.java:93)
	at org.apache.solr.cloud.autoscaling.NodeAddedTriggerTest.lambda$new$0(NodeAddedTriggerTest.java:49)
	at org.apache.solr.cloud.autoscaling.NodeAddedTrigger.run(NodeAddedTrigger.java:161)
	at org.apache.solr.cloud.autoscaling.NodeAddedTriggerTest.testRestoreState(NodeAddedTriggerTest.java:257)
	at sun.reflect.NativeMethodAccessorImpl.invoke0(Native Method)
	at sun.reflect.NativeMethodAccessorImpl.invoke(NativeMethodAccessorImpl.java:62)
	at sun.reflect.DelegatingMethodAccessorImpl.invoke(DelegatingMethodAccessorImpl.java:43)
	at java.lang.reflect.Method.invoke(Method.java:498)
	at com.carrotsearch.randomizedtesting.RandomizedRunner.invoke(RandomizedRunner.java:1737)
	at com.carrotsearch.randomizedtesting.RandomizedRunner$8.evaluate(RandomizedRunner.java:934)
	at com.carrotsearch.randomizedtesting.RandomizedRunner$9.evaluate(RandomizedRunner.java:970)
	at com.carrotsearch.randomizedtesting.RandomizedRunner$10.evaluate(RandomizedRunner.java:984)
	at com.carrotsearch.randomizedtesting.rules.SystemPropertiesRestoreRule$1.evaluate(SystemPropertiesRestoreRule.java:57)
	at org.apache.lucene.util.TestRuleSetupTeardownChained$1.evaluate(TestRuleSetupTeardownChained.java:49)
	at org.apache.lucene.util.AbstractBeforeAfterRule$1.evaluate(AbstractBeforeAfterRule.java:45)
	at org.apache.lucene.util.TestRuleThreadAndTestName$1.evaluate(TestRuleThreadAndTestName.java:48)
	at org.apache.lucene.util.TestRuleIgnoreAfterMaxFailures$1.evaluate(TestRuleIgnoreAfterMaxFailures.java:64)
	at org.apache.lucene.util.TestRuleMarkFailure$1.evaluate(TestRuleMarkFailure.java:47)
	at com.carrotsearch.randomizedtesting.rules.StatementAdapter.evaluate(StatementAdapter.java:36)
	at com.carrotsearch.randomizedtesting.ThreadLeakControl$StatementRunner.run(ThreadLeakControl.java:368)
	at com.carrotsearch.randomizedtesting.ThreadLeakControl.forkTimeoutingTask(ThreadLeakControl.java:817)
	at com.carrotsearch.randomizedtesting.ThreadLeakControl$3.evaluate(ThreadLeakControl.java:468)
	at com.carrotsearch.randomizedtesting.RandomizedRunner.runSingleTest(RandomizedRunner.java:943)
	at com.carrotsearch.randomizedtesting.RandomizedRunner$5.evaluate(RandomizedRunner.java:829)
	at com.carrotsearch.randomizedtesting.RandomizedRunner$6.evaluate(RandomizedRunner.java:879)
	at com.carrotsearch.randomizedtesting.RandomizedRunner$7.evaluate(RandomizedRunner.java:890)
	at com.carrotsearch.randomizedtesting.rules.StatementAdapter.evaluate(StatementAdapter.java:36)
	at com.carrotsearch.randomizedtesting.rules.SystemPropertiesRestoreRule$1.evaluate(SystemPropertiesRestoreRule.java:57)
	at org.apache.lucene.util.AbstractBeforeAfterRule$1.evaluate(AbstractBeforeAfterRule.java:45)
	at com.carrotsearch.randomizedtesting.rules.StatementAdapter.evaluate(StatementAdapter.java:36)
	at org.apache.lucene.util.TestRuleStoreClassName$1.evaluate(TestRuleStoreClassName.java:41)
	at com.carrotsearch.randomizedtesting.rules.NoShadowingOrOverridesOnMethodsRule$1.evaluate(NoShadowingOrOverridesOnMethodsRule.java:40)
	at com.carrotsearch.randomizedtesting.rules.NoShadowingOrOverridesOnMethodsRule$1.evaluate(NoShadowingOrOverridesOnMethodsRule.java:40)
	at com.carrotsearch.randomizedtesting.rules.StatementAdapter.evaluate(StatementAdapter.java:36)
	at com.carrotsearch.randomizedtesting.rules.StatementAdapter.evaluate(StatementAdapter.java:36)
	at com.carrotsearch.randomizedtesting.rules.StatementAdapter.evaluate(StatementAdapter.java:36)
	at org.apache.lucene.util.TestRuleAssertionsRequired$1.evaluate(TestRuleAssertionsRequired.java:53)
	at org.apache.lucene.util.TestRuleMarkFailure$1.evaluate(TestRuleMarkFailure.java:47)
	at org.apache.lucene.util.TestRuleIgnoreAfterMaxFailures$1.evaluate(TestRuleIgnoreAfterMaxFailures.java:64)
	at org.apache.lucene.util.TestRuleIgnoreTestSuites$1.evaluate(TestRuleIgnoreTestSuites.java:54)
	at com.carrotsearch.randomizedtesting.rules.StatementAdapter.evaluate(StatementAdapter.java:36)
	at com.carrotsearch.randomizedtesting.ThreadLeakControl$StatementRunner.run(ThreadLeakControl.java:368)
	at java.lang.Thread.run(Thread.java:748)


FAILED:  org.apache.solr.update.TestHdfsUpdateLog.testFSThreadSafety

Error Message:
Captured an uncaught exception in thread: Thread[id=1745, name=Thread-432, state=RUNNABLE, group=TGRP-TestHdfsUpdateLog]

Stack Trace:
com.carrotsearch.randomizedtesting.UncaughtExceptionError: Captured an uncaught exception in thread: Thread[id=1745, name=Thread-432, state=RUNNABLE, group=TGRP-TestHdfsUpdateLog]
	at __randomizedtesting.SeedInfo.seed([25C0CFAA7104FDBA:D3EF6851BCAE5549]:0)
Caused by: org.apache.solr.common.SolrException: Exception writing document id 68 to the index; possible analysis error.
	at __randomizedtesting.SeedInfo.seed([25C0CFAA7104FDBA]:0)
	at org.apache.solr.update.DirectUpdateHandler2.addDoc(DirectUpdateHandler2.java:246)
	at org.apache.solr.update.processor.RunUpdateProcessor.processAdd(RunUpdateProcessorFactory.java:67)
	at org.apache.solr.update.processor.UpdateRequestProcessor.processAdd(UpdateRequestProcessor.java:55)
	at org.apache.solr.update.processor.DistributedUpdateProcessor.doLocalAdd(DistributedUpdateProcessor.java:950)
	at org.apache.solr.update.processor.DistributedUpdateProcessor.versionAdd(DistributedUpdateProcessor.java:1163)
	at org.apache.solr.update.processor.DistributedUpdateProcessor.processAdd(DistributedUpdateProcessor.java:633)
	at org.apache.solr.update.processor.LogUpdateProcessorFactory$LogUpdateProcessor.processAdd(LogUpdateProcessorFactory.java:103)
	at org.apache.solr.handler.loader.XMLLoader.processUpdate(XMLLoader.java:261)
	at org.apache.solr.handler.loader.XMLLoader.load(XMLLoader.java:188)
	at org.apache.solr.handler.UpdateRequestHandler$1.load(UpdateRequestHandler.java:97)
	at org.apache.solr.handler.ContentStreamHandlerBase.handleRequestBody(ContentStreamHandlerBase.java:68)
	at org.apache.solr.handler.RequestHandlerBase.handleRequest(RequestHandlerBase.java:199)
	at org.apache.solr.core.SolrCore.execute(SolrCore.java:2510)
	at org.apache.solr.servlet.DirectSolrConnection.request(DirectSolrConnection.java:125)
	at org.apache.solr.util.TestHarness.update(TestHarness.java:284)
	at org.apache.solr.util.BaseTestHarness.checkUpdateStatus(BaseTestHarness.java:281)
	at org.apache.solr.util.BaseTestHarness.validateUpdate(BaseTestHarness.java:251)
	at org.apache.solr.SolrTestCaseJ4.checkUpdateU(SolrTestCaseJ4.java:863)
	at org.apache.solr.SolrTestCaseJ4.assertU(SolrTestCaseJ4.java:842)
	at org.apache.solr.SolrTestCaseJ4.assertU(SolrTestCaseJ4.java:836)
	at org.apache.solr.update.TestHdfsUpdateLog$2.run(TestHdfsUpdateLog.java:122)
Caused by: java.lang.NullPointerException
	at org.apache.solr.update.UpdateLog.getCurrentLogSizeFromStream(UpdateLog.java:299)
	at org.apache.solr.update.DirectUpdateHandler2.getCurrentTLogSize(DirectUpdateHandler2.java:1007)
	at org.apache.solr.update.DirectUpdateHandler2.addDoc0(DirectUpdateHandler2.java:291)
	at org.apache.solr.update.DirectUpdateHandler2.addDoc(DirectUpdateHandler2.java:234)
	... 20 more




Build Log:
[...truncated 12728 lines...]
   [junit4] Suite: org.apache.solr.update.TestHdfsUpdateLog
   [junit4]   2> 220426 INFO  (SUITE-TestHdfsUpdateLog-seed#[25C0CFAA7104FDBA]-worker) [    ] o.a.s.SolrTestCaseJ4 SecureRandom sanity checks: test.solr.allowed.securerandom=null & java.security.egd=file:/dev/./urandom
   [junit4]   2> Creating dataDir: /home/jenkins/workspace/Lucene-Solr-master-Linux/solr/build/solr-core/test/J0/temp/solr.update.TestHdfsUpdateLog_25C0CFAA7104FDBA-001/init-core-data-001
   [junit4]   2> 220427 WARN  (SUITE-TestHdfsUpdateLog-seed#[25C0CFAA7104FDBA]-worker) [    ] o.a.s.SolrTestCaseJ4 startTrackingSearchers: numOpens=5 numCloses=5
   [junit4]   2> 220427 INFO  (SUITE-TestHdfsUpdateLog-seed#[25C0CFAA7104FDBA]-worker) [    ] o.a.s.SolrTestCaseJ4 Using PointFields (NUMERIC_POINTS_SYSPROP=true) w/NUMERIC_DOCVALUES_SYSPROP=false
   [junit4]   2> 220429 INFO  (SUITE-TestHdfsUpdateLog-seed#[25C0CFAA7104FDBA]-worker) [    ] o.a.s.SolrTestCaseJ4 Randomized ssl (false) and clientAuth (false) via: @org.apache.solr.util.RandomizeSSL(reason=, ssl=NaN, value=NaN, clientAuth=NaN)
   [junit4]   2> 220968 WARN  (SUITE-TestHdfsUpdateLog-seed#[25C0CFAA7104FDBA]-worker) [    ] o.a.h.u.NativeCodeLoader Unable to load native-hadoop library for your platform... using builtin-java classes where applicable
   [junit4]   1> Formatting using clusterid: testClusterID
   [junit4]   2> 221923 WARN  (SUITE-TestHdfsUpdateLog-seed#[25C0CFAA7104FDBA]-worker) [    ] o.a.h.m.i.MetricsConfig Cannot locate configuration: tried hadoop-metrics2-namenode.properties,hadoop-metrics2.properties
   [junit4]   2> 222135 INFO  (SUITE-TestHdfsUpdateLog-seed#[25C0CFAA7104FDBA]-worker) [    ] o.m.log Logging to org.apache.logging.slf4j.Log4jLogger@1f77e42 via org.mortbay.log.Slf4jLog
   [junit4]   2> 222164 WARN  (SUITE-TestHdfsUpdateLog-seed#[25C0CFAA7104FDBA]-worker) [    ] o.a.h.h.HttpRequestLog Jetty request log can only be enabled using Log4j
   [junit4]   2> 222531 INFO  (SUITE-TestHdfsUpdateLog-seed#[25C0CFAA7104FDBA]-worker) [    ] o.m.log jetty-6.1.26
   [junit4]   2> 222617 INFO  (SUITE-TestHdfsUpdateLog-seed#[25C0CFAA7104FDBA]-worker) [    ] o.m.log Extract jar:file:/home/jenkins/.ivy2/cache/org.apache.hadoop/hadoop-hdfs/tests/hadoop-hdfs-2.7.4-tests.jar!/webapps/hdfs to ./temp/Jetty_localhost_localdomain_44103_hdfs____6by5ou/webapp
   [junit4]   2> 223398 INFO  (SUITE-TestHdfsUpdateLog-seed#[25C0CFAA7104FDBA]-worker) [    ] o.m.log Started HttpServer2$SelectChannelConnectorWithSafeStartup@localhost.localdomain:44103
   [junit4]   2> 224667 WARN  (SUITE-TestHdfsUpdateLog-seed#[25C0CFAA7104FDBA]-worker) [    ] o.a.h.h.HttpRequestLog Jetty request log can only be enabled using Log4j
   [junit4]   2> 224672 INFO  (SUITE-TestHdfsUpdateLog-seed#[25C0CFAA7104FDBA]-worker) [    ] o.m.log jetty-6.1.26
   [junit4]   2> 224700 INFO  (SUITE-TestHdfsUpdateLog-seed#[25C0CFAA7104FDBA]-worker) [    ] o.m.log Extract jar:file:/home/jenkins/.ivy2/cache/org.apache.hadoop/hadoop-hdfs/tests/hadoop-hdfs-2.7.4-tests.jar!/webapps/datanode to ./temp/Jetty_localhost_45325_datanode____4qhl30/webapp
   [junit4]   2> 225267 INFO  (SUITE-TestHdfsUpdateLog-seed#[25C0CFAA7104FDBA]-worker) [    ] o.m.log Started HttpServer2$SelectChannelConnectorWithSafeStartup@localhost:45325
   [junit4]   2> 225779 WARN  (SUITE-TestHdfsUpdateLog-seed#[25C0CFAA7104FDBA]-worker) [    ] o.a.h.h.HttpRequestLog Jetty request log can only be enabled using Log4j
   [junit4]   2> 225781 INFO  (SUITE-TestHdfsUpdateLog-seed#[25C0CFAA7104FDBA]-worker) [    ] o.m.log jetty-6.1.26
   [junit4]   2> 225819 INFO  (SUITE-TestHdfsUpdateLog-seed#[25C0CFAA7104FDBA]-worker) [    ] o.m.log Extract jar:file:/home/jenkins/.ivy2/cache/org.apache.hadoop/hadoop-hdfs/tests/hadoop-hdfs-2.7.4-tests.jar!/webapps/datanode to ./temp/Jetty_localhost_46369_datanode____egx1ej/webapp
   [junit4]   2> 226336 INFO  (SUITE-TestHdfsUpdateLog-seed#[25C0CFAA7104FDBA]-worker) [    ] o.m.log Started HttpServer2$SelectChannelConnectorWithSafeStartup@localhost:46369
   [junit4]   2> 226751 ERROR (DataNode: [[[DISK]file:/home/jenkins/workspace/Lucene-Solr-master-Linux/solr/build/solr-core/test/J0/temp/solr.update.TestHdfsUpdateLog_25C0CFAA7104FDBA-001/tempDir-001/hdfsBaseDir/data/data1/, [DISK]file:/home/jenkins/workspace/Lucene-Solr-master-Linux/solr/build/solr-core/test/J0/temp/solr.update.TestHdfsUpdateLog_25C0CFAA7104FDBA-001/tempDir-001/hdfsBaseDir/data/data2/]]  heartbeating to localhost.localdomain/127.0.0.1:38759) [    ] o.a.h.h.s.d.DirectoryScanner dfs.datanode.directoryscan.throttle.limit.ms.per.sec set to value below 1 ms/sec. Assuming default value of 1000
   [junit4]   2> 226756 ERROR (DataNode: [[[DISK]file:/home/jenkins/workspace/Lucene-Solr-master-Linux/solr/build/solr-core/test/J0/temp/solr.update.TestHdfsUpdateLog_25C0CFAA7104FDBA-001/tempDir-001/hdfsBaseDir/data/data3/, [DISK]file:/home/jenkins/workspace/Lucene-Solr-master-Linux/solr/build/solr-core/test/J0/temp/solr.update.TestHdfsUpdateLog_25C0CFAA7104FDBA-001/tempDir-001/hdfsBaseDir/data/data4/]]  heartbeating to localhost.localdomain/127.0.0.1:38759) [    ] o.a.h.h.s.d.DirectoryScanner dfs.datanode.directoryscan.throttle.limit.ms.per.sec set to value below 1 ms/sec. Assuming default value of 1000
   [junit4]   2> 226878 INFO  (Block report processor) [    ] BlockStateChange BLOCK* processReport 0x47c694d2a2581: from storage DS-ce482716-8334-4b62-8d6f-76b29fee5ab1 node DatanodeRegistration(127.0.0.1:45389, datanodeUuid=eca545d2-2eac-47db-9bd0-cb10bfacc710, infoPort=41337, infoSecurePort=0, ipcPort=38629, storageInfo=lv=-56;cid=testClusterID;nsid=929053974;c=0), blocks: 0, hasStaleStorage: true, processing time: 2 msecs
   [junit4]   2> 226878 INFO  (Block report processor) [    ] BlockStateChange BLOCK* processReport 0x47c694db61848: from storage DS-2e29f1be-c796-446c-b2a6-3435d698382c node DatanodeRegistration(127.0.0.1:46705, datanodeUuid=e35c3dd5-13b0-4192-8139-fe18178dc564, infoPort=37511, infoSecurePort=0, ipcPort=35977, storageInfo=lv=-56;cid=testClusterID;nsid=929053974;c=0), blocks: 0, hasStaleStorage: true, processing time: 0 msecs
   [junit4]   2> 226878 INFO  (Block report processor) [    ] BlockStateChange BLOCK* processReport 0x47c694d2a2581: from storage DS-656d8140-9361-4102-89c9-615f4cf7f262 node DatanodeRegistration(127.0.0.1:45389, datanodeUuid=eca545d2-2eac-47db-9bd0-cb10bfacc710, infoPort=41337, infoSecurePort=0, ipcPort=38629, storageInfo=lv=-56;cid=testClusterID;nsid=929053974;c=0), blocks: 0, hasStaleStorage: false, processing time: 0 msecs
   [junit4]   2> 226878 INFO  (Block report processor) [    ] BlockStateChange BLOCK* processReport 0x47c694db61848: from storage DS-3c21adcf-a8bd-40da-8ffe-33fdbb8ea9c0 node DatanodeRegistration(127.0.0.1:46705, datanodeUuid=e35c3dd5-13b0-4192-8139-fe18178dc564, infoPort=37511, infoSecurePort=0, ipcPort=35977, storageInfo=lv=-56;cid=testClusterID;nsid=929053974;c=0), blocks: 0, hasStaleStorage: false, processing time: 0 msecs
   [junit4]   2> 227077 INFO  (SUITE-TestHdfsUpdateLog-seed#[25C0CFAA7104FDBA]-worker) [    ] o.a.s.SolrTestCaseJ4 ####initCore
   [junit4]   2> 227077 INFO  (SUITE-TestHdfsUpdateLog-seed#[25C0CFAA7104FDBA]-worker) [    ] o.a.s.c.SolrResourceLoader [null] Added 2 libs to classloader, from paths: [/home/jenkins/workspace/Lucene-Solr-master-Linux/solr/core/src/test-files/solr/collection1/lib, /home/jenkins/workspace/Lucene-Solr-master-Linux/solr/core/src/test-files/solr/collection1/lib/classes]
   [junit4]   2> 227093 INFO  (SUITE-TestHdfsUpdateLog-seed#[25C0CFAA7104FDBA]-worker) [    ] o.a.s.c.SolrConfig Using Lucene MatchVersion: 8.0.0
   [junit4]   2> 227100 INFO  (SUITE-TestHdfsUpdateLog-seed#[25C0CFAA7104FDBA]-worker) [    ] o.a.s.s.IndexSchema [null] Schema name=test
   [junit4]   2> 227266 INFO  (SUITE-TestHdfsUpdateLog-seed#[25C0CFAA7104FDBA]-worker) [    ] o.a.s.s.IndexSchema Loaded schema test/1.6 with uniqueid field id
   [junit4]   2> 227315 INFO  (SUITE-TestHdfsUpdateLog-seed#[25C0CFAA7104FDBA]-worker) [    ] o.a.s.m.r.SolrJmxReporter JMX monitoring for 'solr.node' (registry 'solr.node') enabled at server: com.sun.jmx.mbeanserver.JmxMBeanServer@a1ef31
   [junit4]   2> 227323 INFO  (SUITE-TestHdfsUpdateLog-seed#[25C0CFAA7104FDBA]-worker) [    ] o.a.s.m.r.SolrJmxReporter JMX monitoring for 'solr.jvm' (registry 'solr.jvm') enabled at server: com.sun.jmx.mbeanserver.JmxMBeanServer@a1ef31
   [junit4]   2> 227323 INFO  (SUITE-TestHdfsUpdateLog-seed#[25C0CFAA7104FDBA]-worker) [    ] o.a.s.m.r.SolrJmxReporter JMX monitoring for 'solr.jetty' (registry 'solr.jetty') enabled at server: com.sun.jmx.mbeanserver.JmxMBeanServer@a1ef31
   [junit4]   2> 227325 INFO  (coreLoadExecutor-627-thread-1) [    ] o.a.s.c.TransientSolrCoreCacheDefault Allocating transient cache for 2147483647 transient cores
   [junit4]   2> 227325 INFO  (coreLoadExecutor-627-thread-1) [    x:collection1] o.a.s.c.SolrResourceLoader [null] Added 2 libs to classloader, from paths: [/home/jenkins/workspace/Lucene-Solr-master-Linux/solr/core/src/test-files/solr/collection1/lib, /home/jenkins/workspace/Lucene-Solr-master-Linux/solr/core/src/test-files/solr/collection1/lib/classes]
   [junit4]   2> 227342 INFO  (coreLoadExecutor-627-thread-1) [    x:collection1] o.a.s.c.SolrConfig Using Lucene MatchVersion: 8.0.0
   [junit4]   2> 227355 INFO  (coreLoadExecutor-627-thread-1) [    x:collection1] o.a.s.s.IndexSchema [collection1] Schema name=test
   [junit4]   2> 227420 INFO  (coreLoadExecutor-627-thread-1) [    x:collection1] o.a.s.s.IndexSchema Loaded schema test/1.6 with uniqueid field id
   [junit4]   2> 227433 INFO  (coreLoadExecutor-627-thread-1) [    x:collection1] o.a.s.c.CoreContainer Creating SolrCore 'collection1' using configuration from instancedir /home/jenkins/workspace/Lucene-Solr-master-Linux/solr/core/src/test-files/solr/collection1, trusted=true
   [junit4]   2> 227433 INFO  (coreLoadExecutor-627-thread-1) [    x:collection1] o.a.s.m.r.SolrJmxReporter JMX monitoring for 'solr.core.collection1' (registry 'solr.core.collection1') enabled at server: com.sun.jmx.mbeanserver.JmxMBeanServer@a1ef31
   [junit4]   2> 227442 INFO  (coreLoadExecutor-627-thread-1) [    x:collection1] o.a.s.c.HdfsDirectoryFactory solr.hdfs.home=hdfs://localhost.localdomain:38759/solr_hdfs_home
   [junit4]   2> 227442 INFO  (coreLoadExecutor-627-thread-1) [    x:collection1] o.a.s.c.HdfsDirectoryFactory Solr Kerberos Authentication disabled
   [junit4]   2> 227442 INFO  (coreLoadExecutor-627-thread-1) [    x:collection1] o.a.s.c.SolrCore solr.RecoveryStrategy.Builder
   [junit4]   2> 227443 INFO  (coreLoadExecutor-627-thread-1) [    x:collection1] o.a.s.c.SolrCore [[collection1] ] Opening new SolrCore at [/home/jenkins/workspace/Lucene-Solr-master-Linux/solr/core/src/test-files/solr/collection1], dataDir=[hdfs://localhost.localdomain:38759/solr_hdfs_home/collection1//home/jenkins/workspace/Lucene-Solr-master-Linux/solr/build/solr-core/test/J0/temp/solr.update.TestHdfsUpdateLog_25C0CFAA7104FDBA-001/init-core-data-001/]
   [junit4]   2> 227444 INFO  (coreLoadExecutor-627-thread-1) [    x:collection1] o.a.s.c.HdfsDirectoryFactory creating directory factory for path hdfs://localhost.localdomain:38759/solr_hdfs_home/collection1//home/jenkins/workspace/Lucene-Solr-master-Linux/solr/build/solr-core/test/J0/temp/solr.update.TestHdfsUpdateLog_25C0CFAA7104FDBA-001/init-core-data-001/snapshot_metadata
   [junit4]   2> 227456 INFO  (coreLoadExecutor-627-thread-1) [    x:collection1] o.a.s.c.HdfsDirectoryFactory Number of slabs of block cache [1] with direct memory allocation set to [true]
   [junit4]   2> 227456 INFO  (coreLoadExecutor-627-thread-1) [    x:collection1] o.a.s.c.HdfsDirectoryFactory Block cache target memory usage, slab size of [8388608] will allocate [1] slabs and use ~[8388608] bytes
   [junit4]   2> 227456 INFO  (coreLoadExecutor-627-thread-1) [    x:collection1] o.a.s.c.HdfsDirectoryFactory Creating new single instance HDFS BlockCache
   [junit4]   2> 227878 INFO  (coreLoadExecutor-627-thread-1) [    x:collection1] o.a.s.s.b.BlockDirectory Block cache on write is disabled
   [junit4]   2> 227883 INFO  (coreLoadExecutor-627-thread-1) [    x:collection1] o.a.s.c.HdfsDirectoryFactory creating directory factory for path hdfs://localhost.localdomain:38759/solr_hdfs_home/collection1//home/jenkins/workspace/Lucene-Solr-master-Linux/solr/build/solr-core/test/J0/temp/solr.update.TestHdfsUpdateLog_25C0CFAA7104FDBA-001/init-core-data-001
   [junit4]   2> 227904 INFO  (coreLoadExecutor-627-thread-1) [    x:collection1] o.a.s.c.HdfsDirectoryFactory creating directory factory for path hdfs://localhost.localdomain:38759/solr_hdfs_home/collection1//home/jenkins/workspace/Lucene-Solr-master-Linux/solr/build/solr-core/test/J0/temp/solr.update.TestHdfsUpdateLog_25C0CFAA7104FDBA-001/init-core-data-001/index
   [junit4]   2> 227912 INFO  (coreLoadExecutor-627-thread-1) [    x:collection1] o.a.s.c.HdfsDirectoryFactory Number of slabs of block cache [1] with direct memory allocation set to [true]
   [junit4]   2> 227912 INFO  (coreLoadExecutor-627-thread-1) [    x:collection1] o.a.s.c.HdfsDirectoryFactory Block cache target memory usage, slab size of [8388608] will allocate [1] slabs and use ~[8388608] bytes
   [junit4]   2> 227912 INFO  (coreLoadExecutor-627-thread-1) [    x:collection1] o.a.s.c.HdfsDirectoryFactory Creating new single instance HDFS BlockCache
   [junit4]   2> 227920 INFO  (coreLoadExecutor-627-thread-1) [    x:collection1] o.a.s.s.b.BlockDirectory Block cache on write is disabled
   [junit4]   2> 227921 INFO  (coreLoadExecutor-627-thread-1) [    x:collection1] o.a.s.u.RandomMergePolicy RandomMergePolicy wrapping class org.apache.lucene.index.AlcoholicMergePolicy: [AlcoholicMergePolicy: minMergeSize=0, mergeFactor=10, maxMergeSize=1052739774, maxMergeSizeForForcedMerge=9223372036854775807, calibrateSizeByDeletes=true, maxMergeDocs=2147483647, maxCFSSegmentSizeMB=8.796093022207999E12, noCFSRatio=0.1]
   [junit4]   2> 228086 INFO  (Block report processor) [    ] BlockStateChange BLOCK* addStoredBlock: blockMap updated: 127.0.0.1:45389 is added to blk_1073741825_1001{UCState=COMMITTED, truncateBlock=null, primaryNodeIndex=-1, replicas=[ReplicaUC[[DISK]DS-ce482716-8334-4b62-8d6f-76b29fee5ab1:NORMAL:127.0.0.1:45389|RBW], ReplicaUC[[DISK]DS-3c21adcf-a8bd-40da-8ffe-33fdbb8ea9c0:NORMAL:127.0.0.1:46705|RBW]]} size 69
   [junit4]   2> 228086 INFO  (Block report processor) [    ] BlockStateChange BLOCK* addStoredBlock: blockMap updated: 127.0.0.1:46705 is added to blk_1073741825_1001 size 69
   [junit4]   2> 228495 WARN  (coreLoadExecutor-627-thread-1) [    x:collection1] o.a.s.c.RequestHandlers INVALID paramSet a in requestHandler {type = requestHandler,name = /dump,class = DumpRequestHandler,attributes = {initParams=a, name=/dump, class=DumpRequestHandler},args = {defaults={a=A,b=B}}}
   [junit4]   2> 228528 INFO  (coreLoadExecutor-627-thread-1) [    x:collection1] o.a.s.u.UpdateHandler Using UpdateLog implementation: org.apache.solr.update.HdfsUpdateLog
   [junit4]   2> 228528 INFO  (coreLoadExecutor-627-thread-1) [    x:collection1] o.a.s.u.UpdateLog Initializing UpdateLog: dataDir=hdfs://localhost.localdomain:38759/solr/shard1 defaultSyncLevel=FLUSH numRecordsToKeep=100 maxNumLogsToKeep=10 numVersionBuckets=65536
   [junit4]   2> 228528 INFO  (coreLoadExecutor-627-thread-1) [    x:collection1] o.a.s.u.HdfsUpdateLog Initializing HdfsUpdateLog: tlogDfsReplication=2
   [junit4]   2> 228538 INFO  (coreLoadExecutor-627-thread-1) [    x:collection1] o.a.s.u.CommitTracker Hard AutoCommit: disabled
   [junit4]   2> 228538 INFO  (coreLoadExecutor-627-thread-1) [    x:collection1] o.a.s.u.CommitTracker Soft AutoCommit: disabled
   [junit4]   2> 228541 INFO  (coreLoadExecutor-627-thread-1) [    x:collection1] o.a.s.u.RandomMergePolicy RandomMergePolicy wrapping class org.apache.lucene.index.LogDocMergePolicy: [LogDocMergePolicy: minMergeSize=1000, mergeFactor=47, maxMergeSize=9223372036854775807, maxMergeSizeForForcedMerge=9223372036854775807, calibrateSizeByDeletes=false, maxMergeDocs=2147483647, maxCFSSegmentSizeMB=8.796093022207999E12, noCFSRatio=1.0]
   [junit4]   2> 228594 INFO  (coreLoadExecutor-627-thread-1) [    x:collection1] o.a.s.s.SolrIndexSearcher Opening [Searcher@1b3d168[collection1] main]
   [junit4]   2> 228595 WARN  (coreLoadExecutor-627-thread-1) [    x:collection1] o.a.s.r.ManagedResourceStorage Cannot write to config directory /home/jenkins/workspace/Lucene-Solr-master-Linux/solr/core/src/test-files/solr/collection1/conf; switching to use InMemory storage instead.
   [junit4]   2> 228598 INFO  (coreLoadExecutor-627-thread-1) [    x:collection1] o.a.s.h.ReplicationHandler Commits will be reserved for 10000ms.
   [junit4]   2> 228599 INFO  (searcherExecutor-628-thread-1-processing-x:collection1) [    x:collection1] o.a.s.c.SolrCore [collection1] Registered new searcher Searcher@1b3d168[collection1] main{ExitableDirectoryReader(UninvertingDirectoryReader())}
   [junit4]   2> 228599 INFO  (coreLoadExecutor-627-thread-1) [    x:collection1] o.a.s.u.UpdateLog Could not find max version in index or recent updates, using new clock 1600123516131213312
   [junit4]   2> 228601 INFO  (SUITE-TestHdfsUpdateLog-seed#[25C0CFAA7104FDBA]-worker) [    ] o.a.s.SolrTestCaseJ4 ####initCore end
   [junit4]   2> 228616 INFO  (TEST-TestHdfsUpdateLog.testFSThreadSafety-seed#[25C0CFAA7104FDBA]) [    ] o.a.s.SolrTestCaseJ4 ###Starting testFSThreadSafety
   [junit4]   2> 228621 INFO  (TEST-TestHdfsUpdateLog.testFSThreadSafety-seed#[25C0CFAA7104FDBA]) [    ] o.a.s.u.DirectUpdateHandler2 [collection1] REMOVING ALL DOCUMENTS FROM INDEX
   [junit4]   2> 228623 INFO  (TEST-TestHdfsUpdateLog.testFSThreadSafety-seed#[25C0CFAA7104FDBA]) [    ] o.a.s.s.SolrIndexSearcher Opening [Searcher@1bab5f0[collection1] realtime]
   [junit4]   2> 228624 INFO  (TEST-TestHdfsUpdateLog.testFSThreadSafety-seed#[25C0CFAA7104FDBA]) [    ] o.a.s.u.p.LogUpdateProcessorFactory [collection1]  webapp=null path=null params={_version_=-9223372036854775807&update.distrib=FROMLEADER&versions=true&wt=json&indent=true}{deleteByQuery=*:* (-9223372036854775807)} 0 8
   [junit4]   2> 228625 INFO  (TEST-TestHdfsUpdateLog.testFSThreadSafety-seed#[25C0CFAA7104FDBA]) [    ] o.a.s.u.DirectUpdateHandler2 start commit{_version_=1600123516157427712,optimize=false,openSearcher=true,waitSearcher=true,expungeDeletes=false,softCommit=false,prepareCommit=false}
   [junit4]   2> 228625 INFO  (TEST-TestHdfsUpdateLog.testFSThreadSafety-seed#[25C0CFAA7104FDBA]) [    ] o.a.s.u.SolrIndexWriter Calling setCommitData with IW:org.apache.solr.update.SolrIndexWriter@1ed907d commitCommandVersion:1600123516157427712
   [junit4]   2> 228640 INFO  (Block report processor) [    ] BlockStateChange BLOCK* addStoredBlock: blockMap updated: 127.0.0.1:46705 is added to blk_1073741826_1002{UCState=UNDER_CONSTRUCTION, truncateBlock=null, primaryNodeIndex=-1, replicas=[ReplicaUC[[DISK]DS-ce482716-8334-4b62-8d6f-76b29fee5ab1:NORMAL:127.0.0.1:45389|RBW], ReplicaUC[[DISK]DS-3c21adcf-a8bd-40da-8ffe-33fdbb8ea9c0:NORMAL:127.0.0.1:46705|FINALIZED]]} size 0
   [junit4]   2> 228640 INFO  (Block report processor) [    ] BlockStateChange BLOCK* addStoredBlock: blockMap updated: 127.0.0.1:45389 is added to blk_1073741826_1002{UCState=UNDER_CONSTRUCTION, truncateBlock=null, primaryNodeIndex=-1, replicas=[ReplicaUC[[DISK]DS-ce482716-8334-4b62-8d6f-76b29fee5ab1:NORMAL:127.0.0.1:45389|RBW], ReplicaUC[[DISK]DS-3c21adcf-a8bd-40da-8ffe-33fdbb8ea9c0:NORMAL:127.0.0.1:46705|FINALIZED]]} size 0
   [junit4]   2> 228643 INFO  (TEST-TestHdfsUpdateLog.testFSThreadSafety-seed#[25C0CFAA7104FDBA]) [    ] o.a.s.s.SolrIndexSearcher Opening [Searcher@dccf22[collection1] main]
   [junit4]   2> 228643 INFO  (TEST-TestHdfsUpdateLog.testFSThreadSafety-seed#[25C0CFAA7104FDBA]) [    ] o.a.s.u.DirectUpdateHandler2 end_commit_flush
   [junit4]   2> 228644 INFO  (searcherExecutor-628-thread-1) [    ] o.a.s.c.SolrCore [collection1] Registered new searcher Searcher@dccf22[collection1] main{ExitableDirectoryReader(UninvertingDirectoryReader())}
   [junit4]   2> 228644 INFO  (TEST-TestHdfsUpdateLog.testFSThreadSafety-seed#[25C0CFAA7104FDBA]) [    ] o.a.s.u.p.LogUpdateProcessorFactory [collection1]  webapp=null path=null params={}{commit=} 0 20
   [junit4]   2> 228674 INFO  (Thread-432) [    ] o.a.s.u.p.LogUpdateProcessorFactory [collection1]  webapp=null path=null params={}{add=[0 (1600123516181544960)]} 0 27
   [junit4]   2> 228686 INFO  (Thread-432) [    ] o.a.s.u.p.LogUpdateProcessorFactory [collection1]  webapp=null path=null params={}{add=[1 (1600123516221390848)]} 0 1
   [junit4]   2> 228698 INFO  (Thread-432) [    ] o.a.s.u.p.LogUpdateProcessorFactory [collection1]  webapp=null path=null params={}{add=[2 (1600123516233973760)]} 0 1
   [junit4]   2> 228710 INFO  (Thread-432) [    ] o.a.s.u.p.LogUpdateProcessorFactory [collection1]  webapp=null path=null params={}{add=[3 (1600123516246556672)]} 0 1
   [junit4]   2> 228722 INFO  (Thread-432) [    ] o.a.s.u.p.LogUpdateProcessorFactory [collection1]  webapp=null path=null params={}{add=[4 (1600123516259139584)]} 0 1
   [junit4]   2> 228733 INFO  (Thread-432) [    ] o.a.s.u.p.LogUpdateProcessorFactory [collection1]  webapp=null path=null params={}{add=[5 (1600123516270673920)]} 0 1
   [junit4]   2> 228745 INFO  (Thread-432) [    ] o.a.s.u.p.LogUpdateProcessorFactory [collection1]  webapp=null path=null params={}{add=[6 (1600123516283256832)]} 0 1
   [junit4]   2> 228757 INFO  (Thread-432) [    ] o.a.s.u.p.LogUpdateProcessorFactory [collection1]  webapp=null path=null params={}{add=[7 (1600123516295839744)]} 0 1
   [junit4]   2> 228765 INFO  (commitScheduler-631-thread-1) [    ] o.a.s.u.DirectUpdateHandler2 start commit{,optimize=false,openSearcher=false,waitSearcher=true,expungeDeletes=false,softCommit=false,prepareCommit=false}
   [junit4]   2> 228765 INFO  (commitScheduler-631-thread-1) [    ] o.a.s.u.SolrIndexWriter Calling setCommitData with IW:org.apache.solr.update.SolrIndexWriter@1ed907d commitCommandVersion:0
   [junit4]   2> 228778 INFO  (Block report processor) [    ] BlockStateChange BLOCK* addStoredBlock: blockMap updated: 127.0.0.1:46705 is added to blk_1073741828_1004{UCState=UNDER_CONSTRUCTION, truncateBlock=null, primaryNodeIndex=-1, replicas=[ReplicaUC[[DISK]DS-ce482716-8334-4b62-8d6f-76b29fee5ab1:NORMAL:127.0.0.1:45389|RBW], ReplicaUC[[DISK]DS-3c21adcf-a8bd-40da-8ffe-33fdbb8ea9c0:NORMAL:127.0.0.1:46705|FINALIZED]]} size 0
   [junit4]   2> 228780 INFO  (Block report processor) [    ] BlockStateChange BLOCK* addStoredBlock: blockMap updated: 127.0.0.1:45389 is added to blk_1073741828_1004{UCState=UNDER_CONSTRUCTION, truncateBlock=null, primaryNodeIndex=-1, replicas=[ReplicaUC[[DISK]DS-ce482716-8334-4b62-8d6f-76b29fee5ab1:NORMAL:127.0.0.1:45389|RBW], ReplicaUC[[DISK]DS-3c21adcf-a8bd-40da-8ffe-33fdbb8ea9c0:NORMAL:127.0.0.1:46705|FINALIZED]]} size 0
   [junit4]   2> 228784 INFO  (Thread-432) [    ] o.a.s.u.p.LogUpdateProcessorFactory [collection1]  webapp=null path=null params={}{add=[8 (1600123516308422656)]} 0 16
   [junit4]   2> 228794 INFO  (Block report processor) [    ] BlockStateChange BLOCK* addStoredBlock: blockMap updated: 127.0.0.1:46705 is added to blk_1073741830_1006{UCState=UNDER_CONSTRUCTION, truncateBlock=null, primaryNodeIndex=-1, replicas=[ReplicaUC[[DISK]DS-ce482716-8334-4b62-8d6f-76b29fee5ab1:NORMAL:127.0.0.1:45389|RBW], ReplicaUC[[DISK]DS-3c21adcf-a8bd-40da-8ffe-33fdbb8ea9c0:NORMAL:127.0.0.1:46705|FINALIZED]]} size 0
   [junit4]   2> 228798 INFO  (Block report processor) [    ] BlockStateChange BLOCK* addStoredBlock: blockMap updated: 127.0.0.1:45389 is added to blk_1073741830_1006{UCState=UNDER_CONSTRUCTION, truncateBlock=null, primaryNodeIndex=-1, replicas=[ReplicaUC[[DISK]DS-ce482716-8334-4b62-8d6f-76b29fee5ab1:NORMAL:127.0.0.1:45389|RBW], ReplicaUC[[DISK]DS-3c21adcf-a8bd-40da-8ffe-33fdbb8ea9c0:NORMAL:127.0.0.1:46705|FINALIZED]]} size 0
   [junit4]   2> 228798 INFO  (Thread-432) [    ] o.a.s.u.p.LogUpdateProcessorFactory [collection1]  webapp=null path=null params={}{add=[9 (1600123516338831360)]} 0 3
   [junit4]   2> 228811 INFO  (Thread-432) [    ] o.a.s.u.p.LogUpdateProcessorFactory [collection1]  webapp=null path=null params={}{add=[10 (1600123516351414272)]} 0 2
   [junit4]   2> 228822 INFO  (Block report processor) [    ] BlockStateChange BLOCK* addStoredBlock: blockMap updated: 127.0.0.1:45389 is added to blk_1073741831_1007{UCState=UNDER_CONSTRUCTION, truncateBlock=null, primaryNodeIndex=-1, replicas=[ReplicaUC[[DISK]DS-3c21adcf-a8bd-40da-8ffe-33fdbb8ea9c0:NORMAL:127.0.0.1:46705|RBW], ReplicaUC[[DISK]DS-656d8140-9361-4102-89c9-615f4cf7f262:NORMAL:127.0.0.1:45389|FINALIZED]]} size 0
   [junit4]   2> 228823 INFO  (Thread-432) [    ] o.a.s.u.p.LogUpdateProcessorFactory [collection1]  webapp=null path=null params={}{add=[11 (1600123516365045760)]} 0 1
   [junit4]   2> 228823 INFO  (Block report processor) [    ] BlockStateChange BLOCK* addStoredBlock: blockMap updated: 127.0.0.1:46705 is added to blk_1073741831_1007{UCState=UNDER_CONSTRUCTION, truncateBlock=null, primaryNodeIndex=-1, replicas=[ReplicaUC[[DISK]DS-656d8140-9361-4102-89c9-615f4cf7f262:NORMAL:127.0.0.1:45389|FINALIZED], ReplicaUC[[DISK]DS-2e29f1be-c796-446c-b2a6-3435d698382c:NORMAL:127.0.0.1:46705|FINALIZED]]} size 0
   [junit4]   2> 228835 INFO  (Thread-432) [    ] o.a.s.u.p.LogUpdateProcessorFactory [collection1]  webapp=null path=null params={}{add=[12 (1600123516377628672)]} 0 1
   [junit4]   2> 228836 INFO  (Block report processor) [    ] BlockStateChange BLOCK* addStoredBlock: blockMap updated: 127.0.0.1:46705 is added to blk_1073741832_1008{UCState=UNDER_CONSTRUCTION, truncateBlock=null, primaryNodeIndex=-1, replicas=[ReplicaUC[[DISK]DS-ce482716-8334-4b62-8d6f-76b29fee5ab1:NORMAL:127.0.0.1:45389|RBW], ReplicaUC[[DISK]DS-3c21adcf-a8bd-40da-8ffe-33fdbb8ea9c0:NORMAL:127.0.0.1:46705|RBW]]} size 0
   [junit4]   2> 228836 INFO  (Block report processor) [    ] BlockStateChange BLOCK* addStoredBlock: blockMap updated: 127.0.0.1:45389 is added to blk_1073741832_1008{UCState=UNDER_CONSTRUCTION, truncateBlock=null, primaryNodeIndex=-1, replicas=[ReplicaUC[[DISK]DS-ce482716-8334-4b62-8d6f-76b29fee5ab1:NORMAL:127.0.0.1:45389|RBW], ReplicaUC[[DISK]DS-3c21adcf-a8bd-40da-8ffe-33fdbb8ea9c0:NORMAL:127.0.0.1:46705|RBW]]} size 0
   [junit4]   2> 228848 INFO  (Thread-432) [    ] o.a.s.u.p.LogUpdateProcessorFactory [collection1]  webapp=null path=null params={}{add=[13 (1600123516390211584)]} 0 1
   [junit4]   2> 228849 INFO  (Block report processor) [    ] BlockStateChange BLOCK* addStoredBlock: blockMap updated: 127.0.0.1:45389 is added to blk_1073741833_1009{UCState=UNDER_CONSTRUCTION, truncateBlock=null, primaryNodeIndex=-1, replicas=[ReplicaUC[[DISK]DS-3c21adcf-a8bd-40da-8ffe-33fdbb8ea9c0:NORMAL:127.0.0.1:46705|RBW], ReplicaUC[[DISK]DS-656d8140-9361-4102-89c9-615f4cf7f262:NORMAL:127.0.0.1:45389|FINALIZED]]} size 0
   [junit4]   2> 228849 INFO  (Block report processor) [    ] BlockStateChange BLOCK* addStoredBlock: blockMap updated: 127.0.0.1:46705 is added to blk_1073741833_1009 size 133
   [junit4]   2> 228858 INFO  (Block report processor) [    ] BlockStateChange BLOCK* addStoredBlock: blockMap updated: 127.0.0.1:45389 is added to blk_1073741834_1010{UCState=UNDER_CONSTRUCTION, truncateBlock=null, primaryNodeIndex=-1, replicas=[ReplicaUC[[DISK]DS-3c21adcf-a8bd-40da-8ffe-33fdbb8ea9c0:NORMAL:127.0.0.1:46705|RBW], ReplicaUC[[DISK]DS-ce482716-8334-4b62-8d6f-76b29fee5ab1:NORMAL:127.0.0.1:45389|FINALIZED]]} size 0
   [junit4]   2> 228859 INFO  (Block report processor) [    ] BlockStateChange BLOCK* addStoredBlock: blockMap updated: 127.0.0.1:46705 is added to blk_1073741834_1010 size 83
   [junit4]   2> 228859 INFO  (Thread-432) [    ] o.a.s.u.p.LogUpdateProcessorFactory [collection1]  webapp=null path=null params={}{add=[14 (1600123516402794496)]} 0 0
   [junit4]   2> 228866 INFO  (Block report processor) [    ] BlockStateChange BLOCK* addStoredBlock: blockMap updated: 127.0.0.1:46705 is added to blk_1073741835_1011{UCState=UNDER_CONSTRUCTION, truncateBlock=null, primaryNodeIndex=-1, replicas=[ReplicaUC[[DISK]DS-ce482716-8334-4b62-8d6f-76b29fee5ab1:NORMAL:127.0.0.1:45389|RBW], ReplicaUC[[DISK]DS-2e29f1be-c796-446c-b2a6-3435d698382c:NORMAL:127.0.0.1:46705|FINALIZED]]} size 0
   [junit4]   2> 228867 INFO  (Block report processor) [    ] BlockStateChange BLOCK* addStoredBlock: blockMap updated: 127.0.0.1:45389 is added to blk_1073741835_1011{UCState=UNDER_CONSTRUCTION, truncateBlock=null, primaryNodeIndex=-1, replicas=[ReplicaUC[[DISK]DS-2e29f1be-c796-446c-b2a6-3435d698382c:NORMAL:127.0.0.1:46705|FINALIZED], ReplicaUC[[DISK]DS-656d8140-9361-4102-89c9-615f4cf7f262:NORMAL:127.0.0.1:45389|FINALIZED]]} size 0
   [junit4]   2> 228871 INFO  (Thread-432) [    ] o.a.s.u.p.LogUpdateProcessorFactory [collection1]  webapp=null path=null params={}{add=[15 (1600123516415377408)]} 0 1
   [junit4]   2> 228875 INFO  (Block report processor) [    ] BlockStateChange BLOCK* addStoredBlock: blockMap updated: 127.0.0.1:45389 is added to blk_1073741836_1012{UCState=UNDER_CONSTRUCTION, truncateBlock=null, primaryNodeIndex=-1, replicas=[ReplicaUC[[DISK]DS-2e29f1be-c796-446c-b2a6-3435d698382c:NORMAL:127.0.0.1:46705|RBW], ReplicaUC[[DISK]DS-ce482716-8334-4b62-8d6f-76b29fee5ab1:NORMAL:127.0.0.1:45389|RBW]]} size 0
   [junit4]   2> 228875 INFO  (Block report processor) [    ] BlockStateChange BLOCK* addStoredBlock: blockMap updated: 127.0.0.1:46705 is added to blk_1073741836_1012{UCState=UNDER_CONSTRUCTION, truncateBlock=null, primaryNodeIndex=-1, replicas=[ReplicaUC[[DISK]DS-ce482716-8334-4b62-8d6f-76b29fee5ab1:NORMAL:127.0.0.1:45389|RBW], ReplicaUC[[DISK]DS-3c21adcf-a8bd-40da-8ffe-33fdbb8ea9c0:NORMAL:127.0.0.1:46705|FINALIZED]]} size 0
   [junit4]   2> 228882 INFO  (Thread-432) [    ] o.a.s.u.p.LogUpdateProcessorFactory [collection1]  webapp=null path=null params={}{add=[16 (1600123516426911744)]} 0 0
   [junit4]   2> 228891 INFO  (Block report processor) [    ] BlockStateChange BLOCK* addStoredBlock: blockMap updated: 127.0.0.1:46705 is added to blk_1073741837_1013{UCState=UNDER_CONSTRUCTION, truncateBlock=null, primaryNodeIndex=-1, replicas=[ReplicaUC[[DISK]DS-656d8140-9361-4102-89c9-615f4cf7f262:NORMAL:127.0.0.1:45389|RBW], ReplicaUC[[DISK]DS-2e29f1be-c796-446c-b2a6-3435d698382c:NORMAL:127.0.0.1:46705|FINALIZED]]} size 0
   [junit4]   2> 228892 INFO  (Block report processor) [    ] BlockStateChange BLOCK* addStoredBlock: blockMap updated: 127.0.0.1:45389 is added to blk_1073741837_1013{UCState=UNDER_CONSTRUCTION, truncateBlock=null, primaryNodeIndex=-1, replicas=[ReplicaUC[[DISK]DS-656d8140-9361-4102-89c9-615f4cf7f262:NORMAL:127.0.0.1:45389|RBW], ReplicaUC[[DISK]DS-2e29f1be-c796-446c-b2a6-3435d698382c:NORMAL:127.0.0.1:46705|FINALIZED]]} size 0
   [junit4]   2> 228894 INFO  (Thread-432) [    ] o.a.s.u.p.LogUpdateProcessorFactory [collection1]  webapp=null path=null params={}{add=[17 (1600123516439494656)]} 0 0
   [junit4]   2> 228905 INFO  (Block report processor) [    ] BlockStateChange BLOCK* addStoredBlock: blockMap updated: 127.0.0.1:45389 is added to blk_1073741838_1014{UCState=UNDER_CONSTRUCTION, truncateBlock=null, primaryNodeIndex=-1, replicas=[ReplicaUC[[DISK]DS-2e29f1be-c796-446c-b2a6-3435d698382c:NORMAL:127.0.0.1:46705|RBW], ReplicaUC[[DISK]DS-ce482716-8334-4b62-8d6f-76b29fee5ab1:NORMAL:127.0.0.1:45389|RBW]]} size 0
   [junit4]   2> 228905 INFO  (Thread-432) [    ] o.a.s.u.p.LogUpdateProcessorFactory [collection1]  webapp=null path=null params={}{add=[18 (1600123516451028992)]} 0 0
   [junit4]   2> 228905 INFO  (Block report processor) [    ] BlockStateChange BLOCK* addStoredBlock: blockMap updated: 127.0.0.1:46705 is added to blk_1073741838_1014{UCState=UNDER_CONSTRUCTION, truncateBlock=null, primaryNodeIndex=-1, replicas=[ReplicaUC[[DISK]DS-ce482716-8334-4b62-8d6f-76b29fee5ab1:NORMAL:127.0.0.1:45389|RBW], ReplicaUC[[DISK]DS-3c21adcf-a8bd-40da-8ffe-33fdbb8ea9c0:NORMAL:127.0.0.1:46705|FINALIZED]]} size 0
   [junit4]   2> 228916 INFO  (IPC Server handler 7 on 38759) [    ] BlockStateChange BLOCK* addToInvalidates: blk_1073741825_1001 127.0.0.1:45389 127.0.0.1:46705 
   [junit4]   2> 228916 INFO  (Thread-432) [    ] o.a.s.u.p.LogUpdateProcessorFactory [collection1]  webapp=null path=null params={}{add=[19 (1600123516462563328)]} 0 0
   [junit4]   2> 228928 INFO  (Thread-432) [    ] o.a.s.u.p.LogUpdateProcessorFactory [collection1]  webapp=null path=null params={}{add=[20 (1600123516475146240)]} 0 1
   [junit4]   2> 228939 INFO  (Thread-432) [    ] o.a.s.u.p.LogUpdateProcessorFactory [collection1]  webapp=null path=null params={}{add=[21 (1600123516486680576)]} 0 0
   [junit4]   2> 228946 INFO  (commitScheduler-631-thread-1) [    ] o.a.s.s.SolrIndexSearcher Opening [Searcher@97084c[collection1] realtime]
   [junit4]   2> 228949 INFO  (Block report processor) [    ] BlockStateChange BLOCK* addStoredBlock: blockMap updated: 127.0.0.1:45389 is added to blk_1073741827_1003{UCState=UNDER_CONSTRUCTION, truncateBlock=null, primaryNodeIndex=-1, replicas=[ReplicaUC[[DISK]DS-2e29f1be-c796-446c-b2a6-3435d698382c:NORMAL:127.0.0.1:46705|RBW], ReplicaUC[[DISK]DS-656d8140-9361-4102-89c9-615f4cf7f262:NORMAL:127.0.0.1:45389|RBW]]} size 75
   [junit4]   2> 228949 INFO  (Block report processor) [    ] BlockStateChange BLOCK* addStoredBlock: blockMap updated: 127.0.0.1:46705 is added to blk_1073741827_1003{UCState=UNDER_CONSTRUCTION, truncateBlock=null, primaryNodeIndex=-1, replicas=[ReplicaUC[[DISK]DS-2e29f1be-c796-446c-b2a6-3435d698382c:NORMAL:127.0.0.1:46705|RBW], ReplicaUC[[DISK]DS-656d8140-9361-4102-89c9-615f4cf7f262:NORMAL:127.0.0.1:45389|RBW]]} size 75
   [junit4]   2> 228950 INFO  (commitScheduler-631-thread-1) [    ] o.a.s.u.DirectUpdateHandler2 end_commit_flush
   [junit4]   2> 228950 INFO  (commitScheduler-631-thread-1) [    ] o.a.s.u.DirectUpdateHandler2 start commit{,optimize=false,openSearcher=false,waitSearcher=true,expungeDeletes=false,softCommit=false,prepareCommit=false}
   [junit4]   2> 228950 INFO  (commitScheduler-631-thread-1) [    ] o.a.s.u.SolrIndexWriter Calling setCommitData with IW:org.apache.solr.update.SolrIndexWriter@1ed907d commitCommandVersion:0
   [junit4]   2> 228987 INFO  (Thread-432) [    ] o.a.s.u.p.LogUpdateProcessorFactory [collection1]  webapp=null path=null params={}{add=[22 (1600123516499263488)]} 0 37
   [junit4]   2> 228989 INFO  (Block report processor) [    ] BlockStateChange BLOCK* addStoredBlock: blockMap updated: 127.0.0.1:46705 is added to blk_1073741840_1016{UCState=UNDER_CONSTRUCTION, truncateBlock=null, primaryNodeIndex=-1, replicas=[ReplicaUC[[DISK]DS-ce482716-8334-4b62-8d6f-76b29fee5ab1:NORMAL:127.0.0.1:45389|RBW], ReplicaUC[[DISK]DS-3c21adcf-a8bd-40da-8ffe-33fdbb8ea9c0:NORMAL:127.0.0.1:46705|FINALIZED]]} size 0
   [junit4]   2> 228990 INFO  (Block report processor) [    ] BlockStateChange BLOCK* addStoredBlock: blockMap updated: 127.0.0.1:45389 is added to blk_1073741840_1016{UCState=UNDER_CONSTRUCTION, truncateBlock=null, primaryNodeIndex=-1, replicas=[ReplicaUC[[DISK]DS-ce482716-8334-4b62-8d6f-76b29fee5ab1:NORMAL:127.0.0.1:45389|RBW], ReplicaUC[[DISK]DS-3c21adcf-a8bd-40da-8ffe-33fdbb8ea9c0:NORMAL:127.0.0.1:46705|FINALIZED]]} size 0
   [junit4]   2> 228999 INFO  (Thread-432) [    ] o.a.s.u.p.LogUpdateProcessorFactory [collection1]  webapp=null path=null params={}{add=[23 (1600123516548546560)]} 0 1
   [junit4]   2> 229010 INFO  (Thread-432) [    ] o.a.s.u.p.LogUpdateProcessorFactory [collection1]  webapp=null path=null params={}{add=[24 (1600123516561129472)]} 0 0
   [junit4]   2> 229020 INFO  (Block report processor) [    ] BlockStateChange BLOCK* addStoredBlock: blockMap updated: 127.0.0.1:46705 is added to blk_1073741841_1017{UCState=UNDER_CONSTRUCTION, truncateBlock=null, primaryNodeIndex=-1, replicas=[ReplicaUC[[DISK]DS-ce482716-8334-4b62-8d6f-76b29fee5ab1:NORMAL:127.0.0.1:45389|RBW], ReplicaUC[[DISK]DS-2e29f1be-c796-446c-b2a6-3435d698382c:NORMAL:127.0.0.1:46705|FINALIZED]]} size 0
   [junit4]   2> 229021 INFO  (Block report processor) [    ] BlockStateChange BLOCK* addStoredBlock: blockMap updated: 127.0.0.1:45389 is added to blk_1073741841_1017{UCState=UNDER_CONSTRUCTION, truncateBlock=null, primaryNodeIndex=-1, replicas=[ReplicaUC[[DISK]DS-2e29f1be-c796-446c-b2a6-3435d698382c:NORMAL:127.0.0.1:46705|FINALIZED], ReplicaUC[[DISK]DS-656d8140-9361-4102-89c9-615f4cf7f262:NORMAL:127.0.0.1:45389|FINALIZED]]} size 0
   [junit4]   2> 229025 INFO  (Thread-432) [    ] o.a.s.u.p.LogUpdateProcessorFactory [collection1]  webapp=null path=null params={}{add=[25 (1600123516577906688)]} 0 0
   [junit4]   2> 229037 INFO  (Thread-432) [    ] o.a.s.u.p.LogUpdateProcessorFactory [collection1]  webapp=null path=null params={}{add=[26 (1600123516589441024)]} 0 0
   [junit4]   2> 229049 INFO  (Block report processor) [    ] BlockStateChange BLOCK* addStoredBlock: blockMap updated: 127.0.0.1:46705 is added to blk_1073741842_1018{UCState=UNDER_CONSTRUCTION, truncateBlock=null, primaryNodeIndex=-1, replicas=[ReplicaUC[[DISK]DS-ce482716-8334-4b62-8d6f-76b29fee5ab1:NORMAL:127.0.0.1:45389|RBW], ReplicaUC[[DISK]DS-3c21adcf-a8bd-40da-8ffe-33fdbb8ea9c0:NORMAL:127.0.0.1:46705|FINALIZED]]} size 0
   [junit4]   2> 229051 INFO  (Block report processor) [    ] BlockStateChange BLOCK* addStoredBlock: blockMap updated: 127.0.0.1:45389 is added to blk_1073741842_1018 size 478
   [junit4]   2> 229060 INFO  (Thread-432) [    ] o.a.s.u.p.LogUpdateProcessorFactory [collection1]  webapp=null path=null params={}{add=[27 (1600123516613558272)]} 0 0
   [junit4]   2> 229060 INFO  (Block report processor) [    ] BlockStateChange BLOCK* addStoredBlock: blockMap updated: 127.0.0.1:45389 is added to blk_1073741843_1019{UCState=UNDER_CONSTRUCTION, truncateBlock=null, primaryNodeIndex=-1, replicas=[ReplicaUC[[DISK]DS-2e29f1be-c796-446c-b2a6-3435d698382c:NORMAL:127.0.0.1:46705|RBW], ReplicaUC[[DISK]DS-656d8140-9361-4102-89c9-615f4cf7f262:NORMAL:127.0.0.1:45389|FINALIZED]]} size 0
   [junit4]   2> 229061 INFO  (Block report processor) [    ] BlockStateChange BLOCK* addStoredBlock: blockMap updated: 127.0.0.1:46705 is added to blk_1073741843_1019{UCState=UNDER_CONSTRUCTION, truncateBlock=null, primaryNodeIndex=-1, replicas=[ReplicaUC[[DISK]DS-2e29f1be-c796-446c-b2a6-3435d698382c:NORMAL:127.0.0.1:46705|RBW], ReplicaUC[[DISK]DS-656d8140-9361-4102-89c9-615f4cf7f262:NORMAL:127.0.0.1:45389|FINALIZED]]} size 0
   [junit4]   2> 229071 INFO  (Thread-432) [    ] o.a.s.u.p.LogUpdateProcessorFactory [collection1]  webapp=null path=null params={}{add=[28 (1600123516625092608)]} 0 1
   [junit4]   2> 229082 INFO  (Block report processor) [    ] BlockStateChange BLOCK* addStoredBlock: blockMap updated: 127.0.0.1:46705 is added to blk_1073741844_1020{UCState=UNDER_CONSTRUCTION, truncateBlock=null, primaryNodeIndex=-1, replicas=[ReplicaUC[[DISK]DS-656d8140-9361-4102-89c9-615f4cf7f262:NORMAL:127.0.0.1:45389|RBW], ReplicaUC[[DISK]DS-3c21adcf-a8bd-40da-8ffe-33fdbb8ea9c0:NORMAL:127.0.0.1:46705|RBW]]} size 0
   [junit4]   2> 229082 INFO  (Thread-432) [    ] o.a.s.u.p.LogUpdateProcessorFactory [collection1]  webapp=null path=null params={}{add=[29 (1600123516637675520)]} 0 0
   [junit4]   2> 229089 INFO  (Block report processor) [    ] BlockStateChange BLOCK* addStoredBlock: blockMap updated: 127.0.0.1:45389 is added to blk_1073741844_1020 size 244
   [junit4]   2> 229094 INFO  (Thread-432) [    ] o.a.s.u.p.LogUpdateProcessorFactory [collection1]  webapp=null path=null params={}{add=[30 (1600123516649209856)]} 0 0
   [junit4]   2> 229103 INFO  (Block report processor) [    ] BlockStateChange BLOCK* addStoredBlock: blockMap updated: 127.0.0.1:45389 is added to blk_1073741845_1021{UCState=UNDER_CONSTRUCTION, truncateBlock=null, primaryNodeIndex=-1, replicas=[ReplicaUC[[DISK]DS-2e29f1be-c796-446c-b2a6-3435d698382c:NORMAL:127.0.0.1:46705|RBW], ReplicaUC[[DISK]DS-656d8140-9361-4102-89c9-615f4cf7f262:NORMAL:127.0.0.1:45389|RBW]]} size 0
   [junit4]   2> 229104 INFO  (Block report processor) [    ] BlockStateChange BLOCK* addStoredBlock: blockMap updated: 127.0.0.1:46705 is added to blk_1073741845_1021{UCState=UNDER_CONSTRUCTION, truncateBlock=null, primaryNodeIndex=-1, replicas=[ReplicaUC[[DISK]DS-2e29f1be-c796-446c-b2a6-3435d698382c:NORMAL:127.0.0.1:46705|RBW], ReplicaUC[[DISK]DS-656d8140-9361-4102-89c9-615f4cf7f262:NORMAL:127.0.0.1:45389|RBW]]} size 0
   [junit4]   2> 229105 INFO  (Thread-432) [    ] o.a.s.u.p.LogUpdateProcessorFactory [collection1]  webapp=null path=null params={}{add=[31 (1600123516660744192)]} 0 0
   [junit4]   2> 229116 INFO  (Block report processor) [    ] BlockStateChange BLOCK* addStoredBlock: blockMap updated: 127.0.0.1:46705 is added to blk_1073741846_1022{UCState=UNDER_CONSTRUCTION, truncateBlock=null, primaryNodeIndex=-1, replicas=[ReplicaUC[[DISK]DS-ce482716-8334-4b62-8d6f-76b29fee5ab1:NORMAL:127.0.0.1:45389|RBW], ReplicaUC[[DISK]DS-3c21adcf-a8bd-40da-8ffe-33fdbb8ea9c0:NORMAL:127.0.0.1:46705|FINALIZED]]} size 0
   [junit4]   2> 229116 INFO  (Thread-432) [    ] o.a.s.u.p.LogUpdateProcessorFactory [collection1]  webapp=null path=null params={}{add=[32 (1600123516673327104)]} 0 0
   [junit4]   2> 229117 INFO  (Block report processor) [    ] BlockStateChange BLOCK* addStoredBlock: blockMap updated: 127.0.0.1:45389 is added to blk_1073741846_1022{UCState=UNDER_CONSTRUCTION, truncateBlock=null, primaryNodeIndex=-1, replicas=[ReplicaUC[[DISK]DS-ce482716-8334-4b62-8d6f-76b29fee5ab1:NORMAL:127.0.0.1:45389|RBW], ReplicaUC[[DISK]DS-3c21adcf-a8bd-40da-8ffe-33fdbb8ea9c0:NORMAL:127.0.0.1:46705|FINALIZED]]} size 0
   [junit4]   2> 229127 INFO  (Thread-432) [    ] o.a.s.u.p.LogUpdateProcessorFactory [collection1]  webapp=null path=null params={}{add=[33 (1600123516684861440)]} 0 0
   [junit4]   2> 229128 INFO  (Block report processor) [    ] BlockStateChange BLOCK* addStoredBlock: blockMap updated: 127.0.0.1:46705 is added to blk_1073741847_1023{UCState=UNDER_CONSTRUCTION, truncateBlock=null, primaryNodeIndex=-1, replicas=[ReplicaUC[[DISK]DS-ce482716-8334-4b62-8d6f-76b29fee5ab1:NORMAL:127.0.0.1:45389|RBW], ReplicaUC[[DISK]DS-2e29f1be-c796-446c-b2a6-3435d698382c:NORMAL:127.0.0.1:46705|RBW]]} size 0
   [junit4]   2> 229128 INFO  (Block report processor) [    ] BlockStateChange BLOCK* addStoredBlock: blockMap updated: 127.0.0.1:45389 is added to blk_1073741847_1023{UCState=UNDER_CONSTRUCTION, truncateBlock=null, primaryNodeIndex=-1, replicas=[ReplicaUC[[DISK]DS-2e29f1be-c796-446c-b2a6-3435d698382c:NORMAL:127.0.0.1:46705|RBW], ReplicaUC[[DISK]DS-656d8140-9361-4102-89c9-615f4cf7f262:NORMAL:127.0.0.1:45389|FINALIZED]]} size 0
   [junit4]   2> 229138 INFO  (Block report processor) [    ] BlockStateChange BLOCK* addStoredBlock: blockMap updated: 127.0.0.1:46705 is added to blk_1073741848_1024{UCState=UNDER_CONSTRUCTION, truncateBlock=null, primaryNodeIndex=-1, replicas=[ReplicaUC[[DISK]DS-ce482716-8334-4b62-8d6f-76b29fee5ab1:NORMAL:127.0.0.1:45389|RBW], ReplicaUC[[DISK]DS-3c21adcf-a8bd-40da-8ffe-33fdbb8ea9c0:NORMAL:127.0.0.1:46705|FINALIZED]]} size 0
   [junit4]   2> 229138 INFO  (Block report processor) [    ] BlockStateChange BLOCK* addStoredBlock: blockMap updated: 127.0.0.1:45389 is added to blk_1073741848_1024{UCState=UNDER_CONSTRUCTION, truncateBlock=null, primaryNodeIndex=-1, replicas=[ReplicaUC[[DISK]DS-ce482716-8334-4b62-8d6f-76b29fee5ab1:NORMAL:127.0.0.1:45389|RBW], ReplicaUC[[DISK]DS-3c21adcf-a8bd-40da-8ffe-33fdbb8ea9c0:NORMAL:127.0.0.1:46705|FINALIZED]]} size 0
   [junit4]   2> 229139 INFO  (Thread-432) [    ] o.a.s.u.p.LogUpdateProcessorFactory [collection1]  webapp=null path=null params={}{add=[34 (1600123516697444352)]} 0 0
   [junit4]   2> 229146 INFO  (Block report processor) [    ] BlockStateChange BLOCK* addStoredBlock: blockMap updated: 127.0.0.1:45389 is added to blk_1073741849_1025{UCState=UNDER_CONSTRUCTION, truncateBlock=null, primaryNodeIndex=-1, replicas=[ReplicaUC[[DISK]DS-3c21adcf-a8bd-40da-8ffe-33fdbb8ea9c0:NORMAL:127.0.0.1:46705|RBW], ReplicaUC[[DISK]DS-656d8140-9361-4102-89c9-615f4cf7f262:NORMAL:127.0.0.1:45389|FINALIZED]]} size 0
   [junit4]   2> 229146 INFO  (Block report processor) [    ] BlockStateChange BLOCK* addStoredBlock: blockMap updated: 127.0.0.1:46705 is added to blk_1073741849_1025{UCState=UNDER_CONSTRUCTION, truncateBlock=null, primaryNodeIndex=-1, replicas=[ReplicaUC[[DISK]DS-656d8140-9361-4102-89c9-615f4cf7f262:NORMAL:127.0.0.1:45389|FINALIZED], ReplicaUC[[DISK]DS-2e29f1be-c796-446c-b2a6-3435d698382c:NORMAL:127.0.0.1:46705|FINALIZED]]} size 0
   [junit4]   2> 229151 INFO  (Thread-432) [    ] o.a.s.u.p.LogUpdateProcessorFactory [collection1]  webapp=null path=null params={}{add=[35 (1600123516708978688)]} 0 0
   [junit4]   2> 229157 INFO  (Block report processor) [    ] BlockStateChange BLOCK* addStoredBlock: blockMap updated: 127.0.0.1:46705 is added to blk_1073741850_1026{UCState=UNDER_CONSTRUCTION, truncateBlock=null, primaryNodeIndex=-1, replicas=[ReplicaUC[[DISK]DS-656d8140-9361-4102-89c9-615f4cf7f262:NORMAL:127.0.0.1:45389|RBW], ReplicaUC[[DISK]DS-3c21adcf-a8bd-40da-8ffe-33fdbb8ea9c0:NORMAL:127.0.0.1:46705|FINALIZED]]} size 0
   [junit4]   2> 229157 INFO  (Block report processor) [    ] BlockStateChange BLOCK* addStoredBlock: blockMap updated: 127.0.0.1:45389 is added to blk_1073741850_1026{UCState=UNDER_CONSTRUCTION, truncateBlock=null, primaryNodeIndex=-1, replicas=[ReplicaUC[[DISK]DS-3c21adcf-a8bd-40da-8ffe-33fdbb8ea9c0:NORMAL:127.0.0.1:46705|FINALIZED], ReplicaUC[[DISK]DS-ce482716-8334-4b62-8d6f-76b29fee5ab1:NORMAL:127.0.0.1:45389|FINALIZED]]} size 0
   [junit4]   2> 229162 INFO  (Thread-432) [    ] o.a.s.u.p.LogUpdateProcessorFactory [collection1]  webapp=null path=null params={}{add=[36 (1600123516720513024)]} 0 0
   [junit4]   2> 229173 INFO  (Thread-432) [    ] o.a.s.u.p.LogUpdateProcessorFactory [collection1]  webapp=null path=null params={}{add=[37 (1600123516733095936)]} 0 1
   [junit4]   2> 229174 INFO  (Block report processor) [    ] BlockStateChange BLOCK* addStoredBlock: blockMap updated: 127.0.0.1:45389 is added to blk_1073741851_1027{UCState=UNDER_CONSTRUCTION, truncateBlock=null, primaryNodeIndex=-1, replicas=[ReplicaUC[[DISK]DS-2e29f1be-c796-446c-b2a6-3435d698382c:NORMAL:127.0.0.1:46705|RBW], ReplicaUC[[DISK]DS-656d8140-9361-4102-89c9-615f4cf7f262:NORMAL:127.0.0.1:45389|FINALIZED]]} size 0
   [junit4]   2> 229175 INFO  (Block report processor) [    ] BlockStateChange BLOCK* addStoredBlock: blockMap updated: 127.0.0.1:46705 is added to blk_1073741851_1027 size 83
   [junit4]   2> 229184 INFO  (Thread-432) [    ] o.a.s.u.p.LogUpdateProcessorFactory [collection1]  webapp=null path=null params={}{add=[38 (1600123516744630272)]} 0 0
   [junit4]   2> 229184 INFO  (Block report processor) [    ] BlockStateChange BLOCK* addStoredBlock: blockMap updated: 127.0.0.1:46705 is added to blk_1073741852_1028{UCState=UNDER_CONSTRUCTION, truncateBlock=null, primaryNodeIndex=-1, replicas=[ReplicaUC[[DISK]DS-ce482716-8334-4b62-8d6f-76b29fee5ab1:NORMAL:127.0.0.1:45389|RBW], ReplicaUC[[DISK]DS-3c21adcf-a8bd-40da-8ffe-33fdbb8ea9c0:NORMAL:127.0.0.1:46705|FINALIZED]]} size 0
   [junit4]   2> 229185 INFO  (Block report processor) [    ] BlockStateChange BLOCK* addStoredBlock: blockMap updated: 127.0.0.1:45389 is added to blk_1073741852_1028{UCState=UNDER_CONSTRUCTION, truncateBlock=null, primaryNodeIndex=-1, replicas=[ReplicaUC[[DISK]DS-ce482716-8334-4b62-8d6f-76b29fee5ab1:NORMAL:127.0.0.1:45389|RBW], ReplicaUC[[DISK]DS-3c21adcf-a8bd-40da-8ffe-33fdbb8ea9c0:NORMAL:127.0.0.1:46705|FINALIZED]]} size 0
   [junit4]   2> 229199 INFO  (Thread-432) [    ] o.a.s.u.p.LogUpdateProcessorFactory [collection1]  webapp=null path=null params={}{add=[39 (1600123516760358912)]} 0 4
   [junit4]   2> 229200 INFO  (Block report processor) [    ] BlockStateChange BLOCK* addStoredBlock: blockMap updated: 127.0.0.1:46705 is added to blk_1073741853_1029{UCState=UNDER_CONSTRUCTION, truncateBlock=null, primaryNodeIndex=-1, replicas=[ReplicaUC[[DISK]DS-656d8140-9361-4102-89c9-615f4cf7f262:NORMAL:127.0.0.1:45389|RBW], ReplicaUC[[DISK]DS-2e29f1be-c796-446c-b2a6-3435d698382c:NORMAL:127.0.0.1:46705|FINALIZED]]} size 0
   [junit4]   2> 229201 INFO  (Block report processor) [    ] BlockStateChange BLOCK* addStoredBlock: blockMap updated: 127.0.0.1:45389 is added to blk_1073741853_1029{UCState=UNDER_CONSTRUCTION, truncateBlock=null, primaryNodeIndex=-1, replicas=[ReplicaUC[[DISK]DS-656d8140-9361-4102-89c9-615f4cf7f262:NORMAL:127.0.0.1:45389|RBW], ReplicaUC[[DISK]DS-2e29f1be-c796-446c-b2a6-3435d698382c:NORMAL:127.0.0.1:46705|FINALIZED]]} size 0
   [junit4]   2> 229211 INFO  (Thread-432) [    ] o.a.s.u.p.LogUpdateProcessorFactory [collection1]  webapp=null path=null params={}{add=[40 (1600123516771893248)]} 0 0
   [junit4]   2> 229215 INFO  (Block report processor) [    ] BlockStateChange BLOCK* addStoredBlock: blockMap updated: 127.0.0.1:45389 is added to blk_1073741854_1030{UCState=UNDER_CONSTRUCTION, truncateBlock=null, primaryNodeIndex=-1, replicas=[ReplicaUC[[DISK]DS-3c21adcf-a8bd-40da-8ffe-33fdbb8ea9c0:NORMAL:127.0.0.1:46705|RBW], ReplicaUC[[DISK]DS-ce482716-8334-4b62-8d6f-76b29fee5ab1:NORMAL:127.0.0.1:45389|FINALIZED]]} size 0
   [junit4]   2> 229215 INFO  (Block report processor) [    ] BlockStateChange BLOCK* addStoredBlock: blockMap updated: 127.0.0.1:46705 is added to blk_1073741854_1030{UCState=UNDER_CONSTRUCTION, truncateBlock=null, primaryNodeIndex=-1, replicas=[ReplicaUC[[DISK]DS-3c21adcf-a8bd-40da-8ffe-33fdbb8ea9c0:NORMAL:127.0.0.1:46705|RBW], ReplicaUC[[DISK]DS-ce482716-8334-4b62-8d6f-76b29fee5ab1:NORMAL:127.0.0.1:45389|FINALIZED]]} size 0
   [junit4]   2> 229222 INFO  (Thread-432) [    ] o.a.s.u.p.LogUpdateProcessorFactory [collection1]  webapp=null path=null params={}{add=[41 (1600123516784476160)]} 0 0
   [junit4]   2> 229226 INFO  (Block report processor) [    ] BlockStateChange BLOCK* addStoredBlock: blockMap updated: 127.0.0.1:45389 is added to blk_1073741855_1031{UCState=UNDER_CONSTRUCTION, truncateBlock=null, primaryNodeIndex=-1, replicas=[ReplicaUC[[DISK]DS-2e29f1be-c796-446c-b2a6-3435d698382c:NORMAL:127.0.0.1:46705|RBW], ReplicaUC[[DISK]DS-656d8140-9361-4102-89c9-615f4cf7f262:NORMAL:127.0.0.1:45389|FINALIZED]]} size 0
   [junit4]   2> 229226 INFO  (Block report processor) [    ] BlockStateChange BLOCK* addStoredBlock: blockMap updated: 127.0.0.1:46705 is added to blk_1073741855_1031{UCState=UNDER_CONSTRUCTION, truncateBlock=null, primaryNodeIndex=-1, replicas=[ReplicaUC[[DISK]DS-2e29f1be-c796-446c-b2a6-3435d698382c:NORMAL:127.0.0.1:46705|RBW], ReplicaUC[[DISK]DS-656d8140-9361-4102-89c9-615f4cf7f262:NORMAL:127.0.0.1:45389|FINALIZED]]} size 0
   [junit4]   2> 229233 INFO  (Thread-432) [    ] o.a.s.u.p.LogUpdateProcessorFactory [collection1]  webapp=null path=null params={}{add=[42 (1600123516796010496)]} 0 0
   [junit4]   2> 229237 INFO  (Block report processor) [    ] BlockStateChange BLOCK* addStoredBlock: blockMap updated: 127.0.0.1:45389 is added to blk_1073741856_1032{UCState=UNDER_CONSTRUCTION, truncateBlock=null, primaryNodeIndex=-1, replicas=[ReplicaUC[[DISK]DS-2e29f1be-c796-446c-b2a6-3435d698382c:NORMAL:127.0.0.1:46705|RBW], ReplicaUC[[DISK]DS-ce482716-8334-4b62-8d6f-76b29fee5ab1:NORMAL:127.0.0.1:45389|FINALIZED]]} size 0
   [junit4]   2> 229238 INFO  (Block report processor) [    ] BlockStateChange BLOCK* addStoredBlock: blockMap updated: 127.0.0.1:46705 is added to blk_1073741856_1032 size 85
   [junit4]   2> 229245 INFO  (Thread-432) [    ] o.a.s.u.p.LogUpdateProcessorFactory [collection1]  webapp=null path=null params={}{add=[43 (1600123516807544832)]} 0 0
   [junit4]   2> 229252 INFO  (Block report processor) [    ] BlockStateChange BLOCK* addStoredBlock: blockMap updated: 127.0.0.1:45389 is added to blk_1073741857_1033{UCState=UNDER_CONSTRUCTION, truncateBlock=null, primaryNodeIndex=-1, replicas=[ReplicaUC[[DISK]DS-2e29f1be-c796-446c-b2a6-3435d698382c:NORMAL:127.0.0.1:46705|RBW], ReplicaUC[[DISK]DS-656d8140-9361-4102-89c9-615f4cf7f262:NORMAL:127.0.0.1:45389|FINALIZED]]} size 0
   [junit4]   2> 229253 INFO  (Block report processor) [    ] BlockStateChange BLOCK* addStoredBlock: blockMap updated: 127.0.0.1:46705 is added to blk_1073741857_1033{UCState=UNDER_CONSTRUCTION, truncateBlock=null, primaryNodeIndex=-1, replicas=[ReplicaUC[[DISK]DS-2e29f1be-c796-446c-b2a6-3435d698382c:NORMAL:127.0.0.1:46705|RBW], ReplicaUC[[DISK]DS-656d8140-9361-4102-89c9-615f4cf7f262:NORMAL:127.0.0.1:45389|FINALIZED]]} size 0
   [junit4]   2> 229256 INFO  (Thread-432) [    ] o.a.s.u.p.LogUpdateProcessorFactory [collection1]  webapp=null path=null params={}{add=[44 (1600123516819079168)]} 0 0
   [junit4]   2> 229267 INFO  (Thread-432) [    ] o.a.s.u.p.LogUpdateProcessorFactory [collection1]  webapp=null path=null params={}{add=[45 (1600123516831662080)]} 0 0
   [junit4]   2> 229278 INFO  (Thread-432) [    ] o.a.s.u.p.LogUpdateProcessorFactory [collection1]  webapp=null path=null params={}{add=[46 (1600123516843196416)]} 0 0
   [junit4]   2> 229279 INFO  (Block report processor) [    ] BlockStateChange BLOCK* addStoredBlock: blockMap updated: 127.0.0.1:45389 is added to blk_1073741858_1034{UCState=UNDER_CONSTRUCTION, truncateBlock=null, primaryNodeIndex=-1, replicas=[ReplicaUC[[DISK]DS-3c21adcf-a8bd-40da-8ffe-33fdbb8ea9c0:NORMAL:127.0.0.1:46705|RBW], ReplicaUC[[DISK]DS-ce482716-8334-4b62-8d6f-76b29fee5ab1:NORMAL:127.0.0.1:45389|RBW]]} size 0
   [junit4]   2> 229280 INFO  (Block report processor) [    ] BlockStateChange BLOCK* addStoredBlock: blockMap updated: 127.0.0.1:46705 is added to blk_1073741858_1034 size 101
   [junit4]   2> 229291 INFO  (Thread-432) [    ] o.a.s.u.p.LogUpdateProcessorFactory [collection1]  webapp=null path=null params={}{add=[47 (1600123516856827904)]} 0 0
   [junit4]   2> 229303 INFO  (Thread-432) [    ] o.a.s.u.p.LogUpdateProcessorFactory [collection1]  webapp=null path=null params={}{add=[48 (1600123516868362240)]} 0 0
   [junit4]   2> 229306 INFO  (commitScheduler-631-thread-1) [    ] o.a.s.s.SolrIndexSearcher Opening [Searcher@bb172c[collection1] realtime]
   [junit4]   2> 229308 INFO  (Block report processor) [    ] BlockStateChange BLOCK* addStoredBlock: blockMap updated: 127.0.0.1:45389 is added to blk_1073741829_1005{UCState=UNDER_CONSTRUCTION, truncateBlock=null, primaryNodeIndex=-1, replicas=[ReplicaUC[[DISK]DS-2e29f1be-c796-446c-b2a6-3435d698382c:NORMAL:127.0.0.1:46705|RBW], ReplicaUC[[DISK]DS-656d8140-9361-4102-89c9-615f4cf7f262:NORMAL:127.0.0.1:45389|RBW]]} size 75
   [junit4]   2> 229308 INFO  (Block report processor) [    ] BlockStateChange BLOCK* addStoredBlock: blockMap updated: 127.0.0.1:46705 is added to blk_1073741829_1005{UCState=UNDER_CONSTRUCTION, truncateBlock=null, primaryNodeIndex=-1, replicas=[ReplicaUC[[DISK]DS-2e29f1be-c796-446c-b2a6-3435d698382c:NORMAL:127.0.0.1:46705|RBW], ReplicaUC[[DISK]DS-656d8140-9361-4102-89c9-615f4cf7f262:NORMAL:127.0.0.1:45389|RBW]]} size 75
   [junit4]   2> 229309 INFO  (commitScheduler-631-thread-1) [    ] o.a.s.u.DirectUpdateHandler2 end_commit_flush
   [junit4]   2> 229309 INFO  (commitScheduler-631-thread-1) [    ] o.a.s.u.DirectUpdateHandler2 start commit{,optimize=false,openSearcher=false,waitSearcher=true,expungeDeletes=false,softCommit=false,prepareCommit=false}
   [junit4]   2> 229309 INFO  (commitScheduler-631-thread-1) [    ] o.a.s.u.SolrIndexWriter Calling setCommitData with IW:org.apache.solr.update.SolrIndexWriter@1ed907d commitCommandVersion:0
   [junit4]   2> 229321 INFO  (Block report processor) [    ] BlockStateChange BLOCK* addStoredBlock: blockMap updated: 127.0.0.1:46705 is added to blk_1073741859_1035{UCState=UNDER_CONSTRUCTION, truncateBlock=null, primaryNodeIndex=-1, replicas=[ReplicaUC[[DISK]DS-656d8140-9361-4102-89c9-615f4cf7f262:NORMAL:127.0.0.1:45389|RBW], ReplicaUC[[DISK]DS-2e29f1be-c796-446c-b2a6-3435d698382c:NORMAL:127.0.0.1:46705|RBW]]} size 0
   [junit4]   2> 229322 INFO  (Block report processor) [    ] BlockStateChange BLOCK* addStoredBlock: blockMap updated: 127.0.0.1:45389 is added to blk_1073741859_1035 size 430
   [junit4]   2> 229333 INFO  (Thread-432) [    ] o.a.s.u.p.LogUpdateProcessorFactory [collection1]  webapp=null path=null params={}{add=[49 (1600123516879896576)]} 0 19
   [junit4]   2> 229337 INFO  (Block report processor) [    ] BlockStateChange BLOCK* addStoredBlock: blockMap updated: 127.0.0.1:45389 is added to blk_1073741861_1037{UCState=UNDER_CONSTRUCTION, truncateBlock=null, primaryNodeIndex=-1, replicas=[ReplicaUC[[DISK]DS-2e29f1be-c796-446c-b2a6-3435d698382c:NORMAL:127.0.0.1:46705|RBW], ReplicaUC[[DISK]DS-656d8140-9361-4102-89c9-615f4cf7f262:NORMAL:127.0.0.1:45389|FINALIZED]]} size 0
   [junit4]   2> 229337 INFO  (Block report processor) [    ] BlockStateChange BLOCK* addStoredBlock: blockMap updated: 127.0.0.1:46705 is added to blk_1073741861_1037{UCState=UNDER_CONSTRUCTION, truncateBlock=null, primaryNodeIndex=-1, replicas=[ReplicaUC[[DISK]DS-2e29f1be-c796-446c-b2a6-3435d698382c:NORMAL:127.0.0.1:46705|RBW], ReplicaUC[[DISK]DS-656d8140-9361-4102-89c9-615f4cf7f262:NORMAL:127.0.0.1:45389|FINALIZED]]} size 0
   [junit4]   2> 229344 INFO  (Thread-432) [    ] o.a.s.u.p.LogUpdateProcessorFactory [collection1]  webapp=null path=null params={}{add=[50 (1600123516912402432)]} 0 0
   [junit4]   2> 229355 INFO  (Block report processor) [    ] BlockStateChange BLOCK* addStoredBlock: blockMap updated: 127.0.0.1:45389 is added to blk_1073741862_1038{UCState=UNDER_CONSTRUCTION, truncateBlock=null, primaryNodeIndex=-1, replicas=[ReplicaUC[[DISK]DS-3c21adcf-a8bd-40da-8ffe-33fdbb8ea9c0:NORMAL:127.0.0.1:46705|RBW], ReplicaUC[[DISK]DS-ce482716-8334-4b62-8d6f-76b29fee5ab1:NORMAL:127.0.0.1:45389|RBW]]} size 0
   [junit4]   2> 229356 INFO  (Thread-432) [    ] o.a.s.u.p.LogUpdateProcessorFactory [collection1]  webapp=null path=null params={}{add=[51 (1600123516923936768)]} 0 0
   [junit4]   2> 229356 INFO  (Block report processor) [    ] BlockStateChange BLOCK* addStoredBlock: blockMap updated: 127.0.0.1:46705 is added to blk_1073741862_1038{UCState=UNDER_CONSTRUCTION, truncateBlock=null, primaryNodeIndex=-1, replicas=[ReplicaUC[[DISK]DS-3c21adcf-a8bd-40da-8ffe-33fdbb8ea9c0:NORMAL:127.0.0.1:46705|RBW], ReplicaUC[[DISK]DS-ce482716-8334-4b62-8d6f-76b29fee5ab1:NORMAL:127.0.0.1:45389|RBW]]} size 0
   [junit4]   2> 229368 INFO  (Thread-432) [    ] o.a.s.u.p.LogUpdateProcessorFactory [collection1]  webapp=null path=null params={}{add=[52 (1600123516935471104)]} 0 1
   [junit4]   2> 229377 INFO  (Block report processor) [    ] BlockStateChange BLOCK* addStoredBlock: blockMap updated: 127.0.0.1:46705 is added to blk_1073741863_1039{UCState=UNDER_CONSTRUCTION, truncateBlock=null, primaryNodeIndex=-1, replicas=[ReplicaUC[[DISK]DS-ce482716-8334-4b62-8d6f-76b29fee5ab1:NORMAL:127.0.0.1:45389|RBW], ReplicaUC[[DISK]DS-2e29f1be-c796-446c-b2a6-3435d698382c:NORMAL:127.0.0.1:46705|RBW]]} size 0
   [junit4]   2> 229378 INFO  (Block report processor) [    ] BlockStateChange BLOCK* addStoredBlock: blockMap updated: 127.0.0.1:45389 is added to blk_1073741863_1039{UCState=UNDER_CONSTRUCTION, truncateBlock=null, primaryNodeIndex=-1, replicas=[ReplicaUC[[DISK]DS-2e29f1be-c796-446c-b2a6-3435d698382c:NORMAL:127.0.0.1:46705|RBW], ReplicaUC[[DISK]DS-656d8140-9361-4102-89c9-615f4cf7f262:NORMAL:127.0.0.1:45389|FINALIZED]]} size 0
   [junit4]   2> 229379 INFO  (Thread-432) [    ] o.a.s.u.p.LogUpdateProcessorFactory [collection1]  webapp=null path=null params={}{add=[53 (1600123516948054016)]} 0 0
   [junit4]   2> 229384 INFO  (Block report processor) [    ] BlockStateChange BLOCK* addStoredBlock: blockMap updated: 127.0.0.1:46705 is added to blk_1073741864_1040{UCState=UNDER_CONSTRUCTION, truncateBlock=null, primaryNodeIndex=-1, replicas=[ReplicaUC[[DISK]DS-656d8140-9361-4102-89c9-615f4cf7f262:NORMAL:127.0.0.1:45389|RBW], ReplicaUC[[DISK]DS-3c21adcf-a8bd-40da-8ffe-33fdbb8ea9c0:NORMAL:127.0.0.1:46705|RBW]]} size 0
   [junit4]   2> 229385 INFO  (Block report processor) [    ] BlockStateChange BLOCK* addStoredBlock: blockMap updated: 127.0.0.1:45389 is added to blk_1073741864_1040 size 83
   [junit4]   2> 229390 INFO  (Thread-432) [    ] o.a.s.u.p.LogUpdateProcessorFactory [collection1]  webapp=null path=null params={}{add=[54 (1600123516959588352)]} 0 0
   [junit4]   2> 229391 INFO  (Block report processor) [    ] BlockStateChange BLOCK* addStoredBlock: blockMap updated: 127.0.0.1:45389 is added to blk_1073741865_1041{UCState=UNDER_CONSTRUCTION, truncateBlock=null, primaryNodeIndex=-1, replicas=[ReplicaUC[[DISK]DS-2e29f1be-c796-446c-b2a6-3435d698382c:NORMAL:127.0.0.1:46705|RBW], ReplicaUC[[DISK]DS-656d8140-9361-4102-89c9-615f4cf7f262:NORMAL:127.0.0.1:45389|RBW]]} size 0
   [junit4]   2> 229391 INFO  (Block report processor) [    ] BlockStateChange BLOCK* addStoredBlock: blockMap updated: 127.0.0.1:46705 is added to blk_1073741865_1041{UCState=UNDER_CONSTRUCTION, truncateBlock=null, primaryNodeIndex=-1, replicas=[ReplicaUC[[DISK]DS-2e29f1be-c796-446c-b2a6-3435d698382c:NORMAL:127.0.0.1:46705|RBW], ReplicaUC[[DISK]DS-656d8140-9361-4102-89c9-615f4cf7f262:NORMAL:127.0.0.1:45389|RBW]]} size 0
   [junit4]   2> 229397 INFO  (Block report processor) [    ] BlockStateChange BLOCK* addStoredBlock: blockMap updated: 127.0.0.1:46705 is added to blk_1073741866_1042{UCState=UNDER_CONSTRUCTION, truncateBlock=null, primaryNodeIndex=-1, replicas=[ReplicaUC[[DISK]DS-656d8140-9361-4102-89c9-615f4cf7f262:NORMAL:127.0.0.1:45389|RBW], ReplicaUC[[DISK]DS-3c21adcf-a8bd-40da-8ffe-33fdbb8ea9c0:NORMAL:127.0.0.1:46705|FINALIZED]]} size 0
   [junit4]   2> 229398 INFO  (Block report processor) [    ] BlockStateChange BLOCK* addStoredBlock: blockMap updated: 127.0.0.1:45389 is added to blk_1073741866_1042 size 110
   [junit4]   2> 229401 INFO  (Thread-432) [    ] o.a.s.u.p.LogUpdateProcessorFactory [collection1]  webapp=null path=null params={}{add=[55 (1600123516972171264)]} 0 0
   [junit4]   2> 229405 INFO  (Block report processor) [    ] BlockStateChange BLOCK* addStoredBlock: blockMap updated: 127.0.0.1:45389 is added to blk_1073741867_1043{UCState=UNDER_CONSTRUCTION, truncateBlock=null, primaryNodeIndex=-1, replicas=[ReplicaUC[[DISK]DS-3c21adcf-a8bd-40da-8ffe-33fdbb8ea9c0:NORMAL:127.0.0.1:46705|RBW], ReplicaUC[[DISK]DS-656d8140-9361-4102-89c9-615f4cf7f262:NORMAL:127.0.0.1:45389|RBW]]} size 0
   [junit4]   2> 229406 INFO  (Block report processor) [    ] BlockStateChange BLOCK* addStoredBlock: blockMap updated: 127.0.0.1:46705 is added to blk_1073741867_1043{UCState=UNDER_CONSTRUCTION, truncateBlock=null, primaryNodeIndex=-1, replicas=[ReplicaUC[[DISK]DS-656d8140-9361-4102-89c9-615f4cf7f262:NORMAL:127.0.0.1:45389|RBW], ReplicaUC[[DISK]DS-2e29f1be-c796-446c-b2a6-3435d698382c:NORMAL:127.0.0.1:46705|FINALIZED]]} size 0
   [junit4]   2> 229412 INFO  (Thread-432) [    ] o.a.s.u.p.LogUpdateProcessorFactory [collection1]  webapp=null path=null params={}{add=[56 (1600123516983705600)]} 0 0
   [junit4]   2> 229419 INFO  (Block report processor) [    ] BlockStateChange BLOCK* addStoredBlock: blockMap updated: 127.0.0.1:45389 is added to blk_1073741868_1044{UCState=UNDER_CONSTRUCTION, truncateBlock=null, primaryNodeIndex=-1, replicas=[ReplicaUC[[DISK]DS-3c21adcf-a8bd-40da-8ffe-33fdbb8ea9c0:NORMAL:127.0.0.1:46705|RBW], ReplicaUC[[DISK]DS-ce482716-8334-4b62-8d6f-76b29fee5ab1:NORMAL:127.0.0.1:45389|RBW]]} size 0
   [junit4]   2> 229419 INFO  (Block report processor) [    ] BlockStateChange BLOCK* addStoredBlock: blockMap updated: 127.0.0.1:46705 is added to blk_1073741868_1044 size 244
   [junit4]   2> 229424 INFO  (Thread-432) [    ] o.a.s.u.p.LogUpdateProcessorFactory [collection1]  webapp=null path=null params={}{add=[57 (1600123516995239936)]} 0 0
   [junit4]   2> 229435 INFO  (Thread-432) [    ] o.a.s.u.p.LogUpdateProcessorFactory [collection1]  webapp=null path=null params={}{add=[58 (1600123517006774272)]} 0 0
   [junit4]   2> 229438 INFO  (Block report processor) [    ] BlockStateChange BLOCK* addStoredBlock: blockMap updated: 127.0.0.1:46705 is added to blk_1073741869_1045{UCState=UNDER_CONSTRUCTION, truncateBlock=null, primaryNodeIndex=-1, replicas=[ReplicaUC[[DISK]DS-656d8140-9361-4102-89c9-615f4cf7f262:NORMAL:127.0.0.1:45389|RBW], ReplicaUC[[DISK]DS-2e29f1be-c796-446c-b2a6-3435d698382c:NORMAL:127.0.0.1:46705|RBW]]} size 0
   [junit4]   2> 229439 INFO  (Block report processor) [    ] BlockStateChange BLOCK* addStoredBlock: blockMap updated: 127.0.0.1:45389 is added to blk_1073741869_1045 size 101
   [junit4]   2> 229446 INFO  (Thread-432) [    ] o.a.s.u.p.LogUpdateProcessorFactory [collection1]  webapp=null path=null params={}{add=[59 (1600123517018308608)]} 0 0
   [junit4]   2> 229455 INFO  (Block report processor) [    ] BlockStateChange BLOCK* addStoredBlock: blockMap updated: 127.0.0.1:46705 is added to blk_1073741870_1046{UCState=UNDER_CONSTRUCTION, truncateBlock=null, primaryNodeIndex=-1, replicas=[ReplicaUC[[DISK]DS-ce482716-8334-4b62-8d6f-76b29fee5ab1:NORMAL:127.0.0.1:45389|RBW], ReplicaUC[[DISK]DS-3c21adcf-a8bd-40da-8ffe-33fdbb8ea9c0:NORMAL:127.0.0.1:46705|FINALIZED]]} size 0
   [junit4]   2> 229455 INFO  (Block report processor) [    ] BlockStateChange BLOCK* addStoredBlock: blockMap updated: 127.0.0.1:45389 is added to blk_1073741870_1046{UCState=UNDER_CONSTRUCTION, truncateBlock=null, primaryNodeIndex=-1, replicas=[ReplicaUC[[DISK]DS-ce482716-8334-4b62-8d6f-76b29fee5ab1:NORMAL:127.0.0.1:45389|RBW], ReplicaUC[[DISK]DS-3c21adcf-a8bd-40da-8ffe-33fdbb8ea9c0:NORMAL:127.0.0.1:46705|FINALIZED]]} size 0
   [junit4]   2> 229457 INFO  (Thread-432) [    ] o.a.s.u.p.LogUpdateProcessorFactory [collection1]  webapp=null path=null params={}{add=[60 (1600123517030891520)]} 0 0
   [junit4]   2> 229465 INFO  (Block report processor) [    ] BlockStateChange BLOCK* addStoredBlock: blockMap updated: 127.0.0.1:45389 is added to blk_1073741871_1047{UCState=UNDER_CONSTRUCTION, truncateBlock=null, primaryNodeIndex=-1, replicas=[ReplicaUC[[DISK]DS-2e29f1be-c796-446c-b2a6-3435d698382c:NORMAL:127.0.0.1:46705|RBW], ReplicaUC[[DISK]DS-656d8140-9361-4102-89c9-615f4cf7f262:NORMAL:127.0.0.1:45389|FINALIZED]]} size 0
   [junit4]   2> 229465 INFO  (Block report processor) [    ] BlockStateChange BLOCK* addStoredBlock: blockMap updated: 127.0.0.1:46705 is added to blk_1073741871_1047{UCState=UNDER_CONSTRUCTION, truncateBlock=null, primaryNodeIndex=-1, replicas=[ReplicaUC[[DISK]DS-2e29f1be-c796-446c-b2a6-3435d698382c:NORMAL:127.0.0.1:46705|RBW], ReplicaUC[[DISK]DS-656d8140-9361-4102-89c9-615f4cf7f262:NORMAL:127.0.0.1:45389|FINALIZED]]} size 0
   [junit4]   2> 229468 INFO  (Thread-432) [    ] o.a.s.u.p.LogUpdateProcessorFactory [collection1]  webapp=null path=null params={}{add=[61 (1600123517042425856)]} 0 0
   [junit4]   2> 229475 INFO  (Block report processor) [    ] BlockStateChange BLOCK* addStoredBlock: blockMap updated: 127.0.0.1:46705 is added to blk_1073741872_1048{UCState=UNDER_CONSTRUCTION, truncateBlock=null, primaryNodeIndex=-1, replicas=[ReplicaUC[[DISK]DS-ce482716-8334-4b62-8d6f-76b29fee5ab1:NORMAL:127.0.0.1:45389|RBW], ReplicaUC[[DISK]DS-3c21adcf-a8bd-40da-8ffe-33fdbb8ea9c0:NORMAL:127.0.0.1:46705|FINALIZED]]} size 0
   [junit4]   2> 229475 INFO  (Block report processor) [    ] BlockStateChange BLOCK* addStoredBlock: blockMap updated: 127.0.0.1:45389 is added to blk_1073741872_1048 size 91
   [junit4]   2> 229479 INFO  (Thread-432) [    ] o.a.s.u.p.Log

[...truncated too long message...]

ated live nodes from ZooKeeper... (2) -> (1)
   [junit4]   2> 92812 INFO  (jetty-closer-206-thread-1) [    ] o.a.s.m.SolrMetricManager Closing metric reporters for registry=solr.cluster, tag=null
   [junit4]   2> 92812 INFO  (jetty-closer-206-thread-1) [    ] o.a.s.c.TransientSolrCoreCacheDefault Allocating transient cache for 2147483647 transient cores
   [junit4]   2> 92813 INFO  (jetty-closer-206-thread-4) [    ] o.a.s.c.ZkController Remove node as live in ZooKeeper:/live_nodes/127.0.0.1:34897_solr
   [junit4]   2> 92814 INFO  (jetty-closer-206-thread-4) [    ] o.a.s.m.SolrMetricManager Closing metric reporters for registry=solr.cluster, tag=null
   [junit4]   2> 92814 INFO  (zkCallback-274-thread-1) [    ] o.a.s.c.c.ZkStateReader Updated live nodes from ZooKeeper... (1) -> (0)
   [junit4]   2> 92814 INFO  (zkCallback-222-thread-1) [    ] o.a.s.c.c.ZkStateReader Updated live nodes from ZooKeeper... (1) -> (0)
   [junit4]   2> 92814 INFO  (zkCallback-215-thread-1) [    ] o.a.s.c.c.ZkStateReader Updated live nodes from ZooKeeper... (1) -> (0)
   [junit4]   2> 92814 INFO  (zkCallback-244-thread-1) [    ] o.a.s.c.c.ZkStateReader Updated live nodes from ZooKeeper... (1) -> (0)
   [junit4]   2> 92817 INFO  (zkCallback-252-thread-2) [    ] o.a.s.c.c.ZkStateReader Updated live nodes from ZooKeeper... (4) -> (0)
   [junit4]   2> 92827 INFO  (jetty-closer-206-thread-1) [    ] o.a.s.c.Overseer Overseer (id=72140561708613635-127.0.0.1:41417_solr-n_0000000000) closing
   [junit4]   2> 92827 INFO  (OverseerStateUpdate-72140561708613635-127.0.0.1:41417_solr-n_0000000000) [    ] o.a.s.c.Overseer Overseer Loop exiting : 127.0.0.1:41417_solr
   [junit4]   2> 92827 WARN  (OverseerAutoScalingTriggerThread-72140561708613635-127.0.0.1:41417_solr-n_0000000000) [    ] o.a.s.c.a.OverseerTriggerThread OverseerTriggerThread woken up but we are closed, exiting.
   [junit4]   2> 92828 INFO  (zkCallback-304-thread-2) [    ] o.a.s.c.c.ZkStateReader Updated live nodes from ZooKeeper... (5) -> (0)
   [junit4]   2> 92828 INFO  (zkCallback-297-thread-2) [    ] o.a.s.c.c.ZkStateReader Updated live nodes from ZooKeeper... (2) -> (0)
   [junit4]   2> 92828 INFO  (zkCallback-267-thread-2) [    ] o.a.s.c.c.ZkStateReader Updated live nodes from ZooKeeper... (2) -> (0)
   [junit4]   2> 92833 INFO  (zkCallback-237-thread-2) [    ] o.a.s.c.c.ZkStateReader Updated live nodes from ZooKeeper... (2) -> (0)
   [junit4]   2> 92834 INFO  (zkCallback-259-thread-2) [    ] o.a.s.c.c.ZkStateReader Updated live nodes from ZooKeeper... (2) -> (0)
   [junit4]   2> 92837 WARN  (NIOServerCxn.Factory:0.0.0.0/0.0.0.0:0) [    ] o.a.z.s.NIOServerCnxn Unable to read additional data from client sessionid 0x1004b756a8a0012, likely client has closed socket
   [junit4]   2> 92837 WARN  (NIOServerCxn.Factory:0.0.0.0/0.0.0.0:0) [    ] o.a.z.s.NIOServerCnxn Unable to read additional data from client sessionid 0x1004b756a8a000e, likely client has closed socket
   [junit4]   2> 92839 INFO  (jetty-closer-206-thread-4) [    ] o.e.j.s.h.ContextHandler Stopped o.e.j.s.ServletContextHandler@1fadc0e{/solr,null,UNAVAILABLE}
   [junit4]   2> 92840 INFO  (jetty-closer-206-thread-4) [    ] o.e.j.s.session node0 Stopped scavenging
   [junit4]   2> 92840 WARN  (NIOServerCxn.Factory:0.0.0.0/0.0.0.0:0) [    ] o.a.z.s.NIOServerCnxn Unable to read additional data from client sessionid 0x1004b756a8a000a, likely client has closed socket
   [junit4]   2> 92840 WARN  (NIOServerCxn.Factory:0.0.0.0/0.0.0.0:0) [    ] o.a.z.s.NIOServerCnxn Unable to read additional data from client sessionid 0x1004b756a8a0004, likely client has closed socket
   [junit4]   2> 92840 WARN  (NIOServerCxn.Factory:0.0.0.0/0.0.0.0:0) [    ] o.a.z.s.NIOServerCnxn Unable to read additional data from client sessionid 0x1004b756a8a001a, likely client has closed socket
   [junit4]   2> 92840 WARN  (NIOServerCxn.Factory:0.0.0.0/0.0.0.0:0) [    ] o.a.z.s.NIOServerCnxn Unable to read additional data from client sessionid 0x1004b756a8a0011, likely client has closed socket
   [junit4]   2> 92844 INFO  (jetty-closer-206-thread-1) [    ] o.e.j.s.h.ContextHandler Stopped o.e.j.s.ServletContextHandler@1e595e4{/solr,null,UNAVAILABLE}
   [junit4]   2> 92844 WARN  (NIOServerCxn.Factory:0.0.0.0/0.0.0.0:0) [    ] o.a.z.s.NIOServerCnxn Unable to read additional data from client sessionid 0x1004b756a8a0019, likely client has closed socket
   [junit4]   2> 92845 INFO  (jetty-closer-206-thread-1) [    ] o.e.j.s.session node0 Stopped scavenging
   [junit4]   2> 92847 WARN  (NIOServerCxn.Factory:0.0.0.0/0.0.0.0:0) [    ] o.a.z.s.NIOServerCnxn Unable to read additional data from client sessionid 0x1004b756a8a000d, likely client has closed socket
   [junit4]   2> 92847 INFO  (jetty-closer-206-thread-6) [    ] o.e.j.s.h.ContextHandler Stopped o.e.j.s.ServletContextHandler@bcaa2b{/solr,null,UNAVAILABLE}
   [junit4]   2> 92847 INFO  (jetty-closer-206-thread-3) [    ] o.e.j.s.h.ContextHandler Stopped o.e.j.s.ServletContextHandler@1125185{/solr,null,UNAVAILABLE}
   [junit4]   2> 92847 INFO  (jetty-closer-206-thread-6) [    ] o.e.j.s.session node0 Stopped scavenging
   [junit4]   2> 92847 WARN  (NIOServerCxn.Factory:0.0.0.0/0.0.0.0:0) [    ] o.a.z.s.NIOServerCnxn Unable to read additional data from client sessionid 0x1004b756a8a0003, likely client has closed socket
   [junit4]   2> 92848 INFO  (jetty-closer-206-thread-3) [    ] o.e.j.s.session node0 Stopped scavenging
   [junit4]   2> 94348 INFO  (jetty-closer-206-thread-2) [    ] o.e.j.s.h.ContextHandler Stopped o.e.j.s.ServletContextHandler@1487f54{/solr,null,UNAVAILABLE}
   [junit4]   2> 94348 INFO  (jetty-closer-206-thread-2) [    ] o.e.j.s.session node0 Stopped scavenging
   [junit4]   2> 94349 ERROR (SUITE-NodeAddedTriggerTest-seed#[25C0CFAA7104FDBA]-worker) [    ] o.a.z.s.ZooKeeperServer ZKShutdownHandler is not registered, so ZooKeeper server won't take any action on ERROR or SHUTDOWN server state changes
   [junit4]   2> 94349 INFO  (SUITE-NodeAddedTriggerTest-seed#[25C0CFAA7104FDBA]-worker) [    ] o.a.s.c.ZkTestServer connecting to 127.0.0.1:39693 39693
   [junit4]   2> 94456 INFO  (Thread-3105) [    ] o.a.s.c.ZkTestServer connecting to 127.0.0.1:39693 39693
   [junit4]   2> 94456 WARN  (Thread-3105) [    ] o.a.s.c.ZkTestServer Watch limit violations: 
   [junit4]   2> Maximum concurrent create/delete watches above limit:
   [junit4]   2> 
   [junit4]   2> 	13	/solr/aliases.json
   [junit4]   2> 	13	/solr/clusterprops.json
   [junit4]   2> 	6	/solr/security.json
   [junit4]   2> 
   [junit4]   2> Maximum concurrent data watches above limit:
   [junit4]   2> 
   [junit4]   2> 	13	/solr/clusterstate.json
   [junit4]   2> 	2	/solr/overseer_elect/election/72140561708613649-127.0.0.1:34897_solr-n_0000000003
   [junit4]   2> 
   [junit4]   2> Maximum concurrent children watches above limit:
   [junit4]   2> 
   [junit4]   2> 	13	/solr/live_nodes
   [junit4]   2> 	13	/solr/collections
   [junit4]   2> 
   [junit4]   2> NOTE: leaving temporary files on disk at: /home/jenkins/workspace/Lucene-Solr-master-Linux/solr/build/solr-core/test/J2/temp/solr.cloud.autoscaling.NodeAddedTriggerTest_25C0CFAA7104FDBA-002
   [junit4]   2> May 11, 2018 12:53:29 AM com.carrotsearch.randomizedtesting.ThreadLeakControl checkThreadLeaks
   [junit4]   2> WARNING: Will linger awaiting termination of 1 leaked thread(s).
   [junit4]   2> NOTE: test params are: codec=Asserting(Lucene70): {}, docValues:{}, maxPointsInLeafNode=656, maxMBSortInHeap=6.564786399865421, sim=Asserting(org.apache.lucene.search.similarities.AssertingSimilarity@1c171ff), locale=nl-BE, timezone=America/Kralendijk
   [junit4]   2> NOTE: Linux 4.13.0-39-generic i386/Oracle Corporation 1.8.0_162 (32-bit)/cpus=8,threads=1,free=45146736,total=242483200
   [junit4]   2> NOTE: All tests run in this JVM: [NodeAddedTriggerTest, NodeAddedTriggerTest, TestHdfsUpdateLog, NodeAddedTriggerTest]
   [junit4] Completed [8/10 (3!)] on J2 in 17.06s, 4 tests, 1 failure <<< FAILURES!

[...truncated 21 lines...]
BUILD FAILED
/home/jenkins/workspace/Lucene-Solr-master-Linux/lucene/common-build.xml:1568: The following error occurred while executing this line:
/home/jenkins/workspace/Lucene-Solr-master-Linux/lucene/common-build.xml:1092: There were test failures: 10 suites, 25 tests, 3 failures [seed: 25C0CFAA7104FDBA]

Total time: 1 minute 46 seconds

[repro] Setting last failure code to 256

[repro] Failures:
[repro]   0/5 failed: org.apache.solr.update.TestHdfsUpdateLog
[repro]   3/5 failed: org.apache.solr.cloud.autoscaling.NodeAddedTriggerTest
[repro] Exiting with code 256
+ mv lucene/build lucene/build.repro
+ mv solr/build solr/build.repro
+ mv lucene/build.orig lucene/build
+ mv solr/build.orig solr/build
Archiving artifacts
Setting ANT_1_8_2_HOME=/var/lib/jenkins/tools/hudson.tasks.Ant_AntInstallation/ANT_1.8.2
[WARNINGS] Parsing warnings in console log with parser Java Compiler (javac)
Setting ANT_1_8_2_HOME=/var/lib/jenkins/tools/hudson.tasks.Ant_AntInstallation/ANT_1.8.2
Setting ANT_1_8_2_HOME=/var/lib/jenkins/tools/hudson.tasks.Ant_AntInstallation/ANT_1.8.2
<Git Blamer> Using GitBlamer to create author and commit information for all warnings.
<Git Blamer> GIT_COMMIT=8a697ee09cff3c81ea0805a5c75d1b01a0712768, workspace=/var/lib/jenkins/workspace/Lucene-Solr-master-Linux
[WARNINGS] Computing warning deltas based on reference build #21988
Recording test results
Setting ANT_1_8_2_HOME=/var/lib/jenkins/tools/hudson.tasks.Ant_AntInstallation/ANT_1.8.2
Build step 'Publish JUnit test result report' changed build result to UNSTABLE
Email was triggered for: Unstable (Test Failures)
Sending email for trigger: Unstable (Test Failures)
Setting ANT_1_8_2_HOME=/var/lib/jenkins/tools/hudson.tasks.Ant_AntInstallation/ANT_1.8.2
Setting ANT_1_8_2_HOME=/var/lib/jenkins/tools/hudson.tasks.Ant_AntInstallation/ANT_1.8.2
Setting ANT_1_8_2_HOME=/var/lib/jenkins/tools/hudson.tasks.Ant_AntInstallation/ANT_1.8.2
Setting ANT_1_8_2_HOME=/var/lib/jenkins/tools/hudson.tasks.Ant_AntInstallation/ANT_1.8.2

Mime
View raw message