lucene-dev mailing list archives

Site index · List index
Message view « Date » · « Thread »
Top « Date » · « Thread »
From Apache Jenkins Server <jenk...@builds.apache.org>
Subject [JENKINS] Lucene-Solr-Tests-master - Build # 2539 - Still Unstable
Date Mon, 21 May 2018 14:22:02 GMT
Build: https://builds.apache.org/job/Lucene-Solr-Tests-master/2539/

3 tests failed.
FAILED:  org.apache.solr.cloud.autoscaling.NodeAddedTriggerTest.testRestoreState

Error Message:
Did not expect the processor to fire on first run! event={   "id":"607d3cc2c6345dT7jtpv4rq0cqe2on812a27fpae",   "source":"node_added_trigger",   "eventTime":27159297683502173,   "eventType":"NODEADDED",   "properties":{     "eventTimes":[27159297683502173],     "nodeNames":["127.0.0.1:39659_solr"]}}

Stack Trace:
java.lang.AssertionError: Did not expect the processor to fire on first run! event={
  "id":"607d3cc2c6345dT7jtpv4rq0cqe2on812a27fpae",
  "source":"node_added_trigger",
  "eventTime":27159297683502173,
  "eventType":"NODEADDED",
  "properties":{
    "eventTimes":[27159297683502173],
    "nodeNames":["127.0.0.1:39659_solr"]}}
	at __randomizedtesting.SeedInfo.seed([860FB951B6B7BD4C:48A11DC24E8EC55A]:0)
	at org.junit.Assert.fail(Assert.java:93)
	at org.apache.solr.cloud.autoscaling.NodeAddedTriggerTest.lambda$new$0(NodeAddedTriggerTest.java:49)
	at org.apache.solr.cloud.autoscaling.NodeAddedTrigger.run(NodeAddedTrigger.java:161)
	at org.apache.solr.cloud.autoscaling.NodeAddedTriggerTest.testRestoreState(NodeAddedTriggerTest.java:257)
	at sun.reflect.NativeMethodAccessorImpl.invoke0(Native Method)
	at sun.reflect.NativeMethodAccessorImpl.invoke(NativeMethodAccessorImpl.java:62)
	at sun.reflect.DelegatingMethodAccessorImpl.invoke(DelegatingMethodAccessorImpl.java:43)
	at java.lang.reflect.Method.invoke(Method.java:498)
	at com.carrotsearch.randomizedtesting.RandomizedRunner.invoke(RandomizedRunner.java:1737)
	at com.carrotsearch.randomizedtesting.RandomizedRunner$8.evaluate(RandomizedRunner.java:934)
	at com.carrotsearch.randomizedtesting.RandomizedRunner$9.evaluate(RandomizedRunner.java:970)
	at com.carrotsearch.randomizedtesting.RandomizedRunner$10.evaluate(RandomizedRunner.java:984)
	at com.carrotsearch.randomizedtesting.rules.SystemPropertiesRestoreRule$1.evaluate(SystemPropertiesRestoreRule.java:57)
	at org.apache.lucene.util.TestRuleSetupTeardownChained$1.evaluate(TestRuleSetupTeardownChained.java:49)
	at org.apache.lucene.util.AbstractBeforeAfterRule$1.evaluate(AbstractBeforeAfterRule.java:45)
	at org.apache.lucene.util.TestRuleThreadAndTestName$1.evaluate(TestRuleThreadAndTestName.java:48)
	at org.apache.lucene.util.TestRuleIgnoreAfterMaxFailures$1.evaluate(TestRuleIgnoreAfterMaxFailures.java:64)
	at org.apache.lucene.util.TestRuleMarkFailure$1.evaluate(TestRuleMarkFailure.java:47)
	at com.carrotsearch.randomizedtesting.rules.StatementAdapter.evaluate(StatementAdapter.java:36)
	at com.carrotsearch.randomizedtesting.ThreadLeakControl$StatementRunner.run(ThreadLeakControl.java:368)
	at com.carrotsearch.randomizedtesting.ThreadLeakControl.forkTimeoutingTask(ThreadLeakControl.java:817)
	at com.carrotsearch.randomizedtesting.ThreadLeakControl$3.evaluate(ThreadLeakControl.java:468)
	at com.carrotsearch.randomizedtesting.RandomizedRunner.runSingleTest(RandomizedRunner.java:943)
	at com.carrotsearch.randomizedtesting.RandomizedRunner$5.evaluate(RandomizedRunner.java:829)
	at com.carrotsearch.randomizedtesting.RandomizedRunner$6.evaluate(RandomizedRunner.java:879)
	at com.carrotsearch.randomizedtesting.RandomizedRunner$7.evaluate(RandomizedRunner.java:890)
	at com.carrotsearch.randomizedtesting.rules.StatementAdapter.evaluate(StatementAdapter.java:36)
	at com.carrotsearch.randomizedtesting.rules.SystemPropertiesRestoreRule$1.evaluate(SystemPropertiesRestoreRule.java:57)
	at org.apache.lucene.util.AbstractBeforeAfterRule$1.evaluate(AbstractBeforeAfterRule.java:45)
	at com.carrotsearch.randomizedtesting.rules.StatementAdapter.evaluate(StatementAdapter.java:36)
	at org.apache.lucene.util.TestRuleStoreClassName$1.evaluate(TestRuleStoreClassName.java:41)
	at com.carrotsearch.randomizedtesting.rules.NoShadowingOrOverridesOnMethodsRule$1.evaluate(NoShadowingOrOverridesOnMethodsRule.java:40)
	at com.carrotsearch.randomizedtesting.rules.NoShadowingOrOverridesOnMethodsRule$1.evaluate(NoShadowingOrOverridesOnMethodsRule.java:40)
	at com.carrotsearch.randomizedtesting.rules.StatementAdapter.evaluate(StatementAdapter.java:36)
	at com.carrotsearch.randomizedtesting.rules.StatementAdapter.evaluate(StatementAdapter.java:36)
	at com.carrotsearch.randomizedtesting.rules.StatementAdapter.evaluate(StatementAdapter.java:36)
	at org.apache.lucene.util.TestRuleAssertionsRequired$1.evaluate(TestRuleAssertionsRequired.java:53)
	at org.apache.lucene.util.TestRuleMarkFailure$1.evaluate(TestRuleMarkFailure.java:47)
	at org.apache.lucene.util.TestRuleIgnoreAfterMaxFailures$1.evaluate(TestRuleIgnoreAfterMaxFailures.java:64)
	at org.apache.lucene.util.TestRuleIgnoreTestSuites$1.evaluate(TestRuleIgnoreTestSuites.java:54)
	at com.carrotsearch.randomizedtesting.rules.StatementAdapter.evaluate(StatementAdapter.java:36)
	at com.carrotsearch.randomizedtesting.ThreadLeakControl$StatementRunner.run(ThreadLeakControl.java:368)
	at java.lang.Thread.run(Thread.java:748)


FAILED:  org.apache.solr.cloud.autoscaling.IndexSizeTriggerTest.testMergeIntegration

Error Message:
did not finish processing in time

Stack Trace:
java.lang.AssertionError: did not finish processing in time
	at __randomizedtesting.SeedInfo.seed([860FB951B6B7BD4C:D5B6FBE154A628B6]:0)
	at org.junit.Assert.fail(Assert.java:93)
	at org.junit.Assert.assertTrue(Assert.java:43)
	at org.apache.solr.cloud.autoscaling.IndexSizeTriggerTest.testMergeIntegration(IndexSizeTriggerTest.java:425)
	at sun.reflect.NativeMethodAccessorImpl.invoke0(Native Method)
	at sun.reflect.NativeMethodAccessorImpl.invoke(NativeMethodAccessorImpl.java:62)
	at sun.reflect.DelegatingMethodAccessorImpl.invoke(DelegatingMethodAccessorImpl.java:43)
	at java.lang.reflect.Method.invoke(Method.java:498)
	at com.carrotsearch.randomizedtesting.RandomizedRunner.invoke(RandomizedRunner.java:1737)
	at com.carrotsearch.randomizedtesting.RandomizedRunner$8.evaluate(RandomizedRunner.java:934)
	at com.carrotsearch.randomizedtesting.RandomizedRunner$9.evaluate(RandomizedRunner.java:970)
	at com.carrotsearch.randomizedtesting.RandomizedRunner$10.evaluate(RandomizedRunner.java:984)
	at com.carrotsearch.randomizedtesting.rules.SystemPropertiesRestoreRule$1.evaluate(SystemPropertiesRestoreRule.java:57)
	at org.apache.lucene.util.TestRuleSetupTeardownChained$1.evaluate(TestRuleSetupTeardownChained.java:49)
	at org.apache.lucene.util.AbstractBeforeAfterRule$1.evaluate(AbstractBeforeAfterRule.java:45)
	at org.apache.lucene.util.TestRuleThreadAndTestName$1.evaluate(TestRuleThreadAndTestName.java:48)
	at org.apache.lucene.util.TestRuleIgnoreAfterMaxFailures$1.evaluate(TestRuleIgnoreAfterMaxFailures.java:64)
	at org.apache.lucene.util.TestRuleMarkFailure$1.evaluate(TestRuleMarkFailure.java:47)
	at com.carrotsearch.randomizedtesting.rules.StatementAdapter.evaluate(StatementAdapter.java:36)
	at com.carrotsearch.randomizedtesting.ThreadLeakControl$StatementRunner.run(ThreadLeakControl.java:368)
	at com.carrotsearch.randomizedtesting.ThreadLeakControl.forkTimeoutingTask(ThreadLeakControl.java:817)
	at com.carrotsearch.randomizedtesting.ThreadLeakControl$3.evaluate(ThreadLeakControl.java:468)
	at com.carrotsearch.randomizedtesting.RandomizedRunner.runSingleTest(RandomizedRunner.java:943)
	at com.carrotsearch.randomizedtesting.RandomizedRunner$5.evaluate(RandomizedRunner.java:829)
	at com.carrotsearch.randomizedtesting.RandomizedRunner$6.evaluate(RandomizedRunner.java:879)
	at com.carrotsearch.randomizedtesting.RandomizedRunner$7.evaluate(RandomizedRunner.java:890)
	at com.carrotsearch.randomizedtesting.rules.StatementAdapter.evaluate(StatementAdapter.java:36)
	at com.carrotsearch.randomizedtesting.rules.SystemPropertiesRestoreRule$1.evaluate(SystemPropertiesRestoreRule.java:57)
	at org.apache.lucene.util.AbstractBeforeAfterRule$1.evaluate(AbstractBeforeAfterRule.java:45)
	at com.carrotsearch.randomizedtesting.rules.StatementAdapter.evaluate(StatementAdapter.java:36)
	at org.apache.lucene.util.TestRuleStoreClassName$1.evaluate(TestRuleStoreClassName.java:41)
	at com.carrotsearch.randomizedtesting.rules.NoShadowingOrOverridesOnMethodsRule$1.evaluate(NoShadowingOrOverridesOnMethodsRule.java:40)
	at com.carrotsearch.randomizedtesting.rules.NoShadowingOrOverridesOnMethodsRule$1.evaluate(NoShadowingOrOverridesOnMethodsRule.java:40)
	at com.carrotsearch.randomizedtesting.rules.StatementAdapter.evaluate(StatementAdapter.java:36)
	at com.carrotsearch.randomizedtesting.rules.StatementAdapter.evaluate(StatementAdapter.java:36)
	at com.carrotsearch.randomizedtesting.rules.StatementAdapter.evaluate(StatementAdapter.java:36)
	at org.apache.lucene.util.TestRuleAssertionsRequired$1.evaluate(TestRuleAssertionsRequired.java:53)
	at org.apache.lucene.util.TestRuleMarkFailure$1.evaluate(TestRuleMarkFailure.java:47)
	at org.apache.lucene.util.TestRuleIgnoreAfterMaxFailures$1.evaluate(TestRuleIgnoreAfterMaxFailures.java:64)
	at org.apache.lucene.util.TestRuleIgnoreTestSuites$1.evaluate(TestRuleIgnoreTestSuites.java:54)
	at com.carrotsearch.randomizedtesting.rules.StatementAdapter.evaluate(StatementAdapter.java:36)
	at com.carrotsearch.randomizedtesting.ThreadLeakControl$StatementRunner.run(ThreadLeakControl.java:368)
	at java.lang.Thread.run(Thread.java:748)


FAILED:  org.apache.solr.update.SoftAutoCommitTest.testSoftCommitWithinAndHardCommitMaxTimeMixedAdds

Error Message:
soft529 wasn't fast enough

Stack Trace:
java.lang.AssertionError: soft529 wasn't fast enough
	at __randomizedtesting.SeedInfo.seed([860FB951B6B7BD4C:2BAC05BEB62AAFD9]:0)
	at org.junit.Assert.fail(Assert.java:93)
	at org.junit.Assert.assertTrue(Assert.java:43)
	at org.junit.Assert.assertNotNull(Assert.java:526)
	at org.apache.solr.update.SoftAutoCommitTest.doTestSoftAndHardCommitMaxTimeMixedAdds(SoftAutoCommitTest.java:209)
	at org.apache.solr.update.SoftAutoCommitTest.testSoftCommitWithinAndHardCommitMaxTimeMixedAdds(SoftAutoCommitTest.java:171)
	at sun.reflect.NativeMethodAccessorImpl.invoke0(Native Method)
	at sun.reflect.NativeMethodAccessorImpl.invoke(NativeMethodAccessorImpl.java:62)
	at sun.reflect.DelegatingMethodAccessorImpl.invoke(DelegatingMethodAccessorImpl.java:43)
	at java.lang.reflect.Method.invoke(Method.java:498)
	at com.carrotsearch.randomizedtesting.RandomizedRunner.invoke(RandomizedRunner.java:1737)
	at com.carrotsearch.randomizedtesting.RandomizedRunner$8.evaluate(RandomizedRunner.java:934)
	at com.carrotsearch.randomizedtesting.RandomizedRunner$9.evaluate(RandomizedRunner.java:970)
	at com.carrotsearch.randomizedtesting.RandomizedRunner$10.evaluate(RandomizedRunner.java:984)
	at com.carrotsearch.randomizedtesting.rules.SystemPropertiesRestoreRule$1.evaluate(SystemPropertiesRestoreRule.java:57)
	at org.apache.lucene.util.TestRuleSetupTeardownChained$1.evaluate(TestRuleSetupTeardownChained.java:49)
	at org.apache.lucene.util.AbstractBeforeAfterRule$1.evaluate(AbstractBeforeAfterRule.java:45)
	at org.apache.lucene.util.TestRuleThreadAndTestName$1.evaluate(TestRuleThreadAndTestName.java:48)
	at org.apache.lucene.util.TestRuleIgnoreAfterMaxFailures$1.evaluate(TestRuleIgnoreAfterMaxFailures.java:64)
	at org.apache.lucene.util.TestRuleMarkFailure$1.evaluate(TestRuleMarkFailure.java:47)
	at com.carrotsearch.randomizedtesting.rules.StatementAdapter.evaluate(StatementAdapter.java:36)
	at com.carrotsearch.randomizedtesting.ThreadLeakControl$StatementRunner.run(ThreadLeakControl.java:368)
	at com.carrotsearch.randomizedtesting.ThreadLeakControl.forkTimeoutingTask(ThreadLeakControl.java:817)
	at com.carrotsearch.randomizedtesting.ThreadLeakControl$3.evaluate(ThreadLeakControl.java:468)
	at com.carrotsearch.randomizedtesting.RandomizedRunner.runSingleTest(RandomizedRunner.java:943)
	at com.carrotsearch.randomizedtesting.RandomizedRunner$5.evaluate(RandomizedRunner.java:829)
	at com.carrotsearch.randomizedtesting.RandomizedRunner$6.evaluate(RandomizedRunner.java:879)
	at com.carrotsearch.randomizedtesting.RandomizedRunner$7.evaluate(RandomizedRunner.java:890)
	at com.carrotsearch.randomizedtesting.rules.StatementAdapter.evaluate(StatementAdapter.java:36)
	at com.carrotsearch.randomizedtesting.rules.SystemPropertiesRestoreRule$1.evaluate(SystemPropertiesRestoreRule.java:57)
	at org.apache.lucene.util.AbstractBeforeAfterRule$1.evaluate(AbstractBeforeAfterRule.java:45)
	at com.carrotsearch.randomizedtesting.rules.StatementAdapter.evaluate(StatementAdapter.java:36)
	at org.apache.lucene.util.TestRuleStoreClassName$1.evaluate(TestRuleStoreClassName.java:41)
	at com.carrotsearch.randomizedtesting.rules.NoShadowingOrOverridesOnMethodsRule$1.evaluate(NoShadowingOrOverridesOnMethodsRule.java:40)
	at com.carrotsearch.randomizedtesting.rules.NoShadowingOrOverridesOnMethodsRule$1.evaluate(NoShadowingOrOverridesOnMethodsRule.java:40)
	at com.carrotsearch.randomizedtesting.rules.StatementAdapter.evaluate(StatementAdapter.java:36)
	at com.carrotsearch.randomizedtesting.rules.StatementAdapter.evaluate(StatementAdapter.java:36)
	at com.carrotsearch.randomizedtesting.rules.StatementAdapter.evaluate(StatementAdapter.java:36)
	at org.apache.lucene.util.TestRuleAssertionsRequired$1.evaluate(TestRuleAssertionsRequired.java:53)
	at org.apache.lucene.util.TestRuleMarkFailure$1.evaluate(TestRuleMarkFailure.java:47)
	at org.apache.lucene.util.TestRuleIgnoreAfterMaxFailures$1.evaluate(TestRuleIgnoreAfterMaxFailures.java:64)
	at org.apache.lucene.util.TestRuleIgnoreTestSuites$1.evaluate(TestRuleIgnoreTestSuites.java:54)
	at com.carrotsearch.randomizedtesting.rules.StatementAdapter.evaluate(StatementAdapter.java:36)
	at com.carrotsearch.randomizedtesting.ThreadLeakControl$StatementRunner.run(ThreadLeakControl.java:368)
	at java.lang.Thread.run(Thread.java:748)




Build Log:
[...truncated 12611 lines...]
   [junit4] Suite: org.apache.solr.cloud.autoscaling.NodeAddedTriggerTest
   [junit4]   2> Creating dataDir: /x1/jenkins/jenkins-slave/workspace/Lucene-Solr-Tests-master/solr/build/solr-core/test/J1/temp/solr.cloud.autoscaling.NodeAddedTriggerTest_860FB951B6B7BD4C-001/init-core-data-001
   [junit4]   2> 227763 INFO  (SUITE-NodeAddedTriggerTest-seed#[860FB951B6B7BD4C]-worker) [    ] o.a.s.SolrTestCaseJ4 Using PointFields (NUMERIC_POINTS_SYSPROP=true) w/NUMERIC_DOCVALUES_SYSPROP=true
   [junit4]   2> 227768 INFO  (SUITE-NodeAddedTriggerTest-seed#[860FB951B6B7BD4C]-worker) [    ] o.a.s.SolrTestCaseJ4 Randomized ssl (false) and clientAuth (false) via: @org.apache.solr.util.RandomizeSSL(reason=, ssl=NaN, value=NaN, clientAuth=NaN)
   [junit4]   2> 227769 INFO  (SUITE-NodeAddedTriggerTest-seed#[860FB951B6B7BD4C]-worker) [    ] o.a.s.SolrTestCaseJ4 SecureRandom sanity checks: test.solr.allowed.securerandom=null & java.security.egd=file:/dev/./urandom
   [junit4]   2> 227769 INFO  (SUITE-NodeAddedTriggerTest-seed#[860FB951B6B7BD4C]-worker) [    ] o.a.s.c.MiniSolrCloudCluster Starting cluster of 1 servers in /x1/jenkins/jenkins-slave/workspace/Lucene-Solr-Tests-master/solr/build/solr-core/test/J1/temp/solr.cloud.autoscaling.NodeAddedTriggerTest_860FB951B6B7BD4C-001/tempDir-001
   [junit4]   2> 227772 INFO  (SUITE-NodeAddedTriggerTest-seed#[860FB951B6B7BD4C]-worker) [    ] o.a.s.c.ZkTestServer STARTING ZK TEST SERVER
   [junit4]   2> 227780 INFO  (Thread-322) [    ] o.a.s.c.ZkTestServer client port:0.0.0.0/0.0.0.0:0
   [junit4]   2> 227780 INFO  (Thread-322) [    ] o.a.s.c.ZkTestServer Starting server
   [junit4]   2> 227840 ERROR (Thread-322) [    ] o.a.z.s.ZooKeeperServer ZKShutdownHandler is not registered, so ZooKeeper server won't take any action on ERROR or SHUTDOWN server state changes
   [junit4]   2> 227880 INFO  (SUITE-NodeAddedTriggerTest-seed#[860FB951B6B7BD4C]-worker) [    ] o.a.s.c.ZkTestServer start zk server on port:58971
   [junit4]   2> 227908 INFO  (zkConnectionManagerCallback-195-thread-1) [    ] o.a.s.c.c.ConnectionManager zkClient has connected
   [junit4]   2> 227961 INFO  (jetty-launcher-192-thread-1) [    ] o.e.j.s.Server jetty-9.4.10.v20180503; built: 2018-05-03T15:56:21.710Z; git: daa59876e6f384329b122929e70a80934569428c; jvm 1.8.0_172-b11
   [junit4]   2> 228036 INFO  (jetty-launcher-192-thread-1) [    ] o.e.j.s.session DefaultSessionIdManager workerName=node0
   [junit4]   2> 228036 INFO  (jetty-launcher-192-thread-1) [    ] o.e.j.s.session No SessionScavenger set, using defaults
   [junit4]   2> 228036 INFO  (jetty-launcher-192-thread-1) [    ] o.e.j.s.session node0 Scavenging every 600000ms
   [junit4]   2> 228044 INFO  (jetty-launcher-192-thread-1) [    ] o.e.j.s.h.ContextHandler Started o.e.j.s.ServletContextHandler@604c064e{/solr,null,AVAILABLE}
   [junit4]   2> 228046 INFO  (jetty-launcher-192-thread-1) [    ] o.e.j.s.AbstractConnector Started ServerConnector@22d9351d{HTTP/1.1,[http/1.1]}{127.0.0.1:39659}
   [junit4]   2> 228047 INFO  (jetty-launcher-192-thread-1) [    ] o.e.j.s.Server Started @228106ms
   [junit4]   2> 228047 INFO  (jetty-launcher-192-thread-1) [    ] o.a.s.c.s.e.JettySolrRunner Jetty properties: {hostContext=/solr, hostPort=39659}
   [junit4]   2> 228047 ERROR (jetty-launcher-192-thread-1) [    ] o.a.s.u.StartupLoggingUtils Missing Java Option solr.log.dir. Logging may be missing or incomplete.
   [junit4]   2> 228047 INFO  (jetty-launcher-192-thread-1) [    ] o.a.s.s.SolrDispatchFilter Using logger factory org.apache.logging.slf4j.Log4jLoggerFactory
   [junit4]   2> 228047 INFO  (jetty-launcher-192-thread-1) [    ] o.a.s.s.SolrDispatchFilter  ___      _       Welcome to Apache Solr™ version 8.0.0
   [junit4]   2> 228047 INFO  (jetty-launcher-192-thread-1) [    ] o.a.s.s.SolrDispatchFilter / __| ___| |_ _   Starting in cloud mode on port null
   [junit4]   2> 228047 INFO  (jetty-launcher-192-thread-1) [    ] o.a.s.s.SolrDispatchFilter \__ \/ _ \ | '_|  Install dir: null
   [junit4]   2> 228047 INFO  (jetty-launcher-192-thread-1) [    ] o.a.s.s.SolrDispatchFilter |___/\___/_|_|    Start time: 2018-05-21T12:56:38.566Z
   [junit4]   2> 228100 INFO  (zkConnectionManagerCallback-197-thread-1) [    ] o.a.s.c.c.ConnectionManager zkClient has connected
   [junit4]   2> 228101 INFO  (jetty-launcher-192-thread-1) [    ] o.a.s.s.SolrDispatchFilter solr.xml found in ZooKeeper. Loading...
   [junit4]   2> 228325 INFO  (jetty-launcher-192-thread-1) [    ] o.a.s.c.ZkContainer Zookeeper client=127.0.0.1:58971/solr
   [junit4]   2> 228372 INFO  (zkConnectionManagerCallback-201-thread-1) [    ] o.a.s.c.c.ConnectionManager zkClient has connected
   [junit4]   2> 228408 INFO  (zkConnectionManagerCallback-203-thread-1) [    ] o.a.s.c.c.ConnectionManager zkClient has connected
   [junit4]   2> 228584 INFO  (jetty-launcher-192-thread-1) [n:127.0.0.1:39659_solr    ] o.a.s.c.Overseer Overseer (id=null) closing
   [junit4]   2> 228585 INFO  (jetty-launcher-192-thread-1) [n:127.0.0.1:39659_solr    ] o.a.s.c.OverseerElectionContext I am going to be the leader 127.0.0.1:39659_solr
   [junit4]   2> 228586 INFO  (jetty-launcher-192-thread-1) [n:127.0.0.1:39659_solr    ] o.a.s.c.Overseer Overseer (id=73837505618640899-127.0.0.1:39659_solr-n_0000000000) starting
   [junit4]   2> 228627 INFO  (zkConnectionManagerCallback-210-thread-1) [    ] o.a.s.c.c.ConnectionManager zkClient has connected
   [junit4]   2> 228630 INFO  (jetty-launcher-192-thread-1) [n:127.0.0.1:39659_solr    ] o.a.s.c.s.i.ZkClientClusterStateProvider Cluster at 127.0.0.1:58971/solr ready
   [junit4]   2> 228644 INFO  (jetty-launcher-192-thread-1) [n:127.0.0.1:39659_solr    ] o.a.s.c.ZkController Register node as live in ZooKeeper:/live_nodes/127.0.0.1:39659_solr
   [junit4]   2> 228712 INFO  (zkCallback-209-thread-1) [    ] o.a.s.c.c.ZkStateReader Updated live nodes from ZooKeeper... (0) -> (1)
   [junit4]   2> 228726 INFO  (zkCallback-202-thread-1) [    ] o.a.s.c.c.ZkStateReader Updated live nodes from ZooKeeper... (0) -> (1)
   [junit4]   2> 229539 INFO  (jetty-launcher-192-thread-1) [n:127.0.0.1:39659_solr    ] o.a.s.m.r.SolrJmxReporter JMX monitoring for 'solr_39659.solr.node' (registry 'solr.node') enabled at server: com.sun.jmx.mbeanserver.JmxMBeanServer@428d74d2
   [junit4]   2> 229636 INFO  (jetty-launcher-192-thread-1) [n:127.0.0.1:39659_solr    ] o.a.s.m.r.SolrJmxReporter JMX monitoring for 'solr_39659.solr.jvm' (registry 'solr.jvm') enabled at server: com.sun.jmx.mbeanserver.JmxMBeanServer@428d74d2
   [junit4]   2> 229637 INFO  (jetty-launcher-192-thread-1) [n:127.0.0.1:39659_solr    ] o.a.s.m.r.SolrJmxReporter JMX monitoring for 'solr_39659.solr.jetty' (registry 'solr.jetty') enabled at server: com.sun.jmx.mbeanserver.JmxMBeanServer@428d74d2
   [junit4]   2> 229639 INFO  (jetty-launcher-192-thread-1) [n:127.0.0.1:39659_solr    ] o.a.s.c.CorePropertiesLocator Found 0 core definitions underneath /x1/jenkins/jenkins-slave/workspace/Lucene-Solr-Tests-master/solr/build/solr-core/test/J1/temp/solr.cloud.autoscaling.NodeAddedTriggerTest_860FB951B6B7BD4C-001/tempDir-001/node1/.
   [junit4]   2> 229925 INFO  (zkConnectionManagerCallback-212-thread-1) [    ] o.a.s.c.c.ConnectionManager zkClient has connected
   [junit4]   2> 229996 INFO  (zkConnectionManagerCallback-217-thread-1) [    ] o.a.s.c.c.ConnectionManager zkClient has connected
   [junit4]   2> 229998 INFO  (SUITE-NodeAddedTriggerTest-seed#[860FB951B6B7BD4C]-worker) [    ] o.a.s.c.c.ZkStateReader Updated live nodes from ZooKeeper... (0) -> (1)
   [junit4]   2> 230000 INFO  (SUITE-NodeAddedTriggerTest-seed#[860FB951B6B7BD4C]-worker) [    ] o.a.s.c.s.i.ZkClientClusterStateProvider Cluster at 127.0.0.1:58971/solr ready
   [junit4]   2> 230026 INFO  (TEST-NodeAddedTriggerTest.testActionLifecycle-seed#[860FB951B6B7BD4C]) [    ] o.a.s.SolrTestCaseJ4 ###Starting testActionLifecycle
   [junit4]   2> 230107 INFO  (TEST-NodeAddedTriggerTest.testActionLifecycle-seed#[860FB951B6B7BD4C]) [    ] o.a.s.SolrTestCaseJ4 ###Ending testActionLifecycle
   [junit4]   2> 230122 INFO  (TEST-NodeAddedTriggerTest.testRestoreState-seed#[860FB951B6B7BD4C]) [    ] o.a.s.SolrTestCaseJ4 ###Starting testRestoreState
   [junit4]   2> 230139 INFO  (TEST-NodeAddedTriggerTest.testRestoreState-seed#[860FB951B6B7BD4C]) [    ] o.e.j.s.Server jetty-9.4.10.v20180503; built: 2018-05-03T15:56:21.710Z; git: daa59876e6f384329b122929e70a80934569428c; jvm 1.8.0_172-b11
   [junit4]   2> 230378 INFO  (TEST-NodeAddedTriggerTest.testRestoreState-seed#[860FB951B6B7BD4C]) [    ] o.e.j.s.session DefaultSessionIdManager workerName=node0
   [junit4]   2> 230378 INFO  (TEST-NodeAddedTriggerTest.testRestoreState-seed#[860FB951B6B7BD4C]) [    ] o.e.j.s.session No SessionScavenger set, using defaults
   [junit4]   2> 230378 INFO  (TEST-NodeAddedTriggerTest.testRestoreState-seed#[860FB951B6B7BD4C]) [    ] o.e.j.s.session node0 Scavenging every 600000ms
   [junit4]   2> 230382 INFO  (TEST-NodeAddedTriggerTest.testRestoreState-seed#[860FB951B6B7BD4C]) [    ] o.e.j.s.h.ContextHandler Started o.e.j.s.ServletContextHandler@2d12a84e{/solr,null,AVAILABLE}
   [junit4]   2> 230383 INFO  (TEST-NodeAddedTriggerTest.testRestoreState-seed#[860FB951B6B7BD4C]) [    ] o.e.j.s.AbstractConnector Started ServerConnector@756ff3a2{HTTP/1.1,[http/1.1]}{127.0.0.1:54164}
   [junit4]   2> 230383 INFO  (TEST-NodeAddedTriggerTest.testRestoreState-seed#[860FB951B6B7BD4C]) [    ] o.e.j.s.Server Started @230442ms
   [junit4]   2> 230383 INFO  (TEST-NodeAddedTriggerTest.testRestoreState-seed#[860FB951B6B7BD4C]) [    ] o.a.s.c.s.e.JettySolrRunner Jetty properties: {hostContext=/solr, hostPort=54164}
   [junit4]   2> 230384 ERROR (TEST-NodeAddedTriggerTest.testRestoreState-seed#[860FB951B6B7BD4C]) [    ] o.a.s.u.StartupLoggingUtils Missing Java Option solr.log.dir. Logging may be missing or incomplete.
   [junit4]   2> 230384 INFO  (TEST-NodeAddedTriggerTest.testRestoreState-seed#[860FB951B6B7BD4C]) [    ] o.a.s.s.SolrDispatchFilter Using logger factory org.apache.logging.slf4j.Log4jLoggerFactory
   [junit4]   2> 230384 INFO  (TEST-NodeAddedTriggerTest.testRestoreState-seed#[860FB951B6B7BD4C]) [    ] o.a.s.s.SolrDispatchFilter  ___      _       Welcome to Apache Solr™ version 8.0.0
   [junit4]   2> 230384 INFO  (TEST-NodeAddedTriggerTest.testRestoreState-seed#[860FB951B6B7BD4C]) [    ] o.a.s.s.SolrDispatchFilter / __| ___| |_ _   Starting in cloud mode on port null
   [junit4]   2> 230384 INFO  (TEST-NodeAddedTriggerTest.testRestoreState-seed#[860FB951B6B7BD4C]) [    ] o.a.s.s.SolrDispatchFilter \__ \/ _ \ | '_|  Install dir: null
   [junit4]   2> 230384 INFO  (TEST-NodeAddedTriggerTest.testRestoreState-seed#[860FB951B6B7BD4C]) [    ] o.a.s.s.SolrDispatchFilter |___/\___/_|_|    Start time: 2018-05-21T12:56:40.903Z
   [junit4]   2> 230412 INFO  (zkConnectionManagerCallback-219-thread-1) [    ] o.a.s.c.c.ConnectionManager zkClient has connected
   [junit4]   2> 230413 INFO  (TEST-NodeAddedTriggerTest.testRestoreState-seed#[860FB951B6B7BD4C]) [    ] o.a.s.s.SolrDispatchFilter solr.xml found in ZooKeeper. Loading...
   [junit4]   2> 230470 INFO  (TEST-NodeAddedTriggerTest.testRestoreState-seed#[860FB951B6B7BD4C]) [    ] o.a.s.c.ZkContainer Zookeeper client=127.0.0.1:58971/solr
   [junit4]   2> 230494 INFO  (zkConnectionManagerCallback-223-thread-1) [    ] o.a.s.c.c.ConnectionManager zkClient has connected
   [junit4]   2> 230517 INFO  (zkConnectionManagerCallback-225-thread-1) [    ] o.a.s.c.c.ConnectionManager zkClient has connected
   [junit4]   2> 230543 INFO  (TEST-NodeAddedTriggerTest.testRestoreState-seed#[860FB951B6B7BD4C]) [n:127.0.0.1:54164_solr    ] o.a.s.c.c.ZkStateReader Updated live nodes from ZooKeeper... (0) -> (1)
   [junit4]   2> 230550 INFO  (TEST-NodeAddedTriggerTest.testRestoreState-seed#[860FB951B6B7BD4C]) [n:127.0.0.1:54164_solr    ] o.a.s.c.Overseer Overseer (id=null) closing
   [junit4]   2> 230554 INFO  (TEST-NodeAddedTriggerTest.testRestoreState-seed#[860FB951B6B7BD4C]) [n:127.0.0.1:54164_solr    ] o.a.s.c.TransientSolrCoreCacheDefault Allocating transient cache for 2147483647 transient cores
   [junit4]   2> 230554 INFO  (TEST-NodeAddedTriggerTest.testRestoreState-seed#[860FB951B6B7BD4C]) [n:127.0.0.1:54164_solr    ] o.a.s.c.ZkController Register node as live in ZooKeeper:/live_nodes/127.0.0.1:54164_solr
   [junit4]   2> 230556 INFO  (zkCallback-209-thread-1) [    ] o.a.s.c.c.ZkStateReader Updated live nodes from ZooKeeper... (1) -> (2)
   [junit4]   2> 230556 INFO  (zkCallback-202-thread-1) [    ] o.a.s.c.c.ZkStateReader Updated live nodes from ZooKeeper... (1) -> (2)
   [junit4]   2> 230606 INFO  (zkCallback-216-thread-1) [    ] o.a.s.c.c.ZkStateReader Updated live nodes from ZooKeeper... (1) -> (2)
   [junit4]   2> 230615 INFO  (zkCallback-224-thread-1) [    ] o.a.s.c.c.ZkStateReader Updated live nodes from ZooKeeper... (1) -> (2)
   [junit4]   2> 231418 INFO  (TEST-NodeAddedTriggerTest.testRestoreState-seed#[860FB951B6B7BD4C]) [n:127.0.0.1:54164_solr    ] o.a.s.m.r.SolrJmxReporter JMX monitoring for 'solr_54164.solr.node' (registry 'solr.node') enabled at server: com.sun.jmx.mbeanserver.JmxMBeanServer@428d74d2
   [junit4]   2> 231435 INFO  (TEST-NodeAddedTriggerTest.testRestoreState-seed#[860FB951B6B7BD4C]) [n:127.0.0.1:54164_solr    ] o.a.s.m.r.SolrJmxReporter JMX monitoring for 'solr_54164.solr.jvm' (registry 'solr.jvm') enabled at server: com.sun.jmx.mbeanserver.JmxMBeanServer@428d74d2
   [junit4]   2> 231435 INFO  (TEST-NodeAddedTriggerTest.testRestoreState-seed#[860FB951B6B7BD4C]) [n:127.0.0.1:54164_solr    ] o.a.s.m.r.SolrJmxReporter JMX monitoring for 'solr_54164.solr.jetty' (registry 'solr.jetty') enabled at server: com.sun.jmx.mbeanserver.JmxMBeanServer@428d74d2
   [junit4]   2> 231438 INFO  (TEST-NodeAddedTriggerTest.testRestoreState-seed#[860FB951B6B7BD4C]) [n:127.0.0.1:54164_solr    ] o.a.s.c.CorePropertiesLocator Found 0 core definitions underneath /x1/jenkins/jenkins-slave/workspace/Lucene-Solr-Tests-master/solr/build/solr-core/test/J1/temp/solr.cloud.autoscaling.NodeAddedTriggerTest_860FB951B6B7BD4C-001/tempDir-001/node2/.
   [junit4]   2> 231481 INFO  (zkConnectionManagerCallback-232-thread-1) [    ] o.a.s.c.c.ConnectionManager zkClient has connected
   [junit4]   2> 231483 INFO  (TEST-NodeAddedTriggerTest.testRestoreState-seed#[860FB951B6B7BD4C]) [n:127.0.0.1:54164_solr    ] o.a.s.c.c.ZkStateReader Updated live nodes from ZooKeeper... (0) -> (2)
   [junit4]   2> 231485 INFO  (TEST-NodeAddedTriggerTest.testRestoreState-seed#[860FB951B6B7BD4C]) [n:127.0.0.1:54164_solr    ] o.a.s.c.s.i.ZkClientClusterStateProvider Cluster at 127.0.0.1:58971/solr ready
   [junit4]   2> 231662 INFO  (TEST-NodeAddedTriggerTest.testRestoreState-seed#[860FB951B6B7BD4C]) [    ] o.a.s.SolrTestCaseJ4 ###Ending testRestoreState
   [junit4]   2> NOTE: reproduce with: ant test  -Dtestcase=NodeAddedTriggerTest -Dtests.method=testRestoreState -Dtests.seed=860FB951B6B7BD4C -Dtests.multiplier=2 -Dtests.slow=true -Dtests.locale=vi-VN -Dtests.timezone=Antarctica/McMurdo -Dtests.asserts=true -Dtests.file.encoding=UTF-8
   [junit4] FAILURE 1.55s J1 | NodeAddedTriggerTest.testRestoreState <<<
   [junit4]    > Throwable #1: java.lang.AssertionError: Did not expect the processor to fire on first run! event={
   [junit4]    >   "id":"607d3cc2c6345dT7jtpv4rq0cqe2on812a27fpae",
   [junit4]    >   "source":"node_added_trigger",
   [junit4]    >   "eventTime":27159297683502173,
   [junit4]    >   "eventType":"NODEADDED",
   [junit4]    >   "properties":{
   [junit4]    >     "eventTimes":[27159297683502173],
   [junit4]    >     "nodeNames":["127.0.0.1:39659_solr"]}}
   [junit4]    > 	at __randomizedtesting.SeedInfo.seed([860FB951B6B7BD4C:48A11DC24E8EC55A]:0)
   [junit4]    > 	at org.apache.solr.cloud.autoscaling.NodeAddedTriggerTest.lambda$new$0(NodeAddedTriggerTest.java:49)
   [junit4]    > 	at org.apache.solr.cloud.autoscaling.NodeAddedTrigger.run(NodeAddedTrigger.java:161)
   [junit4]    > 	at org.apache.solr.cloud.autoscaling.NodeAddedTriggerTest.testRestoreState(NodeAddedTriggerTest.java:257)
   [junit4]    > 	at java.lang.Thread.run(Thread.java:748)
   [junit4]   2> 231694 INFO  (TEST-NodeAddedTriggerTest.testListenerAcceptance-seed#[860FB951B6B7BD4C]) [    ] o.a.s.SolrTestCaseJ4 ###Starting testListenerAcceptance
   [junit4]   2> 231696 INFO  (TEST-NodeAddedTriggerTest.testListenerAcceptance-seed#[860FB951B6B7BD4C]) [    ] o.e.j.s.Server jetty-9.4.10.v20180503; built: 2018-05-03T15:56:21.710Z; git: daa59876e6f384329b122929e70a80934569428c; jvm 1.8.0_172-b11
   [junit4]   2> 231711 INFO  (TEST-NodeAddedTriggerTest.testListenerAcceptance-seed#[860FB951B6B7BD4C]) [    ] o.e.j.s.session DefaultSessionIdManager workerName=node0
   [junit4]   2> 231711 INFO  (TEST-NodeAddedTriggerTest.testListenerAcceptance-seed#[860FB951B6B7BD4C]) [    ] o.e.j.s.session No SessionScavenger set, using defaults
   [junit4]   2> 231711 INFO  (TEST-NodeAddedTriggerTest.testListenerAcceptance-seed#[860FB951B6B7BD4C]) [    ] o.e.j.s.session node0 Scavenging every 660000ms
   [junit4]   2> 231712 INFO  (TEST-NodeAddedTriggerTest.testListenerAcceptance-seed#[860FB951B6B7BD4C]) [    ] o.e.j.s.h.ContextHandler Started o.e.j.s.ServletContextHandler@740d6e77{/solr,null,AVAILABLE}
   [junit4]   2> 231712 INFO  (TEST-NodeAddedTriggerTest.testListenerAcceptance-seed#[860FB951B6B7BD4C]) [    ] o.e.j.s.AbstractConnector Started ServerConnector@5eec3a25{HTTP/1.1,[http/1.1]}{127.0.0.1:56855}
   [junit4]   2> 231712 INFO  (TEST-NodeAddedTriggerTest.testListenerAcceptance-seed#[860FB951B6B7BD4C]) [    ] o.e.j.s.Server Started @231771ms
   [junit4]   2> 231712 INFO  (TEST-NodeAddedTriggerTest.testListenerAcceptance-seed#[860FB951B6B7BD4C]) [    ] o.a.s.c.s.e.JettySolrRunner Jetty properties: {hostContext=/solr, hostPort=56855}
   [junit4]   2> 231713 ERROR (TEST-NodeAddedTriggerTest.testListenerAcceptance-seed#[860FB951B6B7BD4C]) [    ] o.a.s.u.StartupLoggingUtils Missing Java Option solr.log.dir. Logging may be missing or incomplete.
   [junit4]   2> 231713 INFO  (TEST-NodeAddedTriggerTest.testListenerAcceptance-seed#[860FB951B6B7BD4C]) [    ] o.a.s.s.SolrDispatchFilter Using logger factory org.apache.logging.slf4j.Log4jLoggerFactory
   [junit4]   2> 231713 INFO  (TEST-NodeAddedTriggerTest.testListenerAcceptance-seed#[860FB951B6B7BD4C]) [    ] o.a.s.s.SolrDispatchFilter  ___      _       Welcome to Apache Solr™ version 8.0.0
   [junit4]   2> 231713 INFO  (TEST-NodeAddedTriggerTest.testListenerAcceptance-seed#[860FB951B6B7BD4C]) [    ] o.a.s.s.SolrDispatchFilter / __| ___| |_ _   Starting in cloud mode on port null
   [junit4]   2> 231713 INFO  (TEST-NodeAddedTriggerTest.testListenerAcceptance-seed#[860FB951B6B7BD4C]) [    ] o.a.s.s.SolrDispatchFilter \__ \/ _ \ | '_|  Install dir: null
   [junit4]   2> 231713 INFO  (TEST-NodeAddedTriggerTest.testListenerAcceptance-seed#[860FB951B6B7BD4C]) [    ] o.a.s.s.SolrDispatchFilter |___/\___/_|_|    Start time: 2018-05-21T12:56:42.232Z
   [junit4]   2> 231915 INFO  (zkConnectionManagerCallback-234-thread-1) [    ] o.a.s.c.c.ConnectionManager zkClient has connected
   [junit4]   2> 231916 INFO  (TEST-NodeAddedTriggerTest.testListenerAcceptance-seed#[860FB951B6B7BD4C]) [    ] o.a.s.s.SolrDispatchFilter solr.xml found in ZooKeeper. Loading...
   [junit4]   2> 231960 INFO  (TEST-NodeAddedTriggerTest.testListenerAcceptance-seed#[860FB951B6B7BD4C]) [    ] o.a.s.c.ZkContainer Zookeeper client=127.0.0.1:58971/solr
   [junit4]   2> 231970 INFO  (zkConnectionManagerCallback-238-thread-1) [    ] o.a.s.c.c.ConnectionManager zkClient has connected
   [junit4]   2> 231982 INFO  (zkConnectionManagerCallback-240-thread-1) [    ] o.a.s.c.c.ConnectionManager zkClient has connected
   [junit4]   2> 231991 INFO  (TEST-NodeAddedTriggerTest.testListenerAcceptance-seed#[860FB951B6B7BD4C]) [n:127.0.0.1:56855_solr    ] o.a.s.c.c.ZkStateReader Updated live nodes from ZooKeeper... (0) -> (2)
   [junit4]   2> 231994 INFO  (TEST-NodeAddedTriggerTest.testListenerAcceptance-seed#[860FB951B6B7BD4C]) [n:127.0.0.1:56855_solr    ] o.a.s.c.Overseer Overseer (id=null) closing
   [junit4]   2> 231997 INFO  (TEST-NodeAddedTriggerTest.testListenerAcceptance-seed#[860FB951B6B7BD4C]) [n:127.0.0.1:56855_solr    ] o.a.s.c.TransientSolrCoreCacheDefault Allocating transient cache for 2147483647 transient cores
   [junit4]   2> 231997 INFO  (TEST-NodeAddedTriggerTest.testListenerAcceptance-seed#[860FB951B6B7BD4C]) [n:127.0.0.1:56855_solr    ] o.a.s.c.ZkController Register node as live in ZooKeeper:/live_nodes/127.0.0.1:56855_solr
   [junit4]   2> 232002 INFO  (zkCallback-224-thread-1) [    ] o.a.s.c.c.ZkStateReader Updated live nodes from ZooKeeper... (2) -> (3)
   [junit4]   2> 232003 INFO  (zkCallback-202-thread-1) [    ] o.a.s.c.c.ZkStateReader Updated live nodes from ZooKeeper... (2) -> (3)
   [junit4]   2> 232003 INFO  (zkCallback-209-thread-1) [    ] o.a.s.c.c.ZkStateReader Updated live nodes from ZooKeeper... (2) -> (3)
   [junit4]   2> 232003 INFO  (zkCallback-216-thread-1) [    ] o.a.s.c.c.ZkStateReader Updated live nodes from ZooKeeper... (2) -> (3)
   [junit4]   2> 232038 INFO  (zkCallback-231-thread-1) [    ] o.a.s.c.c.ZkStateReader Updated live nodes from ZooKeeper... (2) -> (3)
   [junit4]   2> 232039 INFO  (zkCallback-239-thread-1) [    ] o.a.s.c.c.ZkStateReader Updated live nodes from ZooKeeper... (2) -> (3)
   [junit4]   2> 232378 INFO  (TEST-NodeAddedTriggerTest.testListenerAcceptance-seed#[860FB951B6B7BD4C]) [n:127.0.0.1:56855_solr    ] o.a.s.m.r.SolrJmxReporter JMX monitoring for 'solr_56855.solr.node' (registry 'solr.node') enabled at server: com.sun.jmx.mbeanserver.JmxMBeanServer@428d74d2
   [junit4]   2> 232413 INFO  (TEST-NodeAddedTriggerTest.testListenerAcceptance-seed#[860FB951B6B7BD4C]) [n:127.0.0.1:56855_solr    ] o.a.s.m.r.SolrJmxReporter JMX monitoring for 'solr_56855.solr.jvm' (registry 'solr.jvm') enabled at server: com.sun.jmx.mbeanserver.JmxMBeanServer@428d74d2
   [junit4]   2> 232414 INFO  (TEST-NodeAddedTriggerTest.testListenerAcceptance-seed#[860FB951B6B7BD4C]) [n:127.0.0.1:56855_solr    ] o.a.s.m.r.SolrJmxReporter JMX monitoring for 'solr_56855.solr.jetty' (registry 'solr.jetty') enabled at server: com.sun.jmx.mbeanserver.JmxMBeanServer@428d74d2
   [junit4]   2> 232430 INFO  (TEST-NodeAddedTriggerTest.testListenerAcceptance-seed#[860FB951B6B7BD4C]) [n:127.0.0.1:56855_solr    ] o.a.s.c.CorePropertiesLocator Found 0 core definitions underneath /x1/jenkins/jenkins-slave/workspace/Lucene-Solr-Tests-master/solr/build/solr-core/test/J1/temp/solr.cloud.autoscaling.NodeAddedTriggerTest_860FB951B6B7BD4C-001/tempDir-001/node3/.
   [junit4]   2> 232488 INFO  (zkConnectionManagerCallback-247-thread-1) [    ] o.a.s.c.c.ConnectionManager zkClient has connected
   [junit4]   2> 232491 INFO  (TEST-NodeAddedTriggerTest.testListenerAcceptance-seed#[860FB951B6B7BD4C]) [n:127.0.0.1:56855_solr    ] o.a.s.c.c.ZkStateReader Updated live nodes from ZooKeeper... (0) -> (3)
   [junit4]   2> 232493 INFO  (TEST-NodeAddedTriggerTest.testListenerAcceptance-seed#[860FB951B6B7BD4C]) [n:127.0.0.1:56855_solr    ] o.a.s.c.s.i.ZkClientClusterStateProvider Cluster at 127.0.0.1:58971/solr ready
   [junit4]   2> 232657 INFO  (TEST-NodeAddedTriggerTest.testListenerAcceptance-seed#[860FB951B6B7BD4C]) [    ] o.a.s.SolrTestCaseJ4 ###Ending testListenerAcceptance
   [junit4]   2> 232910 INFO  (TEST-NodeAddedTriggerTest.testTrigger-seed#[860FB951B6B7BD4C]) [    ] o.a.s.SolrTestCaseJ4 ###Starting testTrigger
   [junit4]   2> 232916 INFO  (TEST-NodeAddedTriggerTest.testTrigger-seed#[860FB951B6B7BD4C]) [    ] o.e.j.s.Server jetty-9.4.10.v20180503; built: 2018-05-03T15:56:21.710Z; git: daa59876e6f384329b122929e70a80934569428c; jvm 1.8.0_172-b11
   [junit4]   2> 232992 INFO  (TEST-NodeAddedTriggerTest.testTrigger-seed#[860FB951B6B7BD4C]) [    ] o.e.j.s.session DefaultSessionIdManager workerName=node0
   [junit4]   2> 232992 INFO  (TEST-NodeAddedTriggerTest.testTrigger-seed#[860FB951B6B7BD4C]) [    ] o.e.j.s.session No SessionScavenger set, using defaults
   [junit4]   2> 232992 INFO  (TEST-NodeAddedTriggerTest.testTrigger-seed#[860FB951B6B7BD4C]) [    ] o.e.j.s.session node0 Scavenging every 600000ms
   [junit4]   2> 232996 INFO  (TEST-NodeAddedTriggerTest.testTrigger-seed#[860FB951B6B7BD4C]) [    ] o.e.j.s.h.ContextHandler Started o.e.j.s.ServletContextHandler@209ddc17{/solr,null,AVAILABLE}
   [junit4]   2> 232997 INFO  (TEST-NodeAddedTriggerTest.testTrigger-seed#[860FB951B6B7BD4C]) [    ] o.e.j.s.AbstractConnector Started ServerConnector@67c29ff3{HTTP/1.1,[http/1.1]}{127.0.0.1:44483}
   [junit4]   2> 232997 INFO  (TEST-NodeAddedTriggerTest.testTrigger-seed#[860FB951B6B7BD4C]) [    ] o.e.j.s.Server Started @233056ms
   [junit4]   2> 232997 INFO  (TEST-NodeAddedTriggerTest.testTrigger-seed#[860FB951B6B7BD4C]) [    ] o.a.s.c.s.e.JettySolrRunner Jetty properties: {hostContext=/solr, hostPort=44483}
   [junit4]   2> 232997 ERROR (TEST-NodeAddedTriggerTest.testTrigger-seed#[860FB951B6B7BD4C]) [    ] o.a.s.u.StartupLoggingUtils Missing Java Option solr.log.dir. Logging may be missing or incomplete.
   [junit4]   2> 232997 INFO  (TEST-NodeAddedTriggerTest.testTrigger-seed#[860FB951B6B7BD4C]) [    ] o.a.s.s.SolrDispatchFilter Using logger factory org.apache.logging.slf4j.Log4jLoggerFactory
   [junit4]   2> 232997 INFO  (TEST-NodeAddedTriggerTest.testTrigger-seed#[860FB951B6B7BD4C]) [    ] o.a.s.s.SolrDispatchFilter  ___      _       Welcome to Apache Solr™ version 8.0.0
   [junit4]   2> 232997 INFO  (TEST-NodeAddedTriggerTest.testTrigger-seed#[860FB951B6B7BD4C]) [    ] o.a.s.s.SolrDispatchFilter / __| ___| |_ _   Starting in cloud mode on port null
   [junit4]   2> 232998 INFO  (TEST-NodeAddedTriggerTest.testTrigger-seed#[860FB951B6B7BD4C]) [    ] o.a.s.s.SolrDispatchFilter \__ \/ _ \ | '_|  Install dir: null
   [junit4]   2> 232998 INFO  (TEST-NodeAddedTriggerTest.testTrigger-seed#[860FB951B6B7BD4C]) [    ] o.a.s.s.SolrDispatchFilter |___/\___/_|_|    Start time: 2018-05-21T12:56:43.517Z
   [junit4]   2> 233052 INFO  (zkConnectionManagerCallback-249-thread-1) [    ] o.a.s.c.c.ConnectionManager zkClient has connected
   [junit4]   2> 233060 INFO  (TEST-NodeAddedTriggerTest.testTrigger-seed#[860FB951B6B7BD4C]) [    ] o.a.s.s.SolrDispatchFilter solr.xml found in ZooKeeper. Loading...
   [junit4]   2> 233147 INFO  (TEST-NodeAddedTriggerTest.testTrigger-seed#[860FB951B6B7BD4C]) [    ] o.a.s.c.ZkContainer Zookeeper client=127.0.0.1:58971/solr
   [junit4]   2> 233209 INFO  (zkConnectionManagerCallback-253-thread-1) [    ] o.a.s.c.c.ConnectionManager zkClient has connected
   [junit4]   2> 233276 INFO  (zkConnectionManagerCallback-255-thread-1) [    ] o.a.s.c.c.ConnectionManager zkClient has connected
   [junit4]   2> 233287 INFO  (TEST-NodeAddedTriggerTest.testTrigger-seed#[860FB951B6B7BD4C]) [n:127.0.0.1:44483_solr    ] o.a.s.c.c.ZkStateReader Updated live nodes from ZooKeeper... (0) -> (3)
   [junit4]   2> 233290 INFO  (TEST-NodeAddedTriggerTest.testTrigger-seed#[860FB951B6B7BD4C]) [n:127.0.0.1:44483_solr    ] o.a.s.c.Overseer Overseer (id=null) closing
   [junit4]   2> 233293 INFO  (TEST-NodeAddedTriggerTest.testTrigger-seed#[860FB951B6B7BD4C]) [n:127.0.0.1:44483_solr    ] o.a.s.c.TransientSolrCoreCacheDefault Allocating transient cache for 2147483647 transient cores
   [junit4]   2> 233293 INFO  (TEST-NodeAddedTriggerTest.testTrigger-seed#[860FB951B6B7BD4C]) [n:127.0.0.1:44483_solr    ] o.a.s.c.ZkController Register node as live in ZooKeeper:/live_nodes/127.0.0.1:44483_solr
   [junit4]   2> 233296 INFO  (zkCallback-216-thread-1) [    ] o.a.s.c.c.ZkStateReader Updated live nodes from ZooKeeper... (3) -> (4)
   [junit4]   2> 233296 INFO  (zkCallback-239-thread-1) [    ] o.a.s.c.c.ZkStateReader Updated live nodes from ZooKeeper... (3) -> (4)
   [junit4]   2> 233296 INFO  (zkCallback-224-thread-1) [    ] o.a.s.c.c.ZkStateReader Updated live nodes from ZooKeeper... (3) -> (4)
   [junit4]   2> 233296 INFO  (zkCallback-231-thread-1) [    ] o.a.s.c.c.ZkStateReader Updated live nodes from ZooKeeper... (3) -> (4)
   [junit4]   2> 233297 INFO  (zkCallback-209-thread-1) [    ] o.a.s.c.c.ZkStateReader Updated live nodes from ZooKeeper... (3) -> (4)
   [junit4]   2> 233297 INFO  (zkCallback-202-thread-1) [    ] o.a.s.c.c.ZkStateReader Updated live nodes from ZooKeeper... (3) -> (4)
   [junit4]   2> 233337 INFO  (zkCallback-254-thread-1) [    ] o.a.s.c.c.ZkStateReader Updated live nodes from ZooKeeper... (3) -> (4)
   [junit4]   2> 233337 INFO  (zkCallback-246-thread-1) [    ] o.a.s.c.c.ZkStateReader Updated live nodes from ZooKeeper... (3) -> (4)
   [junit4]   2> 234103 INFO  (TEST-NodeAddedTriggerTest.testTrigger-seed#[860FB951B6B7BD4C]) [n:127.0.0.1:44483_solr    ] o.a.s.m.r.SolrJmxReporter JMX monitoring for 'solr_44483.solr.node' (registry 'solr.node') enabled at server: com.sun.jmx.mbeanserver.JmxMBeanServer@428d74d2
   [junit4]   2> 234134 INFO  (TEST-NodeAddedTriggerTest.testTrigger-seed#[860FB951B6B7BD4C]) [n:127.0.0.1:44483_solr    ] o.a.s.m.r.SolrJmxReporter JMX monitoring for 'solr_44483.solr.jvm' (registry 'solr.jvm') enabled at server: com.sun.jmx.mbeanserver.JmxMBeanServer@428d74d2
   [junit4]   2> 234134 INFO  (TEST-NodeAddedTriggerTest.testTrigger-seed#[860FB951B6B7BD4C]) [n:127.0.0.1:44483_solr    ] o.a.s.m.r.SolrJmxReporter JMX monitoring for 'solr_44483.solr.jetty' (registry 'solr.jetty') enabled at server: com.sun.jmx.mbeanserver.JmxMBeanServer@428d74d2
   [junit4]   2> 234146 INFO  (TEST-NodeAddedTriggerTest.testTrigger-seed#[860FB951B6B7BD4C]) [n:127.0.0.1:44483_solr    ] o.a.s.c.CorePropertiesLocator Found 0 core definitions underneath /x1/jenkins/jenkins-slave/workspace/Lucene-Solr-Tests-master/solr/build/solr-core/test/J1/temp/solr.cloud.autoscaling.NodeAddedTriggerTest_860FB951B6B7BD4C-001/tempDir-001/node4/.
   [junit4]   2> 234224 INFO  (zkConnectionManagerCallback-262-thread-1) [    ] o.a.s.c.c.ConnectionManager zkClient has connected
   [junit4]   2> 234226 INFO  (TEST-NodeAddedTriggerTest.testTrigger-seed#[860FB951B6B7BD4C]) [n:127.0.0.1:44483_solr    ] o.a.s.c.c.ZkStateReader Updated live nodes from ZooKeeper... (0) -> (4)
   [junit4]   2> 234229 INFO  (TEST-NodeAddedTriggerTest.testTrigger-seed#[860FB951B6B7BD4C]) [n:127.0.0.1:44483_solr    ] o.a.s.c.s.i.ZkClientClusterStateProvider Cluster at 127.0.0.1:58971/solr ready
   [junit4]   2> 234388 INFO  (TEST-NodeAddedTriggerTest.testTrigger-seed#[860FB951B6B7BD4C]) [    ] o.e.j.s.Server jetty-9.4.10.v20180503; built: 2018-05-03T15:56:21.710Z; git: daa59876e6f384329b122929e70a80934569428c; jvm 1.8.0_172-b11
   [junit4]   2> 234485 INFO  (TEST-NodeAddedTriggerTest.testTrigger-seed#[860FB951B6B7BD4C]) [    ] o.e.j.s.session DefaultSessionIdManager workerName=node0
   [junit4]   2> 234485 INFO  (TEST-NodeAddedTriggerTest.testTrigger-seed#[860FB951B6B7BD4C]) [    ] o.e.j.s.session No SessionScavenger set, using defaults
   [junit4]   2> 234485 INFO  (TEST-NodeAddedTriggerTest.testTrigger-seed#[860FB951B6B7BD4C]) [    ] o.e.j.s.session node0 Scavenging every 660000ms
   [junit4]   2> 234486 INFO  (TEST-NodeAddedTriggerTest.testTrigger-seed#[860FB951B6B7BD4C]) [    ] o.e.j.s.h.ContextHandler Started o.e.j.s.ServletContextHandler@5230ef7c{/solr,null,AVAILABLE}
   [junit4]   2> 234487 INFO  (TEST-NodeAddedTriggerTest.testTrigger-seed#[860FB951B6B7BD4C]) [    ] o.e.j.s.AbstractConnector Started ServerConnector@7cdf48a5{HTTP/1.1,[http/1.1]}{127.0.0.1:51689}
   [junit4]   2> 234487 INFO  (TEST-NodeAddedTriggerTest.testTrigger-seed#[860FB951B6B7BD4C]) [    ] o.e.j.s.Server Started @234546ms
   [junit4]   2> 234487 INFO  (TEST-NodeAddedTriggerTest.testTrigger-seed#[860FB951B6B7BD4C]) [    ] o.a.s.c.s.e.JettySolrRunner Jetty properties: {hostContext=/solr, hostPort=51689}
   [junit4]   2> 234487 ERROR (TEST-NodeAddedTriggerTest.testTrigger-seed#[860FB951B6B7BD4C]) [    ] o.a.s.u.StartupLoggingUtils Missing Java Option solr.log.dir. Logging may be missing or incomplete.
   [junit4]   2> 234487 INFO  (TEST-NodeAddedTriggerTest.testTrigger-seed#[860FB951B6B7BD4C]) [    ] o.a.s.s.SolrDispatchFilter Using logger factory org.apache.logging.slf4j.Log4jLoggerFactory
   [junit4]   2> 234488 INFO  (TEST-NodeAddedTriggerTest.testTrigger-seed#[860FB951B6B7BD4C]) [    ] o.a.s.s.SolrDispatchFilter  ___      _       Welcome to Apache Solr™ version 8.0.0
   [junit4]   2> 234488 INFO  (TEST-NodeAddedTriggerTest.testTrigger-seed#[860FB951B6B7BD4C]) [    ] o.a.s.s.SolrDispatchFilter / __| ___| |_ _   Starting in cloud mode on port null
   [junit4]   2> 234488 INFO  (TEST-NodeAddedTriggerTest.testTrigger-seed#[860FB951B6B7BD4C]) [    ] o.a.s.s.SolrDispatchFilter \__ \/ _ \ | '_|  Install dir: null
   [junit4]   2> 234488 INFO  (TEST-NodeAddedTriggerTest.testTrigger-seed#[860FB951B6B7BD4C]) [    ] o.a.s.s.SolrDispatchFilter |___/\___/_|_|    Start time: 2018-05-21T12:56:45.007Z
   [junit4]   2> 234548 INFO  (zkConnectionManagerCallback-264-thread-1) [    ] o.a.s.c.c.ConnectionManager zkClient has connected
   [junit4]   2> 234549 INFO  (TEST-NodeAddedTriggerTest.testTrigger-seed#[860FB951B6B7BD4C]) [    ] o.a.s.s.SolrDispatchFilter solr.xml found in ZooKeeper. Loading...
   [junit4]   2> 234601 INFO  (TEST-NodeAddedTriggerTest.testTrigger-seed#[860FB951B6B7BD4C]) [    ] o.a.s.c.ZkContainer Zookeeper client=127.0.0.1:58971/solr
   [junit4]   2> 234632 INFO  (zkConnectionManagerCallback-268-thread-1) [    ] o.a.s.c.c.ConnectionManager zkClient has connected
   [junit4]   2> 234660 INFO  (zkConnectionManagerCallback-270-thread-1) [    ] o.a.s.c.c.ConnectionManager zkClient has connected
   [junit4]   2> 234674 INFO  (TEST-NodeAddedTriggerTest.testTrigger-seed#[860FB951B6B7BD4C]) [n:127.0.0.1:51689_solr    ] o.a.s.c.c.ZkStateReader Updated live nodes from ZooKeeper... (0) -> (4)
   [junit4]   2> 234677 INFO  (TEST-NodeAddedTriggerTest.testTrigger-seed#[860FB951B6B7BD4C]) [n:127.0.0.1:51689_solr    ] o.a.s.c.Overseer Overseer (id=null) closing
   [junit4]   2> 234687 INFO  (TEST-NodeAddedTriggerTest.testTrigger-seed#[860FB951B6B7BD4C]) [n:127.0.0.1:51689_solr    ] o.a.s.c.TransientSolrCoreCacheDefault Allocating transient cache for 2147483647 transient cores
   [junit4]   2> 234687 INFO  (TEST-NodeAddedTriggerTest.testTrigger-seed#[860FB951B6B7BD4C]) [n:127.0.0.1:51689_solr    ] o.a.s.c.ZkController Register node as live in ZooKeeper:/live_nodes/127.0.0.1:51689_solr
   [junit4]   2> 234690 INFO  (zkCallback-216-thread-1) [    ] o.a.s.c.c.ZkStateReader Updated live nodes from ZooKeeper... (4) -> (5)
   [junit4]   2> 234690 INFO  (zkCallback-239-thread-1) [    ] o.a.s.c.c.ZkStateReader Updated live nodes from ZooKeeper... (4) -> (5)
   [junit4]   2> 234691 INFO  (zkCallback-224-thread-1) [    ] o.a.s.c.c.ZkStateReader Updated live nodes from ZooKeeper... (4) -> (5)
   [junit4]   2> 234691 INFO  (zkCallback-209-thread-1) [    ] o.a.s.c.c.ZkStateReader Updated live nodes from ZooKeeper... (4) -> (5)
   [junit4]   2> 234691 INFO  (zkCallback-231-thread-1) [    ] o.a.s.c.c.ZkStateReader Updated live nodes from ZooKeeper... (4) -> (5)
   [junit4]   2> 234691 INFO  (zkCallback-202-thread-1) [    ] o.a.s.c.c.ZkStateReader Updated live nodes from ZooKeeper... (4) -> (5)
   [junit4]   2> 234711 INFO  (zkCallback-261-thread-1) [    ] o.a.s.c.c.ZkStateReader Updated live nodes from ZooKeeper... (4) -> (5)
   [junit4]   2> 234712 INFO  (zkCallback-246-thread-1) [    ] o.a.s.c.c.ZkStateReader Updated live nodes from ZooKeeper... (4) -> (5)
   [junit4]   2> 234712 INFO  (zkCallback-269-thread-1) [    ] o.a.s.c.c.ZkStateReader Updated live nodes from ZooKeeper... (4) -> (5)
   [junit4]   2> 234712 INFO  (zkCallback-254-thread-1) [    ] o.a.s.c.c.ZkStateReader Updated live nodes from ZooKeeper... (4) -> (5)
   [junit4]   2> 236043 INFO  (TEST-NodeAddedTriggerTest.testTrigger-seed#[860FB951B6B7BD4C]) [n:127.0.0.1:51689_solr    ] o.a.s.m.r.SolrJmxReporter JMX monitoring for 'solr_51689.solr.node' (registry 'solr.node') enabled at server: com.sun.jmx.mbeanserver.JmxMBeanServer@428d74d2
   [junit4]   2> 236093 INFO  (TEST-NodeAddedTriggerTest.testTrigger-seed#[860FB951B6B7BD4C]) [n:127.0.0.1:51689_solr    ] o.a.s.m.r.SolrJmxReporter JMX monitoring for 'solr_51689.solr.jvm' (registry 'solr.jvm') enabled at server: com.sun.jmx.mbeanserver.JmxMBeanServer@428d74d2
   [junit4]   2> 236093 INFO  (TEST-NodeAddedTriggerTest.testTrigger-seed#[860FB951B6B7BD4C]) [n:127.0.0.1:51689_solr    ] o.a.s.m.r.SolrJmxReporter JMX monitoring for 'solr_51689.solr.jetty' (registry 'solr.jetty') enabled at server: com.sun.jmx.mbeanserver.JmxMBeanServer@428d74d2
   [junit4]   2> 236095 INFO  (TEST-NodeAddedTriggerTest.testTrigger-seed#[860FB951B6B7BD4C]) [n:127.0.0.1:51689_solr    ] o.a.s.c.CorePropertiesLocator Found 0 core definitions underneath /x1/jenkins/jenkins-slave/workspace/Lucene-Solr-Tests-master/solr/build/solr-core/test/J1/temp/solr.cloud.autoscaling.NodeAddedTriggerTest_860FB951B6B7BD4C-001/tempDir-001/node5/.
   [junit4]   2> 236152 INFO  (zkConnectionManagerCallback-277-thread-1) [    ] o.a.s.c.c.ConnectionManager zkClient has connected
   [junit4]   2> 236154 INFO  (TEST-NodeAddedTriggerTest.testTrigger-seed#[860FB951B6B7BD4C]) [n:127.0.0.1:51689_solr    ] o.a.s.c.c.ZkStateReader Updated live nodes from ZooKeeper... (0) -> (5)
   [junit4]   2> 236155 INFO  (TEST-NodeAddedTriggerTest.testTrigger-seed#[860FB951B6B7BD4C]) [n:127.0.0.1:51689_solr    ] o.a.s.c.s.i.ZkClientClusterStateProvider Cluster at 127.0.0.1:58971/solr ready
   [junit4]   2> 241396 INFO  (TEST-NodeAddedTriggerTest.testTrigger-seed#[860FB951B6B7BD4C]) [    ] o.e.j.s.Server jetty-9.4.10.v20180503; built: 2018-05-03T15:56:21.710Z; git: daa59876e6f384329b122929e70a80934569428c; jvm 1.8.0_172-b11
   [junit4]   2> 241466 INFO  (TEST-NodeAddedTriggerTest.testTrigger-seed#[860FB951B6B7BD4C]) [    ] o.e.j.s.session DefaultSessionIdManager workerName=node0
   [junit4]   2> 241466 INFO  (TEST-NodeAddedTriggerTest.testTrigger-seed#[860FB951B6B7BD4C]) [    ] o.e.j.s.session No SessionScavenger set, using defaults
   [junit4]   2> 241466 INFO  (TEST-NodeAddedTriggerTest.testTrigger-seed#[860FB951B6B7BD4C]) [    ] o.e.j.s.session node0 Scavenging every 600000ms
   [junit4]   2> 241480 INFO  (TEST-NodeAddedTriggerTest.testTrigger-seed#[860FB951B6B7BD4C]) [    ] o.e.j.s.h.ContextHandler Started o.e.j.s.ServletContextHandler@158483a2{/solr,null,AVAILABLE}
   [junit4]   2> 241481 INFO  (TEST-NodeAddedTriggerTest.testTrigger-seed#[860FB951B6B7BD4C]) [    ] o.e.j.s.AbstractConnector Started ServerConnector@6ca8f97c{HTTP/1.1,[http/1.1]}{127.0.0.1:60973}
   [junit4]   2> 241481 INFO  (TEST-NodeAddedTriggerTest.testTrigger-seed#[860FB951B6B7BD4C]) [    ] o.e.j.s.Server Started @241540ms
   [junit4]   2> 241481 INFO  (TEST-NodeAddedTriggerTest.testTrigger-seed#[860FB951B6B7BD4C]) [    ] o.a.s.c.s.e.JettySolrRunner Jetty properties: {hostContext=/solr, hostPort=60973}
   [junit4]   2> 241481 ERROR (TEST-NodeAddedTriggerTest.testTrigger-seed#[860FB951B6B7BD4C]) [    ] o.a.s.u.StartupLoggingUtils Missing Java Option solr.log.dir. Logging may be missing or incomplete.
   [junit4]   2> 241481 INFO  (TEST-NodeAddedTriggerTest.testTrigger-seed#[860FB951B6B7BD4C]) [    ] o.a.s.s.SolrDispatchFilter Using logger factory org.apache.logging.slf4j.Log4jLoggerFactory
   [junit4]   2> 241481 INFO  (TEST-NodeAddedTriggerTest.testTrigger-seed#[860FB951B6B7BD4C]) [    ] o.a.s.s.SolrDispatchFilter  ___      _       Welcome to Apache Solr™ version 8.0.0
   [junit4]   2> 241482 INFO  (TEST-NodeAddedTriggerTest.testTrigger-seed#[860FB951B6B7BD4C]) [    ] o.a.s.s.SolrDispatchFilter / __| ___| |_ _   Starting in cloud mode on port null
   [junit4]   2> 241482 INFO  (TEST-NodeAddedTriggerTest.testTrigger-seed#[860FB951B6B7BD4C]) [    ] o.a.s.s.SolrDispatchFilter \__ \/ _ \ | '_|  Install dir: null
   [junit4]   2> 241482 INFO  (TEST-NodeAddedTriggerTest.testTrigger-seed#[860FB951B6B7BD4C]) [    ] o.a.s.s.SolrDispatchFilter |___/\___/_|_|    Start time: 2018-05-21T12:56:52.001Z
   [junit4]   2> 241574 INFO  (zkConnectionManagerCallback-279-thread-1) [    ] o.a.s.c.c.ConnectionManager zkClient has connected
   [junit4]   2> 241575 INFO  (TEST-NodeAddedTriggerTest.testTrigger-seed#[860FB951B6B7BD4C]) [    ] o.a.s.s.SolrDispatchFilter solr.xml found in ZooKeeper. Loading...
   [junit4]   2> 241637 INFO  (TEST-NodeAddedTriggerTest.testTrigger-seed#[860FB951B6B7BD4C]) [    ] o.a.s.c.ZkContainer Zookeeper client=127.0.0.1:58971/solr
   [junit4]   2> 241792 INFO  (zkConnectionManagerCallback-283-thread-1) [    ] o.a.s.c.c.ConnectionManager zkClient has connected
   [junit4]   2> 241834 INFO  (zkConnectionManagerCallback-285-thread-1) [    ] o.a.s.c.c.ConnectionManager zkClient has connected
   [junit4]   2> 241862 INFO  (TEST-NodeAddedTriggerTest.testTrigger-seed#[860FB951B6B7BD4C]) [n:127.0.0.1:60973_solr    ] o.a.s.c.c.ZkStateReader Updated live nodes from ZooKeeper... (0) -> (5)
   [junit4]   2> 241868 INFO  (TEST-NodeAddedTriggerTest.testTrigger-seed#[860FB951B6B7BD4C]) [n:127.0.0.1:60973_solr    ] o.a.s.c.Overseer Overseer (id=null) closing
   [junit4]   2> 241872 INFO  (TEST-NodeAddedTriggerTest.testTrigger-seed#[860FB951B6B7BD4C]) [n:127.0.0.1:60973_solr    ] o.a.s.c.TransientSolrCoreCacheDefault Allocating transient cache for 2147483647 transient cores
   [junit4]   2> 241872 INFO  (TEST-NodeAddedTriggerTest.testTrigger-seed#[860FB951B6B7BD4C]) [n:127.0.0.1:60973_solr    ] o.a.s.c.ZkController Register node as live in ZooKeeper:/live_nodes/127.0.0.1:60973_solr
   [junit4]   2> 241875 INFO  (zkCallback-254-thread-1) [    ] o.a.s.c.c.ZkStateReader Updated live nodes from ZooKeeper... (5) -> (6)
   [junit4]   2> 241875 INFO  (zkCallback-209-thread-1) [    ] o.a.s.c.c.ZkStateReader Updated live nodes from ZooKeeper... (5) -> (6)
   [junit4]   2> 241876 INFO  (zkCallback-202-thread-1) [    ] o.a.s.c.c.ZkStateReader Updated live nodes from ZooKeeper... (5) -> (6)
   [junit4]   2> 241876 INFO  (zkCallback-239-thread-1) [    ] o.a.s.c.c.ZkStateReader Updated live nodes from ZooKeeper... (5) -> (6)
   [junit4]   2> 241876 INFO  (zkCallback-216-thread-1) [    ] o.a.s.c.c.ZkStateReader Updated live nodes from ZooKeeper... (5) -> (6)
   [junit4]   2> 241876 INFO  (zkCallback-246-thread-1) [    ] o.a.s.c.c.ZkStateReader Updated live nodes from ZooKeeper... (5) -> (6)
   [junit4]   2> 241876 INFO  (zkCallback-224-thread-1) [    ] o.a.s.c.c.ZkStateReader Updated live nodes from ZooKeeper... (5) -> (6)
   [junit4]   2> 241877 INFO  (zkCallback-231-thread-1) [    ] o.a.s.c.c.ZkStateReader Updated live nodes from ZooKeeper... (5) -> (6)
   [junit4]   2> 241909 INFO  (zkCallback-269-thread-1) [    ] o.a.s.c.c.ZkStateReader Updated live nodes from ZooKeeper... (5) -> (6)
   [junit4]   2> 241909 INFO  (zkCallback-261-thread-1) [    ] o.a.s.c.c.ZkStateReader Updated live nodes from ZooKeeper... (5) -> (6)
   [junit4]   2> 241909 INFO  (zkCallback-276-thread-1) [    ] o.a.s.c.c.ZkStateReader Updated live nodes from ZooKeeper... (5) -> (6)
   [junit4]   2> 241928 INFO  (zkCallback-284-thread-1) [    ] o.a.s.c.c.ZkStateReader Updated live nodes from ZooKeeper... (5) -> (6)
   [junit4]   2> 242585 INFO  (TEST-NodeAddedTriggerTest.testTrigger-seed#[860FB951B6B7BD4C]) [n:127.0.0.1:60973_solr    ] o.a.s.m.r.SolrJmxReporter JMX monitoring for 'solr_60973.solr.node' (registry 'solr.node') enabled at server: com.sun.jmx.mbeanserver.JmxMBeanServer@428d74d2
   [junit4]   2> 242615 INFO  (TEST-NodeAddedTriggerTest.testTrigger-seed#[860FB951B6B7BD4C]) [n:127.0.0.1:60973_solr    ] o.a.s.m.r.SolrJmxReporter JMX monitoring for 'solr_60973.solr.jvm' (registry 'solr.jvm') enabled at server: com.sun.jmx.mbeanserver.JmxMBeanServer@428d74d2
   [junit4]   2> 242615 INFO  (TEST-NodeAddedTriggerTest.testTrigger-seed#[860FB951B6B7BD4C]) [n:127.0.0.1:60973_solr    ] o.a.s.m.r.SolrJmxReporter JMX monitoring for 'solr_60973.solr.jetty' (registry 'solr.jetty') enabled at server: com.sun.jmx.mbeanserver.JmxMBeanServer@428d74d2
   [junit4]   2> 242622 INFO  (TEST-NodeAddedTriggerTest.testTrigger-seed#[860FB951B6B7BD4C]) [n:127.0.0.1:60973_solr    ] o.a.s.c.CorePropertiesLocator Found 0 core definitions underneath /x1/jenkins/jenkins-slave/workspace/Lucene-Solr-Tests-master/solr/build/solr-core/test/J1/temp/solr.cloud.autoscaling.NodeAddedTriggerTest_860FB951B6B7BD4C-001/tempDir-001/node6/.
   [junit4]   2> 242684 INFO  (zkConnectionManagerCallback-292-thread-1) [    ] o.a.s.c.c.ConnectionManager zkClient has connected
   [junit4]   2> 242697 INFO  (TEST-NodeAddedTriggerTest.testTrigger-seed#[860FB951B6B7BD4C]) [n:127.0.0.1:60973_solr    ] o.a.s.c.c.ZkStateReader Updated live nodes from ZooKeeper... (0) -> (6)
   [junit4]   2> 242698 INFO  (TEST-NodeAddedTriggerTest.testTrigger-seed#[860FB951B6B7BD4C]) [n:127.0.0.1:60973_solr    ] o.a.s.c.s.i.ZkClientClusterStateProvider Cluster at 127.0.0.1:58971/solr ready
   [junit4]   2> 243235 INFO  (TEST-NodeAddedTriggerTest.testTrigger-seed#[860FB951B6B7BD4C]) [    ] o.e.j.s.AbstractConnector Stopped ServerConnector@6ca8f97c{HTTP/1.1,[http/1.1]}{127.0.0.1:0}
   [junit4]   2> 243236 INFO  (TEST-NodeAddedTriggerTest.testTrigger-seed#[860FB951B6B7BD4C]) [    ] o.a.s.c.CoreContainer Shutting down CoreContainer instance=1633972711
   [junit4]   2> 243241 INFO  (TEST-NodeAddedTriggerTest.testTrigger-seed#[860FB951B6B7BD4C]) [    ] o.a.s.m.SolrMetricManager Closing metric reporters for registry=solr.node, tag=null
   [junit4]   2> 243241 INFO  (TEST-NodeAddedTriggerTest.testTrigger-seed#[860FB951B6B7BD4C]) [    ] o.a.s.m.r.SolrJmxReporter Closing reporter [org.apache.solr.metrics.reporters.SolrJmxReporter@4a1a962b: rootName = solr_60973, domain = solr.node, service url = null, agent id = null] for registry solr.node / com.codahale.metrics.MetricRegistry@7980a20
   [junit4]   2> 243250 INFO  (TEST-NodeAddedTriggerTest.testTrigger-seed#[860FB951B6B7BD4C]) [    ] o.a.s.m.SolrMetricManager Closing metric reporters for registry=solr.jvm, tag=null
   [junit4]   2> 243250 INFO  (TEST-NodeAddedTriggerTest.testTrigger-seed#[860FB951B6B7BD4C]) [    ] o.a.s.m.r.SolrJmxReporter Closing reporter [org.apache.solr.metrics.reporters.SolrJmxReporter@7bbd255c: rootName = solr_60973, domain = solr.jvm, service url = null, agent id = null] for registry solr.jvm / com.codahale.metrics.MetricRegistry@577ff99c
   [junit4]   2> 243263 INFO  (TEST-NodeAddedTriggerTest.testTrigger-seed#[860FB951B6B7BD4C]) [    ] o.a.s.m.SolrMetricManager Closing metric reporters for registry=solr.jetty, tag=null
   [junit4]   2> 243263 INFO  (TEST-NodeAddedTriggerTest.testTrigger-seed#[860FB951B6B7BD4C]) [    ] o.a.s.m.r.SolrJmxReporter Closing reporter [org.apache.solr.metrics.reporters.SolrJmxReporter@35e5cdbc: rootName = solr_60973, domain = solr.jetty, service url = null, agent id = null] for registry solr.jetty / com.codahale.metrics.MetricRegistry@ef444d4
   [junit4]   2> 243269 INFO  (TEST-NodeAddedTriggerTest.testTrigger-seed#[860FB951B6B7BD4C]) [    ] o.a.s.c.ZkController Remove node as live in ZooKeeper:/live_nodes/127.0.0.1:60973_solr
   [junit4]   2> 243357 INFO  (zkCallback-284-thread-1) [    ] o.a.s.c.c.ZkStateReader Updated live nodes from ZooKeeper... (6) -> (5)
   [junit4]   2> 243357 INFO  (zkCallback-231-thread-1) [    ] o.a.s.c.c.ZkStateReader Updated live nodes from ZooKeeper... (6) -> (5)
   [junit4]   2> 243357 INFO  (zkCallback-261-thread-1) [    ] o.a.s.c.c.ZkStateReader Updated live nodes from ZooKeeper... (6) -> (5)
   [junit4]   2> 243358 INFO  (zkCallback-202-thread-1) [    ] o.a.s.c.c.ZkStateReader Updated live nodes from ZooKeeper... (6) -> (5)
   [junit4]   2> 243358 INFO  (zkCallback-246-thread-1) [    ] o.a.s.c.c.ZkStateReader Updated live nodes from ZooKeeper... (6) -> (5)
   [junit4]   2> 243358 INFO  (zkCallback-209-thread-1) [    ] o.a.s.c.c.ZkStateReader Updated live nodes from ZooKeeper... (6) -> (5)
   [junit4]   2> 243358 INFO  (zkCallback-239-thread-1) [    ] o.a.s.c.c.ZkStateReader Updated live nodes from ZooKeeper... (6) -> (5)
   [junit4]   2> 243358 INFO  (zkCallback-216-thread-1) [    ] o.a.s.c.c.ZkStateReader Updated live nodes from ZooKeeper... (6) -> (5)
   [junit4]   2> 243358 INFO  (zkCallback-254-thread-1) [    ] o.a.s.c.c.ZkStateReader Updated live nodes from ZooKeeper... (6) -> (5)
   [junit4]   2> 243359 INFO  (zkCallback-276-thread-1) [    ] o.a.s.c.c.ZkStateReader Updated live nodes from ZooKeeper... (6) -> (5)
   [junit4]   2> 243359 INFO  (zkCallback-224-thread-1) [    ] o.a.s.c.c.ZkStateReader Updated live nodes from ZooKeeper... (6) -> (5)
   [junit4]   2> 243362 INFO  (TEST-NodeAddedTriggerTest.testTrigger-seed#[860FB951B6B7BD4C]) [    ] o.a.s.m.SolrMetricManager Closing metric reporters for registry=solr.cluster, tag=null
   [junit4]   2> 243478 INFO  (zkCallback-269-thread-1) [    ] o.a.s.c.c.ZkStateReader Updated live nodes from ZooKeeper... (6) -> (5)
   [junit4]   2> 244977 WARN  (zkCallback-291-thread-1) [    ] o.a.s.c.c.ZkStateReader ZooKeeper watch triggered, but Solr cannot talk to ZK: [KeeperErrorCode = Session expired for /live_nodes]
   [junit4]   2> 244980 INFO  (TEST-NodeAddedTriggerTest.testTrigger-seed#[860FB951B6B7BD4C]) [    ] o.e.j.s.h.ContextHandler Stopped o.e.j.s.ServletContextHandler@158483a2{/solr,null,UNAVAILABLE}
   [junit4]   2> 244980 INFO  (TEST-NodeAddedTriggerTest.testTrigger-seed#[860FB951B6B7BD4C]) [    ] o.e.j.s.session node0 Stopped scavenging
   [junit4]   2> 249988 INFO  (TEST-NodeAddedTriggerTest.testTrigger-seed#[860FB951B6B7BD4C]) [    ] o.a.s.SolrTestCaseJ4 ###Ending testTrigger
   [junit4]   2> 250016 INFO  (jetty-closer-193-thread-2) [    ] o.e.j.s.AbstractConnector Stopped ServerConnector@756ff3a2{HTTP/1.1,[http/1.1]}{127.0.0.1:0}
   [junit4]   2> 250020 INFO  (jetty-closer-193-thread-3) [    ] o.e.j.s.AbstractConnector Stopped ServerConnector@5eec3a25{HTTP/1.1,[http/1.1]}{127.0.0.1:0}
   [junit4]   2> 250024 INFO  (jetty-closer-193-thread-1) [    ] o.e.j.s.AbstractConnector Stopped ServerConnector@22d9351d{HTTP/1.1,[http/1.1]}{127.0.0.1:0}
   [junit4]   2> 250035 INFO  (jetty-closer-193-thread-4) [    ] o.e.j.s.AbstractConnector Stopped ServerConnector@67c29ff3{HTTP/1.1,[http/1.1]}{127.0.0.1:0}
   [junit4]   2> 250035 INFO  (jetty-closer-193-thread-5) [    ] o.e.j.s.AbstractConnector Stopped ServerConnector@7cdf48a5{HTTP/1.1,[http/1.1]}{127.0.0.1:0}
   [junit4]   2> 250040 INFO  (jetty-closer-193-thread-3) [    ] o.a.s.c.CoreContainer Shutting down CoreContainer instance=1448738046
   [junit4]   2> 250040 INFO  (jetty-closer-193-thread-2) [    ] o.a.s.c.CoreContainer Shutting down CoreContainer instance=74360477
   [junit4]   2> 250041 INFO  (jetty-closer-193-thread-1) [    ] o.a.s.c.CoreContainer Shutting down CoreContainer instance=1006659093
   [junit4]   2> 250041 INFO  (jetty-closer-193-thread-4) [    ] o.a.s.c.CoreContainer Shutting down CoreContainer instance=2143504993
   [junit4]   2> 250041 INFO  (jetty-closer-193-thread-5) [    ] o.a.s.c.CoreContainer Shutting down CoreContainer instance=1503326168
   [junit4]   2> 250044 INFO  (jetty-closer-193-thread-4) [    ] o.a.s.m.SolrMetricManager Closing metric reporters for registry=solr.node, tag=null
   [junit4]   2> 250051 INFO  (jetty-closer-193-thread-4) [    ] o.a.s.m.r.SolrJmxReporter Closing reporter [org.apache.solr.metrics.reporters.SolrJmxReporter@3f10e4f3: rootName = solr_44483, domain = solr.node, service url = null, agent id = null] for registry solr.node / com.codahale.metrics.MetricRegistry@7485bc10
   [junit4]   2> 250057 INFO  (jetty-closer-193-thread-5) [    ] o.a.s.m.SolrMetricManager Closing metric reporters for registry=solr.node, tag=null
   [junit4]   2> 250058 INFO  (jetty-closer-193-thread-1) [    ] o.a.s.m.SolrMetricManager Closing metric reporters for registry=solr.node, tag=null
   [junit4]   2> 250058 INFO  (jetty-closer-193-thread-3) [    ] o.a.s.m.SolrMetricManager Closing metric reporters for registry=solr.node, tag=null
   [junit4]   2> 250058 INFO  (jetty-closer-193-thread-2) [    ] o.a.s.m.SolrMetricManager Closing metric reporters for registry=solr.node, tag=null
   [junit4]   2> 250060 INFO  (jetty-closer-193-thread-5) [    ] o.a.s.m.r.SolrJmxReporter Closing reporter [org.apache.solr.metrics.reporters.SolrJmxReporter@73588cb1: rootName = solr_51689, domain = solr.node, service url = null, agent id = null] for registry solr.node / com.codahale.metrics.MetricRegistry@bcd267f
   [junit4]   2> 250060 INFO  (jetty-closer-193-thread-4) [    ] o.a.s.m.SolrMetricManager Closing metric reporters for registry=solr.jvm, tag=null
   [junit4]   2> 250060 INFO  (jetty-closer-193-thread-4) [    ] o.a.s.m.r.SolrJmxReporter Closing reporter [org.apache.solr.metrics.reporters.SolrJmxReporter@1571f51d: rootName = solr_44483, domain = solr.jvm, service url = null, agent id = null] for registry solr.jvm / com.codahale.metrics.MetricRegistry@577ff99c
   [junit4]   2> 250063 INFO  (jetty-closer-193-thread-1) [    ] o.a.s.m.r.SolrJmxReporter Closing reporter [org.apache.solr.metrics.reporters.SolrJmxReporter@3ab94679: rootName = solr_39659, domain = solr.node, service url = null, agent id = null] for registry solr.node / com.codahale.metrics.MetricRegistry@1793b94d
   [junit4]   2> 250063 INFO  (jetty-closer-193-thread-3) [    ] o.a.s.m.r.SolrJmxReporter Closing reporter [org.apache.solr.metrics.reporters.SolrJmxReporter@2c26e229: rootName = solr_56855, domain = solr.node, service url = null, agent id = null] for registry solr.node / com.codahale.metrics.MetricRegistry@7893e615
   [junit4]   2> 250063 INFO  (jetty-closer-193-thread-2) [    ] o.a.s.m.r.SolrJmxReporter Closing reporter [org.apache.solr.metrics.reporters.SolrJmxReporter@444a5b30: rootName = solr_54164, domain = solr.node, service url = null, agent id = null] for registry solr.node / com.codahale.metrics.MetricRegistry@7c457ab1
   [junit4]   2> 250082 INFO  (jetty-closer-193-thread-4) [    ] o.a.s.m.SolrMetricManager Closing metric reporters for registry=solr.jetty, tag=null
   [junit4]   2> 250082 INFO  (jetty-closer-193-thread-4) [    ] o.a.s.m.r.SolrJmxReporter Closing reporter [org.apache.solr.metrics.reporters.SolrJmxReporter@42c5563f: rootName = solr_44483, domain = solr.jetty, service url = null, agent id = null] for registry solr.jetty / com.codahale.metrics.MetricRegistry@ef444d4
   [junit4]   2> 250089 INFO  (jetty-closer-193-thread-4) [    ] o.a.s.c.ZkController Remove node as live in ZooKeeper:/live_nodes/127.0.0.1:44483_solr
   [junit4]   2> 250091 INFO  (jetty-closer-193-thread-4) [    ] o.a.s.m.SolrMetricManager Closing metric reporters for registry=solr.cluster, tag=null
   [junit4]   2> 250093 INFO  (zkCallback-202-thread-1) [    ] o.a.s.c.c.ZkStateReader Updated live nodes from ZooKeeper... (5) -> (4)
   [junit4]   2> 250093 INFO  (zkCallback-254-thread-1) [    ] o.a.s.c.c.ZkStateReader Updated live nodes from ZooKeeper... (5) -> (4)
   [junit4]   2> 250093 INFO  (zkCallback-269-thread-1) [    ] o.a.s.c.c.ZkStateReader Updated live nodes from ZooKeeper... (5) -> (4)
   [junit4]   2> 250093 INFO  (zkCallback-231-thread-1) [    ] o.a.s.c.c.ZkStateReader Updated live nodes from ZooKeeper... (5) -> (4)
   [junit4]   2> 250093 INFO  (zkCallback-261-thread-1) [    ] o.a.s.c.c.ZkStateReader Updated live nodes from ZooKeeper... (5) -> (4)
   [junit4]   2> 250093 INFO  (zkCallback-246-thread-1) [    ] o.a.s.c.c.ZkStateReader Updated live nodes from ZooKeeper... (5) -> (4)
   [junit4]   2> 250093 INFO  (zkCallback-239-thread-1) [    ] o.a.s.c.c.ZkStateReader Updated live nodes from ZooKeeper... (5) -> (4)
   [junit4]   2> 250094 INFO  (zkCallback-224-thread-1) [    ] o.a.s.c.c.ZkStateReader Updated live nodes from ZooKeeper... (5) -> (4)
   [junit4]   2> 250094 INFO  (zkCallback-276-thread-1) [    ] o.a.s.c.c.ZkStateReader Updated live nodes from ZooKeeper... (5) -> (4)
   [junit4]   2> 250094 INFO  (zkCallback-209-thread-1) [    ] o.a.s.c.c.ZkStateReader Updated live nodes from ZooKeeper... (5) -> (4)
   [junit4]   2> 250130 INFO  (jetty-closer-193-thread-1) [    ] o.a.s.m.SolrMetricManager Closing metric reporters for registry=solr.jvm, tag=null
   [junit4]   2> 250130 INFO  (jetty-closer-193-thread-1) [    ] o.a.s.m.r.SolrJmxReporter Closing reporter [org.apache.solr.metrics.reporters.SolrJmxReporter@4f00562f: rootName = solr_39659, domain = solr.jvm, service url = null, agent id = null] for registry solr.jvm / com.codahale.metrics.MetricRegistry@577ff99c
   [junit4]   2> 250132 INFO  (jetty-closer-193-thread-5) [    ] o.a.s.m.SolrMetricManager Closing metric reporters for registry=solr.jvm, tag=null
   [junit4]   2> 250132 INFO  (jetty-closer-193-thread-5) [    ] o.a.s.m.r.SolrJmxReporter Closing reporter [org.apache.solr.metrics.reporters.SolrJmxReporter@7d712c3: rootName = solr_51689, domain = solr.jvm, service url = null, agent id = null] for registry solr.jvm / com.codahale.metrics.MetricRegistry@577ff99c
   [junit4]   2> 250137 INFO  (jetty-closer-193-thread-2) [    ] o.a.s.m.SolrMetricManager Closing metric reporters for registry=solr.jvm, tag=null
   [junit4]   2> 250137 INFO  (jetty-closer-193-thread-2) [    ] o.a.s.m.r.SolrJmxReporter Closing reporter [org.apache.solr.metrics.reporters.SolrJmxReporter@44d3a075: rootName = solr_54164, domain = solr.jvm, service url = null, agent id = null] for registry solr.jvm / com.codahale.metrics.MetricRegistry@577ff99c
   [junit4]   2> 250139 INFO  (jetty-closer-193-thread-3) [    ] o.a.s.m.SolrMetricManager Closing metric reporters for registry=solr.jvm, tag=null
   [junit4]   2> 250139 INFO  (jetty-closer-193-thread-3) [    ] o.a.s.m.r.SolrJmxReporter Closing reporter [org.apache.solr.metrics.reporters.SolrJmxReporter@1ae9a9b8: rootName = solr_56855, domain = solr.jvm, service url = null, agent id = null] for registry solr.jvm / com.codahale.metrics.MetricRegistry@577ff99c
   [junit4]   2> 250201 INFO  (jetty-closer-193-thread-1) [    ] o.a.s.m.SolrMetricManager Closing metric reporters for registry=solr.jetty, tag=null
   [junit4]   2> 250201 INFO  (jetty-closer-193-thread-1) [    ] o.a.s.m.r.SolrJmxReporter Closing reporter [org.apache.solr.metrics.reporters.SolrJmxReporter@e083038: rootName = solr_39659, domain = solr.jetty, service url = null, agent id = null] for registry solr.jetty / com.codahale.metrics.MetricRegistry@ef444d4
   [junit4]   2> 250203 INFO  (jetty-closer-193-thread-5) [    ] o.a.s.m.SolrMetricManager Closing metric reporters for registry=solr.jetty, tag=null
   [junit4]   2> 250203 INFO  (jetty-closer-193-thread-5) [    ] o.a.s.m.r.SolrJmxReporter Closing reporter [org.apache.solr.metrics.reporters.SolrJmxReporter@1ea92656: rootName = solr_51689, domain = solr.jetty, service url = null, agent id = null] for registry solr.jetty / com.codahale.metrics.MetricRegistry@ef444d4
   [junit4]   2> 250205 INFO  (jetty-closer-193-thread-3) [    ] o.a.s.m.SolrMetricManager Closing metric reporters for registry=solr.jetty, tag=null
   [junit4]   2> 250205 INFO  (jetty-closer-193-thread-3) [    ] o.a.s.m.r.SolrJmxReporter Closing reporter [org.apache.solr.metrics.reporters.SolrJmxReporter@74cf5341: rootName = solr_56855, domain = solr.jetty, service url = null, agent id = null] for registry solr.jetty / com.codahale.metrics.MetricRegistry@ef444d4
   [junit4]   2> 250206 INFO  (jetty-closer-193-thread-2) [    ] o.a.s.m.SolrMetricManager Closing metric reporters for registry=solr.jetty, tag=null
   [junit4]   2> 250206 INFO  (jetty-closer-193-thread-2) [    ] o.a.s.m.r.SolrJmxReporter Closing reporter [org.apache.solr.metrics.reporters.SolrJmxReporter@66246b3c: rootName = solr_54164, domain = solr.jetty, service url = null, agent id = null] for registry solr.jetty / com.codahale.metrics.MetricRegistry@ef444d4
   [junit4]   2> 250213 INFO  (jetty-closer-193-thread-5) [    ] o.a.s.c.ZkController Remove node as live in ZooKeeper:/live_nodes/127.0.0.1:51689_solr
   [junit4]   2> 250213 INFO  (jetty-closer-193-thread-1) [    ] o.a.s.c.ZkController Remove node as live in ZooKeeper:/live_nodes/127.0.0.1:39659_solr
   [junit4]   2> 250215 INFO  (jetty-closer-193-thread-1) [    ] o.a.s.m.SolrMetricManager Closing metric reporters for registry=solr.cluster, tag=null
   [junit4]   2> 250215 INFO  (jetty-closer-193-thread-1) [    ] o.a.s.c.TransientSolrCoreCacheDefault Allocating transient cache for 2147483647 transient cores
   [junit4]   2> 250216 INFO  (jetty-closer-193-thread-1) [    ] o.a.s.c.Overseer Overseer (id=73837505618640899-127.0.0.1:39659_solr-n_0000000000) closing
   [junit4]   2> 250216 INFO  (zkCallback-202-thread-1) [    ] o.a.s.c.c.ZkStateReader Updated live nodes from ZooKeeper... (4) -> (3)
   [junit4]   2> 250216 INFO  (zkCallback-246-thread-1) [    ] o.a.s.c.c.ZkStateReader Updated live nodes from ZooKeeper... (4) -> (3)
   [junit4]   2> 250216 INFO  (zkCallback-231-thread-1) [    ] o.a.s.c.c.ZkStateReader Updated live nodes from ZooKeeper... (4) -> (3)
   [junit4]   2> 250216 INFO  (OverseerStateUpdate-73837505618640899-127.0.0.1:39659_solr-n_0000000000) [    ] o.a.s.c.Overseer Overseer Loop exiting : 127.0.0.1:39659_solr
   [junit4]   2> 250216 INFO  (zkCallback-209-thread-1) [    ] o.a.s.c.c.ZkStateReader Updated live nodes from ZooKeeper... (4) -> (3)
   [junit4]   2> 250216 INFO  (zkCallback-276-thread-1) [    ] o.a.s.c.c.ZkStateReader Updated live nodes from ZooKeeper... (4) -> (3)
   [junit4]   2> 250216 INFO  (zkCallback-239-thread-1) [    ] o.a.s.c.c.ZkStateReader Updated live nodes from ZooKeeper... (4) -> (3)
   [junit4]   2> 250217 INFO  (zkCallback-224-thread-1) [    ] o.a.s.c.c.ZkStateReader Updated live nodes from ZooKeeper... (4) -> (3)
   [junit4]   2> 250225 INFO  (jetty-closer-193-thread-4) [    ] o.e.j.s.h.ContextHandler Stopped o.e.j.s.ServletContextHandler@209ddc17{/solr,null,UNAVAILABLE}
   [junit4]   2> 250261 INFO  (jetty-closer-193-thread-5) [    ] o.a.s.m.SolrMetricManager Closing metric reporters for registry=solr.cluster, tag=null
   [junit4]   2> 250261 WARN  (OverseerAutoScalingTriggerThread-73837505618640899-127.0.0.1:39659_solr-n_0000000000) [    ] o.a.s.c.a.OverseerTriggerThread OverseerTriggerThread woken up but we are closed, exiting.
   [junit4]   2> 250262 INFO  (jetty-closer-193-thread-4) [    ] o.e.j.s.session node0 Stopped scavenging
   [junit4]   2> 250263 INFO  (zkCallback-202-thread-1) [    ] o.a.s.c.c.ZkStateReader Updated live nodes from ZooKeeper... (3) -> (2)
   [junit4]   2> 250263 INFO  (zkCallback-246-thread-1) [    ] o.a.s.c.c.ZkStateReader Updated live nodes from ZooKeeper... (3) -> (2)
   [junit4]   2> 250268 INFO  (zkCallback-269-thread-1) [    ] o.a.s.c.c.ZkStateReader Updated live nodes from ZooKeeper... (4) -> (2)
   [junit4]   2> 250276 INFO  (zkCallback-239-thread-1) [    ] o.a.s.c.c.ZkStateReader Updated live nodes from ZooKeeper... (3) -> (2)
   [junit4]   2> 250276 INFO  (zkCallback-209-thread-1) [    ] o.a.s.c.c.ZkStateReader Updated live nodes from ZooKeeper... (3) -> (2)
   [junit4]   2> 250276 INFO  (zkCallback-231-thread-1) [    ] o.a.s.c.c.ZkStateReader Updated live nodes from ZooKeeper... (3) -> (2)
   [junit4]   2> 250277 INFO  (zkCallback-276-thread-1) [    ] o.a.s.c.c.ZkStateReader Updated live nodes from ZooKeeper... (3) -> (2)
   [junit4]   2> 250279 INFO  (zkCallback-224-thread-1) [    ] o.a.s.c.c.ZkStateReader Updated live nodes from ZooKeeper... (3) -> (2)
   [junit4]   2> 250292 WARN  (NIOServerCxn.Factory:0.0.0.0/0.0.0.0:0) [    ] o.a.z.s.NIOServerCnxn Unable to read additional data from client sessionid 0x10652d1f5800015, likely client has closed socket
   [junit4]   2> 250295 INFO  (jetty-closer-193-thread-3) [    ] o.a.s.c.ZkController Remove node as live in ZooKeeper:/live_nodes/127.0.0.1:56855_solr
   [junit4]   2> 250295 INFO  (jetty-closer-193-thread-2) [    ] o.a.s.c.ZkController Remove node as live in ZooKeeper:/live_nodes/127.0.0.1:54164_solr
   [junit4]   2> 250298 INFO  (jetty-closer-193-thread-2) [    ] o.a.s.m.SolrMetricManager Closing metric reporters for registry=solr.cluster, tag=null
   [junit4]   2> 250298 INFO  (jetty-closer-193-thread-3) [    ] o.a.s.m.SolrMetricManager Closing metric reporters for registry=solr.cluster, tag=null
   [junit4]   2> 250298 WARN  (NIOServerCxn.Factory:0.0.0.0/0.0.0.0:0) [    ] o.a.z.s.NIOServerCnxn Unable to read additional data from client sessionid 0x10652d1f5800003, likely client has closed socket
   [junit4]   2> 250298 INFO  (zkCallback-231-thread-1) [    ] o.a.s.c.c.ZkStateReader Updated live nodes from ZooKeeper... (2) -> (0)
   [junit4]   2> 250298 INFO  (zkCallback-246-thread-1) [    ] o.a.s.c.c.ZkStateReader Updated live nodes from ZooKeeper... (2) -> (0)
   [junit4]   2> 250299 INFO  (zkCallback-239-thread-1) [    ] o.a.s.c.c.ZkStateReader Updated live nodes from ZooKeeper... (2) -> (0)
   [junit4]   2> 250299 INFO  (zkCallback-224-thread-1) [    ] o.a.s.c.OverseerElectionContext I am going to be the leader 127.0.0.1:54164_solr
   [junit4]   2> 250318 INFO  (jetty-closer-193-thread-5) [    ] o.e.j.s.h.ContextHandler Stopped o.e.j.s.ServletContextHandler@5230ef7c{/solr,null,UNAVAILABLE}
   [junit4]   2> 250320 INFO  (jetty-closer-193-thread-5) [    ] o.e.j.s.session node0 Stopped scavenging
   [junit4]   2> 250321 INFO  (jetty-closer-193-thread-1) [    ] o.e.j.s.h.ContextHandler Stopped o.e.j.s.ServletContextHandler@604c064e{/solr,null,UNAVAILABLE}
   [junit4]   2> 250323 WARN  (NIOServerCxn.Factory:0.0.0.0/0.0.0.0:0) [    ] o.a.z.s.NIOServerCnxn Unable to read additional data from client sessionid 0x10652d1f580000e, likely client has closed socket
   [junit4]   2> 250324 INFO  (jetty-closer-193-thread-1) [    ] o.e.j.s.session node0 Stopped scavenging
   [junit4]   2> 250326 WARN  (NIOServerCxn.Factory:0.0.0.0/0.0.0.0:0) [    ] o.a.z.s.NIOServerCnxn Unable to read additional data from client sessionid 0x10652d1f580000d, likely client has closed socket
   [junit4]   2> 250327 INFO  (jetty-closer-193-thread-3) [    ] o.e.j.s.h.ContextHandler Stopped o.e.j.s.ServletContextHandler@740d6e77{/solr,null,UNAVAILABLE}
   [junit4]   2> 250327 INFO  (jetty-closer-193-thread-3) [    ] o.e.j.s.session node0 Stopped scavenging
   [junit4]   2> 250331 WARN  (zkCallback-224-thread-2) [    ] o.a.s.c.c.ZkStateReader ZooKeeper watch triggered, but Solr cannot talk to ZK: [KeeperErrorCode = Session expired for /live_nodes]
   [junit4]   2> 250337 INFO  (jetty-closer-193-thread-2) [    ] o.e.j.s.h.ContextHandler Stopped o.e.j.s.ServletContextHandler@2d12a84e{/solr,null,UNAVAILABLE}
   [junit4]   2> 250337 INFO  (jetty-closer-193-thread-2) [    ] o.e.j.s.session node0 Stopped scavenging
   [junit4]   2> 250345 ERROR (SUITE-NodeAddedTriggerTest-seed#[860FB951B6B7BD4C]-worker) [    ] o.a.z.s.ZooKeeperServer ZKShutdownHandler is not registered, so ZooKeeper server won't take any action on ERROR or SHUTDOWN server state changes
   [junit4]   2> 250345 INFO  (SUITE-NodeAddedTriggerTest-seed#[860FB951B6B7BD4C]-worker) [    ] o.a.s.c.ZkTestServer connecting to 127.0.0.1:58971 58971
   [junit4]   2> 250449 INFO  (Thread-322) [    ] o.a.s.c.ZkTestServer connecting to 127.0.0.1:58971 58971
   [junit4]   2> 250450 WARN  (Thread-322) [    ] o.a.s.c.ZkTestServer Watch limit violations: 
   [junit4]   2> Maximum concurrent create/delete watches above limit:
   [junit4]   2> 
   [junit4]   2> 	13	/solr/aliases.json
   [junit4]   2> 	13	/solr/clusterprops.json
   [junit4]   2> 	6	/solr/security.json
   [junit4]   2> 
   [junit4]   2> Maximum concurrent data watches above limit:
   [junit4]   2> 
   [junit4]   2> 	13	/solr/clusterstate.json
   [junit4]   2> 	2	/solr/overseer_elect/election/73837505618640909-127.0.0.1:56855_solr-n_0000000002
   [junit4]   2> 
   [junit4]   2> Maximum concurrent children watches above limit:
   [junit4]   2> 
   [junit4]   2> 	13	/solr/live_nodes
   [junit4]   2> 	13	/solr/collections
   [junit4]   2> 
   [junit4]   2> NOTE: leaving temporary files on disk at: /x1/jenkins/jenkins-slave/workspace/Lucene-Solr-Tests-master/solr/build/solr-core/test/J1/temp/solr.cloud.autoscaling.NodeAddedTriggerTest_860FB951B6B7BD4C-001
   [junit4]   2> NOTE: test params are: codec=Asserting(Lucene70): {}, docValues:{}, maxPointsInLeafNode=372, maxMBSortInHeap=7.714399632125305, sim=Asserting(org.apache.lucene.search.similarities.AssertingSimilarity@33c7b2ca), locale=vi-VN, timezone=Antarctica/McMurdo
   [junit4]   2> NOTE: Linux 3.13.0-88-generic amd64/Oracle Corporation 1.8.0_172 (64-bit)/cpus=4,threads=1,free=231139448,total=383254528
   [junit4]   2> NOTE: All tests run in this JVM: [BadCopyFieldTest, DistributedFacetPivotWhiteBoxTest, TestLeaderElectionWithEmptyReplica, SortSpecParsingTest, TestExportWriter, TestSchemaManager, TestStressCloudBlindAtomicUpdates, MetricUtilsTest, TestManagedSchemaAPI, AddBlockUpdateTest, CurrencyFieldTypeTest, WrapperMergePolicyFactoryTest, HdfsRecoverLeaseTest, NodeAddedTriggerTest]
   [junit4] Completed [57/807 (1!)] on J1 in 22.85s, 4 tests, 1 failure <<< FAILURES!

[...truncated 1640 lines...]
   [junit4] Suite: org.apache.solr.update.SoftAutoCommitTest
   [junit4]   2> Creating dataDir: /x1/jenkins/jenkins-slave/workspace/Lucene-Solr-Tests-master/solr/build/solr-core/test/J2/temp/solr.update.SoftAutoCommitTest_860FB951B6B7BD4C-001/init-core-data-001
   [junit4]   2> 1957093 WARN  (SUITE-SoftAutoCommitTest-seed#[860FB951B6B7BD4C]-worker) [    ] o.a.s.SolrTestCaseJ4 startTrackingSearchers: numOpens=94 numCloses=94
   [junit4]   2> 1957094 INFO  (SUITE-SoftAutoCommitTest-seed#[860FB951B6B7BD4C]-worker) [    ] o.a.s.SolrTestCaseJ4 Using TrieFields (NUMERIC_POINTS_SYSPROP=false) w/NUMERIC_DOCVALUES_SYSPROP=true
   [junit4]   2> 1957096 INFO  (SUITE-SoftAutoCommitTest-seed#[860FB951B6B7BD4C]-worker) [    ] o.a.s.SolrTestCaseJ4 Randomized ssl (true) and clientAuth (false) via: @org.apache.solr.util.RandomizeSSL(reason=, ssl=NaN, value=NaN, clientAuth=NaN)
   [junit4]   2> 1957198 INFO  (SUITE-SoftAutoCommitTest-seed#[860FB951B6B7BD4C]-worker) [    ] o.a.s.SolrTestCaseJ4 SecureRandom sanity checks: test.solr.allowed.securerandom=null & java.security.egd=file:/dev/./urandom
   [junit4]   2> 1957198 INFO  (SUITE-SoftAutoCommitTest-seed#[860FB951B6B7BD4C]-worker) [    ] o.a.s.SolrTestCaseJ4 ####initCore
   [junit4]   2> 1957199 INFO  (SUITE-SoftAutoCommitTest-seed#[860FB951B6B7BD4C]-worker) [    ] o.a.s.c.SolrResourceLoader [null] Added 2 libs to classloader, from paths: [/x1/jenkins/jenkins-slave/workspace/Lucene-Solr-Tests-master/solr/core/src/test-files/solr/collection1/lib, /x1/jenkins/jenkins-slave/workspace/Lucene-Solr-Tests-master/solr/core/src/test-files/solr/collection1/lib/classes]
   [junit4]   2> 1957237 INFO  (SUITE-SoftAutoCommitTest-seed#[860FB951B6B7BD4C]-worker) [    ] o.a.s.c.SolrConfig Using Lucene MatchVersion: 8.0.0
   [junit4]   2> 1957297 INFO  (SUITE-SoftAutoCommitTest-seed#[860FB951B6B7BD4C]-worker) [    ] o.a.s.s.IndexSchema [null] Schema name=test
   [junit4]   2> 1957443 INFO  (SUITE-SoftAutoCommitTest-seed#[860FB951B6B7BD4C]-worker) [    ] o.a.s.s.IndexSchema Loaded schema test/1.0 with uniqueid field id
   [junit4]   2> 1957506 INFO  (SUITE-SoftAutoCommitTest-seed#[860FB951B6B7BD4C]-worker) [    ] o.a.s.m.r.SolrJmxReporter JMX monitoring for 'solr.node' (registry 'solr.node') enabled at server: com.sun.jmx.mbeanserver.JmxMBeanServer@2249d245
   [junit4]   2> 1957517 INFO  (SUITE-SoftAutoCommitTest-seed#[860FB951B6B7BD4C]-worker) [    ] o.a.s.m.r.SolrJmxReporter JMX monitoring for 'solr.jvm' (registry 'solr.jvm') enabled at server: com.sun.jmx.mbeanserver.JmxMBeanServer@2249d245
   [junit4]   2> 1957517 INFO  (SUITE-SoftAutoCommitTest-seed#[860FB951B6B7BD4C]-worker) [    ] o.a.s.m.r.SolrJmxReporter JMX monitoring for 'solr.jetty' (registry 'solr.jetty') enabled at server: com.sun.jmx.mbeanserver.JmxMBeanServer@2249d245
   [junit4]   2> 1957585 INFO  (coreLoadExecutor-4455-thread-1) [    ] o.a.s.c.TransientSolrCoreCacheDefault Allocating transient cache for 2147483647 transient cores
   [junit4]   2> 1957586 INFO  (coreLoadExecutor-4455-thread-1) [    x:collection1] o.a.s.c.SolrResourceLoader [null] Added 2 libs to classloader, from paths: [/x1/jenkins/jenkins-slave/workspace/Lucene-Solr-Tests-master/solr/core/src/test-files/solr/collection1/lib, /x1/jenkins/jenkins-slave/workspace/Lucene-Solr-Tests-master/solr/core/src/test-files/solr/collection1/lib/classes]
   [junit4]   2> 1957753 INFO  (coreLoadExecutor-4455-thread-1) [    x:collection1] o.a.s.c.SolrConfig Using Lucene MatchVersion: 8.0.0
   [junit4]   2> 1957783 INFO  (coreLoadExecutor-4455-thread-1) [    x:collection1] o.a.s.s.IndexSchema [collection1] Schema name=test
   [junit4]   2> 1958010 INFO  (coreLoadExecutor-4455-thread-1) [    x:collection1] o.a.s.s.IndexSchema Loaded schema test/1.0 with uniqueid field id
   [junit4]   2> 1958028 INFO  (coreLoadExecutor-4455-thread-1) [    x:collection1] o.a.s.c.CoreContainer Creating SolrCore 'collection1' using configuration from instancedir /x1/jenkins/jenkins-slave/workspace/Lucene-Solr-Tests-master/solr/core/src/test-files/solr/collection1, trusted=true
   [junit4]   2> 1958028 INFO  (coreLoadExecutor-4455-thread-1) [    x:collection1] o.a.s.m.r.SolrJmxReporter JMX monitoring for 'solr.core.collection1' (registry 'solr.core.collection1') enabled at server: com.sun.jmx.mbeanserver.JmxMBeanServer@2249d245
   [junit4]   2> 1958028 INFO  (coreLoadExecutor-4455-thread-1) [    x:collection1] o.a.s.c.SolrCore solr.RecoveryStrategy.Builder
   [junit4]   2> 1958028 INFO  (coreLoadExecutor-4455-thread-1) [    x:collection1] o.a.s.c.SolrCore [[collection1] ] Opening new SolrCore at [/x1/jenkins/jenkins-slave/workspace/Lucene-Solr-Tests-master/solr/core/src/test-files/solr/collection1], dataDir=[/x1/jenkins/jenkins-slave/workspace/Lucene-Solr-Tests-master/solr/build/solr-core/test/J2/temp/solr.update.SoftAutoCommitTest_860FB951B6B7BD4C-001/init-core-data-001/]
   [junit4]   2> 1958040 INFO  (coreLoadExecutor-4455-thread-1) [    x:collection1] o.a.s.u.RandomMergePolicy RandomMergePolicy wrapping class org.apache.lucene.index.TieredMergePolicy: [TieredMergePolicy: maxMergeAtOnce=47, maxMergeAtOnceExplicit=20, maxMergedSegmentMB=72.6708984375, floorSegmentMB=0.5771484375, forceMergeDeletesPctAllowed=16.645500036705094, segmentsPerTier=44.0, maxCFSSegmentSizeMB=8.796093022207999E12, noCFSRatio=0.0
   [junit4]   2> 1958236 INFO  (coreLoadExecutor-4455-thread-1) [    x:collection1] o.a.s.u.UpdateHandler Using UpdateLog implementation: org.apache.solr.update.UpdateLog
   [junit4]   2> 1958236 INFO  (coreLoadExecutor-4455-thread-1) [    x:collection1] o.a.s.u.UpdateLog Initializing UpdateLog: dataDir= defaultSyncLevel=FLUSH numRecordsToKeep=100 maxNumLogsToKeep=10 numVersionBuckets=65536
   [junit4]   2> 1958237 INFO  (coreLoadExecutor-4455-thread-1) [    x:collection1] o.a.s.u.CommitTracker Hard AutoCommit: disabled
   [junit4]   2> 1958237 INFO  (coreLoadExecutor-4455-thread-1) [    x:collection1] o.a.s.u.CommitTracker Soft AutoCommit: disabled
   [junit4]   2> 1958239 INFO  (coreLoadExecutor-4455-thread-1) [    x:collection1] o.a.s.u.RandomMergePolicy RandomMergePolicy wrapping class org.apache.lucene.index.TieredMergePolicy: [TieredMergePolicy: maxMergeAtOnce=33, maxMergeAtOnceExplicit=15, maxMergedSegmentMB=1.9619140625, floorSegmentMB=1.5673828125, forceMergeDeletesPctAllowed=24.454918260096704, segmentsPerTier=12.0, maxCFSSegmentSizeMB=8.796093022207999E12, noCFSRatio=0.5885758209357294
   [junit4]   2> 1958239 INFO  (coreLoadExecutor-4455-thread-1) [    x:collection1] o.a.s.s.SolrIndexSearcher Opening [Searcher@3ed00825[collection1] main]
   [junit4]   2> 1958240 INFO  (coreLoadExecutor-4455-thread-1) [    x:collection1] o.a.s.h.c.SpellCheckComponent Initializing spell checkers
   [junit4]   2> 1958247 INFO  (coreLoadExecutor-4455-thread-1) [    x:collection1] o.a.s.s.DirectSolrSpellChecker init: {name=direct,classname=DirectSolrSpellChecker,field=lowerfilt,minQueryLength=3}
   [junit4]   2> 1958287 INFO  (coreLoadExecutor-4455-thread-1) [    x:collection1] o.a.s.h.ReplicationHandler Commits will be reserved for 10000ms.
   [junit4]   2> 1958287 INFO  (searcherExecutor-4456-thread-1-processing-x:collection1) [    x:collection1] o.a.s.h.c.SpellCheckComponent Loading spell index for spellchecker: default
   [junit4]   2> 1958287 INFO  (searcherExecutor-4456-thread-1-processing-x:collection1) [    x:collection1] o.a.s.h.c.SpellCheckComponent Loading spell i

[...truncated too long message...]

pace/Lucene-Solr-Tests-master/lucene/top-level-ivy-settings.xml

resolve:

ivy-availability-check:
[loadresource] Do not set property disallowed.ivy.jars.list as its length is 0.

-ivy-fail-disallowed-ivy-version:

ivy-fail:

ivy-configure:
[ivy:configure] :: loading settings :: file = /x1/jenkins/jenkins-slave/workspace/Lucene-Solr-Tests-master/lucene/top-level-ivy-settings.xml

resolve:

ivy-availability-check:
[loadresource] Do not set property disallowed.ivy.jars.list as its length is 0.

-ivy-fail-disallowed-ivy-version:

ivy-fail:

ivy-configure:
[ivy:configure] :: loading settings :: file = /x1/jenkins/jenkins-slave/workspace/Lucene-Solr-Tests-master/lucene/top-level-ivy-settings.xml

resolve:

ivy-availability-check:
[loadresource] Do not set property disallowed.ivy.jars.list as its length is 0.

-ivy-fail-disallowed-ivy-version:

ivy-fail:

ivy-configure:
[ivy:configure] :: loading settings :: file = /x1/jenkins/jenkins-slave/workspace/Lucene-Solr-Tests-master/lucene/top-level-ivy-settings.xml

resolve:

ivy-availability-check:
[loadresource] Do not set property disallowed.ivy.jars.list as its length is 0.

-ivy-fail-disallowed-ivy-version:

ivy-fail:

ivy-configure:
[ivy:configure] :: loading settings :: file = /x1/jenkins/jenkins-slave/workspace/Lucene-Solr-Tests-master/lucene/top-level-ivy-settings.xml

resolve:

jar-checksums:
    [mkdir] Created dir: /x1/jenkins/jenkins-slave/workspace/Lucene-Solr-Tests-master/lucene/null734097861
     [copy] Copying 39 files to /x1/jenkins/jenkins-slave/workspace/Lucene-Solr-Tests-master/lucene/null734097861
   [delete] Deleting directory /x1/jenkins/jenkins-slave/workspace/Lucene-Solr-Tests-master/lucene/null734097861

resolve-example:

ivy-availability-check:
[loadresource] Do not set property disallowed.ivy.jars.list as its length is 0.

-ivy-fail-disallowed-ivy-version:

ivy-fail:

ivy-configure:
[ivy:configure] :: loading settings :: file = /x1/jenkins/jenkins-slave/workspace/Lucene-Solr-Tests-master/lucene/top-level-ivy-settings.xml

resolve:

resolve-server:

ivy-availability-check:
[loadresource] Do not set property disallowed.ivy.jars.list as its length is 0.

-ivy-fail-disallowed-ivy-version:

ivy-fail:

ivy-fail:

ivy-configure:
[ivy:configure] :: loading settings :: file = /x1/jenkins/jenkins-slave/workspace/Lucene-Solr-Tests-master/lucene/top-level-ivy-settings.xml

resolve:

resolve:

ivy-availability-check:
[loadresource] Do not set property disallowed.ivy.jars.list as its length is 0.

-ivy-fail-disallowed-ivy-version:

ivy-fail:

ivy-fail:

ivy-configure:
[ivy:configure] :: loading settings :: file = /x1/jenkins/jenkins-slave/workspace/Lucene-Solr-Tests-master/lucene/top-level-ivy-settings.xml

resolve:

ivy-availability-check:
[loadresource] Do not set property disallowed.ivy.jars.list as its length is 0.

-ivy-fail-disallowed-ivy-version:

ivy-fail:

ivy-fail:

ivy-configure:
[ivy:configure] :: loading settings :: file = /x1/jenkins/jenkins-slave/workspace/Lucene-Solr-Tests-master/lucene/top-level-ivy-settings.xml

resolve:

ivy-availability-check:
[loadresource] Do not set property disallowed.ivy.jars.list as its length is 0.

-ivy-fail-disallowed-ivy-version:

ivy-fail:

ivy-configure:
[ivy:configure] :: loading settings :: file = /x1/jenkins/jenkins-slave/workspace/Lucene-Solr-Tests-master/lucene/top-level-ivy-settings.xml

resolve:

ivy-availability-check:
[loadresource] Do not set property disallowed.ivy.jars.list as its length is 0.

-ivy-fail-disallowed-ivy-version:

ivy-fail:

ivy-fail:

ivy-configure:
[ivy:configure] :: loading settings :: file = /x1/jenkins/jenkins-slave/workspace/Lucene-Solr-Tests-master/lucene/top-level-ivy-settings.xml

resolve:

ivy-availability-check:
[loadresource] Do not set property disallowed.ivy.jars.list as its length is 0.

-ivy-fail-disallowed-ivy-version:

ivy-fail:

ivy-configure:
[ivy:configure] :: loading settings :: file = /x1/jenkins/jenkins-slave/workspace/Lucene-Solr-Tests-master/lucene/top-level-ivy-settings.xml

resolve:

ivy-availability-check:
[loadresource] Do not set property disallowed.ivy.jars.list as its length is 0.

-ivy-fail-disallowed-ivy-version:

ivy-fail:

ivy-fail:

ivy-configure:
[ivy:configure] :: loading settings :: file = /x1/jenkins/jenkins-slave/workspace/Lucene-Solr-Tests-master/lucene/top-level-ivy-settings.xml

resolve:

ivy-availability-check:
[loadresource] Do not set property disallowed.ivy.jars.list as its length is 0.

-ivy-fail-disallowed-ivy-version:

ivy-fail:

ivy-fail:

ivy-configure:
[ivy:configure] :: loading settings :: file = /x1/jenkins/jenkins-slave/workspace/Lucene-Solr-Tests-master/lucene/top-level-ivy-settings.xml

resolve:

ivy-availability-check:
[loadresource] Do not set property disallowed.ivy.jars.list as its length is 0.

-ivy-fail-disallowed-ivy-version:

ivy-fail:

ivy-fail:

ivy-configure:
[ivy:configure] :: loading settings :: file = /x1/jenkins/jenkins-slave/workspace/Lucene-Solr-Tests-master/lucene/top-level-ivy-settings.xml

resolve:

ivy-availability-check:
[loadresource] Do not set property disallowed.ivy.jars.list as its length is 0.

-ivy-fail-disallowed-ivy-version:

ivy-fail:

ivy-fail:

ivy-configure:
[ivy:configure] :: loading settings :: file = /x1/jenkins/jenkins-slave/workspace/Lucene-Solr-Tests-master/lucene/top-level-ivy-settings.xml

resolve:

ivy-availability-check:
[loadresource] Do not set property disallowed.ivy.jars.list as its length is 0.

-ivy-fail-disallowed-ivy-version:

ivy-fail:

ivy-fail:

ivy-configure:
[ivy:configure] :: loading settings :: file = /x1/jenkins/jenkins-slave/workspace/Lucene-Solr-Tests-master/lucene/top-level-ivy-settings.xml

resolve:

ivy-availability-check:
[loadresource] Do not set property disallowed.ivy.jars.list as its length is 0.

-ivy-fail-disallowed-ivy-version:

ivy-fail:

ivy-fail:

ivy-configure:
[ivy:configure] :: loading settings :: file = /x1/jenkins/jenkins-slave/workspace/Lucene-Solr-Tests-master/lucene/top-level-ivy-settings.xml

resolve:

ivy-availability-check:
[loadresource] Do not set property disallowed.ivy.jars.list as its length is 0.

-ivy-fail-disallowed-ivy-version:

ivy-fail:

ivy-fail:

ivy-configure:
[ivy:configure] :: loading settings :: file = /x1/jenkins/jenkins-slave/workspace/Lucene-Solr-Tests-master/lucene/top-level-ivy-settings.xml

resolve:

ivy-availability-check:
[loadresource] Do not set property disallowed.ivy.jars.list as its length is 0.

-ivy-fail-disallowed-ivy-version:

ivy-fail:

ivy-fail:

ivy-configure:
[ivy:configure] :: loading settings :: file = /x1/jenkins/jenkins-slave/workspace/Lucene-Solr-Tests-master/lucene/top-level-ivy-settings.xml

resolve:

ivy-availability-check:
[loadresource] Do not set property disallowed.ivy.jars.list as its length is 0.

-ivy-fail-disallowed-ivy-version:

ivy-fail:

ivy-fail:

ivy-configure:
[ivy:configure] :: loading settings :: file = /x1/jenkins/jenkins-slave/workspace/Lucene-Solr-Tests-master/lucene/top-level-ivy-settings.xml

resolve:

ivy-availability-check:
[loadresource] Do not set property disallowed.ivy.jars.list as its length is 0.

-ivy-fail-disallowed-ivy-version:

ivy-fail:

ivy-fail:

ivy-configure:
[ivy:configure] :: loading settings :: file = /x1/jenkins/jenkins-slave/workspace/Lucene-Solr-Tests-master/lucene/top-level-ivy-settings.xml

resolve:

ivy-availability-check:
[loadresource] Do not set property disallowed.ivy.jars.list as its length is 0.

-ivy-fail-disallowed-ivy-version:

ivy-fail:

ivy-fail:

ivy-configure:
[ivy:configure] :: loading settings :: file = /x1/jenkins/jenkins-slave/workspace/Lucene-Solr-Tests-master/lucene/top-level-ivy-settings.xml

resolve:

jar-checksums:
    [mkdir] Created dir: /x1/jenkins/jenkins-slave/workspace/Lucene-Solr-Tests-master/solr/null1289737012
     [copy] Copying 246 files to /x1/jenkins/jenkins-slave/workspace/Lucene-Solr-Tests-master/solr/null1289737012
   [delete] Deleting directory /x1/jenkins/jenkins-slave/workspace/Lucene-Solr-Tests-master/solr/null1289737012

check-working-copy:
[ivy:cachepath] :: resolving dependencies :: org.eclipse.jgit#org.eclipse.jgit-caller;working
[ivy:cachepath] 	confs: [default]
[ivy:cachepath] 	found org.eclipse.jgit#org.eclipse.jgit;4.6.0.201612231935-r in public
[ivy:cachepath] 	found com.jcraft#jsch;0.1.53 in public
[ivy:cachepath] 	found com.googlecode.javaewah#JavaEWAH;1.1.6 in public
[ivy:cachepath] 	found org.apache.httpcomponents#httpclient;4.3.6 in public
[ivy:cachepath] 	found org.apache.httpcomponents#httpcore;4.3.3 in public
[ivy:cachepath] 	found commons-logging#commons-logging;1.1.3 in public
[ivy:cachepath] 	found commons-codec#commons-codec;1.6 in public
[ivy:cachepath] 	found org.slf4j#slf4j-api;1.7.2 in public
[ivy:cachepath] :: resolution report :: resolve 46ms :: artifacts dl 1ms
	---------------------------------------------------------------------
	|                  |            modules            ||   artifacts   |
	|       conf       | number| search|dwnlded|evicted|| number|dwnlded|
	---------------------------------------------------------------------
	|      default     |   8   |   0   |   0   |   0   ||   8   |   0   |
	---------------------------------------------------------------------
[wc-checker] Initializing working copy...
[wc-checker] SLF4J: Failed to load class "org.slf4j.impl.StaticLoggerBinder".
[wc-checker] SLF4J: Defaulting to no-operation (NOP) logger implementation
[wc-checker] SLF4J: See http://www.slf4j.org/codes.html#StaticLoggerBinder for further details.
[wc-checker] Checking working copy status...

-jenkins-base:

BUILD SUCCESSFUL
Total time: 153 minutes 58 seconds
Archiving artifacts
WARN: No artifacts found that match the file pattern "**/*.events,heapdumps/**,**/hs_err_pid*". Configuration error?
WARN: java.lang.InterruptedException: no matches found within 10000
Recording test results
Build step 'Publish JUnit test result report' changed build result to UNSTABLE
Email was triggered for: Unstable (Test Failures)
Sending email for trigger: Unstable (Test Failures)

Mime
View raw message