lucene-dev mailing list archives

Site index · List index
Message view « Date » · « Thread »
Top « Date » · « Thread »
From Policeman Jenkins Server <jenk...@thetaphi.de>
Subject [JENKINS-EA] Lucene-Solr-master-Linux (64bit/jdk-11-ea+5) - Build # 22020 - Unstable!
Date Wed, 16 May 2018 14:43:53 GMT
Build: https://jenkins.thetaphi.de/job/Lucene-Solr-master-Linux/22020/
Java: 64bit/jdk-11-ea+5 -XX:+UseCompressedOops -XX:+UseConcMarkSweepGC

2 tests failed.
FAILED:  org.apache.solr.cloud.TestCloudConsistency.testOutOfSyncReplicasCannotBecomeLeader

Error Message:
Doc with id=4 not found in https://127.0.0.1:45671/solr/outOfSyncReplicasCannotBecomeLeader-false due to: Path not found: /id; rsp={doc=null}

Stack Trace:
java.lang.AssertionError: Doc with id=4 not found in https://127.0.0.1:45671/solr/outOfSyncReplicasCannotBecomeLeader-false due to: Path not found: /id; rsp={doc=null}
	at __randomizedtesting.SeedInfo.seed([B7710365847F9DD:759C30269B20F6E7]:0)
	at org.junit.Assert.fail(Assert.java:93)
	at org.junit.Assert.assertTrue(Assert.java:43)
	at org.apache.solr.cloud.TestCloudConsistency.assertDocExists(TestCloudConsistency.java:252)
	at org.apache.solr.cloud.TestCloudConsistency.assertDocsExistInAllReplicas(TestCloudConsistency.java:236)
	at org.apache.solr.cloud.TestCloudConsistency.testOutOfSyncReplicasCannotBecomeLeader(TestCloudConsistency.java:129)
	at org.apache.solr.cloud.TestCloudConsistency.testOutOfSyncReplicasCannotBecomeLeader(TestCloudConsistency.java:92)
	at java.base/jdk.internal.reflect.NativeMethodAccessorImpl.invoke0(Native Method)
	at java.base/jdk.internal.reflect.NativeMethodAccessorImpl.invoke(NativeMethodAccessorImpl.java:62)
	at java.base/jdk.internal.reflect.DelegatingMethodAccessorImpl.invoke(DelegatingMethodAccessorImpl.java:43)
	at java.base/java.lang.reflect.Method.invoke(Method.java:564)
	at com.carrotsearch.randomizedtesting.RandomizedRunner.invoke(RandomizedRunner.java:1737)
	at com.carrotsearch.randomizedtesting.RandomizedRunner$8.evaluate(RandomizedRunner.java:934)
	at com.carrotsearch.randomizedtesting.RandomizedRunner$9.evaluate(RandomizedRunner.java:970)
	at com.carrotsearch.randomizedtesting.RandomizedRunner$10.evaluate(RandomizedRunner.java:984)
	at com.carrotsearch.randomizedtesting.rules.SystemPropertiesRestoreRule$1.evaluate(SystemPropertiesRestoreRule.java:57)
	at org.apache.lucene.util.TestRuleSetupTeardownChained$1.evaluate(TestRuleSetupTeardownChained.java:49)
	at org.apache.lucene.util.AbstractBeforeAfterRule$1.evaluate(AbstractBeforeAfterRule.java:45)
	at org.apache.lucene.util.TestRuleThreadAndTestName$1.evaluate(TestRuleThreadAndTestName.java:48)
	at org.apache.lucene.util.TestRuleIgnoreAfterMaxFailures$1.evaluate(TestRuleIgnoreAfterMaxFailures.java:64)
	at org.apache.lucene.util.TestRuleMarkFailure$1.evaluate(TestRuleMarkFailure.java:47)
	at com.carrotsearch.randomizedtesting.rules.StatementAdapter.evaluate(StatementAdapter.java:36)
	at com.carrotsearch.randomizedtesting.ThreadLeakControl$StatementRunner.run(ThreadLeakControl.java:368)
	at com.carrotsearch.randomizedtesting.ThreadLeakControl.forkTimeoutingTask(ThreadLeakControl.java:817)
	at com.carrotsearch.randomizedtesting.ThreadLeakControl$3.evaluate(ThreadLeakControl.java:468)
	at com.carrotsearch.randomizedtesting.RandomizedRunner.runSingleTest(RandomizedRunner.java:943)
	at com.carrotsearch.randomizedtesting.RandomizedRunner$5.evaluate(RandomizedRunner.java:829)
	at com.carrotsearch.randomizedtesting.RandomizedRunner$6.evaluate(RandomizedRunner.java:879)
	at com.carrotsearch.randomizedtesting.RandomizedRunner$7.evaluate(RandomizedRunner.java:890)
	at com.carrotsearch.randomizedtesting.rules.StatementAdapter.evaluate(StatementAdapter.java:36)
	at com.carrotsearch.randomizedtesting.rules.SystemPropertiesRestoreRule$1.evaluate(SystemPropertiesRestoreRule.java:57)
	at org.apache.lucene.util.AbstractBeforeAfterRule$1.evaluate(AbstractBeforeAfterRule.java:45)
	at com.carrotsearch.randomizedtesting.rules.StatementAdapter.evaluate(StatementAdapter.java:36)
	at org.apache.lucene.util.TestRuleStoreClassName$1.evaluate(TestRuleStoreClassName.java:41)
	at com.carrotsearch.randomizedtesting.rules.NoShadowingOrOverridesOnMethodsRule$1.evaluate(NoShadowingOrOverridesOnMethodsRule.java:40)
	at com.carrotsearch.randomizedtesting.rules.NoShadowingOrOverridesOnMethodsRule$1.evaluate(NoShadowingOrOverridesOnMethodsRule.java:40)
	at com.carrotsearch.randomizedtesting.rules.StatementAdapter.evaluate(StatementAdapter.java:36)
	at com.carrotsearch.randomizedtesting.rules.StatementAdapter.evaluate(StatementAdapter.java:36)
	at org.apache.lucene.util.TestRuleAssertionsRequired$1.evaluate(TestRuleAssertionsRequired.java:53)
	at org.apache.lucene.util.TestRuleMarkFailure$1.evaluate(TestRuleMarkFailure.java:47)
	at org.apache.lucene.util.TestRuleIgnoreAfterMaxFailures$1.evaluate(TestRuleIgnoreAfterMaxFailures.java:64)
	at org.apache.lucene.util.TestRuleIgnoreTestSuites$1.evaluate(TestRuleIgnoreTestSuites.java:54)
	at com.carrotsearch.randomizedtesting.rules.StatementAdapter.evaluate(StatementAdapter.java:36)
	at com.carrotsearch.randomizedtesting.ThreadLeakControl$StatementRunner.run(ThreadLeakControl.java:368)
	at java.base/java.lang.Thread.run(Thread.java:841)


FAILED:  org.apache.solr.update.TestInPlaceUpdatesDistrib.test

Error Message:
This doc was supposed to have been deleted, but was: SolrDocument{id=1, inplace_updatable_float=2.0, _version_=1600631110448971777, inplace_updatable_int_with_default=666, inplace_updatable_float_with_default=42.0}

Stack Trace:
java.lang.AssertionError: This doc was supposed to have been deleted, but was: SolrDocument{id=1, inplace_updatable_float=2.0, _version_=1600631110448971777, inplace_updatable_int_with_default=666, inplace_updatable_float_with_default=42.0}
	at __randomizedtesting.SeedInfo.seed([B7710365847F9DD:83232FECF6BB9425]:0)
	at org.junit.Assert.fail(Assert.java:93)
	at org.junit.Assert.assertTrue(Assert.java:43)
	at org.junit.Assert.assertNull(Assert.java:551)
	at org.apache.solr.update.TestInPlaceUpdatesDistrib.delayedReorderingFetchesMissingUpdateFromLeaderTest(TestInPlaceUpdatesDistrib.java:972)
	at org.apache.solr.update.TestInPlaceUpdatesDistrib.test(TestInPlaceUpdatesDistrib.java:147)
	at java.base/jdk.internal.reflect.NativeMethodAccessorImpl.invoke0(Native Method)
	at java.base/jdk.internal.reflect.NativeMethodAccessorImpl.invoke(NativeMethodAccessorImpl.java:62)
	at java.base/jdk.internal.reflect.DelegatingMethodAccessorImpl.invoke(DelegatingMethodAccessorImpl.java:43)
	at java.base/java.lang.reflect.Method.invoke(Method.java:564)
	at com.carrotsearch.randomizedtesting.RandomizedRunner.invoke(RandomizedRunner.java:1737)
	at com.carrotsearch.randomizedtesting.RandomizedRunner$8.evaluate(RandomizedRunner.java:934)
	at com.carrotsearch.randomizedtesting.RandomizedRunner$9.evaluate(RandomizedRunner.java:970)
	at com.carrotsearch.randomizedtesting.RandomizedRunner$10.evaluate(RandomizedRunner.java:984)
	at org.apache.solr.BaseDistributedSearchTestCase$ShardsRepeatRule$ShardsFixedStatement.callStatement(BaseDistributedSearchTestCase.java:993)
	at org.apache.solr.BaseDistributedSearchTestCase$ShardsRepeatRule$ShardsStatement.evaluate(BaseDistributedSearchTestCase.java:968)
	at com.carrotsearch.randomizedtesting.rules.SystemPropertiesRestoreRule$1.evaluate(SystemPropertiesRestoreRule.java:57)
	at org.apache.lucene.util.TestRuleSetupTeardownChained$1.evaluate(TestRuleSetupTeardownChained.java:49)
	at org.apache.lucene.util.AbstractBeforeAfterRule$1.evaluate(AbstractBeforeAfterRule.java:45)
	at org.apache.lucene.util.TestRuleThreadAndTestName$1.evaluate(TestRuleThreadAndTestName.java:48)
	at org.apache.lucene.util.TestRuleIgnoreAfterMaxFailures$1.evaluate(TestRuleIgnoreAfterMaxFailures.java:64)
	at org.apache.lucene.util.TestRuleMarkFailure$1.evaluate(TestRuleMarkFailure.java:47)
	at com.carrotsearch.randomizedtesting.rules.StatementAdapter.evaluate(StatementAdapter.java:36)
	at com.carrotsearch.randomizedtesting.ThreadLeakControl$StatementRunner.run(ThreadLeakControl.java:368)
	at com.carrotsearch.randomizedtesting.ThreadLeakControl.forkTimeoutingTask(ThreadLeakControl.java:817)
	at com.carrotsearch.randomizedtesting.ThreadLeakControl$3.evaluate(ThreadLeakControl.java:468)
	at com.carrotsearch.randomizedtesting.RandomizedRunner.runSingleTest(RandomizedRunner.java:943)
	at com.carrotsearch.randomizedtesting.RandomizedRunner$5.evaluate(RandomizedRunner.java:829)
	at com.carrotsearch.randomizedtesting.RandomizedRunner$6.evaluate(RandomizedRunner.java:879)
	at com.carrotsearch.randomizedtesting.RandomizedRunner$7.evaluate(RandomizedRunner.java:890)
	at com.carrotsearch.randomizedtesting.rules.StatementAdapter.evaluate(StatementAdapter.java:36)
	at com.carrotsearch.randomizedtesting.rules.SystemPropertiesRestoreRule$1.evaluate(SystemPropertiesRestoreRule.java:57)
	at org.apache.lucene.util.AbstractBeforeAfterRule$1.evaluate(AbstractBeforeAfterRule.java:45)
	at com.carrotsearch.randomizedtesting.rules.StatementAdapter.evaluate(StatementAdapter.java:36)
	at org.apache.lucene.util.TestRuleStoreClassName$1.evaluate(TestRuleStoreClassName.java:41)
	at com.carrotsearch.randomizedtesting.rules.NoShadowingOrOverridesOnMethodsRule$1.evaluate(NoShadowingOrOverridesOnMethodsRule.java:40)
	at com.carrotsearch.randomizedtesting.rules.NoShadowingOrOverridesOnMethodsRule$1.evaluate(NoShadowingOrOverridesOnMethodsRule.java:40)
	at com.carrotsearch.randomizedtesting.rules.StatementAdapter.evaluate(StatementAdapter.java:36)
	at com.carrotsearch.randomizedtesting.rules.StatementAdapter.evaluate(StatementAdapter.java:36)
	at org.apache.lucene.util.TestRuleAssertionsRequired$1.evaluate(TestRuleAssertionsRequired.java:53)
	at org.apache.lucene.util.TestRuleMarkFailure$1.evaluate(TestRuleMarkFailure.java:47)
	at org.apache.lucene.util.TestRuleIgnoreAfterMaxFailures$1.evaluate(TestRuleIgnoreAfterMaxFailures.java:64)
	at org.apache.lucene.util.TestRuleIgnoreTestSuites$1.evaluate(TestRuleIgnoreTestSuites.java:54)
	at com.carrotsearch.randomizedtesting.rules.StatementAdapter.evaluate(StatementAdapter.java:36)
	at com.carrotsearch.randomizedtesting.ThreadLeakControl$StatementRunner.run(ThreadLeakControl.java:368)
	at java.base/java.lang.Thread.run(Thread.java:841)




Build Log:
[...truncated 1875 lines...]
   [junit4] JVM J2: stderr was not empty, see: /home/jenkins/workspace/Lucene-Solr-master-Linux/lucene/build/core/test/temp/junit4-J2-20180516_133130_7878434667861568572163.syserr
   [junit4] >>> JVM J2 emitted unexpected output (verbatim) ----
   [junit4] OpenJDK 64-Bit Server VM warning: Option UseConcMarkSweepGC was deprecated in version 9.0 and will likely be removed in a future release.
   [junit4] <<< JVM J2: EOF ----

   [junit4] JVM J0: stderr was not empty, see: /home/jenkins/workspace/Lucene-Solr-master-Linux/lucene/build/core/test/temp/junit4-J0-20180516_133130_78714987075497152008984.syserr
   [junit4] >>> JVM J0 emitted unexpected output (verbatim) ----
   [junit4] OpenJDK 64-Bit Server VM warning: Option UseConcMarkSweepGC was deprecated in version 9.0 and will likely be removed in a future release.
   [junit4] <<< JVM J0: EOF ----

[...truncated 3 lines...]
   [junit4] JVM J1: stderr was not empty, see: /home/jenkins/workspace/Lucene-Solr-master-Linux/lucene/build/core/test/temp/junit4-J1-20180516_133130_7879106306718470790701.syserr
   [junit4] >>> JVM J1 emitted unexpected output (verbatim) ----
   [junit4] OpenJDK 64-Bit Server VM warning: Option UseConcMarkSweepGC was deprecated in version 9.0 and will likely be removed in a future release.
   [junit4] <<< JVM J1: EOF ----

[...truncated 275 lines...]
   [junit4] JVM J0: stderr was not empty, see: /home/jenkins/workspace/Lucene-Solr-master-Linux/lucene/build/test-framework/test/temp/junit4-J0-20180516_134023_7386629795307884456753.syserr
   [junit4] >>> JVM J0 emitted unexpected output (verbatim) ----
   [junit4] OpenJDK 64-Bit Server VM warning: Option UseConcMarkSweepGC was deprecated in version 9.0 and will likely be removed in a future release.
   [junit4] <<< JVM J0: EOF ----

[...truncated 23 lines...]
   [junit4] JVM J2: stderr was not empty, see: /home/jenkins/workspace/Lucene-Solr-master-Linux/lucene/build/test-framework/test/temp/junit4-J2-20180516_134023_7387416636437216520316.syserr
   [junit4] >>> JVM J2 emitted unexpected output (verbatim) ----
   [junit4] OpenJDK 64-Bit Server VM warning: Option UseConcMarkSweepGC was deprecated in version 9.0 and will likely be removed in a future release.
   [junit4] <<< JVM J2: EOF ----

[...truncated 3 lines...]
   [junit4] JVM J1: stderr was not empty, see: /home/jenkins/workspace/Lucene-Solr-master-Linux/lucene/build/test-framework/test/temp/junit4-J1-20180516_134023_7383806550768706249660.syserr
   [junit4] >>> JVM J1 emitted unexpected output (verbatim) ----
   [junit4] OpenJDK 64-Bit Server VM warning: Option UseConcMarkSweepGC was deprecated in version 9.0 and will likely be removed in a future release.
   [junit4] <<< JVM J1: EOF ----

[...truncated 1075 lines...]
   [junit4] JVM J1: stderr was not empty, see: /home/jenkins/workspace/Lucene-Solr-master-Linux/lucene/build/analysis/common/test/temp/junit4-J1-20180516_134144_4455824695865262364094.syserr
   [junit4] >>> JVM J1 emitted unexpected output (verbatim) ----
   [junit4] OpenJDK 64-Bit Server VM warning: Option UseConcMarkSweepGC was deprecated in version 9.0 and will likely be removed in a future release.
   [junit4] <<< JVM J1: EOF ----

[...truncated 3 lines...]
   [junit4] JVM J2: stderr was not empty, see: /home/jenkins/workspace/Lucene-Solr-master-Linux/lucene/build/analysis/common/test/temp/junit4-J2-20180516_134144_4452750078527632647746.syserr
   [junit4] >>> JVM J2 emitted unexpected output (verbatim) ----
   [junit4] OpenJDK 64-Bit Server VM warning: Option UseConcMarkSweepGC was deprecated in version 9.0 and will likely be removed in a future release.
   [junit4] <<< JVM J2: EOF ----

[...truncated 3 lines...]
   [junit4] JVM J0: stderr was not empty, see: /home/jenkins/workspace/Lucene-Solr-master-Linux/lucene/build/analysis/common/test/temp/junit4-J0-20180516_134144_445541785248236706408.syserr
   [junit4] >>> JVM J0 emitted unexpected output (verbatim) ----
   [junit4] OpenJDK 64-Bit Server VM warning: Option UseConcMarkSweepGC was deprecated in version 9.0 and will likely be removed in a future release.
   [junit4] <<< JVM J0: EOF ----

[...truncated 256 lines...]
   [junit4] JVM J2: stderr was not empty, see: /home/jenkins/workspace/Lucene-Solr-master-Linux/lucene/build/analysis/icu/test/temp/junit4-J2-20180516_134337_4622201830373007090929.syserr
   [junit4] >>> JVM J2 emitted unexpected output (verbatim) ----
   [junit4] OpenJDK 64-Bit Server VM warning: Option UseConcMarkSweepGC was deprecated in version 9.0 and will likely be removed in a future release.
   [junit4] <<< JVM J2: EOF ----

   [junit4] JVM J0: stderr was not empty, see: /home/jenkins/workspace/Lucene-Solr-master-Linux/lucene/build/analysis/icu/test/temp/junit4-J0-20180516_134337_4598308965171901667253.syserr
   [junit4] >>> JVM J0 emitted unexpected output (verbatim) ----
   [junit4] OpenJDK 64-Bit Server VM warning: Option UseConcMarkSweepGC was deprecated in version 9.0 and will likely be removed in a future release.
   [junit4] <<< JVM J0: EOF ----

[...truncated 5 lines...]
   [junit4] JVM J1: stderr was not empty, see: /home/jenkins/workspace/Lucene-Solr-master-Linux/lucene/build/analysis/icu/test/temp/junit4-J1-20180516_134337_4597889529989424741480.syserr
   [junit4] >>> JVM J1 emitted unexpected output (verbatim) ----
   [junit4] OpenJDK 64-Bit Server VM warning: Option UseConcMarkSweepGC was deprecated in version 9.0 and will likely be removed in a future release.
   [junit4] <<< JVM J1: EOF ----

[...truncated 247 lines...]
   [junit4] JVM J2: stderr was not empty, see: /home/jenkins/workspace/Lucene-Solr-master-Linux/lucene/build/analysis/kuromoji/test/temp/junit4-J2-20180516_134348_7918615904016031503705.syserr
   [junit4] >>> JVM J2 emitted unexpected output (verbatim) ----
   [junit4] OpenJDK 64-Bit Server VM warning: Option UseConcMarkSweepGC was deprecated in version 9.0 and will likely be removed in a future release.
   [junit4] <<< JVM J2: EOF ----

[...truncated 3 lines...]
   [junit4] JVM J0: stderr was not empty, see: /home/jenkins/workspace/Lucene-Solr-master-Linux/lucene/build/analysis/kuromoji/test/temp/junit4-J0-20180516_134348_79011156664043708865943.syserr
   [junit4] >>> JVM J0 emitted unexpected output (verbatim) ----
   [junit4] OpenJDK 64-Bit Server VM warning: Option UseConcMarkSweepGC was deprecated in version 9.0 and will likely be removed in a future release.
   [junit4] <<< JVM J0: EOF ----

[...truncated 9 lines...]
   [junit4] JVM J1: stderr was not empty, see: /home/jenkins/workspace/Lucene-Solr-master-Linux/lucene/build/analysis/kuromoji/test/temp/junit4-J1-20180516_134348_79017769086671743425208.syserr
   [junit4] >>> JVM J1 emitted unexpected output (verbatim) ----
   [junit4] OpenJDK 64-Bit Server VM warning: Option UseConcMarkSweepGC was deprecated in version 9.0 and will likely be removed in a future release.
   [junit4] <<< JVM J1: EOF ----

[...truncated 162 lines...]
   [junit4] JVM J1: stderr was not empty, see: /home/jenkins/workspace/Lucene-Solr-master-Linux/lucene/build/analysis/morfologik/test/temp/junit4-J1-20180516_134414_88616034500623673636222.syserr
   [junit4] >>> JVM J1 emitted unexpected output (verbatim) ----
   [junit4] OpenJDK 64-Bit Server VM warning: Option UseConcMarkSweepGC was deprecated in version 9.0 and will likely be removed in a future release.
   [junit4] <<< JVM J1: EOF ----

[...truncated 3 lines...]
   [junit4] JVM J0: stderr was not empty, see: /home/jenkins/workspace/Lucene-Solr-master-Linux/lucene/build/analysis/morfologik/test/temp/junit4-J0-20180516_134414_8869188467550023374656.syserr
   [junit4] >>> JVM J0 emitted unexpected output (verbatim) ----
   [junit4] OpenJDK 64-Bit Server VM warning: Option UseConcMarkSweepGC was deprecated in version 9.0 and will likely be removed in a future release.
   [junit4] <<< JVM J0: EOF ----

[...truncated 3 lines...]
   [junit4] JVM J2: stderr was not empty, see: /home/jenkins/workspace/Lucene-Solr-master-Linux/lucene/build/analysis/morfologik/test/temp/junit4-J2-20180516_134414_88717925784266368756091.syserr
   [junit4] >>> JVM J2 emitted unexpected output (verbatim) ----
   [junit4] OpenJDK 64-Bit Server VM warning: Option UseConcMarkSweepGC was deprecated in version 9.0 and will likely be removed in a future release.
   [junit4] <<< JVM J2: EOF ----

[...truncated 204 lines...]
   [junit4] JVM J0: stderr was not empty, see: /home/jenkins/workspace/Lucene-Solr-master-Linux/lucene/build/analysis/nori/test/temp/junit4-J0-20180516_134418_8845088399009047052261.syserr
   [junit4] >>> JVM J0 emitted unexpected output (verbatim) ----
   [junit4] OpenJDK 64-Bit Server VM warning: Option UseConcMarkSweepGC was deprecated in version 9.0 and will likely be removed in a future release.
   [junit4] <<< JVM J0: EOF ----

[...truncated 3 lines...]
   [junit4] JVM J2: stderr was not empty, see: /home/jenkins/workspace/Lucene-Solr-master-Linux/lucene/build/analysis/nori/test/temp/junit4-J2-20180516_134418_8856007085009594751553.syserr
   [junit4] >>> JVM J2 emitted unexpected output (verbatim) ----
   [junit4] OpenJDK 64-Bit Server VM warning: Option UseConcMarkSweepGC was deprecated in version 9.0 and will likely be removed in a future release.
   [junit4] <<< JVM J2: EOF ----

[...truncated 6 lines...]
   [junit4] JVM J1: stderr was not empty, see: /home/jenkins/workspace/Lucene-Solr-master-Linux/lucene/build/analysis/nori/test/temp/junit4-J1-20180516_134418_8859282354678519914487.syserr
   [junit4] >>> JVM J1 emitted unexpected output (verbatim) ----
   [junit4] OpenJDK 64-Bit Server VM warning: Option UseConcMarkSweepGC was deprecated in version 9.0 and will likely be removed in a future release.
   [junit4] <<< JVM J1: EOF ----

[...truncated 174 lines...]
   [junit4] JVM J1: stderr was not empty, see: /home/jenkins/workspace/Lucene-Solr-master-Linux/lucene/build/analysis/opennlp/test/temp/junit4-J1-20180516_134428_1057404108877664641358.syserr
   [junit4] JVM J2: stderr was not empty, see: /home/jenkins/workspace/Lucene-Solr-master-Linux/lucene/build/analysis/opennlp/test/temp/junit4-J2-20180516_134428_105980061250777964876.syserr
   [junit4] JVM J0: stderr was not empty, see: /home/jenkins/workspace/Lucene-Solr-master-Linux/lucene/build/analysis/opennlp/test/temp/junit4-J0-20180516_134428_1051474767853266926830.syserr
   [junit4] >>> JVM J2 emitted unexpected output (verbatim) ----
   [junit4] OpenJDK 64-Bit Server VM warning: Option UseConcMarkSweepGC was deprecated in version 9.0 and will likely be removed in a future release.
   [junit4] <<< JVM J2: EOF ----

[...truncated 182 lines...]
   [junit4] JVM J2: stderr was not empty, see: /home/jenkins/workspace/Lucene-Solr-master-Linux/lucene/build/analysis/phonetic/test/temp/junit4-J2-20180516_134431_1095509972859088808257.syserr
   [junit4] >>> JVM J2 emitted unexpected output (verbatim) ----
   [junit4] OpenJDK 64-Bit Server VM warning: Option UseConcMarkSweepGC was deprecated in version 9.0 and will likely be removed in a future release.
   [junit4] <<< JVM J2: EOF ----

[...truncated 3 lines...]
   [junit4] JVM J0: stderr was not empty, see: /home/jenkins/workspace/Lucene-Solr-master-Linux/lucene/build/analysis/phonetic/test/temp/junit4-J0-20180516_134431_1097850521848200457105.syserr
   [junit4] >>> JVM J0 emitted unexpected output (verbatim) ----
   [junit4] OpenJDK 64-Bit Server VM warning: Option UseConcMarkSweepGC was deprecated in version 9.0 and will likely be removed in a future release.
   [junit4] <<< JVM J0: EOF ----

[...truncated 3 lines...]
   [junit4] JVM J1: stderr was not empty, see: /home/jenkins/workspace/Lucene-Solr-master-Linux/lucene/build/analysis/phonetic/test/temp/junit4-J1-20180516_134431_1096307569203476823951.syserr
   [junit4] >>> JVM J1 emitted unexpected output (verbatim) ----
   [junit4] OpenJDK 64-Bit Server VM warning: Option UseConcMarkSweepGC was deprecated in version 9.0 and will likely be removed in a future release.
   [junit4] <<< JVM J1: EOF ----

[...truncated 161 lines...]
   [junit4] JVM J1: stderr was not empty, see: /home/jenkins/workspace/Lucene-Solr-master-Linux/lucene/build/analysis/smartcn/test/temp/junit4-J1-20180516_134441_0454700340237507231521.syserr
   [junit4] >>> JVM J1 emitted unexpected output (verbatim) ----
   [junit4] OpenJDK 64-Bit Server VM warning: Option UseConcMarkSweepGC was deprecated in version 9.0 and will likely be removed in a future release.
   [junit4] <<< JVM J1: EOF ----

[...truncated 3 lines...]
   [junit4] JVM J0: stderr was not empty, see: /home/jenkins/workspace/Lucene-Solr-master-Linux/lucene/build/analysis/smartcn/test/temp/junit4-J0-20180516_134441_0446756072106503723197.syserr
   [junit4] >>> JVM J0 emitted unexpected output (verbatim) ----
   [junit4] OpenJDK 64-Bit Server VM warning: Option UseConcMarkSweepGC was deprecated in version 9.0 and will likely be removed in a future release.
   [junit4] <<< JVM J0: EOF ----

[...truncated 162 lines...]
   [junit4] JVM J1: stderr was not empty, see: /home/jenkins/workspace/Lucene-Solr-master-Linux/lucene/build/analysis/stempel/test/temp/junit4-J1-20180516_134449_2512439952494717305298.syserr
   [junit4] >>> JVM J1 emitted unexpected output (verbatim) ----
   [junit4] OpenJDK 64-Bit Server VM warning: Option UseConcMarkSweepGC was deprecated in version 9.0 and will likely be removed in a future release.
   [junit4] <<< JVM J1: EOF ----

[...truncated 3 lines...]
   [junit4] JVM J2: stderr was not empty, see: /home/jenkins/workspace/Lucene-Solr-master-Linux/lucene/build/analysis/stempel/test/temp/junit4-J2-20180516_134449_2519360413133065583576.syserr
   [junit4] >>> JVM J2 emitted unexpected output (verbatim) ----
   [junit4] OpenJDK 64-Bit Server VM warning: Option UseConcMarkSweepGC was deprecated in version 9.0 and will likely be removed in a future release.
   [junit4] <<< JVM J2: EOF ----

[...truncated 3 lines...]
   [junit4] JVM J0: stderr was not empty, see: /home/jenkins/workspace/Lucene-Solr-master-Linux/lucene/build/analysis/stempel/test/temp/junit4-J0-20180516_134449_25112379438380105482728.syserr
   [junit4] >>> JVM J0 emitted unexpected output (verbatim) ----
   [junit4] OpenJDK 64-Bit Server VM warning: Option UseConcMarkSweepGC was deprecated in version 9.0 and will likely be removed in a future release.
   [junit4] <<< JVM J0: EOF ----

[...truncated 177 lines...]
   [junit4] JVM J0: stderr was not empty, see: /home/jenkins/workspace/Lucene-Solr-master-Linux/lucene/build/analysis/uima/test/temp/junit4-J0-20180516_134452_3252883546729856250973.syserr
   [junit4] >>> JVM J0 emitted unexpected output (verbatim) ----
   [junit4] OpenJDK 64-Bit Server VM warning: Option UseConcMarkSweepGC was deprecated in version 9.0 and will likely be removed in a future release.
   [junit4] <<< JVM J0: EOF ----

[...truncated 158 lines...]
   [junit4] JVM J1: stderr was not empty, see: /home/jenkins/workspace/Lucene-Solr-master-Linux/lucene/build/backward-codecs/test/temp/junit4-J1-20180516_134502_2081306255481643220881.syserr
   [junit4] >>> JVM J1 emitted unexpected output (verbatim) ----
   [junit4] OpenJDK 64-Bit Server VM warning: Option UseConcMarkSweepGC was deprecated in version 9.0 and will likely be removed in a future release.
   [junit4] <<< JVM J1: EOF ----

   [junit4] JVM J2: stderr was not empty, see: /home/jenkins/workspace/Lucene-Solr-master-Linux/lucene/build/backward-codecs/test/temp/junit4-J2-20180516_134502_2076477818957537834907.syserr
   [junit4] >>> JVM J2 emitted unexpected output (verbatim) ----
   [junit4] OpenJDK 64-Bit Server VM warning: Option UseConcMarkSweepGC was deprecated in version 9.0 and will likely be removed in a future release.
   [junit4] <<< JVM J2: EOF ----

[...truncated 19 lines...]
   [junit4] JVM J0: stderr was not empty, see: /home/jenkins/workspace/Lucene-Solr-master-Linux/lucene/build/backward-codecs/test/temp/junit4-J0-20180516_134502_2069414214835952924335.syserr
   [junit4] >>> JVM J0 emitted unexpected output (verbatim) ----
   [junit4] OpenJDK 64-Bit Server VM warning: Option UseConcMarkSweepGC was deprecated in version 9.0 and will likely be removed in a future release.
   [junit4] <<< JVM J0: EOF ----

[...truncated 1391 lines...]
   [junit4] JVM J1: stderr was not empty, see: /home/jenkins/workspace/Lucene-Solr-master-Linux/lucene/build/benchmark/test/temp/junit4-J1-20180516_134529_3728046943591492405802.syserr
   [junit4] >>> JVM J1 emitted unexpected output (verbatim) ----
   [junit4] OpenJDK 64-Bit Server VM warning: Option UseConcMarkSweepGC was deprecated in version 9.0 and will likely be removed in a future release.
   [junit4] <<< JVM J1: EOF ----

   [junit4] JVM J2: stderr was not empty, see: /home/jenkins/workspace/Lucene-Solr-master-Linux/lucene/build/benchmark/test/temp/junit4-J2-20180516_134529_3723454987638026073309.syserr
   [junit4] >>> JVM J2 emitted unexpected output (verbatim) ----
   [junit4] OpenJDK 64-Bit Server VM warning: Option UseConcMarkSweepGC was deprecated in version 9.0 and will likely be removed in a future release.
   [junit4] <<< JVM J2: EOF ----

[...truncated 3 lines...]
   [junit4] JVM J0: stderr was not empty, see: /home/jenkins/workspace/Lucene-Solr-master-Linux/lucene/build/benchmark/test/temp/junit4-J0-20180516_134529_3726477456205749523187.syserr
   [junit4] >>> JVM J0 emitted unexpected output (verbatim) ----
   [junit4] OpenJDK 64-Bit Server VM warning: Option UseConcMarkSweepGC was deprecated in version 9.0 and will likely be removed in a future release.
   [junit4] <<< JVM J0: EOF ----

[...truncated 250 lines...]
   [junit4] JVM J0: stderr was not empty, see: /home/jenkins/workspace/Lucene-Solr-master-Linux/lucene/build/classification/test/temp/junit4-J0-20180516_134537_8775622331925114352332.syserr
   [junit4] >>> JVM J0 emitted unexpected output (verbatim) ----
   [junit4] OpenJDK 64-Bit Server VM warning: Option UseConcMarkSweepGC was deprecated in version 9.0 and will likely be removed in a future release.
   [junit4] <<< JVM J0: EOF ----

[...truncated 3 lines...]
   [junit4] JVM J2: stderr was not empty, see: /home/jenkins/workspace/Lucene-Solr-master-Linux/lucene/build/classification/test/temp/junit4-J2-20180516_134537_8775164715186282383981.syserr
   [junit4] >>> JVM J2 emitted unexpected output (verbatim) ----
   [junit4] OpenJDK 64-Bit Server VM warning: Option UseConcMarkSweepGC was deprecated in version 9.0 and will likely be removed in a future release.
   [junit4] <<< JVM J2: EOF ----

[...truncated 3 lines...]
   [junit4] JVM J1: stderr was not empty, see: /home/jenkins/workspace/Lucene-Solr-master-Linux/lucene/build/classification/test/temp/junit4-J1-20180516_134537_8778859975179819750596.syserr
   [junit4] >>> JVM J1 emitted unexpected output (verbatim) ----
   [junit4] OpenJDK 64-Bit Server VM warning: Option UseConcMarkSweepGC was deprecated in version 9.0 and will likely be removed in a future release.
   [junit4] <<< JVM J1: EOF ----

[...truncated 259 lines...]
   [junit4] JVM J1: stderr was not empty, see: /home/jenkins/workspace/Lucene-Solr-master-Linux/lucene/build/codecs/test/temp/junit4-J1-20180516_134555_01216581140674346216612.syserr
   [junit4] >>> JVM J1 emitted unexpected output (verbatim) ----
   [junit4] OpenJDK 64-Bit Server VM warning: Option UseConcMarkSweepGC was deprecated in version 9.0 and will likely be removed in a future release.
   [junit4] <<< JVM J1: EOF ----

[...truncated 5 lines...]
   [junit4] JVM J2: stderr was not empty, see: /home/jenkins/workspace/Lucene-Solr-master-Linux/lucene/build/codecs/test/temp/junit4-J2-20180516_134555_0121428893697745164831.syserr
   [junit4] >>> JVM J2 emitted unexpected output (verbatim) ----
   [junit4] OpenJDK 64-Bit Server VM warning: Option UseConcMarkSweepGC was deprecated in version 9.0 and will likely be removed in a future release.
   [junit4] <<< JVM J2: EOF ----

[...truncated 4 lines...]
   [junit4] JVM J0: stderr was not empty, see: /home/jenkins/workspace/Lucene-Solr-master-Linux/lucene/build/codecs/test/temp/junit4-J0-20180516_134555_0123659879353142957608.syserr
   [junit4] >>> JVM J0 emitted unexpected output (verbatim) ----
   [junit4] OpenJDK 64-Bit Server VM warning: Option UseConcMarkSweepGC was deprecated in version 9.0 and will likely be removed in a future release.
   [junit4] <<< JVM J0: EOF ----

[...truncated 234 lines...]
   [junit4] JVM J0: stderr was not empty, see: /home/jenkins/workspace/Lucene-Solr-master-Linux/lucene/build/demo/test/temp/junit4-J0-20180516_134827_82510120407788029103831.syserr
   [junit4] >>> JVM J0 emitted unexpected output (verbatim) ----
   [junit4] OpenJDK 64-Bit Server VM warning: Option UseConcMarkSweepGC was deprecated in version 9.0 and will likely be removed in a future release.
   [junit4] <<< JVM J0: EOF ----

   [junit4] JVM J1: stderr was not empty, see: /home/jenkins/workspace/Lucene-Solr-master-Linux/lucene/build/demo/test/temp/junit4-J1-20180516_134827_8254464933648793893348.syserr
   [junit4] >>> JVM J1 emitted unexpected output (verbatim) ----
   [junit4] OpenJDK 64-Bit Server VM warning: Option UseConcMarkSweepGC was deprecated in version 9.0 and will likely be removed in a future release.
   [junit4] <<< JVM J1: EOF ----

   [junit4] JVM J2: stderr was not empty, see: /home/jenkins/workspace/Lucene-Solr-master-Linux/lucene/build/demo/test/temp/junit4-J2-20180516_134827_8262759930108787362266.syserr
   [junit4] >>> JVM J2 emitted unexpected output (verbatim) ----
   [junit4] OpenJDK 64-Bit Server VM warning: Option UseConcMarkSweepGC was deprecated in version 9.0 and will likely be removed in a future release.
   [junit4] <<< JVM J2: EOF ----

[...truncated 173 lines...]
   [junit4] JVM J1: stderr was not empty, see: /home/jenkins/workspace/Lucene-Solr-master-Linux/lucene/build/expressions/test/temp/junit4-J1-20180516_134830_80810460259544982775252.syserr
   [junit4] >>> JVM J1 emitted unexpected output (verbatim) ----
   [junit4] OpenJDK 64-Bit Server VM warning: Option UseConcMarkSweepGC was deprecated in version 9.0 and will likely be removed in a future release.
   [junit4] <<< JVM J1: EOF ----

   [junit4] JVM J2: stderr was not empty, see: /home/jenkins/workspace/Lucene-Solr-master-Linux/lucene/build/expressions/test/temp/junit4-J2-20180516_134830_8087491551932904262370.syserr
   [junit4] >>> JVM J2 emitted unexpected output (verbatim) ----
   [junit4] OpenJDK 64-Bit Server VM warning: Option UseConcMarkSweepGC was deprecated in version 9.0 and will likely be removed in a future release.
   [junit4] <<< JVM J2: EOF ----

[...truncated 6 lines...]
   [junit4] JVM J0: stderr was not empty, see: /home/jenkins/workspace/Lucene-Solr-master-Linux/lucene/build/expressions/test/temp/junit4-J0-20180516_134830_8082526381666501346076.syserr
   [junit4] >>> JVM J0 emitted unexpected output (verbatim) ----
   [junit4] OpenJDK 64-Bit Server VM warning: Option UseConcMarkSweepGC was deprecated in version 9.0 and will likely be removed in a future release.
   [junit4] <<< JVM J0: EOF ----

[...truncated 232 lines...]
   [junit4] JVM J2: stderr was not empty, see: /home/jenkins/workspace/Lucene-Solr-master-Linux/lucene/build/facet/test/temp/junit4-J2-20180516_134836_8941603411657282730514.syserr
   [junit4] >>> JVM J2 emitted unexpected output (verbatim) ----
   [junit4] OpenJDK 64-Bit Server VM warning: Option UseConcMarkSweepGC was deprecated in version 9.0 and will likely be removed in a future release.
   [junit4] <<< JVM J2: EOF ----

[...truncated 3 lines...]
   [junit4] JVM J0: stderr was not empty, see: /home/jenkins/workspace/Lucene-Solr-master-Linux/lucene/build/facet/test/temp/junit4-J0-20180516_134836_89418185473775950892721.syserr
   [junit4] >>> JVM J0 emitted unexpected output (verbatim) ----
   [junit4] OpenJDK 64-Bit Server VM warning: Option UseConcMarkSweepGC was deprecated in version 9.0 and will likely be removed in a future release.
   [junit4] <<< JVM J0: EOF ----

[...truncated 3 lines...]
   [junit4] JVM J1: stderr was not empty, see: /home/jenkins/workspace/Lucene-Solr-master-Linux/lucene/build/facet/test/temp/junit4-J1-20180516_134836_8943007196566063776413.syserr
   [junit4] >>> JVM J1 emitted unexpected output (verbatim) ----
   [junit4] OpenJDK 64-Bit Server VM warning: Option UseConcMarkSweepGC was deprecated in version 9.0 and will likely be removed in a future release.
   [junit4] <<< JVM J1: EOF ----

[...truncated 179 lines...]
   [junit4] JVM J0: stderr was not empty, see: /home/jenkins/workspace/Lucene-Solr-master-Linux/lucene/build/grouping/test/temp/junit4-J0-20180516_134908_95012352127082568439106.syserr
   [junit4] >>> JVM J0 emitted unexpected output (verbatim) ----
   [junit4] OpenJDK 64-Bit Server VM warning: Option UseConcMarkSweepGC was deprecated in version 9.0 and will likely be removed in a future release.
   [junit4] <<< JVM J0: EOF ----

[...truncated 3 lines...]
   [junit4] JVM J2: stderr was not empty, see: /home/jenkins/workspace/Lucene-Solr-master-Linux/lucene/build/grouping/test/temp/junit4-J2-20180516_134908_95017341137800039947522.syserr
   [junit4] >>> JVM J2 emitted unexpected output (verbatim) ----
   [junit4] OpenJDK 64-Bit Server VM warning: Option UseConcMarkSweepGC was deprecated in version 9.0 and will likely be removed in a future release.
   [junit4] <<< JVM J2: EOF ----

[...truncated 6 lines...]
   [junit4] JVM J1: stderr was not empty, see: /home/jenkins/workspace/Lucene-Solr-master-Linux/lucene/build/grouping/test/temp/junit4-J1-20180516_134908_95015770023756059993808.syserr
   [junit4] >>> JVM J1 emitted unexpected output (verbatim) ----
   [junit4] OpenJDK 64-Bit Server VM warning: Option UseConcMarkSweepGC was deprecated in version 9.0 and will likely be removed in a future release.
   [junit4] <<< JVM J1: EOF ----

[...truncated 255 lines...]
   [junit4] JVM J2: stderr was not empty, see: /home/jenkins/workspace/Lucene-Solr-master-Linux/lucene/build/highlighter/test/temp/junit4-J2-20180516_134921_0551089697949301888355.syserr
   [junit4] >>> JVM J2 emitted unexpected output (verbatim) ----
   [junit4] OpenJDK 64-Bit Server VM warning: Option UseConcMarkSweepGC was deprecated in version 9.0 and will likely be removed in a future release.
   [junit4] <<< JVM J2: EOF ----

[...truncated 3 lines...]
   [junit4] JVM J1: stderr was not empty, see: /home/jenkins/workspace/Lucene-Solr-master-Linux/lucene/build/highlighter/test/temp/junit4-J1-20180516_134921_05410487099135760230153.syserr
   [junit4] >>> JVM J1 emitted unexpected output (verbatim) ----
   [junit4] OpenJDK 64-Bit Server VM warning: Option UseConcMarkSweepGC was deprecated in version 9.0 and will likely be removed in a future release.
   [junit4] <<< JVM J1: EOF ----

[...truncated 3 lines...]
   [junit4] JVM J0: stderr was not empty, see: /home/jenkins/workspace/Lucene-Solr-master-Linux/lucene/build/highlighter/test/temp/junit4-J0-20180516_134921_0547419159265007150434.syserr
   [junit4] >>> JVM J0 emitted unexpected output (verbatim) ----
   [junit4] OpenJDK 64-Bit Server VM warning: Option UseConcMarkSweepGC was deprecated in version 9.0 and will likely be removed in a future release.
   [junit4] <<< JVM J0: EOF ----

[...truncated 166 lines...]
   [junit4] JVM J1: stderr was not empty, see: /home/jenkins/workspace/Lucene-Solr-master-Linux/lucene/build/join/test/temp/junit4-J1-20180516_134954_661223298395475466535.syserr
   [junit4] >>> JVM J1 emitted unexpected output (verbatim) ----
   [junit4] OpenJDK 64-Bit Server VM warning: Option UseConcMarkSweepGC was deprecated in version 9.0 and will likely be removed in a future release.
   [junit4] <<< JVM J1: EOF ----

[...truncated 3 lines...]
   [junit4] JVM J0: stderr was not empty, see: /home/jenkins/workspace/Lucene-Solr-master-Linux/lucene/build/join/test/temp/junit4-J0-20180516_134954_6619561163397302218194.syserr
   [junit4] >>> JVM J0 emitted unexpected output (verbatim) ----
   [junit4] OpenJDK 64-Bit Server VM warning: Option UseConcMarkSweepGC was deprecated in version 9.0 and will likely be removed in a future release.
   [junit4] <<< JVM J0: EOF ----

[...truncated 3 lines...]
   [junit4] JVM J2: stderr was not empty, see: /home/jenkins/workspace/Lucene-Solr-master-Linux/lucene/build/join/test/temp/junit4-J2-20180516_134954_66211389546899097989185.syserr
   [junit4] >>> JVM J2 emitted unexpected output (verbatim) ----
   [junit4] OpenJDK 64-Bit Server VM warning: Option UseConcMarkSweepGC was deprecated in version 9.0 and will likely be removed in a future release.
   [junit4] <<< JVM J2: EOF ----

[...truncated 155 lines...]
   [junit4] JVM J0: stderr was not empty, see: /home/jenkins/workspace/Lucene-Solr-master-Linux/lucene/build/memory/test/temp/junit4-J0-20180516_135008_60815646915385678231066.syserr
   [junit4] >>> JVM J0 emitted unexpected output (verbatim) ----
   [junit4] OpenJDK 64-Bit Server VM warning: Option UseConcMarkSweepGC was deprecated in version 9.0 and will likely be removed in a future release.
   [junit4] <<< JVM J0: EOF ----

[...truncated 3 lines...]
   [junit4] JVM J1: stderr was not empty, see: /home/jenkins/workspace/Lucene-Solr-master-Linux/lucene/build/memory/test/temp/junit4-J1-20180516_135008_6086805041000536003129.syserr
   [junit4] >>> JVM J1 emitted unexpected output (verbatim) ----
   [junit4] OpenJDK 64-Bit Server VM warning: Option UseConcMarkSweepGC was deprecated in version 9.0 and will likely be removed in a future release.
   [junit4] <<< JVM J1: EOF ----

[...truncated 189 lines...]
   [junit4] JVM J0: stderr was not empty, see: /home/jenkins/workspace/Lucene-Solr-master-Linux/lucene/build/misc/test/temp/junit4-J0-20180516_135018_08613673748457440819950.syserr
   [junit4] >>> JVM J0 emitted unexpected output (verbatim) ----
   [junit4] OpenJDK 64-Bit Server VM warning: Option UseConcMarkSweepGC was deprecated in version 9.0 and will likely be removed in a future release.
   [junit4] <<< JVM J0: EOF ----

[...truncated 3 lines...]
   [junit4] JVM J1: stderr was not empty, see: /home/jenkins/workspace/Lucene-Solr-master-Linux/lucene/build/misc/test/temp/junit4-J1-20180516_135018_086617652321008630465.syserr
   [junit4] >>> JVM J1 emitted unexpected output (verbatim) ----
   [junit4] OpenJDK 64-Bit Server VM warning: Option UseConcMarkSweepGC was deprecated in version 9.0 and will likely be removed in a future release.
   [junit4] <<< JVM J1: EOF ----

[...truncated 3 lines...]
   [junit4] JVM J2: stderr was not empty, see: /home/jenkins/workspace/Lucene-Solr-master-Linux/lucene/build/misc/test/temp/junit4-J2-20180516_135018_08611393716205092448462.syserr
   [junit4] >>> JVM J2 emitted unexpected output (verbatim) ----
   [junit4] OpenJDK 64-Bit Server VM warning: Option UseConcMarkSweepGC was deprecated in version 9.0 and will likely be removed in a future release.
   [junit4] <<< JVM J2: EOF ----

[...truncated 304 lines...]
   [junit4] JVM J2: stderr was not empty, see: /home/jenkins/workspace/Lucene-Solr-master-Linux/lucene/build/queries/test/temp/junit4-J2-20180516_135032_27616005432502631261513.syserr
   [junit4] >>> JVM J2 emitted unexpected output (verbatim) ----
   [junit4] OpenJDK 64-Bit Server VM warning: Option UseConcMarkSweepGC was deprecated in version 9.0 and will likely be removed in a future release.
   [junit4] <<< JVM J2: EOF ----

[...truncated 6 lines...]
   [junit4] JVM J1: stderr was not empty, see: /home/jenkins/workspace/Lucene-Solr-master-Linux/lucene/build/queries/test/temp/junit4-J1-20180516_135032_2762924693830606771304.syserr
   [junit4] >>> JVM J1 emitted unexpected output (verbatim) ----
   [junit4] OpenJDK 64-Bit Server VM warning: Option UseConcMarkSweepGC was deprecated in version 9.0 and will likely be removed in a future release.
   [junit4] <<< JVM J1: EOF ----

   [junit4] JVM J0: stderr was not empty, see: /home/jenkins/workspace/Lucene-Solr-master-Linux/lucene/build/queries/test/temp/junit4-J0-20180516_135032_27610775427077811668998.syserr
   [junit4] >>> JVM J0 emitted unexpected output (verbatim) ----
   [junit4] OpenJDK 64-Bit Server VM warning: Option UseConcMarkSweepGC was deprecated in version 9.0 and will likely be removed in a future release.
   [junit4] <<< JVM J0: EOF ----

[...truncated 232 lines...]
   [junit4] JVM J2: stderr was not empty, see: /home/jenkins/workspace/Lucene-Solr-master-Linux/lucene/build/queryparser/test/temp/junit4-J2-20180516_135039_0692605448884022459168.syserr
   [junit4] >>> JVM J2 emitted unexpected output (verbatim) ----
   [junit4] OpenJDK 64-Bit Server VM warning: Option UseConcMarkSweepGC was deprecated in version 9.0 and will likely be removed in a future release.
   [junit4] <<< JVM J2: EOF ----

   [junit4] JVM J1: stderr was not empty, see: /home/jenkins/workspace/Lucene-Solr-master-Linux/lucene/build/queryparser/test/temp/junit4-J1-20180516_135039_06913837602864466589917.syserr
   [junit4] >>> JVM J1 emitted unexpected output (verbatim) ----
   [junit4] OpenJDK 64-Bit Server VM warning: Option UseConcMarkSweepGC was deprecated in version 9.0 and will likely be removed in a future release.
   [junit4] <<< JVM J1: EOF ----

[...truncated 3 lines...]
   [junit4] JVM J0: stderr was not empty, see: /home/jenkins/workspace/Lucene-Solr-master-Linux/lucene/build/queryparser/test/temp/junit4-J0-20180516_135039_06914791385583856946446.syserr
   [junit4] >>> JVM J0 emitted unexpected output (verbatim) ----
   [junit4] OpenJDK 64-Bit Server VM warning: Option UseConcMarkSweepGC was deprecated in version 9.0 and will likely be removed in a future release.
   [junit4] <<< JVM J0: EOF ----

[...truncated 212 lines...]
   [junit4] JVM J1: stderr was not empty, see: /home/jenkins/workspace/Lucene-Solr-master-Linux/lucene/build/replicator/test/temp/junit4-J1-20180516_135046_3733846584199545222904.syserr
   [junit4] >>> JVM J1 emitted unexpected output (verbatim) ----
   [junit4] OpenJDK 64-Bit Server VM warning: Option UseConcMarkSweepGC was deprecated in version 9.0 and will likely be removed in a future release.
   [junit4] <<< JVM J1: EOF ----

[...truncated 3 lines...]
   [junit4] JVM J2: stderr was not empty, see: /home/jenkins/workspace/Lucene-Solr-master-Linux/lucene/build/replicator/test/temp/junit4-J2-20180516_135046_37312917465774617339818.syserr
   [junit4] >>> JVM J2 emitted unexpected output (verbatim) ----
   [junit4] OpenJDK 64-Bit Server VM warning: Option UseConcMarkSweepGC was deprecated in version 9.0 and will likely be removed in a future release.
   [junit4] <<< JVM J2: EOF ----

[...truncated 3 lines...]
   [junit4] JVM J0: stderr was not empty, see: /home/jenkins/workspace/Lucene-Solr-master-Linux/lucene/build/replicator/test/temp/junit4-J0-20180516_135046_3734762465754356209162.syserr
   [junit4] >>> JVM J0 emitted unexpected output (verbatim) ----
   [junit4] OpenJDK 64-Bit Server VM warning: Option UseConcMarkSweepGC was deprecated in version 9.0 and will likely be removed in a future release.
   [junit4] <<< JVM J0: EOF ----

[...truncated 209 lines...]
   [junit4] JVM J1: stderr was not empty, see: /home/jenkins/workspace/Lucene-Solr-master-Linux/lucene/build/sandbox/test/temp/junit4-J1-20180516_135058_8571999929094382687502.syserr
   [junit4] >>> JVM J1 emitted unexpected output (verbatim) ----
   [junit4] OpenJDK 64-Bit Server VM warning: Option UseConcMarkSweepGC was deprecated in version 9.0 and will likely be removed in a future release.
   [junit4] <<< JVM J1: EOF ----

[...truncated 21 lines...]
   [junit4] JVM J0: stderr was not empty, see: /home/jenkins/workspace/Lucene-Solr-master-Linux/lucene/build/sandbox/test/temp/junit4-J0-20180516_135058_85713795953814928201779.syserr
   [junit4] >>> JVM J0 emitted unexpected output (verbatim) ----
   [junit4] OpenJDK 64-Bit Server VM warning: Option UseConcMarkSweepGC was deprecated in version 9.0 and will likely be removed in a future release.
   [junit4] <<< JVM J0: EOF ----

[...truncated 7 lines...]
   [junit4] JVM J2: stderr was not empty, see: /home/jenkins/workspace/Lucene-Solr-master-Linux/lucene/build/sandbox/test/temp/junit4-J2-20180516_135058_85717071827728211296166.syserr
   [junit4] >>> JVM J2 emitted unexpected output (verbatim) ----
   [junit4] OpenJDK 64-Bit Server VM warning: Option UseConcMarkSweepGC was deprecated in version 9.0 and will likely be removed in a future release.
   [junit4] <<< JVM J2: EOF ----

[...truncated 320 lines...]
   [junit4] JVM J0: stderr was not empty, see: /home/jenkins/workspace/Lucene-Solr-master-Linux/lucene/build/spatial-extras/test/temp/junit4-J0-20180516_135147_26214748808085523387013.syserr
   [junit4] >>> JVM J0 emitted unexpected output (verbatim) ----
   [junit4] OpenJDK 64-Bit Server VM warning: Option UseConcMarkSweepGC was deprecated in version 9.0 and will likely be removed in a future release.
   [junit4] <<< JVM J0: EOF ----

[...truncated 3 lines...]
   [junit4] JVM J1: stderr was not empty, see: /home/jenkins/workspace/Lucene-Solr-master-Linux/lucene/build/spatial-extras/test/temp/junit4-J1-20180516_135147_26212293608185037199951.syserr
   [junit4] >>> JVM J1 emitted unexpected output (verbatim) ----
   [junit4] OpenJDK 64-Bit Server VM warning: Option UseConcMarkSweepGC was deprecated in version 9.0 and will likely be removed in a future release.
   [junit4] <<< JVM J1: EOF ----

[...truncated 3 lines...]
   [junit4] JVM J2: stderr was not empty, see: /home/jenkins/workspace/Lucene-Solr-master-Linux/lucene/build/spatial-extras/test/temp/junit4-J2-20180516_135147_2622213707194100234541.syserr
   [junit4] >>> JVM J2 emitted unexpected output (verbatim) ----
   [junit4] OpenJDK 64-Bit Server VM warning: Option UseConcMarkSweepGC was deprecated in version 9.0 and will likely be removed in a future release.
   [junit4] <<< JVM J2: EOF ----

[...truncated 153 lines...]
   [junit4] JVM J0: stderr was not empty, see: /home/jenkins/workspace/Lucene-Solr-master-Linux/lucene/build/spatial/test/temp/junit4-J0-20180516_135213_41412766264527365152462.syserr
   [junit4] >>> JVM J0 emitted unexpected output (verbatim) ----
   [junit4] OpenJDK 64-Bit Server VM warning: Option UseConcMarkSweepGC was deprecated in version 9.0 and will likely be removed in a future release.
   [junit4] <<< JVM J0: EOF ----

[...truncated 178 lines...]
   [junit4] JVM J0: stderr was not empty, see: /home/jenkins/workspace/Lucene-Solr-master-Linux/lucene/build/spatial3d/test/temp/junit4-J0-20180516_135215_40217445141207162335377.syserr
   [junit4] >>> JVM J0 emitted unexpected output (verbatim) ----
   [junit4] OpenJDK 64-Bit Server VM warning: Option UseConcMarkSweepGC was deprecated in version 9.0 and will likely be removed in a future release.
   [junit4] <<< JVM J0: EOF ----

[...truncated 9 lines...]
   [junit4] JVM J1: stderr was not empty, see: /home/jenkins/workspace/Lucene-Solr-master-Linux/lucene/build/spatial3d/test/temp/junit4-J1-20180516_135215_4023614992186734203231.syserr
   [junit4] >>> JVM J1 emitted unexpected output (verbatim) ----
   [junit4] OpenJDK 64-Bit Server VM warning: Option UseConcMarkSweepGC was deprecated in version 9.0 and will likely be removed in a future release.
   [junit4] <<< JVM J1: EOF ----

[...truncated 5 lines...]
   [junit4] JVM J2: stderr was not empty, see: /home/jenkins/workspace/Lucene-Solr-master-Linux/lucene/build/spatial3d/test/temp/junit4-J2-20180516_135215_40216079205649916315924.syserr
   [junit4] >>> JVM J2 emitted unexpected output (verbatim) ----
   [junit4] OpenJDK 64-Bit Server VM warning: Option UseConcMarkSweepGC was deprecated in version 9.0 and will likely be removed in a future release.
   [junit4] <<< JVM J2: EOF ----

[...truncated 264 lines...]
   [junit4] JVM J0: stderr was not empty, see: /home/jenkins/workspace/Lucene-Solr-master-Linux/lucene/build/suggest/test/temp/junit4-J0-20180516_135310_6818365490109904790424.syserr
   [junit4] >>> JVM J0 emitted unexpected output (verbatim) ----
   [junit4] OpenJDK 64-Bit Server VM warning: Option UseConcMarkSweepGC was deprecated in version 9.0 and will likely be removed in a future release.
   [junit4] <<< JVM J0: EOF ----

[...truncated 3 lines...]
   [junit4] JVM J1: stderr was not empty, see: /home/jenkins/workspace/Lucene-Solr-master-Linux/lucene/build/suggest/test/temp/junit4-J1-20180516_135310_6811519652504278399804.syserr
   [junit4] >>> JVM J1 emitted unexpected output (verbatim) ----
   [junit4] OpenJDK 64-Bit Server VM warning: Option UseConcMarkSweepGC was deprecated in version 9.0 and will likely be removed in a future release.
   [junit4] <<< JVM J1: EOF ----

[...truncated 3 lines...]
   [junit4] JVM J2: stderr was not empty, see: /home/jenkins/workspace/Lucene-Solr-master-Linux/lucene/build/suggest/test/temp/junit4-J2-20180516_135310_68111478240286254974411.syserr
   [junit4] >>> JVM J2 emitted unexpected output (verbatim) ----
   [junit4] OpenJDK 64-Bit Server VM warning: Option UseConcMarkSweepGC was deprecated in version 9.0 and will likely be removed in a future release.
   [junit4] <<< JVM J2: EOF ----

[...truncated 2032 lines...]
   [junit4] Suite: org.apache.solr.cloud.TestCloudConsistency
   [junit4]   2> 207401 INFO  (SUITE-TestCloudConsistency-seed#[B7710365847F9DD]-worker) [    ] o.a.s.SolrTestCaseJ4 SecureRandom sanity checks: test.solr.allowed.securerandom=null & java.security.egd=file:/dev/./urandom
   [junit4]   2> Creating dataDir: /home/jenkins/workspace/Lucene-Solr-master-Linux/solr/build/solr-core/test/J0/temp/solr.cloud.TestCloudConsistency_B7710365847F9DD-001/init-core-data-001
   [junit4]   2> 207401 WARN  (SUITE-TestCloudConsistency-seed#[B7710365847F9DD]-worker) [    ] o.a.s.SolrTestCaseJ4 startTrackingSearchers: numOpens=13 numCloses=13
   [junit4]   2> 207402 INFO  (SUITE-TestCloudConsistency-seed#[B7710365847F9DD]-worker) [    ] o.a.s.SolrTestCaseJ4 Using PointFields (NUMERIC_POINTS_SYSPROP=true) w/NUMERIC_DOCVALUES_SYSPROP=false
   [junit4]   2> 207402 INFO  (SUITE-TestCloudConsistency-seed#[B7710365847F9DD]-worker) [    ] o.a.s.SolrTestCaseJ4 Randomized ssl (true) and clientAuth (false) via: @org.apache.solr.util.RandomizeSSL(reason="", ssl=0.0/0.0, value=0.0/0.0, clientAuth=0.0/0.0)
   [junit4]   2> 207403 INFO  (SUITE-TestCloudConsistency-seed#[B7710365847F9DD]-worker) [    ] o.a.s.c.MiniSolrCloudCluster Starting cluster of 4 servers in /home/jenkins/workspace/Lucene-Solr-master-Linux/solr/build/solr-core/test/J0/temp/solr.cloud.TestCloudConsistency_B7710365847F9DD-001/tempDir-001
   [junit4]   2> 207403 INFO  (SUITE-TestCloudConsistency-seed#[B7710365847F9DD]-worker) [    ] o.a.s.c.ZkTestServer STARTING ZK TEST SERVER
   [junit4]   2> 207406 INFO  (Thread-325) [    ] o.a.s.c.ZkTestServer client port:0.0.0.0/0.0.0.0:0
   [junit4]   2> 207406 INFO  (Thread-325) [    ] o.a.s.c.ZkTestServer Starting server
   [junit4]   2> 207410 ERROR (Thread-325) [    ] o.a.z.s.ZooKeeperServer ZKShutdownHandler is not registered, so ZooKeeper server won't take any action on ERROR or SHUTDOWN server state changes
   [junit4]   2> 207506 INFO  (SUITE-TestCloudConsistency-seed#[B7710365847F9DD]-worker) [    ] o.a.s.c.ZkTestServer start zk server on port:41203
   [junit4]   2> 207508 INFO  (zkConnectionManagerCallback-451-thread-1) [    ] o.a.s.c.c.ConnectionManager zkClient has connected
   [junit4]   2> 207511 INFO  (jetty-launcher-448-thread-2) [    ] o.e.j.s.Server jetty-9.4.10.v20180503; built: 2018-05-03T15:56:21.710Z; git: daa59876e6f384329b122929e70a80934569428c; jvm 11-ea+5
   [junit4]   2> 207511 INFO  (jetty-launcher-448-thread-1) [    ] o.e.j.s.Server jetty-9.4.10.v20180503; built: 2018-05-03T15:56:21.710Z; git: daa59876e6f384329b122929e70a80934569428c; jvm 11-ea+5
   [junit4]   2> 207512 INFO  (jetty-launcher-448-thread-3) [    ] o.e.j.s.Server jetty-9.4.10.v20180503; built: 2018-05-03T15:56:21.710Z; git: daa59876e6f384329b122929e70a80934569428c; jvm 11-ea+5
   [junit4]   2> 207511 INFO  (jetty-launcher-448-thread-4) [    ] o.e.j.s.Server jetty-9.4.10.v20180503; built: 2018-05-03T15:56:21.710Z; git: daa59876e6f384329b122929e70a80934569428c; jvm 11-ea+5
   [junit4]   2> 207512 INFO  (jetty-launcher-448-thread-3) [    ] o.e.j.s.session DefaultSessionIdManager workerName=node0
   [junit4]   2> 207512 INFO  (jetty-launcher-448-thread-3) [    ] o.e.j.s.session No SessionScavenger set, using defaults
   [junit4]   2> 207512 INFO  (jetty-launcher-448-thread-3) [    ] o.e.j.s.session node0 Scavenging every 600000ms
   [junit4]   2> 207512 INFO  (jetty-launcher-448-thread-4) [    ] o.e.j.s.session DefaultSessionIdManager workerName=node0
   [junit4]   2> 207512 INFO  (jetty-launcher-448-thread-4) [    ] o.e.j.s.session No SessionScavenger set, using defaults
   [junit4]   2> 207513 INFO  (jetty-launcher-448-thread-4) [    ] o.e.j.s.session node0 Scavenging every 660000ms
   [junit4]   2> 207513 INFO  (jetty-launcher-448-thread-3) [    ] o.e.j.s.h.ContextHandler Started o.e.j.s.ServletContextHandler@68e2f4da{/solr,null,AVAILABLE}
   [junit4]   2> 207513 INFO  (jetty-launcher-448-thread-1) [    ] o.e.j.s.session DefaultSessionIdManager workerName=node0
   [junit4]   2> 207513 INFO  (jetty-launcher-448-thread-1) [    ] o.e.j.s.session No SessionScavenger set, using defaults
   [junit4]   2> 207513 INFO  (jetty-launcher-448-thread-2) [    ] o.e.j.s.session DefaultSessionIdManager workerName=node0
   [junit4]   2> 207513 INFO  (jetty-launcher-448-thread-1) [    ] o.e.j.s.session node0 Scavenging every 660000ms
   [junit4]   2> 207513 INFO  (jetty-launcher-448-thread-2) [    ] o.e.j.s.session No SessionScavenger set, using defaults
   [junit4]   2> 207513 INFO  (jetty-launcher-448-thread-4) [    ] o.e.j.s.h.ContextHandler Started o.e.j.s.ServletContextHandler@7d607c86{/solr,null,AVAILABLE}
   [junit4]   2> 207513 INFO  (jetty-launcher-448-thread-2) [    ] o.e.j.s.session node0 Scavenging every 660000ms
   [junit4]   2> 207513 INFO  (jetty-launcher-448-thread-1) [    ] o.e.j.s.h.ContextHandler Started o.e.j.s.ServletContextHandler@126a1b3b{/solr,null,AVAILABLE}
   [junit4]   2> 207513 INFO  (jetty-launcher-448-thread-2) [    ] o.e.j.s.h.ContextHandler Started o.e.j.s.ServletContextHandler@4fc78065{/solr,null,AVAILABLE}
   [junit4]   2> 207515 INFO  (jetty-launcher-448-thread-2) [    ] o.e.j.s.AbstractConnector Started ServerConnector@563a89d{SSL,[ssl, http/1.1]}{127.0.0.1:41205}
   [junit4]   2> 207515 INFO  (jetty-launcher-448-thread-4) [    ] o.e.j.s.AbstractConnector Started ServerConnector@7d20f3dd{SSL,[ssl, http/1.1]}{127.0.0.1:46043}
   [junit4]   2> 207515 INFO  (jetty-launcher-448-thread-3) [    ] o.e.j.s.AbstractConnector Started ServerConnector@35b2c13e{SSL,[ssl, http/1.1]}{127.0.0.1:44807}
   [junit4]   2> 207515 INFO  (jetty-launcher-448-thread-1) [    ] o.e.j.s.AbstractConnector Started ServerConnector@7cee4b08{SSL,[ssl, http/1.1]}{127.0.0.1:39841}
   [junit4]   2> 207515 INFO  (jetty-launcher-448-thread-4) [    ] o.e.j.s.Server Started @207543ms
   [junit4]   2> 207515 INFO  (jetty-launcher-448-thread-3) [    ] o.e.j.s.Server Started @207543ms
   [junit4]   2> 207515 INFO  (jetty-launcher-448-thread-1) [    ] o.e.j.s.Server Started @207544ms
   [junit4]   2> 207515 INFO  (jetty-launcher-448-thread-2) [    ] o.e.j.s.Server Started @207543ms
   [junit4]   2> 207515 INFO  (jetty-launcher-448-thread-1) [    ] o.a.s.c.s.e.JettySolrRunner Jetty properties: {hostContext=/solr, hostPort=39841}
   [junit4]   2> 207515 INFO  (jetty-launcher-448-thread-3) [    ] o.a.s.c.s.e.JettySolrRunner Jetty properties: {hostContext=/solr, hostPort=44807}
   [junit4]   2> 207515 INFO  (jetty-launcher-448-thread-2) [    ] o.a.s.c.s.e.JettySolrRunner Jetty properties: {hostContext=/solr, hostPort=41205}
   [junit4]   2> 207515 INFO  (jetty-launcher-448-thread-4) [    ] o.a.s.c.s.e.JettySolrRunner Jetty properties: {hostContext=/solr, hostPort=46043}
   [junit4]   2> 207515 ERROR (jetty-launcher-448-thread-3) [    ] o.a.s.u.StartupLoggingUtils Missing Java Option solr.log.dir. Logging may be missing or incomplete.
   [junit4]   2> 207515 ERROR (jetty-launcher-448-thread-4) [    ] o.a.s.u.StartupLoggingUtils Missing Java Option solr.log.dir. Logging may be missing or incomplete.
   [junit4]   2> 207515 ERROR (jetty-launcher-448-thread-1) [    ] o.a.s.u.StartupLoggingUtils Missing Java Option solr.log.dir. Logging may be missing or incomplete.
   [junit4]   2> 207515 ERROR (jetty-launcher-448-thread-2) [    ] o.a.s.u.StartupLoggingUtils Missing Java Option solr.log.dir. Logging may be missing or incomplete.
   [junit4]   2> 207516 INFO  (jetty-launcher-448-thread-1) [    ] o.a.s.s.SolrDispatchFilter Using logger factory org.apache.logging.slf4j.Log4jLoggerFactory
   [junit4]   2> 207516 INFO  (jetty-launcher-448-thread-2) [    ] o.a.s.s.SolrDispatchFilter Using logger factory org.apache.logging.slf4j.Log4jLoggerFactory
   [junit4]   2> 207515 INFO  (jetty-launcher-448-thread-3) [    ] o.a.s.s.SolrDispatchFilter Using logger factory org.apache.logging.slf4j.Log4jLoggerFactory
   [junit4]   2> 207516 INFO  (jetty-launcher-448-thread-1) [    ] o.a.s.s.SolrDispatchFilter  ___      _       Welcome to Apache Solr? version 8.0.0
   [junit4]   2> 207516 INFO  (jetty-launcher-448-thread-4) [    ] o.a.s.s.SolrDispatchFilter Using logger factory org.apache.logging.slf4j.Log4jLoggerFactory
   [junit4]   2> 207516 INFO  (jetty-launcher-448-thread-2) [    ] o.a.s.s.SolrDispatchFilter  ___      _       Welcome to Apache Solr? version 8.0.0
   [junit4]   2> 207516 INFO  (jetty-launcher-448-thread-1) [    ] o.a.s.s.SolrDispatchFilter / __| ___| |_ _   Starting in cloud mode on port null
   [junit4]   2> 207516 INFO  (jetty-launcher-448-thread-4) [    ] o.a.s.s.SolrDispatchFilter  ___      _       Welcome to Apache Solr? version 8.0.0
   [junit4]   2> 207516 INFO  (jetty-launcher-448-thread-3) [    ] o.a.s.s.SolrDispatchFilter  ___      _       Welcome to Apache Solr? version 8.0.0
   [junit4]   2> 207516 INFO  (jetty-launcher-448-thread-1) [    ] o.a.s.s.SolrDispatchFilter \__ \/ _ \ | '_|  Install dir: null
   [junit4]   2> 207516 INFO  (jetty-launcher-448-thread-4) [    ] o.a.s.s.SolrDispatchFilter / __| ___| |_ _   Starting in cloud mode on port null
   [junit4]   2> 207516 INFO  (jetty-launcher-448-thread-3) [    ] o.a.s.s.SolrDispatchFilter / __| ___| |_ _   Starting in cloud mode on port null
   [junit4]   2> 207516 INFO  (jetty-launcher-448-thread-2) [    ] o.a.s.s.SolrDispatchFilter / __| ___| |_ _   Starting in cloud mode on port null
   [junit4]   2> 207516 INFO  (jetty-launcher-448-thread-1) [    ] o.a.s.s.SolrDispatchFilter |___/\___/_|_|    Start time: 2018-05-16T13:57:39.565179Z
   [junit4]   2> 207516 INFO  (jetty-launcher-448-thread-3) [    ] o.a.s.s.SolrDispatchFilter \__ \/ _ \ | '_|  Install dir: null
   [junit4]   2> 207516 INFO  (jetty-launcher-448-thread-2) [    ] o.a.s.s.SolrDispatchFilter \__ \/ _ \ | '_|  Install dir: null
   [junit4]   2> 207516 INFO  (jetty-launcher-448-thread-4) [    ] o.a.s.s.SolrDispatchFilter \__ \/ _ \ | '_|  Install dir: null
   [junit4]   2> 207516 INFO  (jetty-launcher-448-thread-3) [    ] o.a.s.s.SolrDispatchFilter |___/\___/_|_|    Start time: 2018-05-16T13:57:39.565224Z
   [junit4]   2> 207516 INFO  (jetty-launcher-448-thread-2) [    ] o.a.s.s.SolrDispatchFilter |___/\___/_|_|    Start time: 2018-05-16T13:57:39.565232Z
   [junit4]   2> 207516 INFO  (jetty-launcher-448-thread-4) [    ] o.a.s.s.SolrDispatchFilter |___/\___/_|_|    Start time: 2018-05-16T13:57:39.565249Z
   [junit4]   2> 207517 INFO  (zkConnectionManagerCallback-456-thread-1) [    ] o.a.s.c.c.ConnectionManager zkClient has connected
   [junit4]   2> 207517 INFO  (zkConnectionManagerCallback-459-thread-1) [    ] o.a.s.c.c.ConnectionManager zkClient has connected
   [junit4]   2> 207517 INFO  (zkConnectionManagerCallback-457-thread-1) [    ] o.a.s.c.c.ConnectionManager zkClient has connected
   [junit4]   2> 207517 INFO  (zkConnectionManagerCallback-458-thread-1) [    ] o.a.s.c.c.ConnectionManager zkClient has connected
   [junit4]   2> 207517 INFO  (jetty-launcher-448-thread-2) [    ] o.a.s.s.SolrDispatchFilter solr.xml found in ZooKeeper. Loading...
   [junit4]   2> 207517 INFO  (jetty-launcher-448-thread-4) [    ] o.a.s.s.SolrDispatchFilter solr.xml found in ZooKeeper. Loading...
   [junit4]   2> 207517 INFO  (jetty-launcher-448-thread-1) [    ] o.a.s.s.SolrDispatchFilter solr.xml found in ZooKeeper. Loading...
   [junit4]   2> 207517 INFO  (jetty-launcher-448-thread-3) [    ] o.a.s.s.SolrDispatchFilter solr.xml found in ZooKeeper. Loading...
   [junit4]   2> 207540 INFO  (jetty-launcher-448-thread-1) [    ] o.a.s.c.ZkContainer Zookeeper client=127.0.0.1:41203/solr
   [junit4]   2> 207540 INFO  (jetty-launcher-448-thread-2) [    ] o.a.s.c.ZkContainer Zookeeper client=127.0.0.1:41203/solr
   [junit4]   2> 207543 INFO  (jetty-launcher-448-thread-4) [    ] o.a.s.c.ZkContainer Zookeeper client=127.0.0.1:41203/solr
   [junit4]   2> 207547 INFO  (jetty-launcher-448-thread-3) [    ] o.a.s.c.ZkContainer Zookeeper client=127.0.0.1:41203/solr
   [junit4]   2> 207549 INFO  (zkConnectionManagerCallback-467-thread-1) [    ] o.a.s.c.c.ConnectionManager zkClient has connected
   [junit4]   2> 207551 INFO  (zkConnectionManagerCallback-469-thread-1) [    ] o.a.s.c.c.ConnectionManager zkClient has connected
   [junit4]   2> 207552 INFO  (zkConnectionManagerCallback-472-thread-1) [    ] o.a.s.c.c.ConnectionManager zkClient has connected
   [junit4]   2> 207552 INFO  (zkConnectionManagerCallback-475-thread-1) [    ] o.a.s.c.c.ConnectionManager zkClient has connected
   [junit4]   2> 207552 INFO  (zkConnectionManagerCallback-477-thread-1) [    ] o.a.s.c.c.ConnectionManager zkClient has connected
   [junit4]   2> 207552 WARN  (NIOServerCxn.Factory:0.0.0.0/0.0.0.0:0) [    ] o.a.z.s.NIOServerCnxn Unable to read additional data from client sessionid 0x100680362ec0008, likely client has closed socket
   [junit4]   2> 207553 INFO  (zkConnectionManagerCallback-479-thread-1) [    ] o.a.s.c.c.ConnectionManager zkClient has connected
   [junit4]   2> 207553 INFO  (zkConnectionManagerCallback-481-thread-1) [    ] o.a.s.c.c.ConnectionManager zkClient has connected
   [junit4]   2> 207553 INFO  (zkConnectionManagerCallback-483-thread-1) [    ] o.a.s.c.c.ConnectionManager zkClient has connected
   [junit4]   2> 207600 INFO  (jetty-launcher-448-thread-1) [n:127.0.0.1:39841_solr    ] o.a.s.c.Overseer Overseer (id=null) closing
   [junit4]   2> 207600 INFO  (jetty-launcher-448-thread-2) [n:127.0.0.1:41205_solr    ] o.a.s.c.Overseer Overseer (id=null) closing
   [junit4]   2> 207600 INFO  (jetty-launcher-448-thread-4) [n:127.0.0.1:46043_solr    ] o.a.s.c.Overseer Overseer (id=null) closing
   [junit4]   2> 207601 INFO  (jetty-launcher-448-thread-1) [n:127.0.0.1:39841_solr    ] o.a.s.c.OverseerElectionContext I am going to be the leader 127.0.0.1:39841_solr
   [junit4]   2> 207601 INFO  (jetty-launcher-448-thread-3) [n:127.0.0.1:44807_solr    ] o.a.s.c.Overseer Overseer (id=null) closing
   [junit4]   2> 207601 INFO  (jetty-launcher-448-thread-2) [n:127.0.0.1:41205_solr    ] o.a.s.c.ZkController Register node as live in ZooKeeper:/live_nodes/127.0.0.1:41205_solr
   [junit4]   2> 207601 INFO  (jetty-launcher-448-thread-4) [n:127.0.0.1:46043_solr    ] o.a.s.c.ZkController Register node as live in ZooKeeper:/live_nodes/127.0.0.1:46043_solr
   [junit4]   2> 207601 INFO  (jetty-launcher-448-thread-1) [n:127.0.0.1:39841_solr    ] o.a.s.c.Overseer Overseer (id=72171957791752201-127.0.0.1:39841_solr-n_0000000000) starting
   [junit4]   2> 207603 INFO  (zkCallback-478-thread-1) [    ] o.a.s.c.c.ZkStateReader Updated live nodes from ZooKeeper... (0) -> (2)
   [junit4]   2> 207603 INFO  (zkCallback-480-thread-1) [    ] o.a.s.c.c.ZkStateReader Updated live nodes from ZooKeeper... (0) -> (2)
   [junit4]   2> 207603 INFO  (zkCallback-476-thread-1) [    ] o.a.s.c.c.ZkStateReader Updated live nodes from ZooKeeper... (0) -> (2)
   [junit4]   2> 207603 INFO  (zkCallback-482-thread-1) [    ] o.a.s.c.c.ZkStateReader Updated live nodes from ZooKeeper... (0) -> (2)
   [junit4]   2> 207604 INFO  (jetty-launcher-448-thread-3) [n:127.0.0.1:44807_solr    ] o.a.s.c.TransientSolrCoreCacheDefault Allocating transient cache for 2147483647 transient cores
   [junit4]   2> 207604 INFO  (jetty-launcher-448-thread-3) [n:127.0.0.1:44807_solr    ] o.a.s.c.ZkController Register node as live in ZooKeeper:/live_nodes/127.0.0.1:44807_solr
   [junit4]   2> 207604 INFO  (zkCallback-480-thread-1) [    ] o.a.s.c.c.ZkStateReader Updated live nodes from ZooKeeper... (2) -> (3)
   [junit4]   2> 207604 INFO  (zkCallback-478-thread-1) [    ] o.a.s.c.c.ZkStateReader Updated live nodes from ZooKeeper... (2) -> (3)
   [junit4]   2> 207604 INFO  (zkCallback-476-thread-1) [    ] o.a.s.c.c.ZkStateReader Updated live nodes from ZooKeeper... (2) -> (3)
   [junit4]   2> 207604 INFO  (zkCallback-482-thread-1) [    ] o.a.s.c.c.ZkStateReader Updated live nodes from ZooKeeper... (2) -> (3)
   [junit4]   2> 207619 INFO  (zkConnectionManagerCallback-496-thread-1) [    ] o.a.s.c.c.ConnectionManager zkClient has connected
   [junit4]   2> 207619 INFO  (jetty-launcher-448-thread-1) [n:127.0.0.1:39841_solr    ] o.a.s.c.c.ZkStateReader Updated live nodes from ZooKeeper... (0) -> (3)
   [junit4]   2> 207620 INFO  (jetty-launcher-448-thread-1) [n:127.0.0.1:39841_solr    ] o.a.s.c.s.i.ZkClientClusterStateProvider Cluster at 127.0.0.1:41203/solr ready
   [junit4]   2> 207635 INFO  (jetty-launcher-448-thread-1) [n:127.0.0.1:39841_solr    ] o.a.s.c.TransientSolrCoreCacheDefault Allocating transient cache for 2147483647 transient cores
   [junit4]   2> 207635 INFO  (jetty-launcher-448-thread-1) [n:127.0.0.1:39841_solr    ] o.a.s.c.ZkController Register node as live in ZooKeeper:/live_nodes/127.0.0.1:39841_solr
   [junit4]   2> 207636 INFO  (zkCallback-478-thread-1) [    ] o.a.s.c.c.ZkStateReader Updated live nodes from ZooKeeper... (3) -> (4)
   [junit4]   2> 207636 INFO  (zkCallback-480-thread-1) [    ] o.a.s.c.c.ZkStateReader Updated live nodes from ZooKeeper... (3) -> (4)
   [junit4]   2> 207636 INFO  (zkCallback-482-thread-1) [    ] o.a.s.c.c.ZkStateReader Updated live nodes from ZooKeeper... (3) -> (4)
   [junit4]   2> 207639 INFO  (zkCallback-476-thread-1) [    ] o.a.s.c.c.ZkStateReader Updated live nodes from ZooKeeper... (3) -> (4)
   [junit4]   2> 207639 INFO  (zkCallback-495-thread-1) [    ] o.a.s.c.c.ZkStateReader Updated live nodes from ZooKeeper... (3) -> (4)
   [junit4]   2> 207700 INFO  (jetty-launcher-448-thread-3) [n:127.0.0.1:44807_solr    ] o.a.s.m.r.SolrJmxReporter JMX monitoring for 'solr_44807.solr.node' (registry 'solr.node') enabled at server: com.sun.jmx.mbeanserver.JmxMBeanServer@137bfacd
   [junit4]   2> 207703 INFO  (jetty-launcher-448-thread-4) [n:127.0.0.1:46043_solr    ] o.a.s.m.r.SolrJmxReporter JMX monitoring for 'solr_46043.solr.node' (registry 'solr.node') enabled at server: com.sun.jmx.mbeanserver.JmxMBeanServer@137bfacd
   [junit4]   2> 207710 INFO  (jetty-launcher-448-thread-3) [n:127.0.0.1:44807_solr    ] o.a.s.m.r.SolrJmxReporter JMX monitoring for 'solr_44807.solr.jvm' (registry 'solr.jvm') enabled at server: com.sun.jmx.mbeanserver.JmxMBeanServer@137bfacd
   [junit4]   2> 207710 INFO  (jetty-launcher-448-thread-3) [n:127.0.0.1:44807_solr    ] o.a.s.m.r.SolrJmxReporter JMX monitoring for 'solr_44807.solr.jetty' (registry 'solr.jetty') enabled at server: com.sun.jmx.mbeanserver.JmxMBeanServer@137bfacd
   [junit4]   2> 207711 INFO  (jetty-launcher-448-thread-3) [n:127.0.0.1:44807_solr    ] o.a.s.c.CorePropertiesLocator Found 0 core definitions underneath /home/jenkins/workspace/Lucene-Solr-master-Linux/solr/build/solr-core/test/J0/temp/solr.cloud.TestCloudConsistency_B7710365847F9DD-001/tempDir-001/node3/.
   [junit4]   2> 207711 INFO  (jetty-launcher-448-thread-4) [n:127.0.0.1:46043_solr    ] o.a.s.m.r.SolrJmxReporter JMX monitoring for 'solr_46043.solr.jvm' (registry 'solr.jvm') enabled at server: com.sun.jmx.mbeanserver.JmxMBeanServer@137bfacd
   [junit4]   2> 207711 INFO  (jetty-launcher-448-thread-4) [n:127.0.0.1:46043_solr    ] o.a.s.m.r.SolrJmxReporter JMX monitoring for 'solr_46043.solr.jetty' (registry 'solr.jetty') enabled at server: com.sun.jmx.mbeanserver.JmxMBeanServer@137bfacd
   [junit4]   2> 207712 INFO  (jetty-launcher-448-thread-4) [n:127.0.0.1:46043_solr    ] o.a.s.c.CorePropertiesLocator Found 0 core definitions underneath /home/jenkins/workspace/Lucene-Solr-master-Linux/solr/build/solr-core/test/J0/temp/solr.cloud.TestCloudConsistency_B7710365847F9DD-001/tempDir-001/node4/.
   [junit4]   2> 207721 INFO  (zkConnectionManagerCallback-502-thread-1) [    ] o.a.s.c.c.ConnectionManager zkClient has connected
   [junit4]   2> 207722 INFO  (jetty-launcher-448-thread-4) [n:127.0.0.1:46043_solr    ] o.a.s.c.c.ZkStateReader Updated live nodes from ZooKeeper... (0) -> (4)
   [junit4]   2> 207722 INFO  (jetty-launcher-448-thread-4) [n:127.0.0.1:46043_solr    ] o.a.s.c.s.i.ZkClientClusterStateProvider Cluster at 127.0.0.1:41203/solr ready
   [junit4]   2> 207723 INFO  (zkConnectionManagerCallback-506-thread-1) [    ] o.a.s.c.c.ConnectionManager zkClient has connected
   [junit4]   2> 207723 INFO  (jetty-launcher-448-thread-3) [n:127.0.0.1:44807_solr    ] o.a.s.c.c.ZkStateReader Updated live nodes from ZooKeeper... (0) -> (4)
   [junit4]   2> 207724 INFO  (jetty-launcher-448-thread-3) [n:127.0.0.1:44807_solr    ] o.a.s.c.s.i.ZkClientClusterStateProvider Cluster at 127.0.0.1:41203/solr ready
   [junit4]   2> 207735 INFO  (jetty-launcher-448-thread-2) [n:127.0.0.1:41205_solr    ] o.a.s.m.r.SolrJmxReporter JMX monitoring for 'solr_41205.solr.node' (registry 'solr.node') enabled at server: com.sun.jmx.mbeanserver.JmxMBeanServer@137bfacd
   [junit4]   2> 207742 INFO  (jetty-launcher-448-thread-2) [n:127.0.0.1:41205_solr    ] o.a.s.m.r.SolrJmxReporter JMX monitoring for 'solr_41205.solr.jvm' (registry 'solr.jvm') enabled at server: com.sun.jmx.mbeanserver.JmxMBeanServer@137bfacd
   [junit4]   2> 207743 INFO  (jetty-launcher-448-thread-2) [n:127.0.0.1:41205_solr    ] o.a.s.m.r.SolrJmxReporter JMX monitoring for 'solr_41205.solr.jetty' (registry 'solr.jetty') enabled at server: com.sun.jmx.mbeanserver.JmxMBeanServer@137bfacd
   [junit4]   2> 207744 INFO  (jetty-launcher-448-thread-2) [n:127.0.0.1:41205_solr    ] o.a.s.c.CorePropertiesLocator Found 0 core definitions underneath /home/jenkins/workspace/Lucene-Solr-master-Linux/solr/build/solr-core/test/J0/temp/solr.cloud.TestCloudConsistency_B7710365847F9DD-001/tempDir-001/node2/.
   [junit4]   2> 207747 INFO  (zkConnectionManagerCallback-511-thread-1) [    ] o.a.s.c.c.ConnectionManager zkClient has connected
   [junit4]   2> 207747 INFO  (jetty-launcher-448-thread-2) [n:127.0.0.1:41205_solr    ] o.a.s.c.c.ZkStateReader Updated live nodes from ZooKeeper... (0) -> (4)
   [junit4]   2> 207748 INFO  (jetty-launcher-448-thread-2) [n:127.0.0.1:41205_solr    ] o.a.s.c.s.i.ZkClientClusterStateProvider Cluster at 127.0.0.1:41203/solr ready
   [junit4]   2> 207767 INFO  (jetty-launcher-448-thread-1) [n:127.0.0.1:39841_solr    ] o.a.s.m.r.SolrJmxReporter JMX monitoring for 'solr_39841.solr.node' (registry 'solr.node') enabled at server: com.sun.jmx.mbeanserver.JmxMBeanServer@137bfacd
   [junit4]   2> 207772 INFO  (jetty-launcher-448-thread-1) [n:127.0.0.1:39841_solr    ] o.a.s.m.r.SolrJmxReporter JMX monitoring for 'solr_39841.solr.jvm' (registry 'solr.jvm') enabled at server: com.sun.jmx.mbeanserver.JmxMBeanServer@137bfacd
   [junit4]   2> 207772 INFO  (jetty-launcher-448-thread-1) [n:127.0.0.1:39841_solr    ] o.a.s.m.r.SolrJmxReporter JMX monitoring for 'solr_39841.solr.jetty' (registry 'solr.jetty') enabled at server: com.sun.jmx.mbeanserver.JmxMBeanServer@137bfacd
   [junit4]   2> 207773 INFO  (jetty-launcher-448-thread-1) [n:127.0.0.1:39841_solr    ] o.a.s.c.CorePropertiesLocator Found 0 core definitions underneath /home/jenkins/workspace/Lucene-Solr-master-Linux/solr/build/solr-core/test/J0/temp/solr.cloud.TestCloudConsistency_B7710365847F9DD-001/tempDir-001/node1/.
   [junit4]   2> 207803 INFO  (zkConnectionManagerCallback-513-thread-1) [    ] o.a.s.c.c.ConnectionManager zkClient has connected
   [junit4]   2> 207805 INFO  (zkConnectionManagerCallback-518-thread-1) [    ] o.a.s.c.c.ConnectionManager zkClient has connected
   [junit4]   2> 207806 INFO  (SUITE-TestCloudConsistency-seed#[B7710365847F9DD]-worker) [    ] o.a.s.c.c.ZkStateReader Updated live nodes from ZooKeeper... (0) -> (4)
   [junit4]   2> 207806 INFO  (SUITE-TestCloudConsistency-seed#[B7710365847F9DD]-worker) [    ] o.a.s.c.s.i.ZkClientClusterStateProvider Cluster at 127.0.0.1:41203/solr ready
   [junit4]   2> 207809 INFO  (SUITE-TestCloudConsistency-seed#[B7710365847F9DD]-worker) [    ] o.e.j.s.AbstractConnector Stopped ServerConnector@7d20f3dd{SSL,[ssl, http/1.1]}{127.0.0.1:0}
   [junit4]   2> 207809 INFO  (SUITE-TestCloudConsistency-seed#[B7710365847F9DD]-worker) [    ] o.a.s.c.CoreContainer Shutting down CoreContainer instance=1023488838
   [junit4]   2> 207810 INFO  (SUITE-TestCloudConsistency-seed#[B7710365847F9DD]-worker) [    ] o.a.s.m.SolrMetricManager Closing metric reporters for registry=solr.node, tag=null
   [junit4]   2> 207810 INFO  (SUITE-TestCloudConsistency-seed#[B7710365847F9DD]-worker) [    ] o.a.s.m.r.SolrJmxReporter Closing reporter [org.apache.solr.metrics.reporters.SolrJmxReporter@1ce60325: rootName = solr_46043, domain = solr.node, service url = null, agent id = null] for registry solr.node / com.codahale.metrics.MetricRegistry@394e6eab
   [junit4]   2> 207813 INFO  (SUITE-TestCloudConsistency-seed#[B7710365847F9DD]-worker) [    ] o.a.s.m.SolrMetricManager Closing metric reporters for registry=solr.jvm, tag=null
   [junit4]   2> 207814 INFO  (SUITE-TestCloudConsistency-seed#[B7710365847F9DD]-worker) [    ] o.a.s.m.r.SolrJmxReporter Closing reporter [org.apache.solr.metrics.reporters.SolrJmxReporter@1aa64084: rootName = solr_46043, domain = solr.jvm, service url = null, agent id = null] for registry solr.jvm / com.codahale.metrics.MetricRegistry@246b40f4
   [junit4]   2> 207816 INFO  (SUITE-TestCloudConsistency-seed#[B7710365847F9DD]-worker) [    ] o.a.s.m.SolrMetricManager Closing metric reporters for registry=solr.jetty, tag=null
   [junit4]   2> 207816 INFO  (SUITE-TestCloudConsistency-seed#[B7710365847F9DD]-worker) [    ] o.a.s.m.r.SolrJmxReporter Closing reporter [org.apache.solr.metrics.reporters.SolrJmxReporter@3fdc33d6: rootName = solr_46043, domain = solr.jetty, service url = null, agent id = null] for registry solr.jetty / com.codahale.metrics.MetricRegistry@295b7c62
   [junit4]   2> 207817 INFO  (SUITE-TestCloudConsistency-seed#[B7710365847F9DD]-worker) [    ] o.a.s.c.ZkController Remove node as live in ZooKeeper:/live_nodes/127.0.0.1:46043_solr
   [junit4]   2> 207818 INFO  (SUITE-TestCloudConsistency-seed#[B7710365847F9DD]-worker) [    ] o.a.s.m.SolrMetricManager Closing metric reporters for registry=solr.cluster, tag=null
   [junit4]   2> 207818 INFO  (zkCallback-478-thread-1) [    ] o.a.s.c.c.ZkStateReader Updated live nodes from ZooKeeper... (4) -> (3)
   [junit4]   2> 207818 INFO  (zkCallback-482-thread-1) [    ] o.a.s.c.c.ZkStateReader Updated live nodes from ZooKeeper... (4) -> (3)
   [junit4]   2> 207819 INFO  (zkCallback-476-thread-1) [    ] o.a.s.c.c.ZkStateReader Updated live nodes from ZooKeeper... (4) -> (3)
   [junit4]   2> 207819 INFO  (SUITE-TestCloudConsistency-seed#[B7710365847F9DD]-worker) [    ] o.a.s.c.TransientSolrCoreCacheDefault Allocating transient cache for 2147483647 transient cores
   [junit4]   2> 207819 INFO  (zkCallback-495-thread-1) [    ] o.a.s.c.c.ZkStateReader Updated live nodes from ZooKeeper... (4) -> (3)
   [junit4]   2> 207819 INFO  (zkCallback-517-thread-1) [    ] o.a.s.c.c.ZkStateReader Updated live nodes from ZooKeeper... (4) -> (3)
   [junit4]   2> 207819 INFO  (zkCallback-480-thread-1) [    ] o.a.s.c.c.ZkStateReader Updated live nodes from ZooKeeper... (4) -> (3)
   [junit4]   2> 207820 INFO  (zkCallback-510-thread-1) [    ] o.a.s.c.c.ZkStateReader Updated live nodes from ZooKeeper... (4) -> (3)
   [junit4]   2> 207820 INFO  (zkCallback-501-thread-1) [    ] o.a.s.c.c.ZkStateReader Updated live nodes from ZooKeeper... (4) -> (3)
   [junit4]   2> 207820 INFO  (zkCallback-505-thread-1) [    ] o.a.s.c.c.ZkStateReader Updated live nodes from ZooKeeper... (4) -> (3)
   [junit4]   2> 207821 INFO  (SUITE-TestCloudConsistency-seed#[B7710365847F9DD]-worker) [    ] o.e.j.s.h.ContextHandler Stopped o.e.j.s.ServletContextHandler@7d607c86{/solr,null,UNAVAILABLE}
   [junit4]   2> 207821 INFO  (SUITE-TestCloudConsistency-seed#[B7710365847F9DD]-worker) [    ] o.e.j.s.session node0 Stopped scavenging
   [junit4]   2> 207823 INFO  (SUITE-TestCloudConsistency-seed#[B7710365847F9DD]-worker) [    ] o.e.j.s.Server jetty-9.4.10.v20180503; built: 2018-05-03T15:56:21.710Z; git: daa59876e6f384329b122929e70a80934569428c; jvm 11-ea+5
   [junit4]   2> 207823 INFO  (SUITE-TestCloudConsistency-seed#[B7710365847F9DD]-worker) [    ] o.e.j.s.session DefaultSessionIdManager workerName=node0
   [junit4]   2> 207823 INFO  (SUITE-TestCloudConsistency-seed#[B7710365847F9DD]-worker) [    ] o.e.j.s.session No SessionScavenger set, using defaults
   [junit4]   2> 207823 INFO  (SUITE-TestCloudConsistency-seed#[B7710365847F9DD]-worker) [    ] o.e.j.s.session node0 Scavenging every 660000ms
   [junit4]   2> 207824 INFO  (SUITE-TestCloudConsistency-seed#[B7710365847F9DD]-worker) [    ] o.e.j.s.h.ContextHandler Started o.e.j.s.ServletContextHandler@616f6aae{/solr,null,AVAILABLE}
   [junit4]   2> 207824 INFO  (SUITE-TestCloudConsistency-seed#[B7710365847F9DD]-worker) [    ] o.e.j.s.AbstractConnector Started ServerConnector@7b6c9822{SSL,[ssl, http/1.1]}{127.0.0.1:34409}
   [junit4]   2> 207824 INFO  (SUITE-TestCloudConsistency-seed#[B7710365847F9DD]-worker) [    ] o.e.j.s.Server Started @207853ms
   [junit4]   2> 207824 INFO  (SUITE-TestCloudConsistency-seed#[B7710365847F9DD]-worker) [    ] o.a.s.c.s.e.JettySolrRunner Jetty properties: {hostContext=/solr, hostPort=46327}
   [junit4]   2> 207825 ERROR (SUITE-TestCloudConsistency-seed#[B7710365847F9DD]-worker) [    ] o.a.s.u.StartupLoggingUtils Missing Java Option solr.log.dir. Logging may be missing or incomplete.
   [junit4]   2> 207825 INFO  (SUITE-TestCloudConsistency-seed#[B7710365847F9DD]-worker) [    ] o.a.s.s.SolrDispatchFilter Using logger factory org.apache.logging.slf4j.Log4jLoggerFactory
   [junit4]   2> 207825 INFO  (SUITE-TestCloudConsistency-seed#[B7710365847F9DD]-worker) [    ] o.a.s.s.SolrDispatchFilter  ___      _       Welcome to Apache Solr? version 8.0.0
   [junit4]   2> 207825 INFO  (SUITE-TestCloudConsistency-seed#[B7710365847F9DD]-worker) [    ] o.a.s.s.SolrDispatchFilter / __| ___| |_ _   Starting in cloud mode on port null
   [junit4]   2> 207825 INFO  (SUITE-TestCloudConsistency-seed#[B7710365847F9DD]-worker) [    ] o.a.s.s.SolrDispatchFilter \__ \/ _ \ | '_|  Install dir: null
   [junit4]   2> 207825 INFO  (SUITE-TestCloudConsistency-seed#[B7710365847F9DD]-worker) [    ] o.a.s.s.SolrDispatchFilter |___/\___/_|_|    Start time: 2018-05-16T13:57:39.874390Z
   [junit4]   2> 207826 INFO  (zkConnectionManagerCallback-520-thread-1) [    ] o.a.s.c.c.ConnectionManager zkClient has connected
   [junit4]   2> 207826 INFO  (SUITE-TestCloudConsistency-seed#[B7710365847F9DD]-worker) [    ] o.a.s.s.SolrDispatchFilter solr.xml found in ZooKeeper. Loading...
   [junit4]   2> 207831 INFO  (SUITE-TestCloudConsistency-seed#[B7710365847F9DD]-worker) [    ] o.a.s.c.ZkContainer Zookeeper client=127.0.0.1:41203/solr
   [junit4]   2> 207832 INFO  (zkConnectionManagerCallback-524-thread-1) [    ] o.a.s.c.c.ConnectionManager zkClient has connected
   [junit4]   2> 207835 INFO  (zkConnectionManagerCallback-526-thread-1) [    ] o.a.s.c.c.ConnectionManager zkClient has connected
   [junit4]   2> 207838 INFO  (SUITE-TestCloudConsistency-seed#[B7710365847F9DD]-worker) [n:127.0.0.1:46327_solr    ] o.a.s.c.c.ZkStateReader Updated live nodes from ZooKeeper... (0) -> (3)
   [junit4]   2> 207839 INFO  (SUITE-TestCloudConsistency-seed#[B7710365847F9DD]-worker) [n:127.0.0.1:46327_solr    ] o.a.s.c.Overseer Overseer (id=null) closing
   [junit4]   2> 207840 INFO  (SUITE-TestCloudConsistency-seed#[B7710365847F9DD]-worker) [n:127.0.0.1:46327_solr    ] o.a.s.c.TransientSolrCoreCacheDefault Allocating transient cache for 2147483647 transient cores
   [junit4]   2> 207840 INFO  (SUITE-TestCloudConsistency-seed#[B7710365847F9DD]-worker) [n:127.0.0.1:46327_solr    ] o.a.s.c.ZkController Register node as live in ZooKeeper:/live_nodes/127.0.0.1:46327_solr
   [junit4]   2> 207841 INFO  (zkCallback-476-thread-1) [    ] o.a.s.c.c.ZkStateReader Updated live nodes from ZooKeeper... (3) -> (4)
   [junit4]   2> 207841 INFO  (zkCallback-510-thread-1) [    ] o.a.s.c.c.ZkStateReader Updated live nodes from ZooKeeper... (3) -> (4)
   [junit4]   2> 207841 INFO  (zkCallback-482-thread-1) [    ] o.a.s.c.c.ZkStateReader Updated live nodes from ZooKeeper... (3) -> (4)
   [junit4]   2> 207841 INFO  (zkCallback-478-thread-1) [    ] o.a.s.c.c.ZkStateReader Updated live nodes from ZooKeeper... (3) -> (4)
   [junit4]   2> 207841 INFO  (zkCallback-495-thread-1) [    ] o.a.s.c.c.ZkStateReader Updated live nodes from ZooKeeper... (3) -> (4)
   [junit4]   2> 207841 INFO  (zkCallback-517-thread-1) [    ] o.a.s.c.c.ZkStateReader Updated live nodes from ZooKeeper... (3) -> (4)
   [junit4]   2> 207843 INFO  (zkCallback-505-thread-1) [    ] o.a.s.c.c.ZkStateReader Updated live nodes from ZooKeeper... (3) -> (4)
   [junit4]   2> 207843 INFO  (zkCallback-525-thread-1) [    ] o.a.s.c.c.ZkStateReader Updated live nodes from ZooKeeper... (3) -> (4)
   [junit4]   2> 207915 INFO  (SUITE-TestCloudConsistency-seed#[B7710365847F9DD]-worker) [n:127.0.0.1:46327_solr    ] o.a.s.m.r.SolrJmxReporter JMX monitoring for 'solr_46327.solr.node' (registry 'solr.node') enabled at server: com.sun.jmx.mbeanserver.JmxMBeanServer@137bfacd
   [junit4]   2> 207921 INFO  (SUITE-TestCloudConsistency-seed#[B7710365847F9DD]-worker) [n:127.0.0.1:46327_solr    ] o.a.s.m.r.SolrJmxReporter JMX monitoring for 'solr_46327.solr.jvm' (registry 'solr.jvm') enabled at server: com.sun.jmx.mbeanserver.JmxMBeanServer@137bfacd
   [junit4]   2> 207921 INFO  (SUITE-TestCloudConsistency-seed#[B7710365847F9DD]-worker) [n:127.0.0.1:46327_solr    ] o.a.s.m.r.SolrJmxReporter JMX monitoring for 'solr_46327.solr.jetty' (registry 'solr.jetty') enabled at server: com.sun.jmx.mbeanserver.JmxMBeanServer@137bfacd
   [junit4]   2> 207922 INFO  (SUITE-TestCloudConsistency-seed#[B7710365847F9DD]-worker) [n:127.0.0.1:46327_solr    ] o.a.s.c.CorePropertiesLocator Found 0 core definitions underneath /home/jenkins/workspace/Lucene-Solr-master-Linux/solr/build/solr-core/test/J0/temp/solr.cloud.TestCloudConsistency_B7710365847F9DD-001/tempDir-001/node4/.
   [junit4]   2> 207924 INFO  (zkConnectionManagerCallback-533-thread-1) [    ] o.a.s.c.c.ConnectionManager zkClient has connected
   [junit4]   2> 207925 INFO  (SUITE-TestCloudConsistency-seed#[B7710365847F9DD]-worker) [n:127.0.0.1:46327_solr    ] o.a.s.c.c.ZkStateReader Updated live nodes from ZooKeeper... (0) -> (4)
   [junit4]   2> 207925 INFO  (SUITE-TestCloudConsistency-seed#[B7710365847F9DD]-worker) [n:127.0.0.1:46327_solr    ] o.a.s.c.s.i.ZkClientClusterStateProvider Cluster at 127.0.0.1:41203/solr ready
   [junit4]   2> 207948 INFO  (SUITE-TestCloudConsistency-seed#[B7710365847F9DD]-worker) [    ] o.a.s.c.TestCloudConsistency Adding proxy for URL: https://127.0.0.1:34409/solr. Proxy: https://127.0.0.1:46327/solr
   [junit4]   2> 207949 INFO  (SUITE-TestCloudConsistency-seed#[B7710365847F9DD]-worker) [    ] o.e.j.s.AbstractConnector Stopped ServerConnector@35b2c13e{SSL,[ssl, http/1.1]}{127.0.0.1:0}
   [junit4]   2> 207949 INFO  (SUITE-TestCloudConsistency-seed#[B7710365847F9DD]-worker) [    ] o.a.s.c.CoreContainer Shutting down CoreContainer instance=479077938
   [junit4]   2> 207950 INFO  (SUITE-TestCloudConsistency-seed#[B7710365847F9DD]-worker) [    ] o.a.s.m.SolrMetricManager Closing metric reporters for registry=solr.node, tag=null
   [junit4]   2> 207950 INFO  (SUITE-TestCloudConsistency-seed#[B7710365847F9DD]-worker) [    ] o.a.s.m.r.SolrJmxReporter Closing reporter [org.apache.solr.metrics.reporters.SolrJmxReporter@2b5d2586: rootName = solr_44807, domain = solr.node, service url = null, agent id = null] for registry solr.node / com.codahale.metrics.MetricRegistry@67a16100
   [junit4]   2> 207954 INFO  (SUITE-TestCloudConsistency-seed#[B7710365847F9DD]-worker) [    ] o.a.s.m.SolrMetricManager Closing metric reporters for registry=solr.jvm, tag=null
   [junit4]   2> 207954 INFO  (SUITE-TestCloudConsistency-seed#[B7710365847F9DD]-worker) [    ] o.a.s.m.r.SolrJmxReporter Closing reporter [org.apache.solr.metrics.reporters.SolrJmxReporter@2d4491de: rootName = solr_44807, domain = solr.jvm, service url = null, agent id = null] for registry solr.jvm / com.codahale.metrics.MetricRegistry@246b40f4
   [junit4]   2> 207956 INFO  (SUITE-TestCloudConsistency-seed#[B7710365847F9DD]-worker) [    ] o.a.s.m.SolrMetricManager Closing metric reporters for registry=solr.jetty, tag=null
   [junit4]   2> 207956 INFO  (SUITE-TestCloudConsistency-seed#[B7710365847F9DD]-worker) [    ] o.a.s.m.r.SolrJmxReporter Closing reporter [org.apache.solr.metrics.reporters.SolrJmxReporter@547d308d: rootName = solr_44807, domain = solr.jetty, service url = null, agent id = null] for registry solr.jetty / com.codahale.metrics.MetricRegistry@295b7c62
   [junit4]   2> 207958 INFO  (SUITE-TestCloudConsistency-seed#[B7710365847F9DD]-worker) [    ] o.a.s.c.ZkController Remove node as live in ZooKeeper:/live_nodes/127.0.0.1:44807_solr
   [junit4]   2> 207958 INFO  (SUITE-TestCloudConsistency-seed#[B7710365847F9DD]-worker) [    ] o.a.s.m.SolrMetricManager Closing metric reporters for registry=solr.cluster, tag=null
   [junit4]   2> 207958 INFO  (zkCallback-476-thread-1) [    ] o.a.s.c.c.ZkStateReader Updated live nodes from ZooKeeper... (4) -> (3)
   [junit4]   2> 207958 INFO  (zkCallback-478-thread-1) [    ] o.a.s.c.c.ZkStateReader Updated live nodes from ZooKeeper... (4) -> (3)
   [junit4]   2> 207958 INFO  (zkCallback-495-thread-1) [    ] o.a.s.c.c.ZkStateReader Updated live nodes from ZooKeeper... (4) -> (3)
   [junit4]   2> 207959 INFO  (zkCallback-482-thread-1) [    ] o.a.s.c.c.ZkStateReader Updated live nodes from ZooKeeper... (4) -> (3)
   [junit4]   2> 207959 INFO  (zkCallback-517-thread-1) [    ] o.a.s.c.c.ZkStateReader Updated live nodes from ZooKeeper... (4) -> (3)
   [junit4]   2> 207959 INFO  (zkCallback-510-thread-1) [    ] o.a.s.c.c.ZkStateReader Updated live nodes from ZooKeeper... (4) -> (3)
   [junit4]   2> 207963 INFO  (zkCallback-505-thread-1) [    ] o.a.s.c.c.ZkStateReader Updated live nodes from ZooKeeper... (4) -> (3)
   [junit4]   2> 207963 INFO  (zkCallback-532-thread-1) [    ] o.a.s.c.c.ZkStateReader Updated live nodes from ZooKeeper... (4) -> (3)
   [junit4]   2> 207964 INFO  (zkCallback-525-thread-1) [    ] o.a.s.c.c.ZkStateReader Updated live nodes from ZooKeeper... (4) -> (3)
   [junit4]   2> 207975 INFO  (SUITE-TestCloudConsistency-seed#[B7710365847F9DD]-worker) [    ] o.e.j.s.h.ContextHandler Stopped o.e.j.s.ServletContextHandler@68e2f4da{/solr,null,UNAVAILABLE}
   [junit4]   2> 207975 INFO  (SUITE-TestCloudConsistency-seed#[B7710365847F9DD]-worker) [    ] o.e.j.s.session node0 Stopped scavenging
   [junit4]   2> 207976 INFO  (SUITE-TestCloudConsistency-seed#[B7710365847F9DD]-worker) [    ] o.e.j.s.Server jetty-9.4.10.v20180503; built: 2018-05-03T15:56:21.710Z; git: daa59876e6f384329b122929e70a80934569428c; jvm 11-ea+5
   [junit4]   2> 207977 INFO  (SUITE-TestCloudConsistency-seed#[B7710365847F9DD]-worker) [    ] o.e.j.s.session DefaultSessionIdManager workerName=node0
   [junit4]   2> 207977 INFO  (SUITE-TestCloudConsistency-seed#[B7710365847F9DD]-worker) [    ] o.e.j.s.session No SessionScavenger set, using defaults
   [junit4]   2> 207977 INFO  (SUITE-TestCloudConsistency-seed#[B7710365847F9DD]-worker) [    ] o.e.j.s.session node0 Scavenging every 660000ms
   [junit4]   2> 207977 INFO  (SUITE-TestCloudConsistency-seed#[B7710365847F9DD]-worker) [    ] o

[...truncated too long message...]

derr was not empty, see: /home/jenkins/workspace/Lucene-Solr-master-Linux/solr/build/contrib/solr-dataimporthandler/test/temp/junit4-J1-20180516_143132_1825711172714225690549.syserr
   [junit4] >>> JVM J1 emitted unexpected output (verbatim) ----
   [junit4] OpenJDK 64-Bit Server VM warning: Option UseConcMarkSweepGC was deprecated in version 9.0 and will likely be removed in a future release.
   [junit4] <<< JVM J1: EOF ----

[...truncated 567 lines...]
   [junit4] JVM J1: stderr was not empty, see: /home/jenkins/workspace/Lucene-Solr-master-Linux/solr/build/contrib/solr-cell/test/temp/junit4-J1-20180516_143157_606742729761066525659.syserr
   [junit4] >>> JVM J1 emitted unexpected output (verbatim) ----
   [junit4] OpenJDK 64-Bit Server VM warning: Option UseConcMarkSweepGC was deprecated in version 9.0 and will likely be removed in a future release.
   [junit4] <<< JVM J1: EOF ----

[...truncated 3 lines...]
   [junit4] JVM J2: stderr was not empty, see: /home/jenkins/workspace/Lucene-Solr-master-Linux/solr/build/contrib/solr-cell/test/temp/junit4-J2-20180516_143157_6063701060242584402676.syserr
   [junit4] >>> JVM J2 emitted unexpected output (verbatim) ----
   [junit4] OpenJDK 64-Bit Server VM warning: Option UseConcMarkSweepGC was deprecated in version 9.0 and will likely be removed in a future release.
   [junit4] <<< JVM J2: EOF ----

[...truncated 3 lines...]
   [junit4] JVM J0: stderr was not empty, see: /home/jenkins/workspace/Lucene-Solr-master-Linux/solr/build/contrib/solr-cell/test/temp/junit4-J0-20180516_143157_60612025446521190776243.syserr
   [junit4] >>> JVM J0 emitted unexpected output (verbatim) ----
   [junit4] OpenJDK 64-Bit Server VM warning: Option UseConcMarkSweepGC was deprecated in version 9.0 and will likely be removed in a future release.
   [junit4] <<< JVM J0: EOF ----

[...truncated 570 lines...]
   [junit4] JVM J1: stderr was not empty, see: /home/jenkins/workspace/Lucene-Solr-master-Linux/solr/build/contrib/solr-langid/test/temp/junit4-J1-20180516_143209_83213028661118714029800.syserr
   [junit4] >>> JVM J1 emitted unexpected output (verbatim) ----
   [junit4] OpenJDK 64-Bit Server VM warning: Option UseConcMarkSweepGC was deprecated in version 9.0 and will likely be removed in a future release.
   [junit4] <<< JVM J1: EOF ----

[...truncated 6 lines...]
   [junit4] JVM J0: stderr was not empty, see: /home/jenkins/workspace/Lucene-Solr-master-Linux/solr/build/contrib/solr-langid/test/temp/junit4-J0-20180516_143209_8327389381070963703252.syserr
   [junit4] >>> JVM J0 emitted unexpected output (verbatim) ----
   [junit4] OpenJDK 64-Bit Server VM warning: Option UseConcMarkSweepGC was deprecated in version 9.0 and will likely be removed in a future release.
   [junit4] <<< JVM J0: EOF ----

   [junit4] JVM J2: stderr was not empty, see: /home/jenkins/workspace/Lucene-Solr-master-Linux/solr/build/contrib/solr-langid/test/temp/junit4-J2-20180516_143209_8326959334559121933762.syserr
   [junit4] >>> JVM J2 emitted unexpected output (verbatim) ----
   [junit4] OpenJDK 64-Bit Server VM warning: Option UseConcMarkSweepGC was deprecated in version 9.0 and will likely be removed in a future release.
   [junit4] <<< JVM J2: EOF ----

[...truncated 674 lines...]
   [junit4] JVM J2: stderr was not empty, see: /home/jenkins/workspace/Lucene-Solr-master-Linux/solr/build/contrib/solr-ltr/test/temp/junit4-J2-20180516_143219_59111960069742516154692.syserr
   [junit4] >>> JVM J2 emitted unexpected output (verbatim) ----
   [junit4] OpenJDK 64-Bit Server VM warning: Option UseConcMarkSweepGC was deprecated in version 9.0 and will likely be removed in a future release.
   [junit4] <<< JVM J2: EOF ----

[...truncated 3 lines...]
   [junit4] JVM J1: stderr was not empty, see: /home/jenkins/workspace/Lucene-Solr-master-Linux/solr/build/contrib/solr-ltr/test/temp/junit4-J1-20180516_143219_59112351869216548861149.syserr
   [junit4] >>> JVM J1 emitted unexpected output (verbatim) ----
   [junit4] OpenJDK 64-Bit Server VM warning: Option UseConcMarkSweepGC was deprecated in version 9.0 and will likely be removed in a future release.
   [junit4] <<< JVM J1: EOF ----

[...truncated 3 lines...]
   [junit4] JVM J0: stderr was not empty, see: /home/jenkins/workspace/Lucene-Solr-master-Linux/solr/build/contrib/solr-ltr/test/temp/junit4-J0-20180516_143219_5917313919484351225548.syserr
   [junit4] >>> JVM J0 emitted unexpected output (verbatim) ----
   [junit4] OpenJDK 64-Bit Server VM warning: Option UseConcMarkSweepGC was deprecated in version 9.0 and will likely be removed in a future release.
   [junit4] <<< JVM J0: EOF ----

[...truncated 567 lines...]
   [junit4] JVM J0: stderr was not empty, see: /home/jenkins/workspace/Lucene-Solr-master-Linux/solr/build/contrib/solr-prometheus-exporter/test/temp/junit4-J0-20180516_143249_88310288948293622106395.syserr
   [junit4] >>> JVM J0 emitted unexpected output (verbatim) ----
   [junit4] OpenJDK 64-Bit Server VM warning: Option UseConcMarkSweepGC was deprecated in version 9.0 and will likely be removed in a future release.
   [junit4] <<< JVM J0: EOF ----

[...truncated 3 lines...]
   [junit4] JVM J1: stderr was not empty, see: /home/jenkins/workspace/Lucene-Solr-master-Linux/solr/build/contrib/solr-prometheus-exporter/test/temp/junit4-J1-20180516_143249_883995380069275102399.syserr
   [junit4] >>> JVM J1 emitted unexpected output (verbatim) ----
   [junit4] OpenJDK 64-Bit Server VM warning: Option UseConcMarkSweepGC was deprecated in version 9.0 and will likely be removed in a future release.
   [junit4] <<< JVM J1: EOF ----

[...truncated 606 lines...]
   [junit4] JVM J1: stderr was not empty, see: /home/jenkins/workspace/Lucene-Solr-master-Linux/solr/build/contrib/solr-uima/test/temp/junit4-J1-20180516_143309_2873918833021936447707.syserr
   [junit4] >>> JVM J1 emitted unexpected output (verbatim) ----
   [junit4] OpenJDK 64-Bit Server VM warning: Option UseConcMarkSweepGC was deprecated in version 9.0 and will likely be removed in a future release.
   [junit4] <<< JVM J1: EOF ----

[...truncated 3 lines...]
   [junit4] JVM J0: stderr was not empty, see: /home/jenkins/workspace/Lucene-Solr-master-Linux/solr/build/contrib/solr-uima/test/temp/junit4-J0-20180516_143309_28710318250618363184102.syserr
   [junit4] >>> JVM J0 emitted unexpected output (verbatim) ----
   [junit4] OpenJDK 64-Bit Server VM warning: Option UseConcMarkSweepGC was deprecated in version 9.0 and will likely be removed in a future release.
   [junit4] <<< JVM J0: EOF ----

[...truncated 557 lines...]
   [junit4] JVM J0: stderr was not empty, see: /home/jenkins/workspace/Lucene-Solr-master-Linux/solr/build/contrib/solr-velocity/test/temp/junit4-J0-20180516_143321_6263246353874285916124.syserr
   [junit4] >>> JVM J0 emitted unexpected output (verbatim) ----
   [junit4] OpenJDK 64-Bit Server VM warning: Option UseConcMarkSweepGC was deprecated in version 9.0 and will likely be removed in a future release.
   [junit4] <<< JVM J0: EOF ----

[...truncated 34279 lines...]
[repro] Jenkins log URL: https://jenkins.thetaphi.de/job/Lucene-Solr-master-Linux/22020/consoleText

[repro] Revision: b809d633ce6744b210e39d3c7ca72c4f8bfe8f4e

[repro] Ant options: "-Dargs=-XX:+UseCompressedOops -XX:+UseConcMarkSweepGC"
[repro] Repro line:  ant test  -Dtestcase=TestCloudConsistency -Dtests.method=testOutOfSyncReplicasCannotBecomeLeader -Dtests.seed=B7710365847F9DD -Dtests.multiplier=3 -Dtests.slow=true -Dtests.locale=ar-EH -Dtests.timezone=Pacific/Wallis -Dtests.asserts=true -Dtests.file.encoding=US-ASCII

[repro] Repro line:  ant test  -Dtestcase=TestInPlaceUpdatesDistrib -Dtests.method=test -Dtests.seed=B7710365847F9DD -Dtests.multiplier=3 -Dtests.slow=true -Dtests.locale=en-PN -Dtests.timezone=GB-Eire -Dtests.asserts=true -Dtests.file.encoding=US-ASCII

[repro] ant clean

[...truncated 6 lines...]
[repro] Test suites by module:
[repro]    solr/core
[repro]       TestCloudConsistency
[repro]       TestInPlaceUpdatesDistrib
[repro] ant compile-test

[...truncated 3303 lines...]
[repro] ant test-nocompile -Dtests.dups=5 -Dtests.maxfailures=10 -Dtests.class="*.TestCloudConsistency|*.TestInPlaceUpdatesDistrib" -Dtests.showOutput=onerror "-Dargs=-XX:+UseCompressedOops -XX:+UseConcMarkSweepGC" -Dtests.seed=B7710365847F9DD -Dtests.multiplier=3 -Dtests.slow=true -Dtests.locale=ar-EH -Dtests.timezone=Pacific/Wallis -Dtests.asserts=true -Dtests.file.encoding=US-ASCII

[...truncated 78 lines...]
   [junit4] JVM J1: stderr was not empty, see: /home/jenkins/workspace/Lucene-Solr-master-Linux/solr/build/solr-core/test/temp/junit4-J1-20180516_143634_36210700319123792764489.syserr
   [junit4] >>> JVM J1 emitted unexpected output (verbatim) ----
   [junit4] OpenJDK 64-Bit Server VM warning: Option UseConcMarkSweepGC was deprecated in version 9.0 and will likely be removed in a future release.
   [junit4] <<< JVM J1: EOF ----

   [junit4] JVM J2: stderr was not empty, see: /home/jenkins/workspace/Lucene-Solr-master-Linux/solr/build/solr-core/test/temp/junit4-J2-20180516_143634_3624528242005324390413.syserr
   [junit4] >>> JVM J2 emitted unexpected output (verbatim) ----
   [junit4] OpenJDK 64-Bit Server VM warning: Option UseConcMarkSweepGC was deprecated in version 9.0 and will likely be removed in a future release.
   [junit4] <<< JVM J2: EOF ----

[...truncated 4 lines...]
   [junit4] JVM J0: stderr was not empty, see: /home/jenkins/workspace/Lucene-Solr-master-Linux/solr/build/solr-core/test/temp/junit4-J0-20180516_143634_36216028478704533822116.syserr
   [junit4] >>> JVM J0 emitted unexpected output (verbatim) ----
   [junit4] OpenJDK 64-Bit Server VM warning: Option UseConcMarkSweepGC was deprecated in version 9.0 and will likely be removed in a future release.
   [junit4] <<< JVM J0: EOF ----

[...truncated 23 lines...]
[repro] Failures:
[repro]   0/5 failed: org.apache.solr.cloud.TestCloudConsistency
[repro]   0/5 failed: org.apache.solr.update.TestInPlaceUpdatesDistrib
[repro] Exiting with code 0

[...truncated 40 lines...]

Mime
View raw message