lucene-dev mailing list archives

Site index · List index
Message view « Date » · « Thread »
Top « Date » · « Thread »
From Policeman Jenkins Server <jenk...@thetaphi.de>
Subject [JENKINS] Lucene-Solr-master-Linux (32bit/jdk1.8.0_162) - Build # 21983 - Still Unstable!
Date Wed, 09 May 2018 21:23:04 GMT
Build: https://jenkins.thetaphi.de/job/Lucene-Solr-master-Linux/21983/
Java: 32bit/jdk1.8.0_162 -client -XX:+UseConcMarkSweepGC

4 tests failed.
FAILED:  org.apache.solr.cloud.autoscaling.NodeAddedTriggerTest.testRestoreState

Error Message:
Did not expect the processor to fire on first run! event={   "id":"4253111b8f305Tawwmdzrrpohyssrv3j43cjsl3",   "source":"node_added_trigger",   "eventTime":1166792587801349,   "eventType":"NODEADDED",   "properties":{     "eventTimes":[1166792587801349],     "nodeNames":["127.0.0.1:43657_solr"]}}

Stack Trace:
java.lang.AssertionError: Did not expect the processor to fire on first run! event={
  "id":"4253111b8f305Tawwmdzrrpohyssrv3j43cjsl3",
  "source":"node_added_trigger",
  "eventTime":1166792587801349,
  "eventType":"NODEADDED",
  "properties":{
    "eventTimes":[1166792587801349],
    "nodeNames":["127.0.0.1:43657_solr"]}}
	at __randomizedtesting.SeedInfo.seed([64A1796B6961123E:AA0FDDF891586A28]:0)
	at org.junit.Assert.fail(Assert.java:93)
	at org.apache.solr.cloud.autoscaling.NodeAddedTriggerTest.lambda$new$0(NodeAddedTriggerTest.java:49)
	at org.apache.solr.cloud.autoscaling.NodeAddedTrigger.run(NodeAddedTrigger.java:161)
	at org.apache.solr.cloud.autoscaling.NodeAddedTriggerTest.testRestoreState(NodeAddedTriggerTest.java:257)
	at sun.reflect.NativeMethodAccessorImpl.invoke0(Native Method)
	at sun.reflect.NativeMethodAccessorImpl.invoke(NativeMethodAccessorImpl.java:62)
	at sun.reflect.DelegatingMethodAccessorImpl.invoke(DelegatingMethodAccessorImpl.java:43)
	at java.lang.reflect.Method.invoke(Method.java:498)
	at com.carrotsearch.randomizedtesting.RandomizedRunner.invoke(RandomizedRunner.java:1737)
	at com.carrotsearch.randomizedtesting.RandomizedRunner$8.evaluate(RandomizedRunner.java:934)
	at com.carrotsearch.randomizedtesting.RandomizedRunner$9.evaluate(RandomizedRunner.java:970)
	at com.carrotsearch.randomizedtesting.RandomizedRunner$10.evaluate(RandomizedRunner.java:984)
	at com.carrotsearch.randomizedtesting.rules.SystemPropertiesRestoreRule$1.evaluate(SystemPropertiesRestoreRule.java:57)
	at org.apache.lucene.util.TestRuleSetupTeardownChained$1.evaluate(TestRuleSetupTeardownChained.java:49)
	at org.apache.lucene.util.AbstractBeforeAfterRule$1.evaluate(AbstractBeforeAfterRule.java:45)
	at org.apache.lucene.util.TestRuleThreadAndTestName$1.evaluate(TestRuleThreadAndTestName.java:48)
	at org.apache.lucene.util.TestRuleIgnoreAfterMaxFailures$1.evaluate(TestRuleIgnoreAfterMaxFailures.java:64)
	at org.apache.lucene.util.TestRuleMarkFailure$1.evaluate(TestRuleMarkFailure.java:47)
	at com.carrotsearch.randomizedtesting.rules.StatementAdapter.evaluate(StatementAdapter.java:36)
	at com.carrotsearch.randomizedtesting.ThreadLeakControl$StatementRunner.run(ThreadLeakControl.java:368)
	at com.carrotsearch.randomizedtesting.ThreadLeakControl.forkTimeoutingTask(ThreadLeakControl.java:817)
	at com.carrotsearch.randomizedtesting.ThreadLeakControl$3.evaluate(ThreadLeakControl.java:468)
	at com.carrotsearch.randomizedtesting.RandomizedRunner.runSingleTest(RandomizedRunner.java:943)
	at com.carrotsearch.randomizedtesting.RandomizedRunner$5.evaluate(RandomizedRunner.java:829)
	at com.carrotsearch.randomizedtesting.RandomizedRunner$6.evaluate(RandomizedRunner.java:879)
	at com.carrotsearch.randomizedtesting.RandomizedRunner$7.evaluate(RandomizedRunner.java:890)
	at com.carrotsearch.randomizedtesting.rules.StatementAdapter.evaluate(StatementAdapter.java:36)
	at com.carrotsearch.randomizedtesting.rules.SystemPropertiesRestoreRule$1.evaluate(SystemPropertiesRestoreRule.java:57)
	at org.apache.lucene.util.AbstractBeforeAfterRule$1.evaluate(AbstractBeforeAfterRule.java:45)
	at com.carrotsearch.randomizedtesting.rules.StatementAdapter.evaluate(StatementAdapter.java:36)
	at org.apache.lucene.util.TestRuleStoreClassName$1.evaluate(TestRuleStoreClassName.java:41)
	at com.carrotsearch.randomizedtesting.rules.NoShadowingOrOverridesOnMethodsRule$1.evaluate(NoShadowingOrOverridesOnMethodsRule.java:40)
	at com.carrotsearch.randomizedtesting.rules.NoShadowingOrOverridesOnMethodsRule$1.evaluate(NoShadowingOrOverridesOnMethodsRule.java:40)
	at com.carrotsearch.randomizedtesting.rules.StatementAdapter.evaluate(StatementAdapter.java:36)
	at com.carrotsearch.randomizedtesting.rules.StatementAdapter.evaluate(StatementAdapter.java:36)
	at com.carrotsearch.randomizedtesting.rules.StatementAdapter.evaluate(StatementAdapter.java:36)
	at org.apache.lucene.util.TestRuleAssertionsRequired$1.evaluate(TestRuleAssertionsRequired.java:53)
	at org.apache.lucene.util.TestRuleMarkFailure$1.evaluate(TestRuleMarkFailure.java:47)
	at org.apache.lucene.util.TestRuleIgnoreAfterMaxFailures$1.evaluate(TestRuleIgnoreAfterMaxFailures.java:64)
	at org.apache.lucene.util.TestRuleIgnoreTestSuites$1.evaluate(TestRuleIgnoreTestSuites.java:54)
	at com.carrotsearch.randomizedtesting.rules.StatementAdapter.evaluate(StatementAdapter.java:36)
	at com.carrotsearch.randomizedtesting.ThreadLeakControl$StatementRunner.run(ThreadLeakControl.java:368)
	at java.lang.Thread.run(Thread.java:748)


FAILED:  org.apache.solr.cloud.autoscaling.NodeAddedTriggerTest.testRestoreState

Error Message:
Did not expect the processor to fire on first run! event={   "id":"425360c7b29acTawwmdzrrpohyssrv3j43cjsl7",   "source":"node_added_trigger",   "eventTime":1166813974702508,   "eventType":"NODEADDED",   "properties":{     "eventTimes":[1166813974702508],     "nodeNames":["127.0.0.1:41873_solr"]}}

Stack Trace:
java.lang.AssertionError: Did not expect the processor to fire on first run! event={
  "id":"425360c7b29acTawwmdzrrpohyssrv3j43cjsl7",
  "source":"node_added_trigger",
  "eventTime":1166813974702508,
  "eventType":"NODEADDED",
  "properties":{
    "eventTimes":[1166813974702508],
    "nodeNames":["127.0.0.1:41873_solr"]}}
	at __randomizedtesting.SeedInfo.seed([64A1796B6961123E:AA0FDDF891586A28]:0)
	at org.junit.Assert.fail(Assert.java:93)
	at org.apache.solr.cloud.autoscaling.NodeAddedTriggerTest.lambda$new$0(NodeAddedTriggerTest.java:49)
	at org.apache.solr.cloud.autoscaling.NodeAddedTrigger.run(NodeAddedTrigger.java:161)
	at org.apache.solr.cloud.autoscaling.NodeAddedTriggerTest.testRestoreState(NodeAddedTriggerTest.java:257)
	at sun.reflect.NativeMethodAccessorImpl.invoke0(Native Method)
	at sun.reflect.NativeMethodAccessorImpl.invoke(NativeMethodAccessorImpl.java:62)
	at sun.reflect.DelegatingMethodAccessorImpl.invoke(DelegatingMethodAccessorImpl.java:43)
	at java.lang.reflect.Method.invoke(Method.java:498)
	at com.carrotsearch.randomizedtesting.RandomizedRunner.invoke(RandomizedRunner.java:1737)
	at com.carrotsearch.randomizedtesting.RandomizedRunner$8.evaluate(RandomizedRunner.java:934)
	at com.carrotsearch.randomizedtesting.RandomizedRunner$9.evaluate(RandomizedRunner.java:970)
	at com.carrotsearch.randomizedtesting.RandomizedRunner$10.evaluate(RandomizedRunner.java:984)
	at com.carrotsearch.randomizedtesting.rules.SystemPropertiesRestoreRule$1.evaluate(SystemPropertiesRestoreRule.java:57)
	at org.apache.lucene.util.TestRuleSetupTeardownChained$1.evaluate(TestRuleSetupTeardownChained.java:49)
	at org.apache.lucene.util.AbstractBeforeAfterRule$1.evaluate(AbstractBeforeAfterRule.java:45)
	at org.apache.lucene.util.TestRuleThreadAndTestName$1.evaluate(TestRuleThreadAndTestName.java:48)
	at org.apache.lucene.util.TestRuleIgnoreAfterMaxFailures$1.evaluate(TestRuleIgnoreAfterMaxFailures.java:64)
	at org.apache.lucene.util.TestRuleMarkFailure$1.evaluate(TestRuleMarkFailure.java:47)
	at com.carrotsearch.randomizedtesting.rules.StatementAdapter.evaluate(StatementAdapter.java:36)
	at com.carrotsearch.randomizedtesting.ThreadLeakControl$StatementRunner.run(ThreadLeakControl.java:368)
	at com.carrotsearch.randomizedtesting.ThreadLeakControl.forkTimeoutingTask(ThreadLeakControl.java:817)
	at com.carrotsearch.randomizedtesting.ThreadLeakControl$3.evaluate(ThreadLeakControl.java:468)
	at com.carrotsearch.randomizedtesting.RandomizedRunner.runSingleTest(RandomizedRunner.java:943)
	at com.carrotsearch.randomizedtesting.RandomizedRunner$5.evaluate(RandomizedRunner.java:829)
	at com.carrotsearch.randomizedtesting.RandomizedRunner$6.evaluate(RandomizedRunner.java:879)
	at com.carrotsearch.randomizedtesting.RandomizedRunner$7.evaluate(RandomizedRunner.java:890)
	at com.carrotsearch.randomizedtesting.rules.StatementAdapter.evaluate(StatementAdapter.java:36)
	at com.carrotsearch.randomizedtesting.rules.SystemPropertiesRestoreRule$1.evaluate(SystemPropertiesRestoreRule.java:57)
	at org.apache.lucene.util.AbstractBeforeAfterRule$1.evaluate(AbstractBeforeAfterRule.java:45)
	at com.carrotsearch.randomizedtesting.rules.StatementAdapter.evaluate(StatementAdapter.java:36)
	at org.apache.lucene.util.TestRuleStoreClassName$1.evaluate(TestRuleStoreClassName.java:41)
	at com.carrotsearch.randomizedtesting.rules.NoShadowingOrOverridesOnMethodsRule$1.evaluate(NoShadowingOrOverridesOnMethodsRule.java:40)
	at com.carrotsearch.randomizedtesting.rules.NoShadowingOrOverridesOnMethodsRule$1.evaluate(NoShadowingOrOverridesOnMethodsRule.java:40)
	at com.carrotsearch.randomizedtesting.rules.StatementAdapter.evaluate(StatementAdapter.java:36)
	at com.carrotsearch.randomizedtesting.rules.StatementAdapter.evaluate(StatementAdapter.java:36)
	at com.carrotsearch.randomizedtesting.rules.StatementAdapter.evaluate(StatementAdapter.java:36)
	at org.apache.lucene.util.TestRuleAssertionsRequired$1.evaluate(TestRuleAssertionsRequired.java:53)
	at org.apache.lucene.util.TestRuleMarkFailure$1.evaluate(TestRuleMarkFailure.java:47)
	at org.apache.lucene.util.TestRuleIgnoreAfterMaxFailures$1.evaluate(TestRuleIgnoreAfterMaxFailures.java:64)
	at org.apache.lucene.util.TestRuleIgnoreTestSuites$1.evaluate(TestRuleIgnoreTestSuites.java:54)
	at com.carrotsearch.randomizedtesting.rules.StatementAdapter.evaluate(StatementAdapter.java:36)
	at com.carrotsearch.randomizedtesting.ThreadLeakControl$StatementRunner.run(ThreadLeakControl.java:368)
	at java.lang.Thread.run(Thread.java:748)


FAILED:  org.apache.solr.cloud.autoscaling.NodeAddedTriggerTest.testRestoreState

Error Message:
Did not expect the processor to fire on first run! event={   "id":"42536d3d83488Tawwmdzrrpohyssrv3j43cjsl7",   "source":"node_added_trigger",   "eventTime":1166817319466120,   "eventType":"NODEADDED",   "properties":{     "eventTimes":[1166817319466120],     "nodeNames":["127.0.0.1:41525_solr"]}}

Stack Trace:
java.lang.AssertionError: Did not expect the processor to fire on first run! event={
  "id":"42536d3d83488Tawwmdzrrpohyssrv3j43cjsl7",
  "source":"node_added_trigger",
  "eventTime":1166817319466120,
  "eventType":"NODEADDED",
  "properties":{
    "eventTimes":[1166817319466120],
    "nodeNames":["127.0.0.1:41525_solr"]}}
	at __randomizedtesting.SeedInfo.seed([64A1796B6961123E:AA0FDDF891586A28]:0)
	at org.junit.Assert.fail(Assert.java:93)
	at org.apache.solr.cloud.autoscaling.NodeAddedTriggerTest.lambda$new$0(NodeAddedTriggerTest.java:49)
	at org.apache.solr.cloud.autoscaling.NodeAddedTrigger.run(NodeAddedTrigger.java:161)
	at org.apache.solr.cloud.autoscaling.NodeAddedTriggerTest.testRestoreState(NodeAddedTriggerTest.java:257)
	at sun.reflect.NativeMethodAccessorImpl.invoke0(Native Method)
	at sun.reflect.NativeMethodAccessorImpl.invoke(NativeMethodAccessorImpl.java:62)
	at sun.reflect.DelegatingMethodAccessorImpl.invoke(DelegatingMethodAccessorImpl.java:43)
	at java.lang.reflect.Method.invoke(Method.java:498)
	at com.carrotsearch.randomizedtesting.RandomizedRunner.invoke(RandomizedRunner.java:1737)
	at com.carrotsearch.randomizedtesting.RandomizedRunner$8.evaluate(RandomizedRunner.java:934)
	at com.carrotsearch.randomizedtesting.RandomizedRunner$9.evaluate(RandomizedRunner.java:970)
	at com.carrotsearch.randomizedtesting.RandomizedRunner$10.evaluate(RandomizedRunner.java:984)
	at com.carrotsearch.randomizedtesting.rules.SystemPropertiesRestoreRule$1.evaluate(SystemPropertiesRestoreRule.java:57)
	at org.apache.lucene.util.TestRuleSetupTeardownChained$1.evaluate(TestRuleSetupTeardownChained.java:49)
	at org.apache.lucene.util.AbstractBeforeAfterRule$1.evaluate(AbstractBeforeAfterRule.java:45)
	at org.apache.lucene.util.TestRuleThreadAndTestName$1.evaluate(TestRuleThreadAndTestName.java:48)
	at org.apache.lucene.util.TestRuleIgnoreAfterMaxFailures$1.evaluate(TestRuleIgnoreAfterMaxFailures.java:64)
	at org.apache.lucene.util.TestRuleMarkFailure$1.evaluate(TestRuleMarkFailure.java:47)
	at com.carrotsearch.randomizedtesting.rules.StatementAdapter.evaluate(StatementAdapter.java:36)
	at com.carrotsearch.randomizedtesting.ThreadLeakControl$StatementRunner.run(ThreadLeakControl.java:368)
	at com.carrotsearch.randomizedtesting.ThreadLeakControl.forkTimeoutingTask(ThreadLeakControl.java:817)
	at com.carrotsearch.randomizedtesting.ThreadLeakControl$3.evaluate(ThreadLeakControl.java:468)
	at com.carrotsearch.randomizedtesting.RandomizedRunner.runSingleTest(RandomizedRunner.java:943)
	at com.carrotsearch.randomizedtesting.RandomizedRunner$5.evaluate(RandomizedRunner.java:829)
	at com.carrotsearch.randomizedtesting.RandomizedRunner$6.evaluate(RandomizedRunner.java:879)
	at com.carrotsearch.randomizedtesting.RandomizedRunner$7.evaluate(RandomizedRunner.java:890)
	at com.carrotsearch.randomizedtesting.rules.StatementAdapter.evaluate(StatementAdapter.java:36)
	at com.carrotsearch.randomizedtesting.rules.SystemPropertiesRestoreRule$1.evaluate(SystemPropertiesRestoreRule.java:57)
	at org.apache.lucene.util.AbstractBeforeAfterRule$1.evaluate(AbstractBeforeAfterRule.java:45)
	at com.carrotsearch.randomizedtesting.rules.StatementAdapter.evaluate(StatementAdapter.java:36)
	at org.apache.lucene.util.TestRuleStoreClassName$1.evaluate(TestRuleStoreClassName.java:41)
	at com.carrotsearch.randomizedtesting.rules.NoShadowingOrOverridesOnMethodsRule$1.evaluate(NoShadowingOrOverridesOnMethodsRule.java:40)
	at com.carrotsearch.randomizedtesting.rules.NoShadowingOrOverridesOnMethodsRule$1.evaluate(NoShadowingOrOverridesOnMethodsRule.java:40)
	at com.carrotsearch.randomizedtesting.rules.StatementAdapter.evaluate(StatementAdapter.java:36)
	at com.carrotsearch.randomizedtesting.rules.StatementAdapter.evaluate(StatementAdapter.java:36)
	at com.carrotsearch.randomizedtesting.rules.StatementAdapter.evaluate(StatementAdapter.java:36)
	at org.apache.lucene.util.TestRuleAssertionsRequired$1.evaluate(TestRuleAssertionsRequired.java:53)
	at org.apache.lucene.util.TestRuleMarkFailure$1.evaluate(TestRuleMarkFailure.java:47)
	at org.apache.lucene.util.TestRuleIgnoreAfterMaxFailures$1.evaluate(TestRuleIgnoreAfterMaxFailures.java:64)
	at org.apache.lucene.util.TestRuleIgnoreTestSuites$1.evaluate(TestRuleIgnoreTestSuites.java:54)
	at com.carrotsearch.randomizedtesting.rules.StatementAdapter.evaluate(StatementAdapter.java:36)
	at com.carrotsearch.randomizedtesting.ThreadLeakControl$StatementRunner.run(ThreadLeakControl.java:368)
	at java.lang.Thread.run(Thread.java:748)


FAILED:  org.apache.solr.cloud.autoscaling.NodeAddedTriggerTest.testRestoreState

Error Message:
Did not expect the processor to fire on first run! event={   "id":"423f199b76200Tawwmdzrrpohyssrv3j43cjzv7",   "source":"node_added_trigger",   "eventTime":1165420479865344,   "eventType":"NODEADDED",   "properties":{     "eventTimes":[1165420479865344],     "nodeNames":["127.0.0.1:41923_solr"]}}

Stack Trace:
java.lang.AssertionError: Did not expect the processor to fire on first run! event={
  "id":"423f199b76200Tawwmdzrrpohyssrv3j43cjzv7",
  "source":"node_added_trigger",
  "eventTime":1165420479865344,
  "eventType":"NODEADDED",
  "properties":{
    "eventTimes":[1165420479865344],
    "nodeNames":["127.0.0.1:41923_solr"]}}
	at __randomizedtesting.SeedInfo.seed([64A1796B6961123E:AA0FDDF891586A28]:0)
	at org.junit.Assert.fail(Assert.java:93)
	at org.apache.solr.cloud.autoscaling.NodeAddedTriggerTest.lambda$new$0(NodeAddedTriggerTest.java:49)
	at org.apache.solr.cloud.autoscaling.NodeAddedTrigger.run(NodeAddedTrigger.java:161)
	at org.apache.solr.cloud.autoscaling.NodeAddedTriggerTest.testRestoreState(NodeAddedTriggerTest.java:257)
	at sun.reflect.NativeMethodAccessorImpl.invoke0(Native Method)
	at sun.reflect.NativeMethodAccessorImpl.invoke(NativeMethodAccessorImpl.java:62)
	at sun.reflect.DelegatingMethodAccessorImpl.invoke(DelegatingMethodAccessorImpl.java:43)
	at java.lang.reflect.Method.invoke(Method.java:498)
	at com.carrotsearch.randomizedtesting.RandomizedRunner.invoke(RandomizedRunner.java:1737)
	at com.carrotsearch.randomizedtesting.RandomizedRunner$8.evaluate(RandomizedRunner.java:934)
	at com.carrotsearch.randomizedtesting.RandomizedRunner$9.evaluate(RandomizedRunner.java:970)
	at com.carrotsearch.randomizedtesting.RandomizedRunner$10.evaluate(RandomizedRunner.java:984)
	at com.carrotsearch.randomizedtesting.rules.SystemPropertiesRestoreRule$1.evaluate(SystemPropertiesRestoreRule.java:57)
	at org.apache.lucene.util.TestRuleSetupTeardownChained$1.evaluate(TestRuleSetupTeardownChained.java:49)
	at org.apache.lucene.util.AbstractBeforeAfterRule$1.evaluate(AbstractBeforeAfterRule.java:45)
	at org.apache.lucene.util.TestRuleThreadAndTestName$1.evaluate(TestRuleThreadAndTestName.java:48)
	at org.apache.lucene.util.TestRuleIgnoreAfterMaxFailures$1.evaluate(TestRuleIgnoreAfterMaxFailures.java:64)
	at org.apache.lucene.util.TestRuleMarkFailure$1.evaluate(TestRuleMarkFailure.java:47)
	at com.carrotsearch.randomizedtesting.rules.StatementAdapter.evaluate(StatementAdapter.java:36)
	at com.carrotsearch.randomizedtesting.ThreadLeakControl$StatementRunner.run(ThreadLeakControl.java:368)
	at com.carrotsearch.randomizedtesting.ThreadLeakControl.forkTimeoutingTask(ThreadLeakControl.java:817)
	at com.carrotsearch.randomizedtesting.ThreadLeakControl$3.evaluate(ThreadLeakControl.java:468)
	at com.carrotsearch.randomizedtesting.RandomizedRunner.runSingleTest(RandomizedRunner.java:943)
	at com.carrotsearch.randomizedtesting.RandomizedRunner$5.evaluate(RandomizedRunner.java:829)
	at com.carrotsearch.randomizedtesting.RandomizedRunner$6.evaluate(RandomizedRunner.java:879)
	at com.carrotsearch.randomizedtesting.RandomizedRunner$7.evaluate(RandomizedRunner.java:890)
	at com.carrotsearch.randomizedtesting.rules.StatementAdapter.evaluate(StatementAdapter.java:36)
	at com.carrotsearch.randomizedtesting.rules.SystemPropertiesRestoreRule$1.evaluate(SystemPropertiesRestoreRule.java:57)
	at org.apache.lucene.util.AbstractBeforeAfterRule$1.evaluate(AbstractBeforeAfterRule.java:45)
	at com.carrotsearch.randomizedtesting.rules.StatementAdapter.evaluate(StatementAdapter.java:36)
	at org.apache.lucene.util.TestRuleStoreClassName$1.evaluate(TestRuleStoreClassName.java:41)
	at com.carrotsearch.randomizedtesting.rules.NoShadowingOrOverridesOnMethodsRule$1.evaluate(NoShadowingOrOverridesOnMethodsRule.java:40)
	at com.carrotsearch.randomizedtesting.rules.NoShadowingOrOverridesOnMethodsRule$1.evaluate(NoShadowingOrOverridesOnMethodsRule.java:40)
	at com.carrotsearch.randomizedtesting.rules.StatementAdapter.evaluate(StatementAdapter.java:36)
	at com.carrotsearch.randomizedtesting.rules.StatementAdapter.evaluate(StatementAdapter.java:36)
	at com.carrotsearch.randomizedtesting.rules.StatementAdapter.evaluate(StatementAdapter.java:36)
	at org.apache.lucene.util.TestRuleAssertionsRequired$1.evaluate(TestRuleAssertionsRequired.java:53)
	at org.apache.lucene.util.TestRuleMarkFailure$1.evaluate(TestRuleMarkFailure.java:47)
	at org.apache.lucene.util.TestRuleIgnoreAfterMaxFailures$1.evaluate(TestRuleIgnoreAfterMaxFailures.java:64)
	at org.apache.lucene.util.TestRuleIgnoreTestSuites$1.evaluate(TestRuleIgnoreTestSuites.java:54)
	at com.carrotsearch.randomizedtesting.rules.StatementAdapter.evaluate(StatementAdapter.java:36)
	at com.carrotsearch.randomizedtesting.ThreadLeakControl$StatementRunner.run(ThreadLeakControl.java:368)
	at java.lang.Thread.run(Thread.java:748)




Build Log:
[...truncated 14510 lines...]
   [junit4] Suite: org.apache.solr.cloud.autoscaling.NodeAddedTriggerTest
   [junit4]   2> 2569625 INFO  (SUITE-NodeAddedTriggerTest-seed#[64A1796B6961123E]-worker) [    ] o.a.s.SolrTestCaseJ4 SecureRandom sanity checks: test.solr.allowed.securerandom=null & java.security.egd=file:/dev/./urandom
   [junit4]   2> Creating dataDir: /home/jenkins/workspace/Lucene-Solr-master-Linux/solr/build/solr-core/test/J0/temp/solr.cloud.autoscaling.NodeAddedTriggerTest_64A1796B6961123E-001/init-core-data-001
   [junit4]   2> 2569625 INFO  (SUITE-NodeAddedTriggerTest-seed#[64A1796B6961123E]-worker) [    ] o.a.s.SolrTestCaseJ4 Using PointFields (NUMERIC_POINTS_SYSPROP=true) w/NUMERIC_DOCVALUES_SYSPROP=true
   [junit4]   2> 2569627 INFO  (SUITE-NodeAddedTriggerTest-seed#[64A1796B6961123E]-worker) [    ] o.a.s.SolrTestCaseJ4 Randomized ssl (false) and clientAuth (true) via: @org.apache.solr.util.RandomizeSSL(reason=, ssl=NaN, value=NaN, clientAuth=NaN)
   [junit4]   2> 2569628 INFO  (SUITE-NodeAddedTriggerTest-seed#[64A1796B6961123E]-worker) [    ] o.a.s.c.MiniSolrCloudCluster Starting cluster of 1 servers in /home/jenkins/workspace/Lucene-Solr-master-Linux/solr/build/solr-core/test/J0/temp/solr.cloud.autoscaling.NodeAddedTriggerTest_64A1796B6961123E-001/tempDir-001
   [junit4]   2> 2569628 INFO  (SUITE-NodeAddedTriggerTest-seed#[64A1796B6961123E]-worker) [    ] o.a.s.c.ZkTestServer STARTING ZK TEST SERVER
   [junit4]   2> 2569628 INFO  (Thread-5598) [    ] o.a.s.c.ZkTestServer client port:0.0.0.0/0.0.0.0:0
   [junit4]   2> 2569628 INFO  (Thread-5598) [    ] o.a.s.c.ZkTestServer Starting server
   [junit4]   2> 2569632 ERROR (Thread-5598) [    ] o.a.z.s.ZooKeeperServer ZKShutdownHandler is not registered, so ZooKeeper server won't take any action on ERROR or SHUTDOWN server state changes
   [junit4]   2> 2569729 INFO  (SUITE-NodeAddedTriggerTest-seed#[64A1796B6961123E]-worker) [    ] o.a.s.c.ZkTestServer start zk server on port:37637
   [junit4]   2> 2569731 INFO  (zkConnectionManagerCallback-9846-thread-1) [    ] o.a.s.c.c.ConnectionManager zkClient has connected
   [junit4]   2> 2569734 INFO  (jetty-launcher-9843-thread-1) [    ] o.e.j.s.Server jetty-9.4.10.v20180503; built: 2018-05-03T15:56:21.710Z; git: daa59876e6f384329b122929e70a80934569428c; jvm 1.8.0_162-b12
   [junit4]   2> 2569735 INFO  (jetty-launcher-9843-thread-1) [    ] o.e.j.s.session DefaultSessionIdManager workerName=node0
   [junit4]   2> 2569735 INFO  (jetty-launcher-9843-thread-1) [    ] o.e.j.s.session No SessionScavenger set, using defaults
   [junit4]   2> 2569735 INFO  (jetty-launcher-9843-thread-1) [    ] o.e.j.s.session node0 Scavenging every 600000ms
   [junit4]   2> 2569735 INFO  (jetty-launcher-9843-thread-1) [    ] o.e.j.s.h.ContextHandler Started o.e.j.s.ServletContextHandler@1b47c07{/solr,null,AVAILABLE}
   [junit4]   2> 2569736 INFO  (jetty-launcher-9843-thread-1) [    ] o.e.j.s.AbstractConnector Started ServerConnector@1f39038{HTTP/1.1,[http/1.1]}{127.0.0.1:41923}
   [junit4]   2> 2569736 INFO  (jetty-launcher-9843-thread-1) [    ] o.e.j.s.Server Started @2569770ms
   [junit4]   2> 2569736 INFO  (jetty-launcher-9843-thread-1) [    ] o.a.s.c.s.e.JettySolrRunner Jetty properties: {hostContext=/solr, hostPort=41923}
   [junit4]   2> 2569736 ERROR (jetty-launcher-9843-thread-1) [    ] o.a.s.u.StartupLoggingUtils Missing Java Option solr.log.dir. Logging may be missing or incomplete.
   [junit4]   2> 2569736 INFO  (jetty-launcher-9843-thread-1) [    ] o.a.s.s.SolrDispatchFilter Using logger factory org.apache.logging.slf4j.Log4jLoggerFactory
   [junit4]   2> 2569736 INFO  (jetty-launcher-9843-thread-1) [    ] o.a.s.s.SolrDispatchFilter  ___      _       Welcome to Apache Solr™ version 8.0.0
   [junit4]   2> 2569736 INFO  (jetty-launcher-9843-thread-1) [    ] o.a.s.s.SolrDispatchFilter / __| ___| |_ _   Starting in cloud mode on port null
   [junit4]   2> 2569736 INFO  (jetty-launcher-9843-thread-1) [    ] o.a.s.s.SolrDispatchFilter \__ \/ _ \ | '_|  Install dir: null
   [junit4]   2> 2569736 INFO  (jetty-launcher-9843-thread-1) [    ] o.a.s.s.SolrDispatchFilter |___/\___/_|_|    Start time: 2018-05-09T20:57:06.512Z
   [junit4]   2> 2569738 INFO  (zkConnectionManagerCallback-9848-thread-1) [    ] o.a.s.c.c.ConnectionManager zkClient has connected
   [junit4]   2> 2569738 INFO  (jetty-launcher-9843-thread-1) [    ] o.a.s.s.SolrDispatchFilter solr.xml found in ZooKeeper. Loading...
   [junit4]   2> 2569753 INFO  (jetty-launcher-9843-thread-1) [    ] o.a.s.c.ZkContainer Zookeeper client=127.0.0.1:37637/solr
   [junit4]   2> 2569755 INFO  (zkConnectionManagerCallback-9852-thread-1) [    ] o.a.s.c.c.ConnectionManager zkClient has connected
   [junit4]   2> 2569757 INFO  (zkConnectionManagerCallback-9854-thread-1) [    ] o.a.s.c.c.ConnectionManager zkClient has connected
   [junit4]   2> 2569816 INFO  (jetty-launcher-9843-thread-1) [n:127.0.0.1:41923_solr    ] o.a.s.c.Overseer Overseer (id=null) closing
   [junit4]   2> 2569816 INFO  (jetty-launcher-9843-thread-1) [n:127.0.0.1:41923_solr    ] o.a.s.c.OverseerElectionContext I am going to be the leader 127.0.0.1:41923_solr
   [junit4]   2> 2569816 INFO  (jetty-launcher-9843-thread-1) [n:127.0.0.1:41923_solr    ] o.a.s.c.Overseer Overseer (id=72133970960318467-127.0.0.1:41923_solr-n_0000000000) starting
   [junit4]   2> 2569821 INFO  (zkConnectionManagerCallback-9861-thread-1) [    ] o.a.s.c.c.ConnectionManager zkClient has connected
   [junit4]   2> 2569822 INFO  (jetty-launcher-9843-thread-1) [n:127.0.0.1:41923_solr    ] o.a.s.c.s.i.ZkClientClusterStateProvider Cluster at 127.0.0.1:37637/solr ready
   [junit4]   2> 2569824 INFO  (jetty-launcher-9843-thread-1) [n:127.0.0.1:41923_solr    ] o.a.s.c.ZkController Register node as live in ZooKeeper:/live_nodes/127.0.0.1:41923_solr
   [junit4]   2> 2569836 INFO  (zkCallback-9860-thread-1) [    ] o.a.s.c.c.ZkStateReader Updated live nodes from ZooKeeper... (0) -> (1)
   [junit4]   2> 2569836 INFO  (zkCallback-9853-thread-1) [    ] o.a.s.c.c.ZkStateReader Updated live nodes from ZooKeeper... (0) -> (1)
   [junit4]   2> 2570667 INFO  (jetty-launcher-9843-thread-1) [n:127.0.0.1:41923_solr    ] o.a.s.m.r.SolrJmxReporter JMX monitoring for 'solr_41923.solr.node' (registry 'solr.node') enabled at server: com.sun.jmx.mbeanserver.JmxMBeanServer@15b6f73
   [junit4]   2> 2570688 INFO  (jetty-launcher-9843-thread-1) [n:127.0.0.1:41923_solr    ] o.a.s.m.r.SolrJmxReporter JMX monitoring for 'solr_41923.solr.jvm' (registry 'solr.jvm') enabled at server: com.sun.jmx.mbeanserver.JmxMBeanServer@15b6f73
   [junit4]   2> 2570688 INFO  (jetty-launcher-9843-thread-1) [n:127.0.0.1:41923_solr    ] o.a.s.m.r.SolrJmxReporter JMX monitoring for 'solr_41923.solr.jetty' (registry 'solr.jetty') enabled at server: com.sun.jmx.mbeanserver.JmxMBeanServer@15b6f73
   [junit4]   2> 2570690 INFO  (jetty-launcher-9843-thread-1) [n:127.0.0.1:41923_solr    ] o.a.s.c.CorePropertiesLocator Found 0 core definitions underneath /home/jenkins/workspace/Lucene-Solr-master-Linux/solr/build/solr-core/test/J0/temp/solr.cloud.autoscaling.NodeAddedTriggerTest_64A1796B6961123E-001/tempDir-001/node1/.
   [junit4]   2> 2570721 INFO  (zkConnectionManagerCallback-9863-thread-1) [    ] o.a.s.c.c.ConnectionManager zkClient has connected
   [junit4]   2> 2570736 INFO  (zkConnectionManagerCallback-9868-thread-1) [    ] o.a.s.c.c.ConnectionManager zkClient has connected
   [junit4]   2> 2570737 INFO  (SUITE-NodeAddedTriggerTest-seed#[64A1796B6961123E]-worker) [    ] o.a.s.c.c.ZkStateReader Updated live nodes from ZooKeeper... (0) -> (1)
   [junit4]   2> 2570738 INFO  (SUITE-NodeAddedTriggerTest-seed#[64A1796B6961123E]-worker) [    ] o.a.s.c.s.i.ZkClientClusterStateProvider Cluster at 127.0.0.1:37637/solr ready
   [junit4]   2> 2570763 INFO  (TEST-NodeAddedTriggerTest.testRestoreState-seed#[64A1796B6961123E]) [    ] o.a.s.SolrTestCaseJ4 ###Starting testRestoreState
   [junit4]   2> 2570764 INFO  (TEST-NodeAddedTriggerTest.testRestoreState-seed#[64A1796B6961123E]) [    ] o.e.j.s.Server jetty-9.4.10.v20180503; built: 2018-05-03T15:56:21.710Z; git: daa59876e6f384329b122929e70a80934569428c; jvm 1.8.0_162-b12
   [junit4]   2> 2570768 INFO  (TEST-NodeAddedTriggerTest.testRestoreState-seed#[64A1796B6961123E]) [    ] o.e.j.s.session DefaultSessionIdManager workerName=node0
   [junit4]   2> 2570768 INFO  (TEST-NodeAddedTriggerTest.testRestoreState-seed#[64A1796B6961123E]) [    ] o.e.j.s.session No SessionScavenger set, using defaults
   [junit4]   2> 2570768 INFO  (TEST-NodeAddedTriggerTest.testRestoreState-seed#[64A1796B6961123E]) [    ] o.e.j.s.session node0 Scavenging every 660000ms
   [junit4]   2> 2570768 INFO  (TEST-NodeAddedTriggerTest.testRestoreState-seed#[64A1796B6961123E]) [    ] o.e.j.s.h.ContextHandler Started o.e.j.s.ServletContextHandler@c93861{/solr,null,AVAILABLE}
   [junit4]   2> 2570769 INFO  (TEST-NodeAddedTriggerTest.testRestoreState-seed#[64A1796B6961123E]) [    ] o.e.j.s.AbstractConnector Started ServerConnector@dfdda2{HTTP/1.1,[http/1.1]}{127.0.0.1:42821}
   [junit4]   2> 2570769 INFO  (TEST-NodeAddedTriggerTest.testRestoreState-seed#[64A1796B6961123E]) [    ] o.e.j.s.Server Started @2570803ms
   [junit4]   2> 2570769 INFO  (TEST-NodeAddedTriggerTest.testRestoreState-seed#[64A1796B6961123E]) [    ] o.a.s.c.s.e.JettySolrRunner Jetty properties: {hostContext=/solr, hostPort=42821}
   [junit4]   2> 2570769 ERROR (TEST-NodeAddedTriggerTest.testRestoreState-seed#[64A1796B6961123E]) [    ] o.a.s.u.StartupLoggingUtils Missing Java Option solr.log.dir. Logging may be missing or incomplete.
   [junit4]   2> 2570769 INFO  (TEST-NodeAddedTriggerTest.testRestoreState-seed#[64A1796B6961123E]) [    ] o.a.s.s.SolrDispatchFilter Using logger factory org.apache.logging.slf4j.Log4jLoggerFactory
   [junit4]   2> 2570770 INFO  (TEST-NodeAddedTriggerTest.testRestoreState-seed#[64A1796B6961123E]) [    ] o.a.s.s.SolrDispatchFilter  ___      _       Welcome to Apache Solr™ version 8.0.0
   [junit4]   2> 2570770 INFO  (TEST-NodeAddedTriggerTest.testRestoreState-seed#[64A1796B6961123E]) [    ] o.a.s.s.SolrDispatchFilter / __| ___| |_ _   Starting in cloud mode on port null
   [junit4]   2> 2570770 INFO  (TEST-NodeAddedTriggerTest.testRestoreState-seed#[64A1796B6961123E]) [    ] o.a.s.s.SolrDispatchFilter \__ \/ _ \ | '_|  Install dir: null
   [junit4]   2> 2570770 INFO  (TEST-NodeAddedTriggerTest.testRestoreState-seed#[64A1796B6961123E]) [    ] o.a.s.s.SolrDispatchFilter |___/\___/_|_|    Start time: 2018-05-09T20:57:07.546Z
   [junit4]   2> 2570775 INFO  (zkConnectionManagerCallback-9870-thread-1) [    ] o.a.s.c.c.ConnectionManager zkClient has connected
   [junit4]   2> 2570775 INFO  (TEST-NodeAddedTriggerTest.testRestoreState-seed#[64A1796B6961123E]) [    ] o.a.s.s.SolrDispatchFilter solr.xml found in ZooKeeper. Loading...
   [junit4]   2> 2570804 INFO  (TEST-NodeAddedTriggerTest.testRestoreState-seed#[64A1796B6961123E]) [    ] o.a.s.c.ZkContainer Zookeeper client=127.0.0.1:37637/solr
   [junit4]   2> 2570805 INFO  (zkConnectionManagerCallback-9874-thread-1) [    ] o.a.s.c.c.ConnectionManager zkClient has connected
   [junit4]   2> 2570808 INFO  (zkConnectionManagerCallback-9876-thread-1) [    ] o.a.s.c.c.ConnectionManager zkClient has connected
   [junit4]   2> 2570813 INFO  (TEST-NodeAddedTriggerTest.testRestoreState-seed#[64A1796B6961123E]) [n:127.0.0.1:42821_solr    ] o.a.s.c.c.ZkStateReader Updated live nodes from ZooKeeper... (0) -> (1)
   [junit4]   2> 2570816 INFO  (TEST-NodeAddedTriggerTest.testRestoreState-seed#[64A1796B6961123E]) [n:127.0.0.1:42821_solr    ] o.a.s.c.Overseer Overseer (id=null) closing
   [junit4]   2> 2570818 INFO  (TEST-NodeAddedTriggerTest.testRestoreState-seed#[64A1796B6961123E]) [n:127.0.0.1:42821_solr    ] o.a.s.c.TransientSolrCoreCacheDefault Allocating transient cache for 2147483647 transient cores
   [junit4]   2> 2570818 INFO  (TEST-NodeAddedTriggerTest.testRestoreState-seed#[64A1796B6961123E]) [n:127.0.0.1:42821_solr    ] o.a.s.c.ZkController Register node as live in ZooKeeper:/live_nodes/127.0.0.1:42821_solr
   [junit4]   2> 2570819 INFO  (zkCallback-9860-thread-1) [    ] o.a.s.c.c.ZkStateReader Updated live nodes from ZooKeeper... (1) -> (2)
   [junit4]   2> 2570819 INFO  (zkCallback-9853-thread-1) [    ] o.a.s.c.c.ZkStateReader Updated live nodes from ZooKeeper... (1) -> (2)
   [junit4]   2> 2570820 INFO  (zkCallback-9867-thread-1) [    ] o.a.s.c.c.ZkStateReader Updated live nodes from ZooKeeper... (1) -> (2)
   [junit4]   2> 2570820 INFO  (zkCallback-9875-thread-1) [    ] o.a.s.c.c.ZkStateReader Updated live nodes from ZooKeeper... (1) -> (2)
   [junit4]   2> 2571728 INFO  (TEST-NodeAddedTriggerTest.testRestoreState-seed#[64A1796B6961123E]) [n:127.0.0.1:42821_solr    ] o.a.s.m.r.SolrJmxReporter JMX monitoring for 'solr_42821.solr.node' (registry 'solr.node') enabled at server: com.sun.jmx.mbeanserver.JmxMBeanServer@15b6f73
   [junit4]   2> 2571738 INFO  (TEST-NodeAddedTriggerTest.testRestoreState-seed#[64A1796B6961123E]) [n:127.0.0.1:42821_solr    ] o.a.s.m.r.SolrJmxReporter JMX monitoring for 'solr_42821.solr.jvm' (registry 'solr.jvm') enabled at server: com.sun.jmx.mbeanserver.JmxMBeanServer@15b6f73
   [junit4]   2> 2571739 INFO  (TEST-NodeAddedTriggerTest.testRestoreState-seed#[64A1796B6961123E]) [n:127.0.0.1:42821_solr    ] o.a.s.m.r.SolrJmxReporter JMX monitoring for 'solr_42821.solr.jetty' (registry 'solr.jetty') enabled at server: com.sun.jmx.mbeanserver.JmxMBeanServer@15b6f73
   [junit4]   2> 2571740 INFO  (TEST-NodeAddedTriggerTest.testRestoreState-seed#[64A1796B6961123E]) [n:127.0.0.1:42821_solr    ] o.a.s.c.CorePropertiesLocator Found 0 core definitions underneath /home/jenkins/workspace/Lucene-Solr-master-Linux/solr/build/solr-core/test/J0/temp/solr.cloud.autoscaling.NodeAddedTriggerTest_64A1796B6961123E-001/tempDir-001/node2/.
   [junit4]   2> 2571743 INFO  (zkConnectionManagerCallback-9883-thread-1) [    ] o.a.s.c.c.ConnectionManager zkClient has connected
   [junit4]   2> 2571744 INFO  (TEST-NodeAddedTriggerTest.testRestoreState-seed#[64A1796B6961123E]) [n:127.0.0.1:42821_solr    ] o.a.s.c.c.ZkStateReader Updated live nodes from ZooKeeper... (0) -> (2)
   [junit4]   2> 2571745 INFO  (TEST-NodeAddedTriggerTest.testRestoreState-seed#[64A1796B6961123E]) [n:127.0.0.1:42821_solr    ] o.a.s.c.s.i.ZkClientClusterStateProvider Cluster at 127.0.0.1:37637/solr ready
   [junit4]   2> 2571778 INFO  (TEST-NodeAddedTriggerTest.testRestoreState-seed#[64A1796B6961123E]) [    ] o.a.s.SolrTestCaseJ4 ###Ending testRestoreState
   [junit4]   2> NOTE: reproduce with: ant test  -Dtestcase=NodeAddedTriggerTest -Dtests.method=testRestoreState -Dtests.seed=64A1796B6961123E -Dtests.multiplier=3 -Dtests.slow=true -Dtests.locale=ar-AE -Dtests.timezone=Canada/Newfoundland -Dtests.asserts=true -Dtests.file.encoding=UTF-8
   [junit4] FAILURE 1.04s J0 | NodeAddedTriggerTest.testRestoreState <<<
   [junit4]    > Throwable #1: java.lang.AssertionError: Did not expect the processor to fire on first run! event={
   [junit4]    >   "id":"423f199b76200Tawwmdzrrpohyssrv3j43cjzv7",
   [junit4]    >   "source":"node_added_trigger",
   [junit4]    >   "eventTime":1165420479865344,
   [junit4]    >   "eventType":"NODEADDED",
   [junit4]    >   "properties":{
   [junit4]    >     "eventTimes":[1165420479865344],
   [junit4]    >     "nodeNames":["127.0.0.1:41923_solr"]}}
   [junit4]    > 	at __randomizedtesting.SeedInfo.seed([64A1796B6961123E:AA0FDDF891586A28]:0)
   [junit4]    > 	at org.apache.solr.cloud.autoscaling.NodeAddedTriggerTest.lambda$new$0(NodeAddedTriggerTest.java:49)
   [junit4]    > 	at org.apache.solr.cloud.autoscaling.NodeAddedTrigger.run(NodeAddedTrigger.java:161)
   [junit4]    > 	at org.apache.solr.cloud.autoscaling.NodeAddedTriggerTest.testRestoreState(NodeAddedTriggerTest.java:257)
   [junit4]    > 	at java.lang.Thread.run(Thread.java:748)
   [junit4]   2> 2571795 INFO  (TEST-NodeAddedTriggerTest.testActionLifecycle-seed#[64A1796B6961123E]) [    ] o.a.s.SolrTestCaseJ4 ###Starting testActionLifecycle
   [junit4]   2> 2571797 INFO  (TEST-NodeAddedTriggerTest.testActionLifecycle-seed#[64A1796B6961123E]) [    ] o.a.s.SolrTestCaseJ4 ###Ending testActionLifecycle
   [junit4]   2> 2571814 INFO  (TEST-NodeAddedTriggerTest.testTrigger-seed#[64A1796B6961123E]) [    ] o.a.s.SolrTestCaseJ4 ###Starting testTrigger
   [junit4]   2> 2571815 INFO  (TEST-NodeAddedTriggerTest.testTrigger-seed#[64A1796B6961123E]) [    ] o.e.j.s.Server jetty-9.4.10.v20180503; built: 2018-05-03T15:56:21.710Z; git: daa59876e6f384329b122929e70a80934569428c; jvm 1.8.0_162-b12
   [junit4]   2> 2571816 INFO  (TEST-NodeAddedTriggerTest.testTrigger-seed#[64A1796B6961123E]) [    ] o.e.j.s.session DefaultSessionIdManager workerName=node0
   [junit4]   2> 2571816 INFO  (TEST-NodeAddedTriggerTest.testTrigger-seed#[64A1796B6961123E]) [    ] o.e.j.s.session No SessionScavenger set, using defaults
   [junit4]   2> 2571816 INFO  (TEST-NodeAddedTriggerTest.testTrigger-seed#[64A1796B6961123E]) [    ] o.e.j.s.session node0 Scavenging every 660000ms
   [junit4]   2> 2571816 INFO  (TEST-NodeAddedTriggerTest.testTrigger-seed#[64A1796B6961123E]) [    ] o.e.j.s.h.ContextHandler Started o.e.j.s.ServletContextHandler@4e2641{/solr,null,AVAILABLE}
   [junit4]   2> 2571817 INFO  (TEST-NodeAddedTriggerTest.testTrigger-seed#[64A1796B6961123E]) [    ] o.e.j.s.AbstractConnector Started ServerConnector@2b7c1d{HTTP/1.1,[http/1.1]}{127.0.0.1:42309}
   [junit4]   2> 2571817 INFO  (TEST-NodeAddedTriggerTest.testTrigger-seed#[64A1796B6961123E]) [    ] o.e.j.s.Server Started @2571852ms
   [junit4]   2> 2571817 INFO  (TEST-NodeAddedTriggerTest.testTrigger-seed#[64A1796B6961123E]) [    ] o.a.s.c.s.e.JettySolrRunner Jetty properties: {hostContext=/solr, hostPort=42309}
   [junit4]   2> 2571818 ERROR (TEST-NodeAddedTriggerTest.testTrigger-seed#[64A1796B6961123E]) [    ] o.a.s.u.StartupLoggingUtils Missing Java Option solr.log.dir. Logging may be missing or incomplete.
   [junit4]   2> 2571818 INFO  (TEST-NodeAddedTriggerTest.testTrigger-seed#[64A1796B6961123E]) [    ] o.a.s.s.SolrDispatchFilter Using logger factory org.apache.logging.slf4j.Log4jLoggerFactory
   [junit4]   2> 2571818 INFO  (TEST-NodeAddedTriggerTest.testTrigger-seed#[64A1796B6961123E]) [    ] o.a.s.s.SolrDispatchFilter  ___      _       Welcome to Apache Solr™ version 8.0.0
   [junit4]   2> 2571818 INFO  (TEST-NodeAddedTriggerTest.testTrigger-seed#[64A1796B6961123E]) [    ] o.a.s.s.SolrDispatchFilter / __| ___| |_ _   Starting in cloud mode on port null
   [junit4]   2> 2571818 INFO  (TEST-NodeAddedTriggerTest.testTrigger-seed#[64A1796B6961123E]) [    ] o.a.s.s.SolrDispatchFilter \__ \/ _ \ | '_|  Install dir: null
   [junit4]   2> 2571818 INFO  (TEST-NodeAddedTriggerTest.testTrigger-seed#[64A1796B6961123E]) [    ] o.a.s.s.SolrDispatchFilter |___/\___/_|_|    Start time: 2018-05-09T20:57:08.594Z
   [junit4]   2> 2571819 INFO  (zkConnectionManagerCallback-9885-thread-1) [    ] o.a.s.c.c.ConnectionManager zkClient has connected
   [junit4]   2> 2571820 INFO  (TEST-NodeAddedTriggerTest.testTrigger-seed#[64A1796B6961123E]) [    ] o.a.s.s.SolrDispatchFilter solr.xml found in ZooKeeper. Loading...
   [junit4]   2> 2571842 INFO  (TEST-NodeAddedTriggerTest.testTrigger-seed#[64A1796B6961123E]) [    ] o.a.s.c.ZkContainer Zookeeper client=127.0.0.1:37637/solr
   [junit4]   2> 2571843 INFO  (zkConnectionManagerCallback-9889-thread-1) [    ] o.a.s.c.c.ConnectionManager zkClient has connected
   [junit4]   2> 2571844 INFO  (zkConnectionManagerCallback-9891-thread-1) [    ] o.a.s.c.c.ConnectionManager zkClient has connected
   [junit4]   2> 2571848 INFO  (TEST-NodeAddedTriggerTest.testTrigger-seed#[64A1796B6961123E]) [n:127.0.0.1:42309_solr    ] o.a.s.c.c.ZkStateReader Updated live nodes from ZooKeeper... (0) -> (2)
   [junit4]   2> 2571849 INFO  (TEST-NodeAddedTriggerTest.testTrigger-seed#[64A1796B6961123E]) [n:127.0.0.1:42309_solr    ] o.a.s.c.Overseer Overseer (id=null) closing
   [junit4]   2> 2571851 INFO  (TEST-NodeAddedTriggerTest.testTrigger-seed#[64A1796B6961123E]) [n:127.0.0.1:42309_solr    ] o.a.s.c.TransientSolrCoreCacheDefault Allocating transient cache for 2147483647 transient cores
   [junit4]   2> 2571851 INFO  (TEST-NodeAddedTriggerTest.testTrigger-seed#[64A1796B6961123E]) [n:127.0.0.1:42309_solr    ] o.a.s.c.ZkController Register node as live in ZooKeeper:/live_nodes/127.0.0.1:42309_solr
   [junit4]   2> 2571851 INFO  (zkCallback-9853-thread-1) [    ] o.a.s.c.c.ZkStateReader Updated live nodes from ZooKeeper... (2) -> (3)
   [junit4]   2> 2571851 INFO  (zkCallback-9860-thread-1) [    ] o.a.s.c.c.ZkStateReader Updated live nodes from ZooKeeper... (2) -> (3)
   [junit4]   2> 2571852 INFO  (zkCallback-9867-thread-1) [    ] o.a.s.c.c.ZkStateReader Updated live nodes from ZooKeeper... (2) -> (3)
   [junit4]   2> 2571852 INFO  (zkCallback-9890-thread-1) [    ] o.a.s.c.c.ZkStateReader Updated live nodes from ZooKeeper... (2) -> (3)
   [junit4]   2> 2571852 INFO  (zkCallback-9875-thread-1) [    ] o.a.s.c.c.ZkStateReader Updated live nodes from ZooKeeper... (2) -> (3)
   [junit4]   2> 2571853 INFO  (zkCallback-9882-thread-1) [    ] o.a.s.c.c.ZkStateReader Updated live nodes from ZooKeeper... (2) -> (3)
   [junit4]   2> 2572702 INFO  (TEST-NodeAddedTriggerTest.testTrigger-seed#[64A1796B6961123E]) [n:127.0.0.1:42309_solr    ] o.a.s.m.r.SolrJmxReporter JMX monitoring for 'solr_42309.solr.node' (registry 'solr.node') enabled at server: com.sun.jmx.mbeanserver.JmxMBeanServer@15b6f73
   [junit4]   2> 2572710 INFO  (TEST-NodeAddedTriggerTest.testTrigger-seed#[64A1796B6961123E]) [n:127.0.0.1:42309_solr    ] o.a.s.m.r.SolrJmxReporter JMX monitoring for 'solr_42309.solr.jvm' (registry 'solr.jvm') enabled at server: com.sun.jmx.mbeanserver.JmxMBeanServer@15b6f73
   [junit4]   2> 2572711 INFO  (TEST-NodeAddedTriggerTest.testTrigger-seed#[64A1796B6961123E]) [n:127.0.0.1:42309_solr    ] o.a.s.m.r.SolrJmxReporter JMX monitoring for 'solr_42309.solr.jetty' (registry 'solr.jetty') enabled at server: com.sun.jmx.mbeanserver.JmxMBeanServer@15b6f73
   [junit4]   2> 2572712 INFO  (TEST-NodeAddedTriggerTest.testTrigger-seed#[64A1796B6961123E]) [n:127.0.0.1:42309_solr    ] o.a.s.c.CorePropertiesLocator Found 0 core definitions underneath /home/jenkins/workspace/Lucene-Solr-master-Linux/solr/build/solr-core/test/J0/temp/solr.cloud.autoscaling.NodeAddedTriggerTest_64A1796B6961123E-001/tempDir-001/node3/.
   [junit4]   2> 2572715 INFO  (zkConnectionManagerCallback-9898-thread-1) [    ] o.a.s.c.c.ConnectionManager zkClient has connected
   [junit4]   2> 2572717 INFO  (TEST-NodeAddedTriggerTest.testTrigger-seed#[64A1796B6961123E]) [n:127.0.0.1:42309_solr    ] o.a.s.c.c.ZkStateReader Updated live nodes from ZooKeeper... (0) -> (3)
   [junit4]   2> 2572718 INFO  (TEST-NodeAddedTriggerTest.testTrigger-seed#[64A1796B6961123E]) [n:127.0.0.1:42309_solr    ] o.a.s.c.s.i.ZkClientClusterStateProvider Cluster at 127.0.0.1:37637/solr ready
   [junit4]   2> 2572753 INFO  (TEST-NodeAddedTriggerTest.testTrigger-seed#[64A1796B6961123E]) [    ] o.e.j.s.Server jetty-9.4.10.v20180503; built: 2018-05-03T15:56:21.710Z; git: daa59876e6f384329b122929e70a80934569428c; jvm 1.8.0_162-b12
   [junit4]   2> 2572754 INFO  (TEST-NodeAddedTriggerTest.testTrigger-seed#[64A1796B6961123E]) [    ] o.e.j.s.session DefaultSessionIdManager workerName=node0
   [junit4]   2> 2572754 INFO  (TEST-NodeAddedTriggerTest.testTrigger-seed#[64A1796B6961123E]) [    ] o.e.j.s.session No SessionScavenger set, using defaults
   [junit4]   2> 2572754 INFO  (TEST-NodeAddedTriggerTest.testTrigger-seed#[64A1796B6961123E]) [    ] o.e.j.s.session node0 Scavenging every 660000ms
   [junit4]   2> 2572755 INFO  (TEST-NodeAddedTriggerTest.testTrigger-seed#[64A1796B6961123E]) [    ] o.e.j.s.h.ContextHandler Started o.e.j.s.ServletContextHandler@7aee94{/solr,null,AVAILABLE}
   [junit4]   2> 2572755 INFO  (TEST-NodeAddedTriggerTest.testTrigger-seed#[64A1796B6961123E]) [    ] o.e.j.s.AbstractConnector Started ServerConnector@1ecbba7{HTTP/1.1,[http/1.1]}{127.0.0.1:45297}
   [junit4]   2> 2572755 INFO  (TEST-NodeAddedTriggerTest.testTrigger-seed#[64A1796B6961123E]) [    ] o.e.j.s.Server Started @2572789ms
   [junit4]   2> 2572755 INFO  (TEST-NodeAddedTriggerTest.testTrigger-seed#[64A1796B6961123E]) [    ] o.a.s.c.s.e.JettySolrRunner Jetty properties: {hostContext=/solr, hostPort=45297}
   [junit4]   2> 2572755 ERROR (TEST-NodeAddedTriggerTest.testTrigger-seed#[64A1796B6961123E]) [    ] o.a.s.u.StartupLoggingUtils Missing Java Option solr.log.dir. Logging may be missing or incomplete.
   [junit4]   2> 2572755 INFO  (TEST-NodeAddedTriggerTest.testTrigger-seed#[64A1796B6961123E]) [    ] o.a.s.s.SolrDispatchFilter Using logger factory org.apache.logging.slf4j.Log4jLoggerFactory
   [junit4]   2> 2572756 INFO  (TEST-NodeAddedTriggerTest.testTrigger-seed#[64A1796B6961123E]) [    ] o.a.s.s.SolrDispatchFilter  ___      _       Welcome to Apache Solr™ version 8.0.0
   [junit4]   2> 2572756 INFO  (TEST-NodeAddedTriggerTest.testTrigger-seed#[64A1796B6961123E]) [    ] o.a.s.s.SolrDispatchFilter / __| ___| |_ _   Starting in cloud mode on port null
   [junit4]   2> 2572756 INFO  (TEST-NodeAddedTriggerTest.testTrigger-seed#[64A1796B6961123E]) [    ] o.a.s.s.SolrDispatchFilter \__ \/ _ \ | '_|  Install dir: null
   [junit4]   2> 2572756 INFO  (TEST-NodeAddedTriggerTest.testTrigger-seed#[64A1796B6961123E]) [    ] o.a.s.s.SolrDispatchFilter |___/\___/_|_|    Start time: 2018-05-09T20:57:09.532Z
   [junit4]   2> 2572757 INFO  (zkConnectionManagerCallback-9900-thread-1) [    ] o.a.s.c.c.ConnectionManager zkClient has connected
   [junit4]   2> 2572758 INFO  (TEST-NodeAddedTriggerTest.testTrigger-seed#[64A1796B6961123E]) [    ] o.a.s.s.SolrDispatchFilter solr.xml found in ZooKeeper. Loading...
   [junit4]   2> 2572779 INFO  (TEST-NodeAddedTriggerTest.testTrigger-seed#[64A1796B6961123E]) [    ] o.a.s.c.ZkContainer Zookeeper client=127.0.0.1:37637/solr
   [junit4]   2> 2572780 INFO  (zkConnectionManagerCallback-9904-thread-1) [    ] o.a.s.c.c.ConnectionManager zkClient has connected
   [junit4]   2> 2572782 INFO  (zkConnectionManagerCallback-9906-thread-1) [    ] o.a.s.c.c.ConnectionManager zkClient has connected
   [junit4]   2> 2572786 INFO  (TEST-NodeAddedTriggerTest.testTrigger-seed#[64A1796B6961123E]) [n:127.0.0.1:45297_solr    ] o.a.s.c.c.ZkStateReader Updated live nodes from ZooKeeper... (0) -> (3)
   [junit4]   2> 2572788 INFO  (TEST-NodeAddedTriggerTest.testTrigger-seed#[64A1796B6961123E]) [n:127.0.0.1:45297_solr    ] o.a.s.c.Overseer Overseer (id=null) closing
   [junit4]   2> 2572790 INFO  (TEST-NodeAddedTriggerTest.testTrigger-seed#[64A1796B6961123E]) [n:127.0.0.1:45297_solr    ] o.a.s.c.TransientSolrCoreCacheDefault Allocating transient cache for 2147483647 transient cores
   [junit4]   2> 2572790 INFO  (TEST-NodeAddedTriggerTest.testTrigger-seed#[64A1796B6961123E]) [n:127.0.0.1:45297_solr    ] o.a.s.c.ZkController Register node as live in ZooKeeper:/live_nodes/127.0.0.1:45297_solr
   [junit4]   2> 2572790 INFO  (zkCallback-9875-thread-1) [    ] o.a.s.c.c.ZkStateReader Updated live nodes from ZooKeeper... (3) -> (4)
   [junit4]   2> 2572790 INFO  (zkCallback-9867-thread-1) [    ] o.a.s.c.c.ZkStateReader Updated live nodes from ZooKeeper... (3) -> (4)
   [junit4]   2> 2572790 INFO  (zkCallback-9882-thread-1) [    ] o.a.s.c.c.ZkStateReader Updated live nodes from ZooKeeper... (3) -> (4)
   [junit4]   2> 2572790 INFO  (zkCallback-9853-thread-1) [    ] o.a.s.c.c.ZkStateReader Updated live nodes from ZooKeeper... (3) -> (4)
   [junit4]   2> 2572790 INFO  (zkCallback-9890-thread-1) [    ] o.a.s.c.c.ZkStateReader Updated live nodes from ZooKeeper... (3) -> (4)
   [junit4]   2> 2572791 INFO  (zkCallback-9860-thread-1) [    ] o.a.s.c.c.ZkStateReader Updated live nodes from ZooKeeper... (3) -> (4)
   [junit4]   2> 2572791 INFO  (zkCallback-9897-thread-1) [    ] o.a.s.c.c.ZkStateReader Updated live nodes from ZooKeeper... (3) -> (4)
   [junit4]   2> 2572791 INFO  (zkCallback-9905-thread-1) [    ] o.a.s.c.c.ZkStateReader Updated live nodes from ZooKeeper... (3) -> (4)
   [junit4]   2> 2573713 INFO  (TEST-NodeAddedTriggerTest.testTrigger-seed#[64A1796B6961123E]) [n:127.0.0.1:45297_solr    ] o.a.s.m.r.SolrJmxReporter JMX monitoring for 'solr_45297.solr.node' (registry 'solr.node') enabled at server: com.sun.jmx.mbeanserver.JmxMBeanServer@15b6f73
   [junit4]   2> 2573729 INFO  (TEST-NodeAddedTriggerTest.testTrigger-seed#[64A1796B6961123E]) [n:127.0.0.1:45297_solr    ] o.a.s.m.r.SolrJmxReporter JMX monitoring for 'solr_45297.solr.jvm' (registry 'solr.jvm') enabled at server: com.sun.jmx.mbeanserver.JmxMBeanServer@15b6f73
   [junit4]   2> 2573730 INFO  (TEST-NodeAddedTriggerTest.testTrigger-seed#[64A1796B6961123E]) [n:127.0.0.1:45297_solr    ] o.a.s.m.r.SolrJmxReporter JMX monitoring for 'solr_45297.solr.jetty' (registry 'solr.jetty') enabled at server: com.sun.jmx.mbeanserver.JmxMBeanServer@15b6f73
   [junit4]   2> 2573731 INFO  (TEST-NodeAddedTriggerTest.testTrigger-seed#[64A1796B6961123E]) [n:127.0.0.1:45297_solr    ] o.a.s.c.CorePropertiesLocator Found 0 core definitions underneath /home/jenkins/workspace/Lucene-Solr-master-Linux/solr/build/solr-core/test/J0/temp/solr.cloud.autoscaling.NodeAddedTriggerTest_64A1796B6961123E-001/tempDir-001/node4/.
   [junit4]   2> 2573740 INFO  (zkConnectionManagerCallback-9913-thread-1) [    ] o.a.s.c.c.ConnectionManager zkClient has connected
   [junit4]   2> 2573743 INFO  (TEST-NodeAddedTriggerTest.testTrigger-seed#[64A1796B6961123E]) [n:127.0.0.1:45297_solr    ] o.a.s.c.c.ZkStateReader Updated live nodes from ZooKeeper... (0) -> (4)
   [junit4]   2> 2573743 INFO  (TEST-NodeAddedTriggerTest.testTrigger-seed#[64A1796B6961123E]) [n:127.0.0.1:45297_solr    ] o.a.s.c.s.i.ZkClientClusterStateProvider Cluster at 127.0.0.1:37637/solr ready
   [junit4]   2> 2577808 INFO  (TEST-NodeAddedTriggerTest.testTrigger-seed#[64A1796B6961123E]) [    ] o.e.j.s.Server jetty-9.4.10.v20180503; built: 2018-05-03T15:56:21.710Z; git: daa59876e6f384329b122929e70a80934569428c; jvm 1.8.0_162-b12
   [junit4]   2> 2577811 INFO  (TEST-NodeAddedTriggerTest.testTrigger-seed#[64A1796B6961123E]) [    ] o.e.j.s.session DefaultSessionIdManager workerName=node0
   [junit4]   2> 2577811 INFO  (TEST-NodeAddedTriggerTest.testTrigger-seed#[64A1796B6961123E]) [    ] o.e.j.s.session No SessionScavenger set, using defaults
   [junit4]   2> 2577811 INFO  (TEST-NodeAddedTriggerTest.testTrigger-seed#[64A1796B6961123E]) [    ] o.e.j.s.session node0 Scavenging every 600000ms
   [junit4]   2> 2577811 INFO  (TEST-NodeAddedTriggerTest.testTrigger-seed#[64A1796B6961123E]) [    ] o.e.j.s.h.ContextHandler Started o.e.j.s.ServletContextHandler@1187ed3{/solr,null,AVAILABLE}
   [junit4]   2> 2577812 INFO  (TEST-NodeAddedTriggerTest.testTrigger-seed#[64A1796B6961123E]) [    ] o.e.j.s.AbstractConnector Started ServerConnector@1cda743{HTTP/1.1,[http/1.1]}{127.0.0.1:36675}
   [junit4]   2> 2577812 INFO  (TEST-NodeAddedTriggerTest.testTrigger-seed#[64A1796B6961123E]) [    ] o.e.j.s.Server Started @2577846ms
   [junit4]   2> 2577812 INFO  (TEST-NodeAddedTriggerTest.testTrigger-seed#[64A1796B6961123E]) [    ] o.a.s.c.s.e.JettySolrRunner Jetty properties: {hostContext=/solr, hostPort=36675}
   [junit4]   2> 2577812 ERROR (TEST-NodeAddedTriggerTest.testTrigger-seed#[64A1796B6961123E]) [    ] o.a.s.u.StartupLoggingUtils Missing Java Option solr.log.dir. Logging may be missing or incomplete.
   [junit4]   2> 2577812 INFO  (TEST-NodeAddedTriggerTest.testTrigger-seed#[64A1796B6961123E]) [    ] o.a.s.s.SolrDispatchFilter Using logger factory org.apache.logging.slf4j.Log4jLoggerFactory
   [junit4]   2> 2577812 INFO  (TEST-NodeAddedTriggerTest.testTrigger-seed#[64A1796B6961123E]) [    ] o.a.s.s.SolrDispatchFilter  ___      _       Welcome to Apache Solr™ version 8.0.0
   [junit4]   2> 2577812 INFO  (TEST-NodeAddedTriggerTest.testTrigger-seed#[64A1796B6961123E]) [    ] o.a.s.s.SolrDispatchFilter / __| ___| |_ _   Starting in cloud mode on port null
   [junit4]   2> 2577812 INFO  (TEST-NodeAddedTriggerTest.testTrigger-seed#[64A1796B6961123E]) [    ] o.a.s.s.SolrDispatchFilter \__ \/ _ \ | '_|  Install dir: null
   [junit4]   2> 2577812 INFO  (TEST-NodeAddedTriggerTest.testTrigger-seed#[64A1796B6961123E]) [    ] o.a.s.s.SolrDispatchFilter |___/\___/_|_|    Start time: 2018-05-09T20:57:14.588Z
   [junit4]   2> 2577814 INFO  (zkConnectionManagerCallback-9915-thread-1) [    ] o.a.s.c.c.ConnectionManager zkClient has connected
   [junit4]   2> 2577814 INFO  (TEST-NodeAddedTriggerTest.testTrigger-seed#[64A1796B6961123E]) [    ] o.a.s.s.SolrDispatchFilter solr.xml found in ZooKeeper. Loading...
   [junit4]   2> 2577829 INFO  (TEST-NodeAddedTriggerTest.testTrigger-seed#[64A1796B6961123E]) [    ] o.a.s.c.ZkContainer Zookeeper client=127.0.0.1:37637/solr
   [junit4]   2> 2577830 INFO  (zkConnectionManagerCallback-9919-thread-1) [    ] o.a.s.c.c.ConnectionManager zkClient has connected
   [junit4]   2> 2577832 INFO  (zkConnectionManagerCallback-9921-thread-1) [    ] o.a.s.c.c.ConnectionManager zkClient has connected
   [junit4]   2> 2577836 INFO  (TEST-NodeAddedTriggerTest.testTrigger-seed#[64A1796B6961123E]) [n:127.0.0.1:36675_solr    ] o.a.s.c.c.ZkStateReader Updated live nodes from ZooKeeper... (0) -> (4)
   [junit4]   2> 2577837 INFO  (TEST-NodeAddedTriggerTest.testTrigger-seed#[64A1796B6961123E]) [n:127.0.0.1:36675_solr    ] o.a.s.c.Overseer Overseer (id=null) closing
   [junit4]   2> 2577839 INFO  (TEST-NodeAddedTriggerTest.testTrigger-seed#[64A1796B6961123E]) [n:127.0.0.1:36675_solr    ] o.a.s.c.TransientSolrCoreCacheDefault Allocating transient cache for 2147483647 transient cores
   [junit4]   2> 2577839 INFO  (TEST-NodeAddedTriggerTest.testTrigger-seed#[64A1796B6961123E]) [n:127.0.0.1:36675_solr    ] o.a.s.c.ZkController Register node as live in ZooKeeper:/live_nodes/127.0.0.1:36675_solr
   [junit4]   2> 2577840 INFO  (zkCallback-9890-thread-1) [    ] o.a.s.c.c.ZkStateReader Updated live nodes from ZooKeeper... (4) -> (5)
   [junit4]   2> 2577840 INFO  (zkCallback-9860-thread-1) [    ] o.a.s.c.c.ZkStateReader Updated live nodes from ZooKeeper... (4) -> (5)
   [junit4]   2> 2577840 INFO  (zkCallback-9875-thread-1) [    ] o.a.s.c.c.ZkStateReader Updated live nodes from ZooKeeper... (4) -> (5)
   [junit4]   2> 2577840 INFO  (zkCallback-9882-thread-1) [    ] o.a.s.c.c.ZkStateReader Updated live nodes from ZooKeeper... (4) -> (5)
   [junit4]   2> 2577840 INFO  (zkCallback-9897-thread-1) [    ] o.a.s.c.c.ZkStateReader Updated live nodes from ZooKeeper... (4) -> (5)
   [junit4]   2> 2577840 INFO  (zkCallback-9905-thread-1) [    ] o.a.s.c.c.ZkStateReader Updated live nodes from ZooKeeper... (4) -> (5)
   [junit4]   2> 2577841 INFO  (zkCallback-9853-thread-1) [    ] o.a.s.c.c.ZkStateReader Updated live nodes from ZooKeeper... (4) -> (5)
   [junit4]   2> 2577842 INFO  (zkCallback-9867-thread-1) [    ] o.a.s.c.c.ZkStateReader Updated live nodes from ZooKeeper... (4) -> (5)
   [junit4]   2> 2577844 INFO  (zkCallback-9912-thread-1) [    ] o.a.s.c.c.ZkStateReader Updated live nodes from ZooKeeper... (4) -> (5)
   [junit4]   2> 2577846 INFO  (zkCallback-9920-thread-1) [    ] o.a.s.c.c.ZkStateReader Updated live nodes from ZooKeeper... (4) -> (5)
   [junit4]   2> 2579074 INFO  (TEST-NodeAddedTriggerTest.testTrigger-seed#[64A1796B6961123E]) [n:127.0.0.1:36675_solr    ] o.a.s.m.r.SolrJmxReporter JMX monitoring for 'solr_36675.solr.node' (registry 'solr.node') enabled at server: com.sun.jmx.mbeanserver.JmxMBeanServer@15b6f73
   [junit4]   2> 2579083 INFO  (TEST-NodeAddedTriggerTest.testTrigger-seed#[64A1796B6961123E]) [n:127.0.0.1:36675_solr    ] o.a.s.m.r.SolrJmxReporter JMX monitoring for 'solr_36675.solr.jvm' (registry 'solr.jvm') enabled at server: com.sun.jmx.mbeanserver.JmxMBeanServer@15b6f73
   [junit4]   2> 2579083 INFO  (TEST-NodeAddedTriggerTest.testTrigger-seed#[64A1796B6961123E]) [n:127.0.0.1:36675_solr    ] o.a.s.m.r.SolrJmxReporter JMX monitoring for 'solr_36675.solr.jetty' (registry 'solr.jetty') enabled at server: com.sun.jmx.mbeanserver.JmxMBeanServer@15b6f73
   [junit4]   2> 2579084 INFO  (TEST-NodeAddedTriggerTest.testTrigger-seed#[64A1796B6961123E]) [n:127.0.0.1:36675_solr    ] o.a.s.c.CorePropertiesLocator Found 0 core definitions underneath /home/jenkins/workspace/Lucene-Solr-master-Linux/solr/build/solr-core/test/J0/temp/solr.cloud.autoscaling.NodeAddedTriggerTest_64A1796B6961123E-001/tempDir-001/node5/.
   [junit4]   2> 2579087 INFO  (zkConnectionManagerCallback-9928-thread-1) [    ] o.a.s.c.c.ConnectionManager zkClient has connected
   [junit4]   2> 2579088 INFO  (TEST-NodeAddedTriggerTest.testTrigger-seed#[64A1796B6961123E]) [n:127.0.0.1:36675_solr    ] o.a.s.c.c.ZkStateReader Updated live nodes from ZooKeeper... (0) -> (5)
   [junit4]   2> 2579089 INFO  (TEST-NodeAddedTriggerTest.testTrigger-seed#[64A1796B6961123E]) [n:127.0.0.1:36675_solr    ] o.a.s.c.s.i.ZkClientClusterStateProvider Cluster at 127.0.0.1:37637/solr ready
   [junit4]   2> 2579148 INFO  (TEST-NodeAddedTriggerTest.testTrigger-seed#[64A1796B6961123E]) [    ] o.e.j.s.AbstractConnector Stopped ServerConnector@1cda743{HTTP/1.1,[http/1.1]}{127.0.0.1:0}
   [junit4]   2> 2579149 INFO  (TEST-NodeAddedTriggerTest.testTrigger-seed#[64A1796B6961123E]) [    ] o.a.s.c.CoreContainer Shutting down CoreContainer instance=33450466
   [junit4]   2> 2579150 INFO  (TEST-NodeAddedTriggerTest.testTrigger-seed#[64A1796B6961123E]) [    ] o.a.s.m.SolrMetricManager Closing metric reporters for registry=solr.node, tag=null
   [junit4]   2> 2579150 INFO  (TEST-NodeAddedTriggerTest.testTrigger-seed#[64A1796B6961123E]) [    ] o.a.s.m.r.SolrJmxReporter Closing reporter [org.apache.solr.metrics.reporters.SolrJmxReporter@1f0caab: rootName = solr_36675, domain = solr.node, service url = null, agent id = null] for registry solr.node / com.codahale.metrics.MetricRegistry@4e34ca
   [junit4]   2> 2579157 INFO  (TEST-NodeAddedTriggerTest.testTrigger-seed#[64A1796B6961123E]) [    ] o.a.s.m.SolrMetricManager Closing metric reporters for registry=solr.jvm, tag=null
   [junit4]   2> 2579158 INFO  (TEST-NodeAddedTriggerTest.testTrigger-seed#[64A1796B6961123E]) [    ] o.a.s.m.r.SolrJmxReporter Closing reporter [org.apache.solr.metrics.reporters.SolrJmxReporter@1fad97c: rootName = solr_36675, domain = solr.jvm, service url = null, agent id = null] for registry solr.jvm / com.codahale.metrics.MetricRegistry@a54dca
   [junit4]   2> 2579162 INFO  (TEST-NodeAddedTriggerTest.testTrigger-seed#[64A1796B6961123E]) [    ] o.a.s.m.SolrMetricManager Closing metric reporters for registry=solr.jetty, tag=null
   [junit4]   2> 2579162 INFO  (TEST-NodeAddedTriggerTest.testTrigger-seed#[64A1796B6961123E]) [    ] o.a.s.m.r.SolrJmxReporter Closing reporter [org.apache.solr.metrics.reporters.SolrJmxReporter@513784: rootName = solr_36675, domain = solr.jetty, service url = null, agent id = null] for registry solr.jetty / com.codahale.metrics.MetricRegistry@dd2e8e
   [junit4]   2> 2579163 INFO  (TEST-NodeAddedTriggerTest.testTrigger-seed#[64A1796B6961123E]) [    ] o.a.s.c.ZkController Remove node as live in ZooKeeper:/live_nodes/127.0.0.1:36675_solr
   [junit4]   2> 2579164 INFO  (zkCallback-9897-thread-1) [    ] o.a.s.c.c.ZkStateReader Updated live nodes from ZooKeeper... (5) -> (4)
   [junit4]   2> 2579164 INFO  (TEST-NodeAddedTriggerTest.testTrigger-seed#[64A1796B6961123E]) [    ] o.a.s.m.SolrMetricManager Closing metric reporters for registry=solr.cluster, tag=null
   [junit4]   2> 2579164 INFO  (zkCallback-9882-thread-1) [    ] o.a.s.c.c.ZkStateReader Updated live nodes from ZooKeeper... (5) -> (4)
   [junit4]   2> 2579164 INFO  (zkCallback-9867-thread-1) [    ] o.a.s.c.c.ZkStateReader Updated live nodes from ZooKeeper... (5) -> (4)
   [junit4]   2> 2579164 INFO  (zkCallback-9920-thread-1) [    ] o.a.s.c.c.ZkStateReader Updated live nodes from ZooKeeper... (5) -> (4)
   [junit4]   2> 2579164 INFO  (zkCallback-9875-thread-1) [    ] o.a.s.c.c.ZkStateReader Updated live nodes from ZooKeeper... (5) -> (4)
   [junit4]   2> 2579164 INFO  (zkCallback-9860-thread-1) [    ] o.a.s.c.c.ZkStateReader Updated live nodes from ZooKeeper... (5) -> (4)
   [junit4]   2> 2579164 INFO  (zkCallback-9905-thread-1) [    ] o.a.s.c.c.ZkStateReader Updated live nodes from ZooKeeper... (5) -> (4)
   [junit4]   2> 2579164 INFO  (zkCallback-9853-thread-1) [    ] o.a.s.c.c.ZkStateReader Updated live nodes from ZooKeeper... (5) -> (4)
   [junit4]   2> 2579164 INFO  (zkCallback-9890-thread-1) [    ] o.a.s.c.c.ZkStateReader Updated live nodes from ZooKeeper... (5) -> (4)
   [junit4]   2> 2579164 INFO  (zkCallback-9912-thread-1) [    ] o.a.s.c.c.ZkStateReader Updated live nodes from ZooKeeper... (5) -> (4)
   [junit4]   2> 2579166 INFO  (zkCallback-9927-thread-1) [    ] o.a.s.c.c.ZkStateReader Updated live nodes from ZooKeeper... (5) -> (4)
   [junit4]   2> 2579166 INFO  (TEST-NodeAddedTriggerTest.testTrigger-seed#[64A1796B6961123E]) [    ] o.e.j.s.h.ContextHandler Stopped o.e.j.s.ServletContextHandler@1187ed3{/solr,null,UNAVAILABLE}
   [junit4]   2> 2579166 INFO  (TEST-NodeAddedTriggerTest.testTrigger-seed#[64A1796B6961123E]) [    ] o.e.j.s.session node0 Stopped scavenging
   [junit4]   2> 2584169 INFO  (TEST-NodeAddedTriggerTest.testTrigger-seed#[64A1796B6961123E]) [    ] o.a.s.SolrTestCaseJ4 ###Ending testTrigger
   [junit4]   2> 2584200 INFO  (TEST-NodeAddedTriggerTest.testListenerAcceptance-seed#[64A1796B6961123E]) [    ] o.a.s.SolrTestCaseJ4 ###Starting testListenerAcceptance
   [junit4]   2> 2584202 INFO  (TEST-NodeAddedTriggerTest.testListenerAcceptance-seed#[64A1796B6961123E]) [    ] o.e.j.s.Server jetty-9.4.10.v20180503; built: 2018-05-03T15:56:21.710Z; git: daa59876e6f384329b122929e70a80934569428c; jvm 1.8.0_162-b12
   [junit4]   2> 2584202 INFO  (TEST-NodeAddedTriggerTest.testListenerAcceptance-seed#[64A1796B6961123E]) [    ] o.e.j.s.session DefaultSessionIdManager workerName=node0
   [junit4]   2> 2584202 INFO  (TEST-NodeAddedTriggerTest.testListenerAcceptance-seed#[64A1796B6961123E]) [    ] o.e.j.s.session No SessionScavenger set, using defaults
   [junit4]   2> 2584203 INFO  (TEST-NodeAddedTriggerTest.testListenerAcceptance-seed#[64A1796B6961123E]) [    ] o.e.j.s.session node0 Scavenging every 600000ms
   [junit4]   2> 2584203 INFO  (TEST-NodeAddedTriggerTest.testListenerAcceptance-seed#[64A1796B6961123E]) [    ] o.e.j.s.h.ContextHandler Started o.e.j.s.ServletContextHandler@1dd12ea{/solr,null,AVAILABLE}
   [junit4]   2> 2584203 INFO  (TEST-NodeAddedTriggerTest.testListenerAcceptance-seed#[64A1796B6961123E]) [    ] o.e.j.s.AbstractConnector Started ServerConnector@982a91{HTTP/1.1,[http/1.1]}{127.0.0.1:40505}
   [junit4]   2> 2584203 INFO  (TEST-NodeAddedTriggerTest.testListenerAcceptance-seed#[64A1796B6961123E]) [    ] o.e.j.s.Server Started @2584238ms
   [junit4]   2> 2584203 INFO  (TEST-NodeAddedTriggerTest.testListenerAcceptance-seed#[64A1796B6961123E]) [    ] o.a.s.c.s.e.JettySolrRunner Jetty properties: {hostContext=/solr, hostPort=40505}
   [junit4]   2> 2584204 ERROR (TEST-NodeAddedTriggerTest.testListenerAcceptance-seed#[64A1796B6961123E]) [    ] o.a.s.u.StartupLoggingUtils Missing Java Option solr.log.dir. Logging may be missing or incomplete.
   [junit4]   2> 2584204 INFO  (TEST-NodeAddedTriggerTest.testListenerAcceptance-seed#[64A1796B6961123E]) [    ] o.a.s.s.SolrDispatchFilter Using logger factory org.apache.logging.slf4j.Log4jLoggerFactory
   [junit4]   2> 2584204 INFO  (TEST-NodeAddedTriggerTest.testListenerAcceptance-seed#[64A1796B6961123E]) [    ] o.a.s.s.SolrDispatchFilter  ___      _       Welcome to Apache Solr™ version 8.0.0
   [junit4]   2> 2584204 INFO  (TEST-NodeAddedTriggerTest.testListenerAcceptance-seed#[64A1796B6961123E]) [    ] o.a.s.s.SolrDispatchFilter / __| ___| |_ _   Starting in cloud mode on port null
   [junit4]   2> 2584204 INFO  (TEST-NodeAddedTriggerTest.testListenerAcceptance-seed#[64A1796B6961123E]) [    ] o.a.s.s.SolrDispatchFilter \__ \/ _ \ | '_|  Install dir: null
   [junit4]   2> 2584204 INFO  (TEST-NodeAddedTriggerTest.testListenerAcceptance-seed#[64A1796B6961123E]) [    ] o.a.s.s.SolrDispatchFilter |___/\___/_|_|    Start time: 2018-05-09T20:57:20.980Z
   [junit4]   2> 2584205 INFO  (zkConnectionManagerCallback-9930-thread-1) [    ] o.a.s.c.c.ConnectionManager zkClient has connected
   [junit4]   2> 2584206 INFO  (TEST-NodeAddedTriggerTest.testListenerAcceptance-seed#[64A1796B6961123E]) [    ] o.a.s.s.SolrDispatchFilter solr.xml found in ZooKeeper. Loading...
   [junit4]   2> 2584217 INFO  (TEST-NodeAddedTriggerTest.testListenerAcceptance-seed#[64A1796B6961123E]) [    ] o.a.s.c.ZkContainer Zookeeper client=127.0.0.1:37637/solr
   [junit4]   2> 2584218 INFO  (zkConnectionManagerCallback-9934-thread-1) [    ] o.a.s.c.c.ConnectionManager zkClient has connected
   [junit4]   2> 2584220 INFO  (zkConnectionManagerCallback-9936-thread-1) [    ] o.a.s.c.c.ConnectionManager zkClient has connected
   [junit4]   2> 2584224 INFO  (TEST-NodeAddedTriggerTest.testListenerAcceptance-seed#[64A1796B6961123E]) [n:127.0.0.1:40505_solr    ] o.a.s.c.c.ZkStateReader Updated live nodes from ZooKeeper... (0) -> (4)
   [junit4]   2> 2584225 INFO  (TEST-NodeAddedTriggerTest.testListenerAcceptance-seed#[64A1796B6961123E]) [n:127.0.0.1:40505_solr    ] o.a.s.c.Overseer Overseer (id=null) closing
   [junit4]   2> 2584226 INFO  (TEST-NodeAddedTriggerTest.testListenerAcceptance-seed#[64A1796B6961123E]) [n:127.0.0.1:40505_solr    ] o.a.s.c.TransientSolrCoreCacheDefault Allocating transient cache for 2147483647 transient cores
   [junit4]   2> 2584227 INFO  (TEST-NodeAddedTriggerTest.testListenerAcceptance-seed#[64A1796B6961123E]) [n:127.0.0.1:40505_solr    ] o.a.s.c.ZkController Register node as live in ZooKeeper:/live_nodes/127.0.0.1:40505_solr
   [junit4]   2> 2584227 INFO  (zkCallback-9890-thread-1) [    ] o.a.s.c.c.ZkStateReader Updated live nodes from ZooKeeper... (4) -> (5)
   [junit4]   2> 2584228 INFO  (zkCallback-9897-thread-1) [    ] o.a.s.c.c.ZkStateReader Updated live nodes from ZooKeeper... (4) -> (5)
   [junit4]   2> 2584228 INFO  (zkCallback-9875-thread-1) [    ] o.a.s.c.c.ZkStateReader Updated live nodes from ZooKeeper... (4) -> (5)
   [junit4]   2> 2584228 INFO  (zkCallback-9853-thread-1) [    ] o.a.s.c.c.ZkStateReader Updated live nodes from ZooKeeper... (4) -> (5)
   [junit4]   2> 2584228 INFO  (zkCallback-9882-thread-1) [    ] o.a.s.c.c.ZkStateReader Updated live nodes from ZooKeeper... (4) -> (5)
   [junit4]   2> 2584228 INFO  (zkCallback-9860-thread-1) [    ] o.a.s.c.c.ZkStateReader Updated live nodes from ZooKeeper... (4) -> (5)
   [junit4]   2> 2584228 INFO  (zkCallback-9867-thread-1) [    ] o.a.s.c.c.ZkStateReader Updated live nodes from ZooKeeper... (4) -> (5)
   [junit4]   2> 2584228 INFO  (zkCallback-9935-thread-1) [    ] o.a.s.c.c.ZkStateReader Updated live nodes from ZooKeeper... (4) -> (5)
   [junit4]   2> 2584228 INFO  (zkCallback-9912-thread-1) [    ] o.a.s.c.c.ZkStateReader Updated live nodes from ZooKeeper... (4) -> (5)
   [junit4]   2> 2584228 INFO  (zkCallback-9905-thread-1) [    ] o.a.s.c.c.ZkStateReader Updated live nodes from ZooKeeper... (4) -> (5)
   [junit4]   2> 2585702 INFO  (TEST-NodeAddedTriggerTest.testListenerAcceptance-seed#[64A1796B6961123E]) [n:127.0.0.1:40505_solr    ] o.a.s.m.r.SolrJmxReporter JMX monitoring for 'solr_40505.solr.node' (registry 'solr.node') enabled at server: com.sun.jmx.mbeanserver.JmxMBeanServer@15b6f73
   [junit4]   2> 2585710 INFO  (TEST-NodeAddedTriggerTest.testListenerAcceptance-seed#[64A1796B6961123E]) [n:127.0.0.1:40505_solr    ] o.a.s.m.r.SolrJmxReporter JMX monitoring for 'solr_40505.solr.jvm' (registry 'solr.jvm') enabled at server: com.sun.jmx.mbeanserver.JmxMBeanServer@15b6f73
   [junit4]   2> 2585711 INFO  (TEST-NodeAddedTriggerTest.testListenerAcceptance-seed#[64A1796B6961123E]) [n:127.0.0.1:40505_solr    ] o.a.s.m.r.SolrJmxReporter JMX monitoring for 'solr_40505.solr.jetty' (registry 'solr.jetty') enabled at server: com.sun.jmx.mbeanserver.JmxMBeanServer@15b6f73
   [junit4]   2> 2585712 INFO  (TEST-NodeAddedTriggerTest.testListenerAcceptance-seed#[64A1796B6961123E]) [n:127.0.0.1:40505_solr    ] o.a.s.c.CorePropertiesLocator Found 0 core definitions underneath /home/jenkins/workspace/Lucene-Solr-master-Linux/solr/build/solr-core/test/J0/temp/solr.cloud.autoscaling.NodeAddedTriggerTest_64A1796B6961123E-001/tempDir-001/node6/.
   [junit4]   2> 2585715 INFO  (zkConnectionManagerCallback-9943-thread-1) [    ] o.a.s.c.c.ConnectionManager zkClient has connected
   [junit4]   2> 2585717 INFO  (TEST-NodeAddedTriggerTest.testListenerAcceptance-seed#[64A1796B6961123E]) [n:127.0.0.1:40505_solr    ] o.a.s.c.c.ZkStateReader Updated live nodes from ZooKeeper... (0) -> (5)
   [junit4]   2> 2585718 INFO  (TEST-NodeAddedTriggerTest.testListenerAcceptance-seed#[64A1796B6961123E]) [n:127.0.0.1:40505_solr    ] o.a.s.c.s.i.ZkClientClusterStateProvider Cluster at 127.0.0.1:37637/solr ready
   [junit4]   2> 2585771 INFO  (TEST-NodeAddedTriggerTest.testListenerAcceptance-seed#[64A1796B6961123E]) [    ] o.a.s.SolrTestCaseJ4 ###Ending testListenerAcceptance
   [junit4]   2> 2585773 INFO  (jetty-closer-9844-thread-1) [    ] o.e.j.s.AbstractConnector Stopped ServerConnector@1f39038{HTTP/1.1,[http/1.1]}{127.0.0.1:0}
   [junit4]   2> 2585773 INFO  (jetty-closer-9844-thread-3) [    ] o.e.j.s.AbstractConnector Stopped ServerConnector@2b7c1d{HTTP/1.1,[http/1.1]}{127.0.0.1:0}
   [junit4]   2> 2585773 INFO  (jetty-closer-9844-thread-2) [    ] o.e.j.s.AbstractConnector Stopped ServerConnector@dfdda2{HTTP/1.1,[http/1.1]}{127.0.0.1:0}
   [junit4]   2> 2585774 INFO  (jetty-closer-9844-thread-4) [    ] o.e.j.s.AbstractConnector Stopped ServerConnector@1ecbba7{HTTP/1.1,[http/1.1]}{127.0.0.1:0}
   [junit4]   2> 2585774 INFO  (jetty-closer-9844-thread-2) [    ] o.a.s.c.CoreContainer Shutting down CoreContainer instance=9496143
   [junit4]   2> 2585774 INFO  (jetty-closer-9844-thread-6) [    ] o.e.j.s.AbstractConnector Stopped ServerConnector@982a91{HTTP/1.1,[http/1.1]}{127.0.0.1:0}
   [junit4]   2> 2585774 INFO  (jetty-closer-9844-thread-3) [    ] o.a.s.c.CoreContainer Shutting down CoreContainer instance=6052383
   [junit4]   2> 2585774 INFO  (jetty-closer-9844-thread-1) [    ] o.a.s.c.CoreContainer Shutting down CoreContainer instance=1156810
   [junit4]   2> 2585775 INFO  (jetty-closer-9844-thread-2) [    ] o.a.s.m.SolrMetricManager Closing metric reporters for registry=solr.node, tag=null
   [junit4]   2> 2585775 INFO  (jetty-closer-9844-thread-4) [    ] o.a.s.c.CoreContainer Shutting down CoreContainer instance=27754989
   [junit4]   2> 2585775 INFO  (jetty-closer-9844-thread-3) [    ] o.a.s.m.SolrMetricManager Closing metric reporters for registry=solr.node, tag=null
   [junit4]   2> 2585775 INFO  (jetty-closer-9844-thread-1) [    ] o.a.s.m.SolrMetricManager Closing metric reporters for registry=solr.node, tag=null
   [junit4]   2> 2585775 INFO  (jetty-closer-9844-thread-2) [    ] o.a.s.m.r.SolrJmxReporter Closing reporter [org.apache.solr.metrics.reporters.SolrJmxReporter@1db72d3: rootName = solr_42821, domain = solr.node, service url = null, agent id = null] for registry solr.node / com.codahale.metrics.MetricRegistry@b7b18b
   [junit4]   2> 2585775 INFO  (jetty-closer-9844-thread-4) [    ] o.a.s.m.SolrMetricManager Closing metric reporters for registry=solr.node, tag=null
   [junit4]   2> 2585775 INFO  (jetty-closer-9844-thread-3) [    ] o.a.s.m.r.SolrJmxReporter Closing reporter [org.apache.solr.metrics.reporters.SolrJmxReporter@146c5f1: rootName = solr_42309, domain = solr.node, service url = null, agent id = null] for registry solr.node / com.codahale.metrics.MetricRegistry@cb46a8
   [junit4]   2> 2585775 INFO  (jetty-closer-9844-thread-1) [    ] o.a.s.m.r.SolrJmxReporter Closing reporter [org.apache.solr.metrics.reporters.SolrJmxReporter@c18d22: rootName = solr_41923, domain = solr.node, service url = null, agent id = null] for registry solr.node / com.codahale.metrics.MetricRegistry@583143
   [junit4]   2> 2585775 INFO  (jetty-closer-9844-thread-4) [    ] o.a.s.m.r.SolrJmxReporter Closing reporter [org.apache.solr.metrics.reporters.SolrJmxReporter@7532f7: rootName = solr_45297, domain = solr.node, service url = null, agent id = null] for registry solr.node / com.codahale.metrics.MetricRegistry@7fb14
   [junit4]   2> 2585775 INFO  (jetty-closer-9844-thread-6) [    ] o.a.s.c.CoreContainer Shutting down CoreContainer instance=16432571
   [junit4]   2> 2585775 INFO  (jetty-closer-9844-thread-6) [    ] o.a.s.m.SolrMetricManager Closing metric reporters for registry=solr.node, tag=null
   [junit4]   2> 2585775 INFO  (jetty-closer-9844-thread-6) [    ] o.a.s.m.r.SolrJmxReporter Closing reporter [org.apache.solr.metrics.reporters.SolrJmxReporter@fdafd: rootName = solr_40505, domain = solr.node, service url = null, agent id = null] for registry solr.node / com.codahale.metrics.MetricRegistry@42a173
   [junit4]   2> 2585784 INFO  (jetty-closer-9844-thread-2) [    ] o.a.s.m.SolrMetricManager Closing metric reporters for registry=solr.jvm, tag=null
   [junit4]   2> 2585784 INFO  (jetty-closer-9844-thread-2) [    ] o.a.s.m.r.SolrJmxReporter Closing reporter [org.apache.solr.metrics.reporters.SolrJmxReporter@1eb8dae: rootName = solr_42821, domain = solr.jvm, service url = null, agent id = null] for registry solr.jvm / com.codahale.metrics.MetricRegistry@a54dca
   [junit4]   2> 2585784 INFO  (jetty-closer-9844-thread-6) [    ] o.a.s.m.SolrMetricManager Closing metric reporters for registry=solr.jvm, tag=null
   [junit4]   2> 2585784 INFO  (jetty-closer-9844-thread-6) [    ] o.a.s.m.r.SolrJmxReporter Closing reporter [org.apache.solr.metrics.reporters.SolrJmxReporter@100c55d: rootName = solr_40505, domain = solr.jvm, service url = null, agent id = null] for registry solr.jvm / com.codahale.metrics.MetricRegistry@a54dca
   [junit4]   2> 2585785 INFO  (jetty-closer-9844-thread-3) [    ] o.a.s.m.SolrMetricManager Closing metric reporters for registry=solr.jvm, tag=null
   [junit4]   2> 2585785 INFO  (jetty-closer-9844-thread-3) [    ] o.a.s.m.r.SolrJmxReporter Closing reporter [org.apache.solr.metrics.reporters.SolrJmxReporter@c9e796: rootName = solr_42309, domain = solr.jvm, service url = null, agent id = null] for registry solr.jvm / com.codahale.metrics.MetricRegistry@a54dca
   [junit4]   2> 2585786 INFO  (jetty-closer-9844-thread-1) [    ] o.a.s.m.SolrMetricManager Closing metric reporters for registry=solr.jvm, tag=null
   [junit4]   2> 2585786 INFO  (jetty-closer-9844-thread-4) [    ] o.a.s.m.SolrMetricManager Closing metric reporters for registry=solr.jvm, tag=null
   [junit4]   2> 2585787 INFO  (jetty-closer-9844-thread-1) [    ] o.a.s.m.r.SolrJmxReporter Closing reporter [org.apache.solr.metrics.reporters.SolrJmxReporter@9feead: rootName = solr_41923, domain = solr.jvm, service url = null, agent id = null] for registry solr.jvm / com.codahale.metrics.MetricRegistry@a54dca
   [junit4]   2> 2585787 INFO  (jetty-closer-9844-thread-4) [    ] o.a.s.m.r.SolrJmxReporter Closing reporter [org.apache.solr.metrics.reporters.SolrJmxReporter@19733d: rootName = solr_45297, domain = solr.jvm, service url = null, agent id = null] for registry solr.jvm / com.codahale.metrics.MetricRegistry@a54dca
   [junit4]   2> 2585788 INFO  (jetty-closer-9844-thread-2) [    ] o.a.s.m.SolrMetricManager Closing metric reporters for registry=solr.jetty, tag=null
   [junit4]   2> 2585788 INFO  (jetty-closer-9844-thread-2) [    ] o.a.s.m.r.SolrJmxReporter Closing reporter [org.apache.solr.metrics.reporters.SolrJmxReporter@12f22d1: rootName = solr_42821, domain = solr.jetty, service url = null, agent id = null] for registry solr.jetty / com.codahale.metrics.MetricRegistry@dd2e8e
   [junit4]   2> 2585788 INFO  (jetty-closer-9844-thread-6) [    ] o.a.s.m.SolrMetricManager Closing metric reporters for registry=solr.jetty, tag=null
   [junit4]   2> 2585788 INFO  (jetty-closer-9844-thread-6) [    ] o.a.s.m.r.SolrJmxReporter Closing reporter [org.apache.solr.metrics.reporters.SolrJmxReporter@14147da: rootName = solr_40505, domain = solr.jetty, service url = null, agent id = null] for registry solr.jetty / com.codahale.metrics.MetricRegistry@dd2e8e
   [junit4]   2> 2585789 INFO  (jetty-closer-9844-thread-3) [    ] o.a.s.m.SolrMetricManager Closing metric reporters for registry=solr.jetty, tag=null
   [junit4]   2> 2585789 INFO  (jetty-closer-9844-thread-3) [    ] o.a.s.m.r.SolrJmxReporter Closing reporter [org.apache.solr.metrics.reporters.SolrJmxReporter@1f3ef12: rootName = solr_42309, domain = solr.jetty, service url = null, agent id = null] for registry solr.jetty / com.codahale.metrics.MetricRegistry@dd2e8e
   [junit4]   2> 2585792 INFO  (jetty-closer-9844-thread-2) [    ] o.a.s.c.ZkController Remove node as live in ZooKeeper:/live_nodes/127.0.0.1:42821_solr
   [junit4]   2> 2585792 INFO  (jetty-closer-9844-thread-6) [    ] o.a.s.c.ZkController Remove node as live in ZooKeeper:/live_nodes/127.0.0.1:40505_solr
   [junit4]   2> 2585793 INFO  (jetty-closer-9844-thread-2) [    ] o.a.s.m.SolrMetricManager Closing metric reporters for registry=solr.cluster, tag=null
   [junit4]   2> 2585793 INFO  (zkCallback-9912-thread-1) [    ] o.a.s.c.c.ZkStateReader Updated live nodes from ZooKeeper... (5) -> (3)
   [junit4]   2> 2585793 INFO  (zkCallback-9860-thread-1) [    ] o.a.s.c.c.ZkStateReader Updated live nodes from ZooKeeper... (5) -> (3)
   [junit4]   2> 2585793 INFO  (zkCallback-9905-thread-1) [    ] o.a.s.c.c.ZkStateReader Updated live nodes from ZooKeeper... (5) -> (3)
   [junit4]   2> 2585793 INFO  (jetty-closer-9844-thread-6) [    ] o.a.s.m.SolrMetricManager Closing metric reporters for registry=solr.cluster, tag=null
   [junit4]   2> 2585793 INFO  (zkCallback-9875-thread-1) [    ] o.a.s.c.c.ZkStateReader Updated live nodes from ZooKeeper... (5) -> (3)
   [junit4]   2> 2585793 INFO  (zkCallback-9890-thread-1) [    ] o.a.s.c.c.ZkStateReader Updated live nodes from ZooKeeper... (5) -> (3)
   [junit4]   2> 2585794 INFO  (zkCallback-9897-thread-1) [    ] o.a.s.c.c.ZkStateReader Updated live nodes from ZooKeeper... (5) -> (3)
   [junit4]   2> 2585794 INFO  (zkCallback-9853-thread-1) [    ] o.a.s.c.c.ZkStateReader Updated live nodes from ZooKeeper... (5) -> (3)
   [junit4]   2> 2585794 INFO  (zkCallback-9882-thread-1) [    ] o.a.s.c.c.ZkStateReader Updated live nodes from ZooKeeper... (5) -> (3)
   [junit4]   2> 2585794 INFO  (jetty-closer-9844-thread-4) [    ] o.a.s.m.SolrMetricManager Closing metric reporters for registry=solr.jetty, tag=null
   [junit4]   2> 2585795 INFO  (jetty-closer-9844-thread-4) [    ] o.a.s.m.r.SolrJmxReporter Closing reporter [org.apache.solr.metrics.reporters.SolrJmxReporter@1bdec67: rootName = solr_45297, domain = solr.jetty, service url = null, agent id = null] for registry solr.jetty / com.codahale.metrics.MetricRegistry@dd2e8e
   [junit4]   2> 2585795 INFO  (jetty-closer-9844-thread-1) [    ] o.a.s.m.SolrMetricManager Closing metric reporters for registry=solr.jetty, tag=null
   [junit4]   2> 2585795 INFO  (jetty-closer-9844-thread-1) [    ] o.a.s.m.r.SolrJmxReporter Closing reporter [org.apache.solr.metrics.reporters.SolrJmxReporter@1c3f635: rootName = solr_41923, domain = solr.jetty, service url = null, agent id = null] for registry solr.jetty / com.codahale.metrics.MetricRegistry@dd2e8e
   [junit4]   2> 2585795 INFO  (jetty-closer-9844-thread-3) [    ] o.a.s.c.ZkController Remove node as live in ZooKeeper:/live_nodes/127.0.0.1:42309_solr
   [junit4]   2> 2585795 INFO  (jetty-closer-9844-thread-4) [    ] o.a.s.c.ZkController Remove node as live in ZooKeeper:/live_nodes/127.0.0.1:45297_solr
   [junit4]   2> 2585796 INFO  (zkCallback-9875-thread-1) [    ] o.a.s.c.c.ZkStateReader Updated live nodes from ZooKeeper... (3) -> (2)
   [junit4]   2> 2585796 INFO  (jetty-closer-9844-thread-3) [    ] o.a.s.m.SolrMetricManager Closing metric reporters for registry=solr.cluster, tag=null
   [junit4]   2> 2585796 INFO  (zkCallback-9897-thread-1) [    ] o.a.s.c.c.ZkStateReader Updated live nodes from ZooKeeper... (3) -> (2)
   [junit4]   2> 2585796 INFO  (zkCallback-9905-thread-1) [    ] o.a.s.c.c.ZkStateReader Updated live nodes from ZooKeeper... (3) -> (2)
   [junit4]   2> 2585796 INFO  (zkCallback-9860-thread-1) [    ] o.a.s.c.c.ZkStateReader Updated live nodes from ZooKeeper... (3) -> (2)
   [junit4]   2> 2585796 INFO  (zkCallback-9912-thread-1) [    ] o.a.s.c.c.ZkStateReader Updated live nodes from ZooKeeper... (3) -> (2)
   [junit4]   2> 2585796 INFO  (zkCallback-9890-thread-1) [    ] o.a.s.c.c.ZkStateReader Updated live nodes from ZooKeeper... (3) -> (2)
   [junit4]   2> 2585796 INFO  (zkCallback-9882-thread-1) [    ] o.a.s.c.c.ZkStateReader Updated live nodes from ZooKeeper... (3) -> (2)
   [junit4]   2> 2585796 INFO  (jetty-closer-9844-thread-4) [    ] o.a.s.m.SolrMetricManager Closing metric reporters for registry=solr.cluster, tag=null
   [junit4]   2> 2585796 INFO  (jetty-closer-9844-thread-1) [    ] o.a.s.c.ZkController Remove node as live in ZooKeeper:/live_nodes/127.0.0.1:41923_solr
   [junit4]   2> 2585796 INFO  (zkCallback-9860-thread-1) [    ] o.a.s.c.c.ZkStateReader Updated live nodes from ZooKeeper... (2) -> (1)
   [junit4]   2> 2585796 INFO  (zkCallback-9897-thread-1) [    ] o.a.s.c.c.ZkStateReader Updated live nodes from ZooKeeper... (2) -> (1)
   [junit4]   2> 2585797 INFO  (zkCallback-9882-thread-1) [    ] o.a.s.c.c.ZkStateReader Updated live nodes from ZooKeeper... (2) -> (1)
   [junit4]   2> 2585796 INFO  (zkCallback-9912-thread-1) [    ] o.a.s.c.c.ZkStateReader Updated live nodes from ZooKeeper... (2) -> (1)
   [junit4]   2> 2585797 INFO  (jetty-closer-9844-thread-1) [    ] o.a.s.m.SolrMetricManager Closing metric reporters for registry=solr.cluster, tag=null
   [junit4]   2> 2585797 INFO  (jetty-closer-9844-thread-1) [    ] o.a.s.c.TransientSolrCoreCacheDefault Allocating transient cache for 2147483647 transient cores
   [junit4]   2> 2585797 INFO  (zkCallback-9897-thread-1) [    ] o.a.s.c.c.ZkStateReader Updated live nodes from ZooKeeper... (1) -> (0)
   [junit4]   2> 2585797 INFO  (zkCallback-9882-thread-1) [    ] o.a.s.c.c.ZkStateReader Updated live nodes from ZooKeeper... (1) -> (0)
   [junit4]   2> 2585797 INFO  (zkCallback-9912-thread-1) [    ] o.a.s.c.c.ZkStateReader Updated live nodes from ZooKeeper... (1) -> (0)
   [junit4]   2> 2585797 INFO  (zkCallback-9860-thread-1) [    ] o.a.s.c.c.ZkStateReader Updated live nodes from ZooKeeper... (1) -> (0)
   [junit4]   2> 2585799 INFO  (jetty-closer-9844-thread-1) [    ] o.a.s.c.Overseer Overseer (id=72133970960318467-127.0.0.1:41923_solr-n_0000000000) closing
   [junit4]   2> 2585800 INFO  (zkCallback-9935-thread-1) [    ] o.a.s.c.c.ZkStateReader Updated live nodes from ZooKeeper... (5) -> (0)
   [junit4]   2> 2585799 INFO  (zkCallback-9942-thread-1) [    ] o.a.s.c.c.ZkStateReader Updated live nodes from ZooKeeper... (5) -> (0)
   [junit4]   2> 2585800 INFO  (zkCallback-9905-thread-2) [    ] o.a.s.c.c.ZkStateReader Updated live nodes from ZooKeeper... (2) -> (0)
   [junit4]   2> 2585800 WARN  (OverseerAutoScalingTriggerThread-72133970960318467-127.0.0.1:41923_solr-n_0000000000) [    ] o.a.s.c.a.OverseerTriggerThread OverseerTriggerThread woken up but we are closed, exiting.
   [junit4]   2> 2585800 INFO  (OverseerStateUpdate-72133970960318467-127.0.0.1:41923_solr-n_0000000000) [    ] o.a.s.c.Overseer Overseer Loop exiting : 127.0.0.1:41923_solr
   [junit4]   2> 2585801 INFO  (zkCallback-9890-thread-2) [    ] o.a.s.c.c.ZkStateReader Updated live nodes from ZooKeeper... (2) -> (0)
   [junit4]   2> 2585801 INFO  (zkCallback-9853-thread-1) [    ] o.a.s.c.c.ZkStateReader Updated live nodes from ZooKeeper... (3) -> (0)
   [junit4]   2> 2585800 INFO  (zkCallback-9875-thread-2) [    ] o.a.s.c.c.ZkStateReader Updated live nodes from ZooKeeper... (2) -> (0)
   [junit4]   2> 2585802 WARN  (NIOServerCxn.Factory:0.0.0.0/0.0.0.0:0) [    ] o.a.z.s.NIOServerCnxn Unable to read additional data from client sessionid 0x1004576e354000e, likely client has closed socket
   [junit4]   2> 2585803 WARN  (NIOServerCxn.Factory:0.0.0.0/0.0.0.0:0) [    ] o.a.z.s.NIOServerCnxn Unable to read additional data from client sessionid 0x1004576e3540004, likely client has closed socket
   [junit4]   2> 2585803 INFO  (jetty-closer-9844-thread-2) [    ] o.e.j.s.h.ContextHandler Stopped o.e.j.s.ServletContextHandler@c93861{/solr,null,UNAVAILABLE}
   [junit4]   2> 2585803 WARN  (NIOServerCxn.Factory:0.0.0.0/0.0.0.0:0) [    ] o.a.z.s.NIOServerCnxn Unable to read additional data from client sessionid 0x1004576e3540009, likely client has closed socket
   [junit4]   2> 2585803 INFO  (jetty-closer-9844-thread-2) [    ] o.e.j.s.session node0 Stopped scavenging
   [junit4]   2> 2585804 INFO  (jetty-closer-9844-thread-6) [    ] o.e.j.s.h.ContextHandler Stopped o.e.j.s.ServletContextHandler@1dd12ea{/solr,null,UNAVAILABLE}
   [junit4]   2> 2585804 INFO  (jetty-closer-9844-thread-6) [    ] o.e.j.s.session node0 Stopped scavenging
   [junit4]   2> 2585804 WARN  (NIOServerCxn.Factory:0.0.0.0/0.0.0.0:0) [    ] o.a.z.s.NIOServerCnxn Unable to read additional data from client sessionid 0x1004576e3540011, likely client has closed socket
   [junit4]   2> 2585805 INFO  (jetty-closer-9844-thread-1) [    ] o.e.j.s.h.ContextHandler Stopped o.e.j.s.ServletContextHandler@1b47c07{/solr,null,UNAVAILABLE}
   [junit4]   2> 2585805 INFO  (jetty-closer-9844-thread-4) [    ] o.e.j.s.h.ContextHandler Stopped o.e.j.s.ServletContextHandler@7aee94{/solr,null,UNAVAILABLE}
   [junit4]   2> 2585805 INFO  (jetty-closer-9844-thread-1) [    ] o.e.j.s.session node0 Stopped scavenging
   [junit4]   2> 2585806 INFO  (jetty-closer-9844-thread-4) [    ] o.e.j.s.session node0 Stopped scavenging
   [junit4]   2> 2587304 INFO  (jetty-closer-9844-thread-3) [    ] o.e.j.s.h.ContextHandler Stopped o.e.j.s.ServletContextHandler@4e2641{/solr,null,UNAVAILABLE}
   [junit4]   2> 2587304 INFO  (jetty-closer-9844-thread-3) [    ] o.e.j.s.session node0 Stopped scavenging
   [junit4]   2> 2587305 ERROR (SUITE-NodeAddedTriggerTest-seed#[64A1796B6961123E]-worker) [    ] o.a.z.s.ZooKeeperServer ZKShutdownHandler is not registered, so ZooKeeper server won't take any action on ERROR or SHUTDOWN server state changes
   [junit4]   2> 2587305 INFO  (SUITE-NodeAddedTriggerTest-seed#[64A1796B6961123E]-worker) [    ] o.a.s.c.ZkTestServer connecting to 127.0.0.1:37637 37637
   [junit4]   2> 2587334 INFO  (Thread-5598) [    ] o.a.s.c.ZkTestServer connecting to 127.0.0.1:37637 37637
   [junit4]   2> 2587335 WARN  (Thread-5598) [    ] o.a.s.c.ZkTestServer Watch limit violations: 
   [junit4]   2> Maximum concurrent create/delete watches above limit:
   [junit4]   2> 
   [junit4]   2> 	13	/solr/aliases.json
   [junit4]   2> 	13	/solr/clusterprops.json
   [junit4]   2> 	6	/solr/security.json
   [junit4]   2> 
   [junit4]   2> Maximum concurrent data watches above limit:
   [junit4]   2> 
   [junit4]   2> 	13	/solr/clusterstate.json
   [junit4]   2> 	2	/solr/overseer_elect/election/72133970960318481-127.0.0.1:45297_solr-n_0000000003
   [junit4]   2> 
   [junit4]   2> Maximum concurrent children watches above limit:
   [junit4]   2> 
   [junit4]   2> 	13	/solr/live_nodes
   [junit4]   2> 	13	/solr/collections
   [junit4]   2> 
   [junit4]   2> NOTE: leaving temporary files on disk at: /home/jenkins/workspace/Lucene-Solr-master-Linux/solr/build/solr-core/test/J0/temp/solr.cloud.autoscaling.NodeAddedTriggerTest_64A1796B6961123E-001
   [junit4]   2> May 09, 2018 8:57:24 PM com.carrotsearch.randomizedtesting.ThreadLeakControl checkThreadLeaks
   [junit4]   2> WARNING: Will linger awaiting termination of 1 leaked thread(s).
   [junit4]   2> NOTE: test params are: codec=FastDecompressionCompressingStoredFields(storedFieldsFormat=CompressingStoredFieldsFormat(compressionMode=FAST_DECOMPRESSION, chunkSize=29625, maxDocsPerChunk=5, blockSize=737), termVectorsFormat=CompressingTermVectorsFormat(compressionMode=FAST_DECOMPRESSION, chunkSize=29625, blockSize=737)), sim=Asserting(org.apache.lucene.search.similarities.AssertingSimilarity@6e86c3), locale=ar-AE, timezone=Canada/Newfoundland
   [junit4]   2> NOTE: Linux 4.13.0-39-generic i386/Oracle Corporation 1.8.0_162 (32-bit)/cpus=8,threads=1,free=60035096,total=332648448
   [junit4]   2> NOTE: All tests run in this JVM: [TestHashQParserPlugin, IndexBasedSpellCheckerTest, SimpleMLTQParserTest, TestImplicitCoreProperties, ZkNodePropsTest, TestReplicationHandlerBackup, ExitableDirectoryReaderTest, TestJsonFacetsWithNestedObjects, TestDelegationWithHadoopAuth, SolrRequestParserTest, TestFieldResource, SmileWriterTest, MultiThreadedOCPTest, ConfigureRecoveryStrategyTest, TestMultiValuedNumericRangeQuery, TestLeaderElectionWithEmptyReplica, TestCSVLoader, TestNodeAddedTrigger, TestSolrQueryParser, TestSimpleTextCodec, TestEmbeddedSolrServerConstructors, TestLuceneMatchVersion, TestFastOutputStream, EchoParamsTest, TestExecutePlanAction, TestWriterPerf, AddSchemaFieldsUpdateProcessorFactoryTest, TestFieldCacheReopen, DataDrivenBlockJoinTest, TestTlogReplica, HdfsUnloadDistributedZkTest, DebugComponentTest, DistribJoinFromCollectionTest, MigrateRouteKeyTest, CdcrBidirectionalTest, CloneFieldUpdateProcessorFactoryTest, FullSolrCloudDistribCmdsTest, TestStressLucene, TestStressCloudBlindAtomicUpdates, TestQuerySenderNoQuery, CoreAdminOperationTest, HdfsRecoverLeaseTest, CollectionStateFormat2Test, TransactionLogTest, TestConfig, OpenCloseCoreStressTest, SuggesterWFSTTest, TestChildDocTransformer, SynonymTokenizerTest, ScheduledTriggerIntegrationTest, TestCrossCoreJoin, DeleteStatusTest, TestNumericTerms32, BasicDistributedZkTest, ChaosMonkeyNothingIsSafeWithPullReplicasTest, SolrIndexConfigTest, ReplaceNodeNoTargetTest, TestIndexSearcher, AliasIntegrationTest, TestSchemaVersionResource, TestFieldCacheVsDocValues, TestSolrConfigHandlerConcurrent, TestSQLHandler, TestCustomStream, OverriddenZkACLAndCredentialsProvidersTest, TestLockTree, IgnoreLargeDocumentProcessorFactoryTest, TestHighlightDedupGrouping, AutoScalingHandlerTest, TriggerCooldownIntegrationTest, V2StandaloneTest, TestScoreJoinQPScore, CdcrReplicationHandlerTest, TestCom

[...truncated too long message...]

 2> 47555 INFO  (zkCallback-149-thread-1) [    ] o.a.s.c.c.ZkStateReader Updated live nodes from ZooKeeper... (5) -> (4)
   [junit4]   2> 47555 INFO  (zkCallback-164-thread-1) [    ] o.a.s.c.c.ZkStateReader Updated live nodes from ZooKeeper... (5) -> (4)
   [junit4]   2> 47555 INFO  (zkCallback-112-thread-1) [    ] o.a.s.c.c.ZkStateReader Updated live nodes from ZooKeeper... (5) -> (4)
   [junit4]   2> 47557 INFO  (jetty-closer-103-thread-1) [    ] o.a.s.c.Overseer Overseer (id=72134062413512707-127.0.0.1:41525_solr-n_0000000000) closing
   [junit4]   2> 47558 INFO  (jetty-closer-103-thread-3) [    ] o.a.s.m.SolrMetricManager Closing metric reporters for registry=solr.cluster, tag=null
   [junit4]   2> 47558 INFO  (zkCallback-141-thread-1) [    ] o.a.s.c.c.ZkStateReader Updated live nodes from ZooKeeper... (4) -> (2)
   [junit4]   2> 47559 INFO  (zkCallback-156-thread-1) [    ] o.a.s.c.c.ZkStateReader Updated live nodes from ZooKeeper... (4) -> (2)
   [junit4]   2> 47558 WARN  (OverseerAutoScalingTriggerThread-72134062413512707-127.0.0.1:41525_solr-n_0000000000) [    ] o.a.s.c.a.OverseerTriggerThread OverseerTriggerThread woken up but we are closed, exiting.
   [junit4]   2> 47558 INFO  (zkCallback-194-thread-1) [    ] o.a.s.c.c.ZkStateReader Updated live nodes from ZooKeeper... (5) -> (2)
   [junit4]   2> 47558 INFO  (jetty-closer-103-thread-4) [    ] o.a.s.m.SolrMetricManager Closing metric reporters for registry=solr.cluster, tag=null
   [junit4]   2> 47558 INFO  (zkCallback-201-thread-1) [    ] o.a.s.c.c.ZkStateReader Updated live nodes from ZooKeeper... (5) -> (2)
   [junit4]   2> 47558 INFO  (OverseerStateUpdate-72134062413512707-127.0.0.1:41525_solr-n_0000000000) [    ] o.a.s.c.Overseer Overseer Loop exiting : 127.0.0.1:41525_solr
   [junit4]   2> 47559 INFO  (zkCallback-134-thread-2) [    ] o.a.s.c.c.ZkStateReader Updated live nodes from ZooKeeper... (4) -> (2)
   [junit4]   2> 47559 INFO  (zkCallback-119-thread-1) [    ] o.a.s.c.c.ZkStateReader Updated live nodes from ZooKeeper... (4) -> (2)
   [junit4]   2> 47559 INFO  (zkCallback-171-thread-1) [    ] o.a.s.c.c.ZkStateReader Updated live nodes from ZooKeeper... (4) -> (2)
   [junit4]   2> 47560 INFO  (zkCallback-112-thread-1) [    ] o.a.s.c.c.ZkStateReader Updated live nodes from ZooKeeper... (4) -> (2)
   [junit4]   2> 47560 INFO  (zkCallback-149-thread-2) [    ] o.a.s.c.c.ZkStateReader Updated live nodes from ZooKeeper... (4) -> (2)
   [junit4]   2> 47561 INFO  (zkCallback-164-thread-2) [    ] o.a.s.c.c.ZkStateReader Updated live nodes from ZooKeeper... (4) -> (2)
   [junit4]   2> 47560 INFO  (jetty-closer-103-thread-2) [    ] o.a.s.c.ZkController Remove node as live in ZooKeeper:/live_nodes/127.0.0.1:46853_solr
   [junit4]   2> 47562 INFO  (jetty-closer-103-thread-6) [    ] o.a.s.c.ZkController Remove node as live in ZooKeeper:/live_nodes/127.0.0.1:37875_solr
   [junit4]   2> 47562 INFO  (jetty-closer-103-thread-2) [    ] o.a.s.m.SolrMetricManager Closing metric reporters for registry=solr.cluster, tag=null
   [junit4]   2> 47563 INFO  (jetty-closer-103-thread-6) [    ] o.a.s.m.SolrMetricManager Closing metric reporters for registry=solr.cluster, tag=null
   [junit4]   2> 47563 INFO  (zkCallback-141-thread-1) [    ] o.a.s.c.c.ZkStateReader Updated live nodes from ZooKeeper... (2) -> (0)
   [junit4]   2> 47564 INFO  (zkCallback-134-thread-1) [    ] o.a.s.c.OverseerElectionContext I am going to be the leader 127.0.0.1:46853_solr
   [junit4]   2> 47564 INFO  (zkCallback-194-thread-2) [    ] o.a.s.c.c.ZkStateReader Updated live nodes from ZooKeeper... (2) -> (0)
   [junit4]   2> 47564 INFO  (zkCallback-134-thread-3) [    ] o.a.s.c.c.ZkStateReader Updated live nodes from ZooKeeper... (2) -> (0)
   [junit4]   2> 47564 INFO  (zkCallback-201-thread-1) [    ] o.a.s.c.c.ZkStateReader Updated live nodes from ZooKeeper... (2) -> (0)
   [junit4]   2> 47565 INFO  (jetty-closer-103-thread-3) [    ] o.e.j.s.h.ContextHandler Stopped o.e.j.s.ServletContextHandler@1278fb7{/solr,null,UNAVAILABLE}
   [junit4]   2> 47565 INFO  (zkCallback-164-thread-1) [    ] o.a.s.c.c.ZkStateReader Updated live nodes from ZooKeeper... (2) -> (0)
   [junit4]   2> 47565 INFO  (jetty-closer-103-thread-3) [    ] o.e.j.s.session node0 Stopped scavenging
   [junit4]   2> 47569 INFO  (jetty-closer-103-thread-1) [    ] o.e.j.s.h.ContextHandler Stopped o.e.j.s.ServletContextHandler@e1d57e{/solr,null,UNAVAILABLE}
   [junit4]   2> 47569 INFO  (jetty-closer-103-thread-4) [    ] o.e.j.s.h.ContextHandler Stopped o.e.j.s.ServletContextHandler@1af89db{/solr,null,UNAVAILABLE}
   [junit4]   2> 47569 INFO  (jetty-closer-103-thread-1) [    ] o.e.j.s.session node0 Stopped scavenging
   [junit4]   2> 47569 INFO  (jetty-closer-103-thread-4) [    ] o.e.j.s.session node0 Stopped scavenging
   [junit4]   2> 47570 WARN  (NIOServerCxn.Factory:0.0.0.0/0.0.0.0:0) [    ] o.a.z.s.NIOServerCnxn Unable to read additional data from client sessionid 0x100458c2e5d0019, likely client has closed socket
   [junit4]   2> 47570 INFO  (jetty-closer-103-thread-2) [    ] o.e.j.s.h.ContextHandler Stopped o.e.j.s.ServletContextHandler@a3d291{/solr,null,UNAVAILABLE}
   [junit4]   2> 47570 INFO  (jetty-closer-103-thread-2) [    ] o.e.j.s.session node0 Stopped scavenging
   [junit4]   2> 49070 INFO  (jetty-closer-103-thread-6) [    ] o.e.j.s.h.ContextHandler Stopped o.e.j.s.ServletContextHandler@34c62{/solr,null,UNAVAILABLE}
   [junit4]   2> 49070 INFO  (jetty-closer-103-thread-6) [    ] o.e.j.s.session node0 Stopped scavenging
   [junit4]   2> 49071 ERROR (SUITE-NodeAddedTriggerTest-seed#[64A1796B6961123E]-worker) [    ] o.a.z.s.ZooKeeperServer ZKShutdownHandler is not registered, so ZooKeeper server won't take any action on ERROR or SHUTDOWN server state changes
   [junit4]   2> 49071 INFO  (SUITE-NodeAddedTriggerTest-seed#[64A1796B6961123E]-worker) [    ] o.a.s.c.ZkTestServer connecting to 127.0.0.1:36553 36553
   [junit4]   2> 49170 INFO  (Thread-61) [    ] o.a.s.c.ZkTestServer connecting to 127.0.0.1:36553 36553
   [junit4]   2> 49170 WARN  (Thread-61) [    ] o.a.s.c.ZkTestServer Watch limit violations: 
   [junit4]   2> Maximum concurrent create/delete watches above limit:
   [junit4]   2> 
   [junit4]   2> 	13	/solr/aliases.json
   [junit4]   2> 	13	/solr/clusterprops.json
   [junit4]   2> 	6	/solr/security.json
   [junit4]   2> 
   [junit4]   2> Maximum concurrent data watches above limit:
   [junit4]   2> 
   [junit4]   2> 	13	/solr/clusterstate.json
   [junit4]   2> 	2	/solr/overseer_elect/election/72134062413512713-127.0.0.1:46853_solr-n_0000000001
   [junit4]   2> 	2	/solr/overseer_elect/election/72134062413512721-127.0.0.1:34865_solr-n_0000000003
   [junit4]   2> 
   [junit4]   2> Maximum concurrent children watches above limit:
   [junit4]   2> 
   [junit4]   2> 	13	/solr/live_nodes
   [junit4]   2> 	13	/solr/collections
   [junit4]   2> 
   [junit4]   2> NOTE: leaving temporary files on disk at: /home/jenkins/workspace/Lucene-Solr-master-Linux/solr/build/solr-core/test/J1/temp/solr.cloud.autoscaling.NodeAddedTriggerTest_64A1796B6961123E-002
   [junit4]   2> May 09, 2018 9:20:42 PM com.carrotsearch.randomizedtesting.ThreadLeakControl checkThreadLeaks
   [junit4]   2> WARNING: Will linger awaiting termination of 1 leaked thread(s).
   [junit4]   2> NOTE: test params are: codec=FastDecompressionCompressingStoredFields(storedFieldsFormat=CompressingStoredFieldsFormat(compressionMode=FAST_DECOMPRESSION, chunkSize=29625, maxDocsPerChunk=5, blockSize=737), termVectorsFormat=CompressingTermVectorsFormat(compressionMode=FAST_DECOMPRESSION, chunkSize=29625, blockSize=737)), sim=Asserting(org.apache.lucene.search.similarities.AssertingSimilarity@1a46786), locale=ar-AE, timezone=Canada/Newfoundland
   [junit4]   2> NOTE: Linux 4.13.0-39-generic i386/Oracle Corporation 1.8.0_162 (32-bit)/cpus=8,threads=1,free=3333216,total=33267712
   [junit4]   2> NOTE: All tests run in this JVM: [NodeAddedTriggerTest, NodeAddedTriggerTest]
   [junit4] Completed [5/5 (5!)] on J1 in 21.29s, 4 tests, 1 failure <<< FAILURES!

[...truncated 15 lines...]
BUILD FAILED
/home/jenkins/workspace/Lucene-Solr-master-Linux/lucene/common-build.xml:1568: The following error occurred while executing this line:
/home/jenkins/workspace/Lucene-Solr-master-Linux/lucene/common-build.xml:1092: There were test failures: 5 suites, 20 tests, 5 failures [seed: 64A1796B6961123E]

Total time: 51 seconds

[repro] Setting last failure code to 256

[repro] Failures:
[repro]   5/5 failed: org.apache.solr.cloud.autoscaling.NodeAddedTriggerTest
[repro] Exiting with code 256
+ mv lucene/build lucene/build.repro
+ mv solr/build solr/build.repro
+ mv lucene/build.orig lucene/build
+ mv solr/build.orig solr/build
Archiving artifacts
Setting ANT_1_8_2_HOME=/var/lib/jenkins/tools/hudson.tasks.Ant_AntInstallation/ANT_1.8.2
[WARNINGS] Parsing warnings in console log with parser Java Compiler (javac)
Setting ANT_1_8_2_HOME=/var/lib/jenkins/tools/hudson.tasks.Ant_AntInstallation/ANT_1.8.2
Setting ANT_1_8_2_HOME=/var/lib/jenkins/tools/hudson.tasks.Ant_AntInstallation/ANT_1.8.2
<Git Blamer> Using GitBlamer to create author and commit information for all warnings.
<Git Blamer> GIT_COMMIT=144f00a1e315541a28f526f4cdf1e55eb60c862b, workspace=/var/lib/jenkins/workspace/Lucene-Solr-master-Linux
[WARNINGS] Computing warning deltas based on reference build #21982
Recording test results
Setting ANT_1_8_2_HOME=/var/lib/jenkins/tools/hudson.tasks.Ant_AntInstallation/ANT_1.8.2
Build step 'Publish JUnit test result report' changed build result to UNSTABLE
Email was triggered for: Unstable (Test Failures)
Sending email for trigger: Unstable (Test Failures)
Setting ANT_1_8_2_HOME=/var/lib/jenkins/tools/hudson.tasks.Ant_AntInstallation/ANT_1.8.2
Setting ANT_1_8_2_HOME=/var/lib/jenkins/tools/hudson.tasks.Ant_AntInstallation/ANT_1.8.2
Setting ANT_1_8_2_HOME=/var/lib/jenkins/tools/hudson.tasks.Ant_AntInstallation/ANT_1.8.2
Setting ANT_1_8_2_HOME=/var/lib/jenkins/tools/hudson.tasks.Ant_AntInstallation/ANT_1.8.2

Mime
View raw message