lucene-dev mailing list archives

Site index · List index
Message view « Date » · « Thread »
Top « Date » · « Thread »
From Apache Jenkins Server <jenk...@builds.apache.org>
Subject [JENKINS] Lucene-Solr-Tests-master - Build # 2537 - Still Unstable
Date Sun, 20 May 2018 17:31:44 GMT
Build: https://builds.apache.org/job/Lucene-Solr-Tests-master/2537/

3 tests failed.
FAILED:  org.apache.solr.cloud.TestPullReplicaErrorHandling.testCantConnectToPullReplica

Error Message:
Timeout occured while waiting response from server at: http://127.0.0.1:34218/solr/pull_replica_error_handling_test_cant_connect_to_pull_replica_shard1_replica_n1

Stack Trace:
org.apache.solr.client.solrj.SolrServerException: Timeout occured while waiting response from server at: http://127.0.0.1:34218/solr/pull_replica_error_handling_test_cant_connect_to_pull_replica_shard1_replica_n1
	at org.apache.solr.client.solrj.impl.HttpSolrClient.executeMethod(HttpSolrClient.java:654)
	at org.apache.solr.client.solrj.impl.HttpSolrClient.request(HttpSolrClient.java:255)
	at org.apache.solr.client.solrj.impl.HttpSolrClient.request(HttpSolrClient.java:244)
	at org.apache.solr.client.solrj.SolrRequest.process(SolrRequest.java:194)
	at org.apache.solr.client.solrj.SolrClient.query(SolrClient.java:942)
	at org.apache.solr.client.solrj.SolrClient.query(SolrClient.java:957)
	at org.apache.solr.cloud.TestPullReplicaErrorHandling.assertNumDocs(TestPullReplicaErrorHandling.java:241)
	at org.apache.solr.cloud.TestPullReplicaErrorHandling.assertNumDocs(TestPullReplicaErrorHandling.java:251)
	at org.apache.solr.cloud.TestPullReplicaErrorHandling.testCantConnectToPullReplica(TestPullReplicaErrorHandling.java:151)
	at sun.reflect.NativeMethodAccessorImpl.invoke0(Native Method)
	at sun.reflect.NativeMethodAccessorImpl.invoke(NativeMethodAccessorImpl.java:62)
	at sun.reflect.DelegatingMethodAccessorImpl.invoke(DelegatingMethodAccessorImpl.java:43)
	at java.lang.reflect.Method.invoke(Method.java:498)
	at com.carrotsearch.randomizedtesting.RandomizedRunner.invoke(RandomizedRunner.java:1737)
	at com.carrotsearch.randomizedtesting.RandomizedRunner$8.evaluate(RandomizedRunner.java:934)
	at com.carrotsearch.randomizedtesting.RandomizedRunner$9.evaluate(RandomizedRunner.java:970)
	at com.carrotsearch.randomizedtesting.RandomizedRunner$10.evaluate(RandomizedRunner.java:984)
	at com.carrotsearch.randomizedtesting.rules.SystemPropertiesRestoreRule$1.evaluate(SystemPropertiesRestoreRule.java:57)
	at org.apache.lucene.util.TestRuleSetupTeardownChained$1.evaluate(TestRuleSetupTeardownChained.java:49)
	at org.apache.lucene.util.AbstractBeforeAfterRule$1.evaluate(AbstractBeforeAfterRule.java:45)
	at org.apache.lucene.util.TestRuleThreadAndTestName$1.evaluate(TestRuleThreadAndTestName.java:48)
	at org.apache.lucene.util.TestRuleIgnoreAfterMaxFailures$1.evaluate(TestRuleIgnoreAfterMaxFailures.java:64)
	at org.apache.lucene.util.TestRuleMarkFailure$1.evaluate(TestRuleMarkFailure.java:47)
	at com.carrotsearch.randomizedtesting.rules.StatementAdapter.evaluate(StatementAdapter.java:36)
	at com.carrotsearch.randomizedtesting.ThreadLeakControl$StatementRunner.run(ThreadLeakControl.java:368)
	at com.carrotsearch.randomizedtesting.ThreadLeakControl.forkTimeoutingTask(ThreadLeakControl.java:817)
	at com.carrotsearch.randomizedtesting.ThreadLeakControl$3.evaluate(ThreadLeakControl.java:468)
	at com.carrotsearch.randomizedtesting.RandomizedRunner.runSingleTest(RandomizedRunner.java:943)
	at com.carrotsearch.randomizedtesting.RandomizedRunner$5.evaluate(RandomizedRunner.java:829)
	at com.carrotsearch.randomizedtesting.RandomizedRunner$6.evaluate(RandomizedRunner.java:879)
	at com.carrotsearch.randomizedtesting.RandomizedRunner$7.evaluate(RandomizedRunner.java:890)
	at com.carrotsearch.randomizedtesting.rules.StatementAdapter.evaluate(StatementAdapter.java:36)
	at com.carrotsearch.randomizedtesting.rules.SystemPropertiesRestoreRule$1.evaluate(SystemPropertiesRestoreRule.java:57)
	at org.apache.lucene.util.AbstractBeforeAfterRule$1.evaluate(AbstractBeforeAfterRule.java:45)
	at com.carrotsearch.randomizedtesting.rules.StatementAdapter.evaluate(StatementAdapter.java:36)
	at org.apache.lucene.util.TestRuleStoreClassName$1.evaluate(TestRuleStoreClassName.java:41)
	at com.carrotsearch.randomizedtesting.rules.NoShadowingOrOverridesOnMethodsRule$1.evaluate(NoShadowingOrOverridesOnMethodsRule.java:40)
	at com.carrotsearch.randomizedtesting.rules.NoShadowingOrOverridesOnMethodsRule$1.evaluate(NoShadowingOrOverridesOnMethodsRule.java:40)
	at com.carrotsearch.randomizedtesting.rules.StatementAdapter.evaluate(StatementAdapter.java:36)
	at com.carrotsearch.randomizedtesting.rules.StatementAdapter.evaluate(StatementAdapter.java:36)
	at com.carrotsearch.randomizedtesting.rules.StatementAdapter.evaluate(StatementAdapter.java:36)
	at org.apache.lucene.util.TestRuleAssertionsRequired$1.evaluate(TestRuleAssertionsRequired.java:53)
	at org.apache.lucene.util.TestRuleMarkFailure$1.evaluate(TestRuleMarkFailure.java:47)
	at org.apache.lucene.util.TestRuleIgnoreAfterMaxFailures$1.evaluate(TestRuleIgnoreAfterMaxFailures.java:64)
	at org.apache.lucene.util.TestRuleIgnoreTestSuites$1.evaluate(TestRuleIgnoreTestSuites.java:54)
	at com.carrotsearch.randomizedtesting.rules.StatementAdapter.evaluate(StatementAdapter.java:36)
	at com.carrotsearch.randomizedtesting.ThreadLeakControl$StatementRunner.run(ThreadLeakControl.java:368)
	at java.lang.Thread.run(Thread.java:748)
Caused by: java.net.SocketTimeoutException: Read timed out
	at java.net.SocketInputStream.socketRead0(Native Method)
	at java.net.SocketInputStream.socketRead(SocketInputStream.java:116)
	at java.net.SocketInputStream.read(SocketInputStream.java:171)
	at java.net.SocketInputStream.read(SocketInputStream.java:141)
	at org.apache.http.impl.io.SessionInputBufferImpl.streamRead(SessionInputBufferImpl.java:137)
	at org.apache.http.impl.io.SessionInputBufferImpl.fillBuffer(SessionInputBufferImpl.java:153)
	at org.apache.http.impl.io.SessionInputBufferImpl.readLine(SessionInputBufferImpl.java:282)
	at org.apache.http.impl.conn.DefaultHttpResponseParser.parseHead(DefaultHttpResponseParser.java:138)
	at org.apache.http.impl.conn.DefaultHttpResponseParser.parseHead(DefaultHttpResponseParser.java:56)
	at org.apache.http.impl.io.AbstractMessageParser.parse(AbstractMessageParser.java:259)
	at org.apache.http.impl.DefaultBHttpClientConnection.receiveResponseHeader(DefaultBHttpClientConnection.java:163)
	at org.apache.http.impl.conn.CPoolProxy.receiveResponseHeader(CPoolProxy.java:165)
	at org.apache.http.protocol.HttpRequestExecutor.doReceiveResponse(HttpRequestExecutor.java:273)
	at org.apache.http.protocol.HttpRequestExecutor.execute(HttpRequestExecutor.java:125)
	at org.apache.http.impl.execchain.MainClientExec.execute(MainClientExec.java:272)
	at org.apache.http.impl.execchain.ProtocolExec.execute(ProtocolExec.java:185)
	at org.apache.http.impl.execchain.RetryExec.execute(RetryExec.java:89)
	at org.apache.http.impl.execchain.RedirectExec.execute(RedirectExec.java:111)
	at org.apache.http.impl.client.InternalHttpClient.doExecute(InternalHttpClient.java:185)
	at org.apache.http.impl.client.CloseableHttpClient.execute(CloseableHttpClient.java:83)
	at org.apache.http.impl.client.CloseableHttpClient.execute(CloseableHttpClient.java:56)
	at org.apache.solr.client.solrj.impl.HttpSolrClient.executeMethod(HttpSolrClient.java:542)
	... 47 more


FAILED:  org.apache.solr.cloud.autoscaling.SearchRateTriggerIntegrationTest.testDeleteNode

Error Message:
unexpected DELETENODE status: {responseHeader={status=0,QTime=72},status={state=notfound,msg=Did not find [search_rate_trigger3/208eebd0175360Tcokt7xqs43hpa22m0b038lxw5/0] in any tasks queue}}

Stack Trace:
java.lang.AssertionError: unexpected DELETENODE status: {responseHeader={status=0,QTime=72},status={state=notfound,msg=Did not find [search_rate_trigger3/208eebd0175360Tcokt7xqs43hpa22m0b038lxw5/0] in any tasks queue}}
	at __randomizedtesting.SeedInfo.seed([8E7BDCA2A7E60AF5:ACE91220902C8588]:0)
	at org.junit.Assert.fail(Assert.java:93)
	at org.apache.solr.cloud.autoscaling.SearchRateTriggerIntegrationTest.lambda$testDeleteNode$6(SearchRateTriggerIntegrationTest.java:668)
	at java.util.ArrayList.forEach(ArrayList.java:1257)
	at org.apache.solr.cloud.autoscaling.SearchRateTriggerIntegrationTest.testDeleteNode(SearchRateTriggerIntegrationTest.java:660)
	at sun.reflect.NativeMethodAccessorImpl.invoke0(Native Method)
	at sun.reflect.NativeMethodAccessorImpl.invoke(NativeMethodAccessorImpl.java:62)
	at sun.reflect.DelegatingMethodAccessorImpl.invoke(DelegatingMethodAccessorImpl.java:43)
	at java.lang.reflect.Method.invoke(Method.java:498)
	at com.carrotsearch.randomizedtesting.RandomizedRunner.invoke(RandomizedRunner.java:1737)
	at com.carrotsearch.randomizedtesting.RandomizedRunner$8.evaluate(RandomizedRunner.java:934)
	at com.carrotsearch.randomizedtesting.RandomizedRunner$9.evaluate(RandomizedRunner.java:970)
	at com.carrotsearch.randomizedtesting.RandomizedRunner$10.evaluate(RandomizedRunner.java:984)
	at com.carrotsearch.randomizedtesting.rules.SystemPropertiesRestoreRule$1.evaluate(SystemPropertiesRestoreRule.java:57)
	at org.apache.lucene.util.TestRuleSetupTeardownChained$1.evaluate(TestRuleSetupTeardownChained.java:49)
	at org.apache.lucene.util.AbstractBeforeAfterRule$1.evaluate(AbstractBeforeAfterRule.java:45)
	at org.apache.lucene.util.TestRuleThreadAndTestName$1.evaluate(TestRuleThreadAndTestName.java:48)
	at org.apache.lucene.util.TestRuleIgnoreAfterMaxFailures$1.evaluate(TestRuleIgnoreAfterMaxFailures.java:64)
	at org.apache.lucene.util.TestRuleMarkFailure$1.evaluate(TestRuleMarkFailure.java:47)
	at com.carrotsearch.randomizedtesting.rules.StatementAdapter.evaluate(StatementAdapter.java:36)
	at com.carrotsearch.randomizedtesting.ThreadLeakControl$StatementRunner.run(ThreadLeakControl.java:368)
	at com.carrotsearch.randomizedtesting.ThreadLeakControl.forkTimeoutingTask(ThreadLeakControl.java:817)
	at com.carrotsearch.randomizedtesting.ThreadLeakControl$3.evaluate(ThreadLeakControl.java:468)
	at com.carrotsearch.randomizedtesting.RandomizedRunner.runSingleTest(RandomizedRunner.java:943)
	at com.carrotsearch.randomizedtesting.RandomizedRunner$5.evaluate(RandomizedRunner.java:829)
	at com.carrotsearch.randomizedtesting.RandomizedRunner$6.evaluate(RandomizedRunner.java:879)
	at com.carrotsearch.randomizedtesting.RandomizedRunner$7.evaluate(RandomizedRunner.java:890)
	at com.carrotsearch.randomizedtesting.rules.StatementAdapter.evaluate(StatementAdapter.java:36)
	at com.carrotsearch.randomizedtesting.rules.SystemPropertiesRestoreRule$1.evaluate(SystemPropertiesRestoreRule.java:57)
	at org.apache.lucene.util.AbstractBeforeAfterRule$1.evaluate(AbstractBeforeAfterRule.java:45)
	at com.carrotsearch.randomizedtesting.rules.StatementAdapter.evaluate(StatementAdapter.java:36)
	at org.apache.lucene.util.TestRuleStoreClassName$1.evaluate(TestRuleStoreClassName.java:41)
	at com.carrotsearch.randomizedtesting.rules.NoShadowingOrOverridesOnMethodsRule$1.evaluate(NoShadowingOrOverridesOnMethodsRule.java:40)
	at com.carrotsearch.randomizedtesting.rules.NoShadowingOrOverridesOnMethodsRule$1.evaluate(NoShadowingOrOverridesOnMethodsRule.java:40)
	at com.carrotsearch.randomizedtesting.rules.StatementAdapter.evaluate(StatementAdapter.java:36)
	at com.carrotsearch.randomizedtesting.rules.StatementAdapter.evaluate(StatementAdapter.java:36)
	at com.carrotsearch.randomizedtesting.rules.StatementAdapter.evaluate(StatementAdapter.java:36)
	at org.apache.lucene.util.TestRuleAssertionsRequired$1.evaluate(TestRuleAssertionsRequired.java:53)
	at org.apache.lucene.util.TestRuleMarkFailure$1.evaluate(TestRuleMarkFailure.java:47)
	at org.apache.lucene.util.TestRuleIgnoreAfterMaxFailures$1.evaluate(TestRuleIgnoreAfterMaxFailures.java:64)
	at org.apache.lucene.util.TestRuleIgnoreTestSuites$1.evaluate(TestRuleIgnoreTestSuites.java:54)
	at com.carrotsearch.randomizedtesting.rules.StatementAdapter.evaluate(StatementAdapter.java:36)
	at com.carrotsearch.randomizedtesting.ThreadLeakControl$StatementRunner.run(ThreadLeakControl.java:368)
	at java.lang.Thread.run(Thread.java:748)


FAILED:  org.apache.solr.cloud.autoscaling.SearchRateTriggerIntegrationTest.testBelowSearchRate

Error Message:
[Op{action=DELETEREPLICA, hints={COLL_SHARD=[{   "first":"belowRate_collection",   "second":"shard1"}], REPLICA=[core_node10]}}, Op{action=NONE, hints={SRC_NODE=[127.0.0.1:38848_solr]}}, Op{action=NONE, hints={SRC_NODE=[127.0.0.1:40876_solr]}}] expected:<2> but was:<3>

Stack Trace:
java.lang.AssertionError: [Op{action=DELETEREPLICA, hints={COLL_SHARD=[{
  "first":"belowRate_collection",
  "second":"shard1"}], REPLICA=[core_node10]}}, Op{action=NONE, hints={SRC_NODE=[127.0.0.1:38848_solr]}}, Op{action=NONE, hints={SRC_NODE=[127.0.0.1:40876_solr]}}] expected:<2> but was:<3>
	at __randomizedtesting.SeedInfo.seed([8E7BDCA2A7E60AF5:E4D67AC2FF0E8FE6]:0)
	at org.junit.Assert.fail(Assert.java:93)
	at org.junit.Assert.failNotEquals(Assert.java:647)
	at org.junit.Assert.assertEquals(Assert.java:128)
	at org.junit.Assert.assertEquals(Assert.java:472)
	at org.apache.solr.cloud.autoscaling.SearchRateTriggerIntegrationTest.testBelowSearchRate(SearchRateTriggerIntegrationTest.java:493)
	at sun.reflect.NativeMethodAccessorImpl.invoke0(Native Method)
	at sun.reflect.NativeMethodAccessorImpl.invoke(NativeMethodAccessorImpl.java:62)
	at sun.reflect.DelegatingMethodAccessorImpl.invoke(DelegatingMethodAccessorImpl.java:43)
	at java.lang.reflect.Method.invoke(Method.java:498)
	at com.carrotsearch.randomizedtesting.RandomizedRunner.invoke(RandomizedRunner.java:1737)
	at com.carrotsearch.randomizedtesting.RandomizedRunner$8.evaluate(RandomizedRunner.java:934)
	at com.carrotsearch.randomizedtesting.RandomizedRunner$9.evaluate(RandomizedRunner.java:970)
	at com.carrotsearch.randomizedtesting.RandomizedRunner$10.evaluate(RandomizedRunner.java:984)
	at com.carrotsearch.randomizedtesting.rules.SystemPropertiesRestoreRule$1.evaluate(SystemPropertiesRestoreRule.java:57)
	at org.apache.lucene.util.TestRuleSetupTeardownChained$1.evaluate(TestRuleSetupTeardownChained.java:49)
	at org.apache.lucene.util.AbstractBeforeAfterRule$1.evaluate(AbstractBeforeAfterRule.java:45)
	at org.apache.lucene.util.TestRuleThreadAndTestName$1.evaluate(TestRuleThreadAndTestName.java:48)
	at org.apache.lucene.util.TestRuleIgnoreAfterMaxFailures$1.evaluate(TestRuleIgnoreAfterMaxFailures.java:64)
	at org.apache.lucene.util.TestRuleMarkFailure$1.evaluate(TestRuleMarkFailure.java:47)
	at com.carrotsearch.randomizedtesting.rules.StatementAdapter.evaluate(StatementAdapter.java:36)
	at com.carrotsearch.randomizedtesting.ThreadLeakControl$StatementRunner.run(ThreadLeakControl.java:368)
	at com.carrotsearch.randomizedtesting.ThreadLeakControl.forkTimeoutingTask(ThreadLeakControl.java:817)
	at com.carrotsearch.randomizedtesting.ThreadLeakControl$3.evaluate(ThreadLeakControl.java:468)
	at com.carrotsearch.randomizedtesting.RandomizedRunner.runSingleTest(RandomizedRunner.java:943)
	at com.carrotsearch.randomizedtesting.RandomizedRunner$5.evaluate(RandomizedRunner.java:829)
	at com.carrotsearch.randomizedtesting.RandomizedRunner$6.evaluate(RandomizedRunner.java:879)
	at com.carrotsearch.randomizedtesting.RandomizedRunner$7.evaluate(RandomizedRunner.java:890)
	at com.carrotsearch.randomizedtesting.rules.StatementAdapter.evaluate(StatementAdapter.java:36)
	at com.carrotsearch.randomizedtesting.rules.SystemPropertiesRestoreRule$1.evaluate(SystemPropertiesRestoreRule.java:57)
	at org.apache.lucene.util.AbstractBeforeAfterRule$1.evaluate(AbstractBeforeAfterRule.java:45)
	at com.carrotsearch.randomizedtesting.rules.StatementAdapter.evaluate(StatementAdapter.java:36)
	at org.apache.lucene.util.TestRuleStoreClassName$1.evaluate(TestRuleStoreClassName.java:41)
	at com.carrotsearch.randomizedtesting.rules.NoShadowingOrOverridesOnMethodsRule$1.evaluate(NoShadowingOrOverridesOnMethodsRule.java:40)
	at com.carrotsearch.randomizedtesting.rules.NoShadowingOrOverridesOnMethodsRule$1.evaluate(NoShadowingOrOverridesOnMethodsRule.java:40)
	at com.carrotsearch.randomizedtesting.rules.StatementAdapter.evaluate(StatementAdapter.java:36)
	at com.carrotsearch.randomizedtesting.rules.StatementAdapter.evaluate(StatementAdapter.java:36)
	at com.carrotsearch.randomizedtesting.rules.StatementAdapter.evaluate(StatementAdapter.java:36)
	at org.apache.lucene.util.TestRuleAssertionsRequired$1.evaluate(TestRuleAssertionsRequired.java:53)
	at org.apache.lucene.util.TestRuleMarkFailure$1.evaluate(TestRuleMarkFailure.java:47)
	at org.apache.lucene.util.TestRuleIgnoreAfterMaxFailures$1.evaluate(TestRuleIgnoreAfterMaxFailures.java:64)
	at org.apache.lucene.util.TestRuleIgnoreTestSuites$1.evaluate(TestRuleIgnoreTestSuites.java:54)
	at com.carrotsearch.randomizedtesting.rules.StatementAdapter.evaluate(StatementAdapter.java:36)
	at com.carrotsearch.randomizedtesting.ThreadLeakControl$StatementRunner.run(ThreadLeakControl.java:368)
	at java.lang.Thread.run(Thread.java:748)




Build Log:
[...truncated 12620 lines...]
   [junit4] Suite: org.apache.solr.cloud.autoscaling.SearchRateTriggerIntegrationTest
   [junit4]   2> 284499 INFO  (SUITE-SearchRateTriggerIntegrationTest-seed#[8E7BDCA2A7E60AF5]-worker) [    ] o.a.s.SolrTestCaseJ4 SecureRandom sanity checks: test.solr.allowed.securerandom=null & java.security.egd=file:/dev/./urandom
   [junit4]   2> Creating dataDir: /home/jenkins/jenkins-slave/workspace/Lucene-Solr-Tests-master/solr/build/solr-core/test/J2/temp/solr.cloud.autoscaling.SearchRateTriggerIntegrationTest_8E7BDCA2A7E60AF5-001/init-core-data-001
   [junit4]   2> 284501 WARN  (SUITE-SearchRateTriggerIntegrationTest-seed#[8E7BDCA2A7E60AF5]-worker) [    ] o.a.s.SolrTestCaseJ4 startTrackingSearchers: numOpens=16 numCloses=16
   [junit4]   2> 284501 INFO  (SUITE-SearchRateTriggerIntegrationTest-seed#[8E7BDCA2A7E60AF5]-worker) [    ] o.a.s.SolrTestCaseJ4 Using PointFields (NUMERIC_POINTS_SYSPROP=true) w/NUMERIC_DOCVALUES_SYSPROP=false
   [junit4]   2> 284502 INFO  (SUITE-SearchRateTriggerIntegrationTest-seed#[8E7BDCA2A7E60AF5]-worker) [    ] o.a.s.SolrTestCaseJ4 Randomized ssl (true) and clientAuth (true) via: @org.apache.solr.util.RandomizeSSL(reason=, ssl=NaN, value=NaN, clientAuth=NaN)
   [junit4]   2> 284523 INFO  (SUITE-SearchRateTriggerIntegrationTest-seed#[8E7BDCA2A7E60AF5]-worker) [    ] o.a.s.c.MiniSolrCloudCluster Starting cluster of 5 servers in /home/jenkins/jenkins-slave/workspace/Lucene-Solr-Tests-master/solr/build/solr-core/test/J2/temp/solr.cloud.autoscaling.SearchRateTriggerIntegrationTest_8E7BDCA2A7E60AF5-001/tempDir-001
   [junit4]   2> 284523 INFO  (SUITE-SearchRateTriggerIntegrationTest-seed#[8E7BDCA2A7E60AF5]-worker) [    ] o.a.s.c.ZkTestServer STARTING ZK TEST SERVER
   [junit4]   2> 284552 INFO  (Thread-111) [    ] o.a.s.c.ZkTestServer client port:0.0.0.0/0.0.0.0:0
   [junit4]   2> 284552 INFO  (Thread-111) [    ] o.a.s.c.ZkTestServer Starting server
   [junit4]   2> 284595 ERROR (Thread-111) [    ] o.a.z.s.ZooKeeperServer ZKShutdownHandler is not registered, so ZooKeeper server won't take any action on ERROR or SHUTDOWN server state changes
   [junit4]   2> 284645 INFO  (SUITE-SearchRateTriggerIntegrationTest-seed#[8E7BDCA2A7E60AF5]-worker) [    ] o.a.s.c.ZkTestServer start zk server on port:39016
   [junit4]   2> 284662 INFO  (zkConnectionManagerCallback-126-thread-1) [    ] o.a.s.c.c.ConnectionManager zkClient has connected
   [junit4]   2> 284716 INFO  (jetty-launcher-123-thread-1) [    ] o.e.j.s.Server jetty-9.4.10.v20180503; built: 2018-05-03T15:56:21.710Z; git: daa59876e6f384329b122929e70a80934569428c; jvm 1.8.0_172-b11
   [junit4]   2> 284717 INFO  (jetty-launcher-123-thread-2) [    ] o.e.j.s.Server jetty-9.4.10.v20180503; built: 2018-05-03T15:56:21.710Z; git: daa59876e6f384329b122929e70a80934569428c; jvm 1.8.0_172-b11
   [junit4]   2> 284736 INFO  (jetty-launcher-123-thread-3) [    ] o.e.j.s.Server jetty-9.4.10.v20180503; built: 2018-05-03T15:56:21.710Z; git: daa59876e6f384329b122929e70a80934569428c; jvm 1.8.0_172-b11
   [junit4]   2> 284861 INFO  (jetty-launcher-123-thread-1) [    ] o.e.j.s.session DefaultSessionIdManager workerName=node0
   [junit4]   2> 284861 INFO  (jetty-launcher-123-thread-1) [    ] o.e.j.s.session No SessionScavenger set, using defaults
   [junit4]   2> 284861 INFO  (jetty-launcher-123-thread-1) [    ] o.e.j.s.session node0 Scavenging every 660000ms
   [junit4]   2> 284881 INFO  (jetty-launcher-123-thread-1) [    ] o.e.j.s.h.ContextHandler Started o.e.j.s.ServletContextHandler@75ee93ad{/solr,null,AVAILABLE}
   [junit4]   2> 284987 INFO  (jetty-launcher-123-thread-1) [    ] o.e.j.s.AbstractConnector Started ServerConnector@724e2cda{SSL,[ssl, http/1.1]}{127.0.0.1:40163}
   [junit4]   2> 284987 INFO  (jetty-launcher-123-thread-1) [    ] o.e.j.s.Server Started @285214ms
   [junit4]   2> 284987 INFO  (jetty-launcher-123-thread-1) [    ] o.a.s.c.s.e.JettySolrRunner Jetty properties: {hostContext=/solr, hostPort=40163}
   [junit4]   2> 284987 ERROR (jetty-launcher-123-thread-1) [    ] o.a.s.u.StartupLoggingUtils Missing Java Option solr.log.dir. Logging may be missing or incomplete.
   [junit4]   2> 284987 INFO  (jetty-launcher-123-thread-1) [    ] o.a.s.s.SolrDispatchFilter Using logger factory org.apache.logging.slf4j.Log4jLoggerFactory
   [junit4]   2> 284987 INFO  (jetty-launcher-123-thread-1) [    ] o.a.s.s.SolrDispatchFilter  ___      _       Welcome to Apache Solr? version 8.0.0
   [junit4]   2> 284988 INFO  (jetty-launcher-123-thread-1) [    ] o.a.s.s.SolrDispatchFilter / __| ___| |_ _   Starting in cloud mode on port null
   [junit4]   2> 284988 INFO  (jetty-launcher-123-thread-1) [    ] o.a.s.s.SolrDispatchFilter \__ \/ _ \ | '_|  Install dir: null
   [junit4]   2> 284988 INFO  (jetty-launcher-123-thread-1) [    ] o.a.s.s.SolrDispatchFilter |___/\___/_|_|    Start time: 2018-05-20T14:34:21.063Z
   [junit4]   2> 285225 INFO  (jetty-launcher-123-thread-3) [    ] o.e.j.s.session DefaultSessionIdManager workerName=node0
   [junit4]   2> 285225 INFO  (jetty-launcher-123-thread-3) [    ] o.e.j.s.session No SessionScavenger set, using defaults
   [junit4]   2> 285226 INFO  (jetty-launcher-123-thread-3) [    ] o.e.j.s.session node0 Scavenging every 660000ms
   [junit4]   2> 285314 INFO  (jetty-launcher-123-thread-2) [    ] o.e.j.s.session DefaultSessionIdManager workerName=node0
   [junit4]   2> 285315 INFO  (jetty-launcher-123-thread-2) [    ] o.e.j.s.session No SessionScavenger set, using defaults
   [junit4]   2> 285315 INFO  (jetty-launcher-123-thread-2) [    ] o.e.j.s.session node0 Scavenging every 660000ms
   [junit4]   2> 285335 INFO  (jetty-launcher-123-thread-2) [    ] o.e.j.s.h.ContextHandler Started o.e.j.s.ServletContextHandler@2e175b70{/solr,null,AVAILABLE}
   [junit4]   2> 285336 INFO  (jetty-launcher-123-thread-2) [    ] o.e.j.s.AbstractConnector Started ServerConnector@7b16703e{SSL,[ssl, http/1.1]}{127.0.0.1:38848}
   [junit4]   2> 285336 INFO  (jetty-launcher-123-thread-2) [    ] o.e.j.s.Server Started @285563ms
   [junit4]   2> 285336 INFO  (jetty-launcher-123-thread-2) [    ] o.a.s.c.s.e.JettySolrRunner Jetty properties: {hostContext=/solr, hostPort=38848}
   [junit4]   2> 285338 ERROR (jetty-launcher-123-thread-2) [    ] o.a.s.u.StartupLoggingUtils Missing Java Option solr.log.dir. Logging may be missing or incomplete.
   [junit4]   2> 285338 INFO  (jetty-launcher-123-thread-2) [    ] o.a.s.s.SolrDispatchFilter Using logger factory org.apache.logging.slf4j.Log4jLoggerFactory
   [junit4]   2> 285338 INFO  (jetty-launcher-123-thread-2) [    ] o.a.s.s.SolrDispatchFilter  ___      _       Welcome to Apache Solr? version 8.0.0
   [junit4]   2> 285338 INFO  (jetty-launcher-123-thread-2) [    ] o.a.s.s.SolrDispatchFilter / __| ___| |_ _   Starting in cloud mode on port null
   [junit4]   2> 285338 INFO  (jetty-launcher-123-thread-2) [    ] o.a.s.s.SolrDispatchFilter \__ \/ _ \ | '_|  Install dir: null
   [junit4]   2> 285338 INFO  (jetty-launcher-123-thread-2) [    ] o.a.s.s.SolrDispatchFilter |___/\___/_|_|    Start time: 2018-05-20T14:34:21.413Z
   [junit4]   2> 285388 INFO  (jetty-launcher-123-thread-3) [    ] o.e.j.s.h.ContextHandler Started o.e.j.s.ServletContextHandler@40dcae46{/solr,null,AVAILABLE}
   [junit4]   2> 285445 INFO  (jetty-launcher-123-thread-4) [    ] o.e.j.s.Server jetty-9.4.10.v20180503; built: 2018-05-03T15:56:21.710Z; git: daa59876e6f384329b122929e70a80934569428c; jvm 1.8.0_172-b11
   [junit4]   2> 285445 INFO  (jetty-launcher-123-thread-5) [    ] o.e.j.s.Server jetty-9.4.10.v20180503; built: 2018-05-03T15:56:21.710Z; git: daa59876e6f384329b122929e70a80934569428c; jvm 1.8.0_172-b11
   [junit4]   2> 285460 INFO  (jetty-launcher-123-thread-3) [    ] o.e.j.s.AbstractConnector Started ServerConnector@630c8415{SSL,[ssl, http/1.1]}{127.0.0.1:46733}
   [junit4]   2> 285460 INFO  (jetty-launcher-123-thread-3) [    ] o.e.j.s.Server Started @285688ms
   [junit4]   2> 285461 INFO  (jetty-launcher-123-thread-3) [    ] o.a.s.c.s.e.JettySolrRunner Jetty properties: {hostContext=/solr, hostPort=46733}
   [junit4]   2> 285461 ERROR (jetty-launcher-123-thread-3) [    ] o.a.s.u.StartupLoggingUtils Missing Java Option solr.log.dir. Logging may be missing or incomplete.
   [junit4]   2> 285461 INFO  (jetty-launcher-123-thread-3) [    ] o.a.s.s.SolrDispatchFilter Using logger factory org.apache.logging.slf4j.Log4jLoggerFactory
   [junit4]   2> 285461 INFO  (jetty-launcher-123-thread-3) [    ] o.a.s.s.SolrDispatchFilter  ___      _       Welcome to Apache Solr? version 8.0.0
   [junit4]   2> 285461 INFO  (jetty-launcher-123-thread-3) [    ] o.a.s.s.SolrDispatchFilter / __| ___| |_ _   Starting in cloud mode on port null
   [junit4]   2> 285461 INFO  (jetty-launcher-123-thread-3) [    ] o.a.s.s.SolrDispatchFilter \__ \/ _ \ | '_|  Install dir: null
   [junit4]   2> 285461 INFO  (jetty-launcher-123-thread-3) [    ] o.a.s.s.SolrDispatchFilter |___/\___/_|_|    Start time: 2018-05-20T14:34:21.536Z
   [junit4]   2> 285462 INFO  (zkConnectionManagerCallback-128-thread-1) [    ] o.a.s.c.c.ConnectionManager zkClient has connected
   [junit4]   2> 285552 INFO  (jetty-launcher-123-thread-1) [    ] o.a.s.s.SolrDispatchFilter solr.xml found in ZooKeeper. Loading...
   [junit4]   2> 285651 INFO  (jetty-launcher-123-thread-5) [    ] o.e.j.s.session DefaultSessionIdManager workerName=node0
   [junit4]   2> 285651 INFO  (jetty-launcher-123-thread-5) [    ] o.e.j.s.session No SessionScavenger set, using defaults
   [junit4]   2> 285651 INFO  (jetty-launcher-123-thread-5) [    ] o.e.j.s.session node0 Scavenging every 660000ms
   [junit4]   2> 285671 INFO  (jetty-launcher-123-thread-5) [    ] o.e.j.s.h.ContextHandler Started o.e.j.s.ServletContextHandler@79db8c25{/solr,null,AVAILABLE}
   [junit4]   2> 285672 INFO  (jetty-launcher-123-thread-5) [    ] o.e.j.s.AbstractConnector Started ServerConnector@70b0ccf1{SSL,[ssl, http/1.1]}{127.0.0.1:40876}
   [junit4]   2> 285672 INFO  (jetty-launcher-123-thread-5) [    ] o.e.j.s.Server Started @285899ms
   [junit4]   2> 285672 INFO  (jetty-launcher-123-thread-5) [    ] o.a.s.c.s.e.JettySolrRunner Jetty properties: {hostContext=/solr, hostPort=40876}
   [junit4]   2> 285673 ERROR (jetty-launcher-123-thread-5) [    ] o.a.s.u.StartupLoggingUtils Missing Java Option solr.log.dir. Logging may be missing or incomplete.
   [junit4]   2> 285673 INFO  (jetty-launcher-123-thread-5) [    ] o.a.s.s.SolrDispatchFilter Using logger factory org.apache.logging.slf4j.Log4jLoggerFactory
   [junit4]   2> 285673 INFO  (jetty-launcher-123-thread-5) [    ] o.a.s.s.SolrDispatchFilter  ___      _       Welcome to Apache Solr? version 8.0.0
   [junit4]   2> 285673 INFO  (jetty-launcher-123-thread-5) [    ] o.a.s.s.SolrDispatchFilter / __| ___| |_ _   Starting in cloud mode on port null
   [junit4]   2> 285673 INFO  (jetty-launcher-123-thread-5) [    ] o.a.s.s.SolrDispatchFilter \__ \/ _ \ | '_|  Install dir: null
   [junit4]   2> 285673 INFO  (jetty-launcher-123-thread-5) [    ] o.a.s.s.SolrDispatchFilter |___/\___/_|_|    Start time: 2018-05-20T14:34:21.748Z
   [junit4]   2> 285744 INFO  (zkConnectionManagerCallback-132-thread-1) [    ] o.a.s.c.c.ConnectionManager zkClient has connected
   [junit4]   2> 285754 INFO  (jetty-launcher-123-thread-4) [    ] o.e.j.s.session DefaultSessionIdManager workerName=node0
   [junit4]   2> 285754 INFO  (jetty-launcher-123-thread-4) [    ] o.e.j.s.session No SessionScavenger set, using defaults
   [junit4]   2> 285754 INFO  (jetty-launcher-123-thread-4) [    ] o.e.j.s.session node0 Scavenging every 600000ms
   [junit4]   2> 285781 INFO  (jetty-launcher-123-thread-1) [    ] o.a.s.c.ZkContainer Zookeeper client=127.0.0.1:39016/solr
   [junit4]   2> 285813 INFO  (zkConnectionManagerCallback-130-thread-1) [    ] o.a.s.c.c.ConnectionManager zkClient has connected
   [junit4]   2> 285827 INFO  (jetty-launcher-123-thread-3) [    ] o.a.s.s.SolrDispatchFilter solr.xml found in ZooKeeper. Loading...
   [junit4]   2> 285827 INFO  (jetty-launcher-123-thread-2) [    ] o.a.s.s.SolrDispatchFilter solr.xml found in ZooKeeper. Loading...
   [junit4]   2> 285837 INFO  (zkConnectionManagerCallback-134-thread-1) [    ] o.a.s.c.c.ConnectionManager zkClient has connected
   [junit4]   2> 285858 INFO  (jetty-launcher-123-thread-4) [    ] o.e.j.s.h.ContextHandler Started o.e.j.s.ServletContextHandler@70f1600b{/solr,null,AVAILABLE}
   [junit4]   2> 285858 INFO  (jetty-launcher-123-thread-4) [    ] o.e.j.s.AbstractConnector Started ServerConnector@44f05aab{SSL,[ssl, http/1.1]}{127.0.0.1:32805}
   [junit4]   2> 285859 INFO  (jetty-launcher-123-thread-4) [    ] o.e.j.s.Server Started @286086ms
   [junit4]   2> 285859 INFO  (jetty-launcher-123-thread-4) [    ] o.a.s.c.s.e.JettySolrRunner Jetty properties: {hostContext=/solr, hostPort=32805}
   [junit4]   2> 285859 ERROR (jetty-launcher-123-thread-4) [    ] o.a.s.u.StartupLoggingUtils Missing Java Option solr.log.dir. Logging may be missing or incomplete.
   [junit4]   2> 285859 INFO  (jetty-launcher-123-thread-4) [    ] o.a.s.s.SolrDispatchFilter Using logger factory org.apache.logging.slf4j.Log4jLoggerFactory
   [junit4]   2> 285859 INFO  (jetty-launcher-123-thread-4) [    ] o.a.s.s.SolrDispatchFilter  ___      _       Welcome to Apache Solr? version 8.0.0
   [junit4]   2> 285859 INFO  (jetty-launcher-123-thread-4) [    ] o.a.s.s.SolrDispatchFilter / __| ___| |_ _   Starting in cloud mode on port null
   [junit4]   2> 285859 INFO  (jetty-launcher-123-thread-4) [    ] o.a.s.s.SolrDispatchFilter \__ \/ _ \ | '_|  Install dir: null
   [junit4]   2> 285859 INFO  (jetty-launcher-123-thread-4) [    ] o.a.s.s.SolrDispatchFilter |___/\___/_|_|    Start time: 2018-05-20T14:34:21.934Z
   [junit4]   2> 285915 INFO  (zkConnectionManagerCallback-138-thread-1) [    ] o.a.s.c.c.ConnectionManager zkClient has connected
   [junit4]   2> 285935 INFO  (jetty-launcher-123-thread-5) [    ] o.a.s.s.SolrDispatchFilter solr.xml found in ZooKeeper. Loading...
   [junit4]   2> 285968 INFO  (jetty-launcher-123-thread-3) [    ] o.a.s.c.ZkContainer Zookeeper client=127.0.0.1:39016/solr
   [junit4]   2> 286045 INFO  (jetty-launcher-123-thread-2) [    ] o.a.s.c.ZkContainer Zookeeper client=127.0.0.1:39016/solr
   [junit4]   2> 286232 INFO  (jetty-launcher-123-thread-5) [    ] o.a.s.c.ZkContainer Zookeeper client=127.0.0.1:39016/solr
   [junit4]   2> 286394 INFO  (zkConnectionManagerCallback-148-thread-1) [    ] o.a.s.c.c.ConnectionManager zkClient has connected
   [junit4]   2> 286394 INFO  (zkConnectionManagerCallback-144-thread-1) [    ] o.a.s.c.c.ConnectionManager zkClient has connected
   [junit4]   2> 286426 INFO  (zkConnectionManagerCallback-140-thread-1) [    ] o.a.s.c.c.ConnectionManager zkClient has connected
   [junit4]   2> 286426 INFO  (zkConnectionManagerCallback-154-thread-1) [    ] o.a.s.c.c.ConnectionManager zkClient has connected
   [junit4]   2> 286479 INFO  (zkConnectionManagerCallback-152-thread-1) [    ] o.a.s.c.c.ConnectionManager zkClient has connected
   [junit4]   2> 286480 INFO  (jetty-launcher-123-thread-4) [    ] o.a.s.s.SolrDispatchFilter solr.xml found in ZooKeeper. Loading...
   [junit4]   2> 286496 WARN  (NIOServerCxn.Factory:0.0.0.0/0.0.0.0:0) [    ] o.a.z.s.NIOServerCnxn Unable to read additional data from client sessionid 0x102223b88cc0008, likely client has closed socket
   [junit4]   2> 286744 INFO  (jetty-launcher-123-thread-4) [    ] o.a.s.c.ZkContainer Zookeeper client=127.0.0.1:39016/solr
   [junit4]   2> 286902 INFO  (zkConnectionManagerCallback-166-thread-1) [    ] o.a.s.c.c.ConnectionManager zkClient has connected
   [junit4]   2> 287008 INFO  (zkConnectionManagerCallback-160-thread-1) [    ] o.a.s.c.c.ConnectionManager zkClient has connected
   [junit4]   2> 287015 INFO  (zkConnectionManagerCallback-156-thread-1) [    ] o.a.s.c.c.ConnectionManager zkClient has connected
   [junit4]   2> 287028 INFO  (zkConnectionManagerCallback-158-thread-1) [    ] o.a.s.c.c.ConnectionManager zkClient has connected
   [junit4]   2> 287249 INFO  (zkConnectionManagerCallback-168-thread-1) [    ] o.a.s.c.c.ConnectionManager zkClient has connected
   [junit4]   2> 287920 INFO  (jetty-launcher-123-thread-5) [n:127.0.0.1:40876_solr    ] o.a.s.c.Overseer Overseer (id=null) closing
   [junit4]   2> 287930 INFO  (jetty-launcher-123-thread-3) [n:127.0.0.1:46733_solr    ] o.a.s.c.Overseer Overseer (id=null) closing
   [junit4]   2> 287938 INFO  (jetty-launcher-123-thread-2) [n:127.0.0.1:38848_solr    ] o.a.s.c.Overseer Overseer (id=null) closing
   [junit4]   2> 287954 INFO  (jetty-launcher-123-thread-5) [n:127.0.0.1:40876_solr    ] o.a.s.c.OverseerElectionContext I am going to be the leader 127.0.0.1:40876_solr
   [junit4]   2> 287975 INFO  (jetty-launcher-123-thread-4) [n:127.0.0.1:32805_solr    ] o.a.s.c.Overseer Overseer (id=null) closing
   [junit4]   2> 288003 INFO  (jetty-launcher-123-thread-3) [n:127.0.0.1:46733_solr    ] o.a.s.c.ZkController Register node as live in ZooKeeper:/live_nodes/127.0.0.1:46733_solr
   [junit4]   2> 288011 INFO  (jetty-launcher-123-thread-2) [n:127.0.0.1:38848_solr    ] o.a.s.c.ZkController Register node as live in ZooKeeper:/live_nodes/127.0.0.1:38848_solr
   [junit4]   2> 288029 INFO  (jetty-launcher-123-thread-5) [n:127.0.0.1:40876_solr    ] o.a.s.c.Overseer Overseer (id=72658183084834828-127.0.0.1:40876_solr-n_0000000000) starting
   [junit4]   2> 288202 INFO  (zkCallback-159-thread-1) [    ] o.a.s.c.c.ZkStateReader Updated live nodes from ZooKeeper... (0) -> (2)
   [junit4]   2> 288202 INFO  (zkCallback-155-thread-1) [    ] o.a.s.c.c.ZkStateReader Updated live nodes from ZooKeeper... (0) -> (2)
   [junit4]   2> 288210 INFO  (zkCallback-167-thread-1) [    ] o.a.s.c.c.ZkStateReader Updated live nodes from ZooKeeper... (0) -> (2)
   [junit4]   2> 288307 INFO  (zkCallback-157-thread-1) [    ] o.a.s.c.c.ZkStateReader Updated live nodes from ZooKeeper... (0) -> (2)
   [junit4]   2> 288340 INFO  (jetty-launcher-123-thread-4) [n:127.0.0.1:32805_solr    ] o.a.s.c.TransientSolrCoreCacheDefault Allocating transient cache for 2147483647 transient cores
   [junit4]   2> 288340 INFO  (jetty-launcher-123-thread-4) [n:127.0.0.1:32805_solr    ] o.a.s.c.ZkController Register node as live in ZooKeeper:/live_nodes/127.0.0.1:32805_solr
   [junit4]   2> 288401 INFO  (zkCallback-157-thread-1) [    ] o.a.s.c.c.ZkStateReader Updated live nodes from ZooKeeper... (2) -> (3)
   [junit4]   2> 288401 INFO  (zkCallback-155-thread-1) [    ] o.a.s.c.c.ZkStateReader Updated live nodes from ZooKeeper... (2) -> (3)
   [junit4]   2> 288416 INFO  (zkCallback-167-thread-1) [    ] o.a.s.c.c.ZkStateReader Updated live nodes from ZooKeeper... (2) -> (3)
   [junit4]   2> 288421 INFO  (zkCallback-159-thread-1) [    ] o.a.s.c.c.ZkStateReader Updated live nodes from ZooKeeper... (2) -> (3)
   [junit4]   2> 288933 INFO  (zkConnectionManagerCallback-181-thread-1) [    ] o.a.s.c.c.ConnectionManager zkClient has connected
   [junit4]   2> 289081 INFO  (jetty-launcher-123-thread-5) [n:127.0.0.1:40876_solr    ] o.a.s.c.c.ZkStateReader Updated live nodes from ZooKeeper... (0) -> (3)
   [junit4]   2> 289152 INFO  (jetty-launcher-123-thread-5) [n:127.0.0.1:40876_solr    ] o.a.s.c.s.i.ZkClientClusterStateProvider Cluster at 127.0.0.1:39016/solr ready
   [junit4]   2> 289226 DEBUG (OverseerAutoScalingTriggerThread-72658183084834828-127.0.0.1:40876_solr-n_0000000000) [    ] o.a.s.c.a.OverseerTriggerThread Adding .auto_add_replicas and .scheduled_maintenance triggers
   [junit4]   2> 289227 DEBUG (OverseerAutoScalingTriggerThread-72658183084834828-127.0.0.1:40876_solr-n_0000000000) [    ] o.a.s.c.a.OverseerTriggerThread Refreshing /autoscaling.json with znode version 1
   [junit4]   2> 289228 DEBUG (OverseerAutoScalingTriggerThread-72658183084834828-127.0.0.1:40876_solr-n_0000000000) [    ] o.a.s.c.a.OverseerTriggerThread Current znodeVersion 1, lastZnodeVersion -1
   [junit4]   2> 289228 DEBUG (OverseerAutoScalingTriggerThread-72658183084834828-127.0.0.1:40876_solr-n_0000000000) [    ] o.a.s.c.a.OverseerTriggerThread Processed trigger updates upto znodeVersion 1
   [junit4]   2> 289297 DEBUG (OverseerAutoScalingTriggerThread-72658183084834828-127.0.0.1:40876_solr-n_0000000000) [    ] o.a.s.c.a.NodeLostTrigger NodeLostTrigger .auto_add_replicas - Initial livenodes: [127.0.0.1:38848_solr, 127.0.0.1:46733_solr, 127.0.0.1:32805_solr]
   [junit4]   2> 289311 DEBUG (OverseerAutoScalingTriggerThread-72658183084834828-127.0.0.1:40876_solr-n_0000000000) [    ] o.a.s.c.a.OverseerTriggerThread -- clean old nodeAdded markers
   [junit4]   2> 289312 DEBUG (OverseerAutoScalingTriggerThread-72658183084834828-127.0.0.1:40876_solr-n_0000000000) [    ] o.a.s.c.a.OverseerTriggerThread Current znodeVersion 1, lastZnodeVersion 1
   [junit4]   2> 289340 INFO  (jetty-launcher-123-thread-5) [n:127.0.0.1:40876_solr    ] o.a.s.c.TransientSolrCoreCacheDefault Allocating transient cache for 2147483647 transient cores
   [junit4]   2> 289340 INFO  (jetty-launcher-123-thread-5) [n:127.0.0.1:40876_solr    ] o.a.s.c.ZkController Register node as live in ZooKeeper:/live_nodes/127.0.0.1:40876_solr
   [junit4]   2> 289360 DEBUG (ScheduledTrigger-213-thread-1) [    ] o.a.s.c.a.NodeLostTrigger Running NodeLostTrigger: .auto_add_replicas with currently live nodes: 3
   [junit4]   2> 289369 INFO  (zkCallback-155-thread-1) [    ] o.a.s.c.c.ZkStateReader Updated live nodes from ZooKeeper... (3) -> (4)
   [junit4]   2> 289369 INFO  (zkCallback-157-thread-1) [    ] o.a.s.c.c.ZkStateReader Updated live nodes from ZooKeeper... (3) -> (4)
   [junit4]   2> 289372 INFO  (zkCallback-167-thread-1) [    ] o.a.s.c.c.ZkStateReader Updated live nodes from ZooKeeper... (3) -> (4)
   [junit4]   2> 289465 INFO  (zkCallback-180-thread-1) [    ] o.a.s.c.c.ZkStateReader Updated live nodes from ZooKeeper... (3) -> (4)
   [junit4]   2> 289522 INFO  (zkCallback-159-thread-1) [    ] o.a.s.c.c.ZkStateReader Updated live nodes from ZooKeeper... (3) -> (4)
   [junit4]   2> 289666 INFO  (jetty-launcher-123-thread-1) [n:127.0.0.1:40163_solr    ] o.a.s.c.c.ZkStateReader Updated live nodes from ZooKeeper... (0) -> (4)
   [junit4]   2> 289668 INFO  (jetty-launcher-123-thread-1) [n:127.0.0.1:40163_solr    ] o.a.s.c.Overseer Overseer (id=null) closing
   [junit4]   2> 289704 INFO  (jetty-launcher-123-thread-1) [n:127.0.0.1:40163_solr    ] o.a.s.c.TransientSolrCoreCacheDefault Allocating transient cache for 2147483647 transient cores
   [junit4]   2> 289704 INFO  (jetty-launcher-123-thread-1) [n:127.0.0.1:40163_solr    ] o.a.s.c.ZkController Register node as live in ZooKeeper:/live_nodes/127.0.0.1:40163_solr
   [junit4]   2> 289737 INFO  (zkCallback-167-thread-1) [    ] o.a.s.c.c.ZkStateReader Updated live nodes from ZooKeeper... (4) -> (5)
   [junit4]   2> 289738 INFO  (zkCallback-157-thread-1) [    ] o.a.s.c.c.ZkStateReader Updated live nodes from ZooKeeper... (4) -> (5)
   [junit4]   2> 289741 INFO  (zkCallback-159-thread-1) [    ] o.a.s.c.c.ZkStateReader Updated live nodes from ZooKeeper... (4) -> (5)
   [junit4]   2> 289754 INFO  (zkCallback-155-thread-1) [    ] o.a.s.c.c.ZkStateReader Updated live nodes from ZooKeeper... (4) -> (5)
   [junit4]   2> 289758 INFO  (zkCallback-180-thread-1) [    ] o.a.s.c.c.ZkStateReader Updated live nodes from ZooKeeper... (4) -> (5)
   [junit4]   2> 289814 INFO  (zkCallback-153-thread-1) [    ] o.a.s.c.c.ZkStateReader Updated live nodes from ZooKeeper... (4) -> (5)
   [junit4]   2> 293624 DEBUG (ScheduledTrigger-213-thread-3) [    ] o.a.s.c.a.NodeLostTrigger Running NodeLostTrigger: .auto_add_replicas with currently live nodes: 5
   [junit4]   2> 294045 INFO  (jetty-launcher-123-thread-4) [n:127.0.0.1:32805_solr    ] o.a.s.m.r.SolrJmxReporter JMX monitoring for 'solr_32805.solr.node' (registry 'solr.node') enabled at server: com.sun.jmx.mbeanserver.JmxMBeanServer@5c6cfff7
   [junit4]   2> 294279 INFO  (jetty-launcher-123-thread-4) [n:127.0.0.1:32805_solr    ] o.a.s.m.r.SolrJmxReporter JMX monitoring for 'solr_32805.solr.jvm' (registry 'solr.jvm') enabled at server: com.sun.jmx.mbeanserver.JmxMBeanServer@5c6cfff7
   [junit4]   2> 294279 INFO  (jetty-launcher-123-thread-4) [n:127.0.0.1:32805_solr    ] o.a.s.m.r.SolrJmxReporter JMX monitoring for 'solr_32805.solr.jetty' (registry 'solr.jetty') enabled at server: com.sun.jmx.mbeanserver.JmxMBeanServer@5c6cfff7
   [junit4]   2> 294280 INFO  (jetty-launcher-123-thread-4) [n:127.0.0.1:32805_solr    ] o.a.s.c.CorePropertiesLocator Found 0 core definitions underneath /home/jenkins/jenkins-slave/workspace/Lucene-Solr-Tests-master/solr/build/solr-core/test/J2/temp/solr.cloud.autoscaling.SearchRateTriggerIntegrationTest_8E7BDCA2A7E60AF5-001/tempDir-001/node5/.
   [junit4]   2> 294753 INFO  (zkConnectionManagerCallback-186-thread-1) [    ] o.a.s.c.c.ConnectionManager zkClient has connected
   [junit4]   2> 294753 DEBUG (ScheduledTrigger-213-thread-2) [    ] o.a.s.c.a.NodeLostTrigger Running NodeLostTrigger: .auto_add_replicas with currently live nodes: 5
   [junit4]   2> 294851 INFO  (jetty-launcher-123-thread-4) [n:127.0.0.1:32805_solr    ] o.a.s.c.c.ZkStateReader Updated live nodes from ZooKeeper... (0) -> (5)
   [junit4]   2> 294852 INFO  (jetty-launcher-123-thread-4) [n:127.0.0.1:32805_solr    ] o.a.s.c.s.i.ZkClientClusterStateProvider Cluster at 127.0.0.1:39016/solr ready
   [junit4]   2> 294873 INFO  (jetty-launcher-123-thread-3) [n:127.0.0.1:46733_solr    ] o.a.s.m.r.SolrJmxReporter JMX monitoring for 'solr_46733.solr.node' (registry 'solr.node') enabled at server: com.sun.jmx.mbeanserver.JmxMBeanServer@5c6cfff7
   [junit4]   2> 294954 INFO  (jetty-launcher-123-thread-3) [n:127.0.0.1:46733_solr    ] o.a.s.m.r.SolrJmxReporter JMX monitoring for 'solr_46733.solr.jvm' (registry 'solr.jvm') enabled at server: com.sun.jmx.mbeanserver.JmxMBeanServer@5c6cfff7
   [junit4]   2> 294954 INFO  (jetty-launcher-123-thread-3) [n:127.0.0.1:46733_solr    ] o.a.s.m.r.SolrJmxReporter JMX monitoring for 'solr_46733.solr.jetty' (registry 'solr.jetty') enabled at server: com.sun.jmx.mbeanserver.JmxMBeanServer@5c6cfff7
   [junit4]   2> 294955 INFO  (jetty-launcher-123-thread-3) [n:127.0.0.1:46733_solr    ] o.a.s.c.CorePropertiesLocator Found 0 core definitions underneath /home/jenkins/jenkins-slave/workspace/Lucene-Solr-Tests-master/solr/build/solr-core/test/J2/temp/solr.cloud.autoscaling.SearchRateTriggerIntegrationTest_8E7BDCA2A7E60AF5-001/tempDir-001/node3/.
   [junit4]   2> 295135 INFO  (zkConnectionManagerCallback-191-thread-1) [    ] o.a.s.c.c.ConnectionManager zkClient has connected
   [junit4]   2> 295266 INFO  (jetty-launcher-123-thread-3) [n:127.0.0.1:46733_solr    ] o.a.s.c.c.ZkStateReader Updated live nodes from ZooKeeper... (0) -> (5)
   [junit4]   2> 295267 INFO  (jetty-launcher-123-thread-3) [n:127.0.0.1:46733_solr    ] o.a.s.c.s.i.ZkClientClusterStateProvider Cluster at 127.0.0.1:39016/solr ready
   [junit4]   2> 295413 INFO  (jetty-launcher-123-thread-5) [n:127.0.0.1:40876_solr    ] o.a.s.m.r.SolrJmxReporter JMX monitoring for 'solr_40876.solr.node' (registry 'solr.node') enabled at server: com.sun.jmx.mbeanserver.JmxMBeanServer@5c6cfff7
   [junit4]   2> 295544 INFO  (jetty-launcher-123-thread-5) [n:127.0.0.1:40876_solr    ] o.a.s.m.r.SolrJmxReporter JMX monitoring for 'solr_40876.solr.jvm' (registry 'solr.jvm') enabled at server: com.sun.jmx.mbeanserver.JmxMBeanServer@5c6cfff7
   [junit4]   2> 295545 INFO  (jetty-launcher-123-thread-5) [n:127.0.0.1:40876_solr    ] o.a.s.m.r.SolrJmxReporter JMX monitoring for 'solr_40876.solr.jetty' (registry 'solr.jetty') enabled at server: com.sun.jmx.mbeanserver.JmxMBeanServer@5c6cfff7
   [junit4]   2> 295595 INFO  (jetty-launcher-123-thread-5) [n:127.0.0.1:40876_solr    ] o.a.s.c.CorePropertiesLocator Found 0 core definitions underneath /home/jenkins/jenkins-slave/workspace/Lucene-Solr-Tests-master/solr/build/solr-core/test/J2/temp/solr.cloud.autoscaling.SearchRateTriggerIntegrationTest_8E7BDCA2A7E60AF5-001/tempDir-001/node4/.
   [junit4]   2> 295757 DEBUG (ScheduledTrigger-213-thread-2) [    ] o.a.s.c.a.NodeLostTrigger Running NodeLostTrigger: .auto_add_replicas with currently live nodes: 5
   [junit4]   2> 295816 INFO  (jetty-launcher-123-thread-2) [n:127.0.0.1:38848_solr    ] o.a.s.m.r.SolrJmxReporter JMX monitoring for 'solr_38848.solr.node' (registry 'solr.node') enabled at server: com.sun.jmx.mbeanserver.JmxMBeanServer@5c6cfff7
   [junit4]   2> 295946 INFO  (jetty-launcher-123-thread-2) [n:127.0.0.1:38848_solr    ] o.a.s.m.r.SolrJmxReporter JMX monitoring for 'solr_38848.solr.jvm' (registry 'solr.jvm') enabled at server: com.sun.jmx.mbeanserver.JmxMBeanServer@5c6cfff7
   [junit4]   2> 295947 INFO  (jetty-launcher-123-thread-2) [n:127.0.0.1:38848_solr    ] o.a.s.m.r.SolrJmxReporter JMX monitoring for 'solr_38848.solr.jetty' (registry 'solr.jetty') enabled at server: com.sun.jmx.mbeanserver.JmxMBeanServer@5c6cfff7
   [junit4]   2> 295983 INFO  (jetty-launcher-123-thread-2) [n:127.0.0.1:38848_solr    ] o.a.s.c.CorePropertiesLocator Found 0 core definitions underneath /home/jenkins/jenkins-slave/workspace/Lucene-Solr-Tests-master/solr/build/solr-core/test/J2/temp/solr.cloud.autoscaling.SearchRateTriggerIntegrationTest_8E7BDCA2A7E60AF5-001/tempDir-001/node2/.
   [junit4]   2> 296180 INFO  (zkConnectionManagerCallback-196-thread-1) [    ] o.a.s.c.c.ConnectionManager zkClient has connected
   [junit4]   2> 296290 INFO  (jetty-launcher-123-thread-2) [n:127.0.0.1:38848_solr    ] o.a.s.c.c.ZkStateReader Updated live nodes from ZooKeeper... (0) -> (5)
   [junit4]   2> 296291 INFO  (jetty-launcher-123-thread-2) [n:127.0.0.1:38848_solr    ] o.a.s.c.s.i.ZkClientClusterStateProvider Cluster at 127.0.0.1:39016/solr ready
   [junit4]   2> 296760 DEBUG (ScheduledTrigger-213-thread-1) [    ] o.a.s.c.a.NodeLostTrigger Running NodeLostTrigger: .auto_add_replicas with currently live nodes: 5
   [junit4]   2> 297344 INFO  (jetty-launcher-123-thread-1) [n:127.0.0.1:40163_solr    ] o.a.s.m.r.SolrJmxReporter JMX monitoring for 'solr_40163.solr.node' (registry 'solr.node') enabled at server: com.sun.jmx.mbeanserver.JmxMBeanServer@5c6cfff7
   [junit4]   2> 297379 INFO  (jetty-launcher-123-thread-1) [n:127.0.0.1:40163_solr    ] o.a.s.m.r.SolrJmxReporter JMX monitoring for 'solr_40163.solr.jvm' (registry 'solr.jvm') enabled at server: com.sun.jmx.mbeanserver.JmxMBeanServer@5c6cfff7
   [junit4]   2> 297379 INFO  (jetty-launcher-123-thread-1) [n:127.0.0.1:40163_solr    ] o.a.s.m.r.SolrJmxReporter JMX monitoring for 'solr_40163.solr.jetty' (registry 'solr.jetty') enabled at server: com.sun.jmx.mbeanserver.JmxMBeanServer@5c6cfff7
   [junit4]   2> 297380 INFO  (jetty-launcher-123-thread-1) [n:127.0.0.1:40163_solr    ] o.a.s.c.CorePropertiesLocator Found 0 core definitions underneath /home/jenkins/jenkins-slave/workspace/Lucene-Solr-Tests-master/solr/build/solr-core/test/J2/temp/solr.cloud.autoscaling.SearchRateTriggerIntegrationTest_8E7BDCA2A7E60AF5-001/tempDir-001/node1/.
   [junit4]   2> 297440 INFO  (zkConnectionManagerCallback-201-thread-1) [    ] o.a.s.c.c.ConnectionManager zkClient has connected
   [junit4]   2> 297442 INFO  (jetty-launcher-123-thread-1) [n:127.0.0.1:40163_solr    ] o.a.s.c.c.ZkStateReader Updated live nodes from ZooKeeper... (0) -> (5)
   [junit4]   2> 297442 INFO  (jetty-launcher-123-thread-1) [n:127.0.0.1:40163_solr    ] o.a.s.c.s.i.ZkClientClusterStateProvider Cluster at 127.0.0.1:39016/solr ready
   [junit4]   2> 297760 DEBUG (ScheduledTrigger-213-thread-2) [    ] o.a.s.c.a.NodeLostTrigger Running NodeLostTrigger: .auto_add_replicas with currently live nodes: 5
   [junit4]   2> 298097 INFO  (zkConnectionManagerCallback-203-thread-1) [    ] o.a.s.c.c.ConnectionManager zkClient has connected
   [junit4]   2> 298115 INFO  (zkConnectionManagerCallback-208-thread-1) [    ] o.a.s.c.c.ConnectionManager zkClient has connected
   [junit4]   2> 298132 INFO  (SUITE-SearchRateTriggerIntegrationTest-seed#[8E7BDCA2A7E60AF5]-worker) [    ] o.a.s.c.c.ZkStateReader Updated live nodes from ZooKeeper... (0) -> (5)
   [junit4]   2> 298145 INFO  (SUITE-SearchRateTriggerIntegrationTest-seed#[8E7BDCA2A7E60AF5]-worker) [    ] o.a.s.c.s.i.ZkClientClusterStateProvider Cluster at 127.0.0.1:39016/solr ready
   [junit4]   2> 298815 DEBUG (ScheduledTrigger-213-thread-2) [    ] o.a.s.c.a.NodeLostTrigger Running NodeLostTrigger: .auto_add_replicas with currently live nodes: 5
   [junit4]   2> 299375 INFO  (qtp961713455-569) [n:127.0.0.1:32805_solr    ] o.a.s.s.HttpSolrCall [admin] webapp=null path=/admin/metrics params={prefix=CONTAINER.fs.usableSpace,CORE.coreName&wt=javabin&version=2&group=solr.node,solr.core} status=0 QTime=70
   [junit4]   2> 299646 INFO  (qtp581656984-545) [n:127.0.0.1:38848_solr    ] o.a.s.s.HttpSolrCall [admin] webapp=null path=/admin/metrics params={prefix=CONTAINER.fs.usableSpace,CORE.coreName&wt=javabin&version=2&group=solr.node,solr.core} status=0 QTime=0
   [junit4]   2> 299823 DEBUG (ScheduledTrigger-213-thread-2) [    ] o.a.s.c.a.NodeLostTrigger Running NodeLostTrigger: .auto_add_replicas with currently live nodes: 5
   [junit4]   2> 299845 INFO  (qtp1715671018-525) [n:127.0.0.1:40163_solr    ] o.a.s.s.HttpSolrCall [admin] webapp=null path=/admin/metrics params={prefix=CONTAINER.fs.usableSpace,CORE.coreName&wt=javabin&version=2&group=solr.node,solr.core} status=0 QTime=0
   [junit4]   2> 299990 INFO  (qtp341942661-557) [n:127.0.0.1:40876_solr    ] o.a.s.s.HttpSolrCall [admin] webapp=null path=/admin/metrics params={prefix=CONTAINER.fs.usableSpace,CORE.coreName&wt=javabin&version=2&group=solr.node,solr.core} status=0 QTime=102
   [junit4]   2> 300407 INFO  (qtp391138884-540) [n:127.0.0.1:46733_solr    ] o.a.s.s.HttpSolrCall [admin] webapp=null path=/admin/metrics params={prefix=CONTAINER.fs.usableSpace,CORE.coreName&wt=javabin&version=2&group=solr.node,solr.core} status=0 QTime=0
   [junit4]   2> 300477 DEBUG (qtp341942661-561) [n:127.0.0.1:40876_solr    ] o.a.s.c.a.AutoScalingHandler Verified autoscaling configuration
   [junit4]   2> 300478 DEBUG (zkCallback-180-thread-1) [    ] o.a.s.c.a.OverseerTriggerThread Refreshing /autoscaling.json with znode version 2
   [junit4]   2> 300576 INFO  (qtp341942661-561) [n:127.0.0.1:40876_solr    ] o.a.s.s.HttpSolrCall [admin] webapp=null path=/cluster/autoscaling params={wt=javabin&version=2} status=0 QTime=1666
   [junit4]   2> 300607 DEBUG (OverseerAutoScalingTriggerThread-72658183084834828-127.0.0.1:40876_solr-n_0000000000) [    ] o.a.s.c.a.OverseerTriggerThread Processed trigger updates upto znodeVersion 2
   [junit4]   2> 300681 DEBUG (OverseerAutoScalingTriggerThread-72658183084834828-127.0.0.1:40876_solr-n_0000000000) [    ] o.a.s.c.a.OverseerTriggerThread -- clean old nodeAdded markers
   [junit4]   2> 300682 DEBUG (OverseerAutoScalingTriggerThread-72658183084834828-127.0.0.1:40876_solr-n_0000000000) [    ] o.a.s.c.a.OverseerTriggerThread Current znodeVersion 2, lastZnodeVersion 2
   [junit4]   2> 300842 DEBUG (ScheduledTrigger-213-thread-2) [    ] o.a.s.c.a.NodeLostTrigger Running NodeLostTrigger: .auto_add_replicas with currently live nodes: 5
   [junit4]   2> 301640 INFO  (TEST-SearchRateTriggerIntegrationTest.testAboveSearchRate-seed#[8E7BDCA2A7E60AF5]) [    ] o.a.s.SolrTestCaseJ4 ###Starting testAboveSearchRate
   [junit4]   2> 301641 INFO  (TEST-SearchRateTriggerIntegrationTest.testAboveSearchRate-seed#[8E7BDCA2A7E60AF5]) [    ] o.a.s.c.c.ZkStateReader Updated live nodes from ZooKeeper... (0) -> (5)
   [junit4]   2> 301660 DEBUG (zkCallback-180-thread-1) [    ] o.a.s.c.a.OverseerTriggerThread Refreshing /autoscaling.json with znode version 3
   [junit4]   2> 301660 DEBUG (OverseerAutoScalingTriggerThread-72658183084834828-127.0.0.1:40876_solr-n_0000000000) [    ] o.a.s.c.a.OverseerTriggerThread Processed trigger updates upto znodeVersion 3
   [junit4]   2> 301661 DEBUG (OverseerAutoScalingTriggerThread-72658183084834828-127.0.0.1:40876_solr-n_0000000000) [    ] o.a.s.c.a.OverseerTriggerThread -- clean old nodeLost markers
   [junit4]   2> 301674 INFO  (TEST-SearchRateTriggerIntegrationTest.testAboveSearchRate-seed#[8E7BDCA2A7E60AF5]) [    ] o.a.s.c.a.SearchRateTriggerIntegrationTest /autoscaling.json reset, new znode version 3
   [junit4]   2> 301677 DEBUG (OverseerAutoScalingTriggerThread-72658183084834828-127.0.0.1:40876_solr-n_0000000000) [    ] o.a.s.c.a.OverseerTriggerThread -- clean old nodeAdded markers
   [junit4]   2> 301678 DEBUG (OverseerAutoScalingTriggerThread-72658183084834828-127.0.0.1:40876_solr-n_0000000000) [    ] o.a.s.c.a.OverseerTriggerThread Current znodeVersion 3, lastZnodeVersion 3
   [junit4]   2> 306685 INFO  (qtp581656984-548) [n:127.0.0.1:38848_solr    ] o.a.s.h.a.CollectionsHandler Invoked Collection Action :create with params replicationFactor=2&collection.configName=conf&name=aboveRate_collection&nrtReplicas=2&action=CREATE&numShards=1&wt=javabin&version=2 and sendToOCPQueue=true
   [junit4]   2> 306699 INFO  (OverseerThreadFactory-215-thread-1) [    ] o.a.s.c.a.c.CreateCollectionCmd Create collection aboveRate_collection
   [junit4]   2> 306860 INFO  (OverseerStateUpdate-72658183084834828-127.0.0.1:40876_solr-n_0000000000) [    ] o.a.s.c.o.SliceMutator createReplica() {
   [junit4]   2>   "operation":"ADDREPLICA",
   [junit4]   2>   "collection":"aboveRate_collection",
   [junit4]   2>   "shard":"shard1",
   [junit4]   2>   "core":"aboveRate_collection_shard1_replica_n1",
   [junit4]   2>   "state":"down",
   [junit4]   2>   "base_url":"https://127.0.0.1:32805/solr",
   [junit4]   2>   "type":"NRT",
   [junit4]   2>   "waitForFinalState":"false"} 
   [junit4]   2> 306876 INFO  (OverseerStateUpdate-72658183084834828-127.0.0.1:40876_solr-n_0000000000) [    ] o.a.s.c.o.SliceMutator createReplica() {
   [junit4]   2>   "operation":"ADDREPLICA",
   [junit4]   2>   "collection":"aboveRate_collection",
   [junit4]   2>   "shard":"shard1",
   [junit4]   2>   "core":"aboveRate_collection_shard1_replica_n2",
   [junit4]   2>   "state":"down",
   [junit4]   2>   "base_url":"https://127.0.0.1:40876/solr",
   [junit4]   2>   "type":"NRT",
   [junit4]   2>   "waitForFinalState":"false"} 
   [junit4]   2> 307160 INFO  (qtp961713455-574) [n:127.0.0.1:32805_solr    x:aboveRate_collection_shard1_replica_n1] o.a.s.h.a.CoreAdminOperation core create command qt=/admin/cores&coreNodeName=core_node3&collection.configName=conf&newCollection=true&name=aboveRate_collection_shard1_replica_n1&action=CREATE&numShards=1&collection=aboveRate_collection&shard=shard1&wt=javabin&version=2&replicaType=NRT
   [junit4]   2> 307237 INFO  (qtp341942661-561) [n:127.0.0.1:40876_solr    x:aboveRate_collection_shard1_replica_n2] o.a.s.h.a.CoreAdminOperation core create command qt=/admin/cores&coreNodeName=core_node4&collection.configName=conf&newCollection=true&name=aboveRate_collection_shard1_replica_n2&action=CREATE&numShards=1&collection=aboveRate_collection&shard=shard1&wt=javabin&version=2&replicaType=NRT
   [junit4]   2> 308240 INFO  (qtp961713455-574) [n:127.0.0.1:32805_solr c:aboveRate_collection s:shard1 r:core_node3 x:aboveRate_collection_shard1_replica_n1] o.a.s.c.SolrConfig Using Lucene MatchVersion: 8.0.0
   [junit4]   2> 308278 INFO  (qtp961713455-574) [n:127.0.0.1:32805_solr c:aboveRate_collection s:shard1 r:core_node3 x:aboveRate_collection_shard1_replica_n1] o.a.s.s.IndexSchema [aboveRate_collection_shard1_replica_n1] Schema name=minimal
   [junit4]   2> 308296 INFO  (qtp961713455-574) [n:127.0.0.1:32805_solr c:aboveRate_collection s:shard1 r:core_node3 x:aboveRate_collection_shard1_replica_n1] o.a.s.s.IndexSchema Loaded schema minimal/1.1 with uniqueid field id
   [junit4]   2> 308296 INFO  (qtp961713455-574) [n:127.0.0.1:32805_solr c:aboveRate_collection s:shard1 r:core_node3 x:aboveRate_collection_shard1_replica_n1] o.a.s.c.CoreContainer Creating SolrCore 'aboveRate_collection_shard1_replica_n1' using configuration from collection aboveRate_collection, trusted=true
   [junit4]   2> 308309 INFO  (qtp961713455-574) [n:127.0.0.1:32805_solr c:aboveRate_collection s:shard1 r:core_node3 x:aboveRate_collection_shard1_replica_n1] o.a.s.m.r.SolrJmxReporter JMX monitoring for 'solr_32805.solr.core.aboveRate_collection.shard1.replica_n1' (registry 'solr.core.aboveRate_collection.shard1.replica_n1') enabled at server: com.sun.jmx.mbeanserver.JmxMBeanServer@5c6cfff7
   [junit4]   2> 308309 INFO  (qtp961713455-574) [n:127.0.0.1:32805_solr c:aboveRate_collection s:shard1 r:core_node3 x:aboveRate_collection_shard1_replica_n1] o.a.s.c.SolrCore solr.RecoveryStrategy.Builder
   [junit4]   2> 308309 INFO  (qtp961713455-574) [n:127.0.0.1:32805_solr c:aboveRate_collection s:shard1 r:core_node3 x:aboveRate_collection_shard1_replica_n1] o.a.s.c.SolrCore [[aboveRate_collection_shard1_replica_n1] ] Opening new SolrCore at [/home/jenkins/jenkins-slave/workspace/Lucene-Solr-Tests-master/solr/build/solr-core/test/J2/temp/solr.cloud.autoscaling.SearchRateTriggerIntegrationTest_8E7BDCA2A7E60AF5-001/tempDir-001/node5/aboveRate_collection_shard1_replica_n1], dataDir=[/home/jenkins/jenkins-slave/workspace/Lucene-Solr-Tests-master/solr/build/solr-core/test/J2/temp/solr.cloud.autoscaling.SearchRateTriggerIntegrationTest_8E7BDCA2A7E60AF5-001/tempDir-001/node5/./aboveRate_collection_shard1_replica_n1/data/]
   [junit4]   2> 308549 INFO  (qtp341942661-561) [n:127.0.0.1:40876_solr c:aboveRate_collection s:shard1 r:core_node4 x:aboveRate_collection_shard1_replica_n2] o.a.s.c.SolrConfig Using Lucene MatchVersion: 8.0.0
   [junit4]   2> 308589 INFO  (qtp341942661-561) [n:127.0.0.1:40876_solr c:aboveRate_collection s:shard1 r:core_node4 x:aboveRate_collection_shard1_replica_n2] o.a.s.s.IndexSchema [aboveRate_collection_shard1_replica_n2] Schema name=minimal
   [junit4]   2> 308591 INFO  (qtp341942661-561) [n:127.0.0.1:40876_solr c:aboveRate_collection s:shard1 r:core_node4 x:aboveRate_collection_shard1_replica_n2] o.a.s.s.IndexSchema Loaded schema minimal/1.1 with uniqueid field id
   [junit4]   2> 308592 INFO  (qtp341942661-561) [n:127.0.0.1:40876_solr c:aboveRate_collection s:shard1 r:core_node4 x:aboveRate_collection_shard1_replica_n2] o.a.s.c.CoreContainer Creating SolrCore 'aboveRate_collection_shard1_replica_n2' using configuration from collection aboveRate_collection, trusted=true
   [junit4]   2> 308592 INFO  (qtp341942661-561) [n:127.0.0.1:40876_solr c:aboveRate_collection s:shard1 r:core_node4 x:aboveRate_collection_shard1_replica_n2] o.a.s.m.r.SolrJmxReporter JMX monitoring for 'solr_40876.solr.core.aboveRate_collection.shard1.replica_n2' (registry 'solr.core.aboveRate_collection.shard1.replica_n2') enabled at server: com.sun.jmx.mbeanserver.JmxMBeanServer@5c6cfff7
   [junit4]   2> 308592 INFO  (qtp341942661-561) [n:127.0.0.1:40876_solr c:aboveRate_collection s:shard1 r:core_node4 x:aboveRate_collection_shard1_replica_n2] o.a.s.c.SolrCore solr.RecoveryStrategy.Builder
   [junit4]   2> 308592 INFO  (qtp341942661-561) [n:127.0.0.1:40876_solr c:aboveRate_collection s:shard1 r:core_node4 x:aboveRate_collection_shard1_replica_n2] o.a.s.c.SolrCore [[aboveRate_collection_shard1_replica_n2] ] Opening new SolrCore at [/home/jenkins/jenkins-slave/workspace/Lucene-Solr-Tests-master/solr/build/solr-core/test/J2/temp/solr.cloud.autoscaling.SearchRateTriggerIntegrationTest_8E7BDCA2A7E60AF5-001/tempDir-001/node4/aboveRate_collection_shard1_replica_n2], dataDir=[/home/jenkins/jenkins-slave/workspace/Lucene-Solr-Tests-master/solr/build/solr-core/test/J2/temp/solr.cloud.autoscaling.SearchRateTriggerIntegrationTest_8E7BDCA2A7E60AF5-001/tempDir-001/node4/./aboveRate_collection_shard1_replica_n2/data/]
   [junit4]   2> 308723 INFO  (qtp961713455-574) [n:127.0.0.1:32805_solr c:aboveRate_collection s:shard1 r:core_node3 x:aboveRate_collection_shard1_replica_n1] o.a.s.u.UpdateHandler Using UpdateLog implementation: org.apache.solr.update.UpdateLog
   [junit4]   2> 308723 INFO  (qtp961713455-574) [n:127.0.0.1:32805_solr c:aboveRate_collection s:shard1 r:core_node3 x:aboveRate_collection_shard1_replica_n1] o.a.s.u.UpdateLog Initializing UpdateLog: dataDir=null defaultSyncLevel=FLUSH numRecordsToKeep=100 maxNumLogsToKeep=10 numVersionBuckets=65536
   [junit4]   2> 308725 INFO  (qtp961713455-574) [n:127.0.0.1:32805_solr c:aboveRate_collection s:shard1 r:core_node3 x:aboveRate_collection_shard1_replica_n1] o.a.s.u.CommitTracker Hard AutoCommit: disabled
   [junit4]   2> 308725 INFO  (qtp961713455-574) [n:127.0.0.1:32805_solr c:aboveRate_collection s:shard1 r:core_node3 x:aboveRate_collection_shard1_replica_n1] o.a.s.u.CommitTracker Soft AutoCommit: disabled
   [junit4]   2> 308727 INFO  (qtp961713455-574) [n:127.0.0.1:32805_solr c:aboveRate_collection s:shard1 r:core_node3 x:aboveRate_collection_shard1_replica_n1] o.a.s.s.SolrIndexSearcher Opening [Searcher@74b7c0e4[aboveRate_collection_shard1_replica_n1] main]
   [junit4]   2> 308740 INFO  (qtp961713455-574) [n:127.0.0.1:32805_solr c:aboveRate_collection s:shard1 r:core_node3 x:aboveRate_collection_shard1_replica_n1] o.a.s.r.ManagedResourceStorage Configured ZooKeeperStorageIO with znodeBase: /configs/conf
   [junit4]   2> 308740 INFO  (qtp961713455-574) [n:127.0.0.1:32805_solr c:aboveRate_collection s:shard1 r:core_node3 x:aboveRate_collection_shard1_replica_n1] o.a.s.r.ManagedResourceStorage Loaded null at path _rest_managed.json using ZooKeeperStorageIO:path=/configs/conf
   [junit4]   2> 308741 INFO  (qtp961713455-574) [n:127.0.0.1:32805_solr c:aboveRate_collection s:shard1 r:core_node3 x:aboveRate_collection_shard1_replica_n1] o.a.s.h.ReplicationHandler Commits will be reserved for 10000ms.
   [junit4]   2> 308752 INFO  (searcherExecutor-226-thread-1-processing-n:127.0.0.1:32805_solr x:aboveRate_collection_shard1_replica_n1 c:aboveRate_collection s:shard1 r:core_node3) [n:127.0.0.1:32805_solr c:aboveRate_collection s:shard1 r:core_node3 x:aboveRate_collection_shard1_replica_n1] o.a.s.c.SolrCore [aboveRate_collection_shard1_replica_n1] Registered new searcher Searcher@74b7c0e4[aboveRate_collection_shard1_replica_n1] main{ExitableDirectoryReader(UninvertingDirectoryReader())}
   [junit4]   2> 308752 INFO  (qtp961713455-574) [n:127.0.0.1:32805_solr c:aboveRate_collection s:shard1 r:core_node3 x:aboveRate_collection_shard1_replica_n1] o.a.s.u.UpdateLog Could not find max version in index or recent updates, using new clock 1600994027584356352
   [junit4]   2> 308790 INFO  (qtp961713455-574) [n:127.0.0.1:32805_solr c:aboveRate_collection s:shard1 r:core_node3 x:aboveRate_collection_shard1_replica_n1] o.a.s.c.ZkShardTerms Successful update of terms at /collections/aboveRate_collection/terms/shard1 to Terms{values={core_node3=0}, version=0}
   [junit4]   2> 308881 INFO  (qtp961713455-574) [n:127.0.0.1:32805_solr c:aboveRate_collection s:shard1 r:core_node3 x:aboveRate_collection_shard1_replica_n1] o.a.s.c.ShardLeaderElectionContext Waiting until we see more replicas up for shard shard1: total=2 found=1 timeoutin=9930ms
   [junit4]   2> 308934 INFO  (qtp341942661-561) [n:127.0.0.1:40876_solr c:aboveRate_collection s:shard1 r:core_node4 x:aboveRate_collection_shard1_replica_n2] o.a.s.u.UpdateHandler Using UpdateLog implementation: org.apache.solr.update.UpdateLog
   [junit4]   2> 308934 INFO  (qtp341942661-561) [n:127.0.0.1:40876_solr c:aboveRate_collection s:shard1 r:core_node4 x:aboveRate_collection_shard1_replica_n2] o.a.s.u.UpdateLog Initializing UpdateLog: dataDir=null defaultSyncLevel=FLUSH numRecordsToKeep=100 maxNumLogsToKeep=10 numVersionBuckets=65536
   [junit4]   2> 308936 INFO  (qtp341942661-561) [n:127.0.0.1:40876_solr c:aboveRate_collection s:shard1 r:core_node4 x:aboveRate_collection_shard1_replica_n2] o.a.s.u.CommitTracker Hard AutoCommit: disabled
   [junit4]   2> 308936 INFO  (qtp341942661-561) [n:127.0.0.1:40876_solr c:aboveRate_collection s:shard1 r:core_node4 x:aboveRate_collection_shard1_replica_n2] o.a.s.u.CommitTracker Soft AutoCommit: disabled
   [junit4]   2> 308938 INFO  (qtp341942661-561) [n:127.0.0.1:40876_solr c:aboveRate_collection s:shard1 r:core_node4 x:aboveRate_collection_shard1_replica_n2] o.a.s.s.SolrIndexSearcher Opening [Searcher@1bf127ce[aboveRate_collection_shard1_replica_n2] main]
   [junit4]   2> 308975 INFO  (qtp341942661-561) [n:127.0.0.1:40876_solr c:aboveRate_collection s:shard1 r:core_node4 x:aboveRate_collection_shard1_replica_n2] o.a.s.r.ManagedResourceStorage Configured ZooKeeperStorageIO with znodeBase: /configs/conf
   [junit4]   2> 308975 INFO  (qtp341942661-561) [n:127.0.0.1:40876_solr c:aboveRate_collection s:shard1 r:core_node4 x:aboveRate_collection_shard1_replica_n2] o.a.s.r.ManagedResourceStorage Loaded null at path _rest_managed.json using ZooKeeperStorageIO:path=/configs/conf
   [junit4]   2> 308976 INFO  (qtp341942661-561) [n:127.0.0.1:40876_solr c:aboveRate_collection s:shard1 r:core_node4 x:aboveRate_collection_shard1_replica_n2] o.a.s.h.ReplicationHandler Commits will be reserved for 10000ms.
   [junit4]   2> 308976 INFO  (qtp341942661-561) [n:127.0.0.1:40876_solr c:aboveRate_collection s:shard1 r:core_node4 x:aboveRate_collection_shard1_replica_n2] o.a.s.u.UpdateLog Could not find max version in index or recent updates, using new clock 1600994027819237376
   [junit4]   2> 309024 INFO  (searcherExecutor-228-thread-1-processing-n:127.0.0.1:40876_solr x:aboveRate_collection_shard1_replica_n2 c:aboveRate_collection s:shard1 r:core_node4) [n:127.0.0.1:40876_solr c:aboveRate_collection s:shard1 r:core_node4 x:aboveRate_collection_shard1_replica_n2] o.a.s.c.SolrCore [aboveRate_collection_shard1_replica_n2] Registered new searcher Searcher@1bf127ce[aboveRate_collection_shard1_replica_n2] main{ExitableDirectoryReader(UninvertingDirectoryReader())}
   [junit4]   2> 309028 INFO  (qtp341942661-561) [n:127.0.0.1:40876_solr c:aboveRate_collection s:shard1 r:core_node4 x:aboveRate_collection_shard1_replica_n2] o.a.s.c.ZkShardTerms Successful update of terms at /collections/aboveRate_collection/terms/shard1 to Terms{values={core_node3=0, core_node4=0}, version=1}
   [junit4]   2> 309386 INFO  (qtp961713455-574) [n:127.0.0.1:32805_solr c:aboveRate_collection s:shard1 r:core_node3 x:aboveRate_collection_shard1_replica_n1] o.a.s.c.ShardLeaderElectionContext Enough replicas found to continue.
   [junit4]   2> 309386 INFO  (qtp961713455-574) [n:127.0.0.1:32805_solr c:aboveRate_collection s:shard1 r:core_node3 x:aboveRate_collection_shard1_replica_n1] o.a.s.c.ShardLeaderElectionContext I may be the new leader - try and sync
   [junit4]   2> 309386 INFO  (qtp961713455-574) [n:127.0.0.1:32805_solr c:aboveRate_collection s:shard1 r:core_node3 x:aboveRate_collection_shard1_replica_n1] o.a.s.c.SyncStrategy Sync replicas to https://127.0.0.1:32805/solr/aboveRate_collection_shard1_replica_n1/
   [junit4]   2> 309387 INFO  (qtp961713455-574) [n:127.0.0.1:32805_solr c:aboveRate_collection s:shard1 r:core_node3 x:aboveRate_collection_shard1_replica_n1] o.a.s.u.PeerSync PeerSync: core=aboveRate_collection_shard1_replica_n1 url=https://127.0.0.1:32805/solr START replicas=[https://127.0.0.1:40876/solr/aboveRate_collection_shard1_replica_n2/] nUpdates=100
   [junit4]   2> 309511 INFO  (qtp341942661-562) [n:127.0.0.1:40876_solr c:aboveRate_collection s:shard1 r:core_node4 x:aboveRate_collection_shard1_replica_n2] o.a.s.c.S.Request [aboveRate_collection_shard1_replica_n2]  webapp=/solr path=/get params={distrib=false&qt=/get&fingerprint=false&getVersions=100&wt=javabin&version=2} status=0 QTime=1
   [junit4]   2> 309710 INFO  (qtp961713455-574) [n:127.0.0.1:32805_solr c:aboveRate_collection s:shard1 r:core_node3 x:aboveRate_collection_shard1_replica_n1] o.a.s.u.PeerSync PeerSync: core=aboveRate_collection_shard1_replica_n1 url=https://127.0.0.1:32805/solr DONE.  We have no versions.  sync failed.
   [junit4]   2> 309710 INFO  (qtp961713455-574) [n:127.0.0.1:32805_solr c:aboveRate_collection s:shard1 r:core_node3 x:aboveRate_collection_shard1_replica_n1] o.a.s.c.SyncStrategy Leader's attempt to sync with shard failed, moving to the next candidate
   [junit4]   2> 309710 INFO  (qtp961713455-574) [n:127.0.0.1:32805_solr c:aboveRate_collection s:shard1 r:core_node3 x:aboveRate_collection_shard1_replica_n1] o.a.s.c.ShardLeaderElectionContext We failed sync, but we have no versions - we can't sync in that case - we were active before, so become leader anyway
   [junit4]   2> 309710 INFO  (qtp961713455-574) [n:127.0.0.1:32805_solr c:aboveRate_collection s:shard1 r:core_node3 x:aboveRate_collection_shard1_replica_n1] o.a.s.c.ShardLeaderElectionContext Found all replicas participating in election, clear LIR
   [junit4]   2> 309747 INFO  (qtp961713455-574) [n:127.0.0.1:32805_solr c:aboveRate_collection s:shard1 r:core_node3 x:aboveRate_collection_shard1_replica_n1] o.a.s.c.ShardLeaderElectionContext I am the new leader: https://127.0.0.1:32805/solr/aboveRate_collection_shard1_replica_n1/ shard1
   [junit4]   2> 309967 INFO  (qtp961713455-574) [n:127.0.0.1:32805_solr c:aboveRate_collection s:shard1 r:core_node3 x:aboveRate_collection_shard1_replica_n1] o.a.s.c.ZkController I am the leader, no recovery necessary
   [junit4]   2> 309970 INFO  (qtp961713455-574) [n:127.0.0.1:32805_solr c:aboveRate_collection s:shard1 r:core_node3 x:aboveRate_collection_shard1_replica_n1] o.a.s.s.HttpSolrCall [admin] webapp=null path=/admin/cores params={qt=/admin/cores&coreNodeName=core_node3&collection.configName=conf&newCollection=true&name=aboveRate_collection_shard1_replica_n1&action=CREATE&numShards=1&collection=aboveRate_collection&shard=shard1&wt=javabin&version=2&replicaType=NRT} status=0 QTime=2810
   [junit4]   2> 310077 INFO  (qtp341942661-561) [n:127.0.0.1:40876_solr c:aboveRate_collection s:shard1 r:core_node4 x:aboveRate_collection_shard1_replica_n2] o.a.s.s.HttpSolrCall [admin] webapp=null path=/admin/cores params={qt=/admin/cores&coreNodeName=core_node4&collection.configName=conf&newCollection=true&name=aboveRate_collection_shard1_replica_n2&action=CREATE&numShards=1&collection=aboveRate_collection&shard=shard1&wt=javabin&version=2&replicaType=NRT} status=0 QTime=2852
   [junit4]   2> 310151 INFO  (zkCallback-167-thread-1) [    ] o.a.s.c.c.ZkStateReader A cluster state change: [WatchedEvent state:SyncConnected type:NodeDataChanged path:/collections/aboveRate_collection/state.json] for collection [aboveRate_collection] has occurred - updating... (live nodes size: [5])
   [junit4]   2> 310151 INFO  (zkCallback-159-thread-2) [    ] o.a.s.c.c.ZkStateReader A cluster state change: [WatchedEvent state:SyncConnected type:NodeDataChanged path:/collections/aboveRate_collection/state.json] for collection [aboveRate_collection] has occurred - updating... (live nodes size: [5])
   [junit4]   2> 310199 INFO  (qtp581656984-548) [n:127.0.0.1:38848_solr    ] o.a.s.h.a.CollectionsHandler Wait for new collection to be active for at most 30 seconds. Check all shard replicas
   [junit4]   2> 310214 INFO  (qtp581656984-548) [n:127.0.0.1:38848_solr    ] o.a.s.s.HttpSolrCall [admin] webapp=null path=/admin/collections params={replicationFactor=2&collection.configName=conf&name=aboveRate_collection&nrtReplicas=2&action=CREATE&numShards=1&wt=javabin&version=2} status=0 QTime=3529
   [junit4]   2> 310987 INFO  (OverseerCollectionConfigSetProcessor-72658183084834828-127.0.0.1:40876_solr-n_0000000000) [    ] o.a.s.c.OverseerTaskQueue Response ZK path: /overseer/collection-queue-work/qnr-0000000000 doesn't exist.  Requestor may have disconnected from ZooKeeper
   [junit4]   2> 311102 INFO  (qtp581656984-548) [n:127.0.0.1:38848_solr    ] o.a.s.s.HttpSolrCall [admin] webapp=null path=/admin/metrics params={prefix=CONTAINER.fs.usableSpace,CORE.coreName&wt=javabin&version=2&group=solr.node,solr.core} status=0 QTime=0
   [junit4]   2> 311286 INFO  (qtp391138884-540) [n:127.0.0.1:46733_solr    ] o.a.s.s.HttpSolrCall [admin] webapp=null path=/admin/metrics params={prefix=CONTAINER.fs.usableSpace,CORE.coreName&wt=javabin&version=2&group=solr.node,solr.core} status=0 QTime=0
   [junit4]   2> 311865 INFO  (qtp961713455-574) [n:127.0.0.1:32805_solr    ] o.a.s.s.HttpSolrCall [admin] webapp=null path=/admin/metrics params={wt=javabin&version=2&key=solr.core.aboveRate_collection.shard1.replica_n1:INDEX.sizeInBytes} status=0 QTime=0
   [junit4]   2> 311901 INFO  (qtp961713455-572) [n:127.0.0.1:32805_solr    ] o.a.s.s.HttpSolrCall [admin] webapp=null path=/admin/metrics params={prefix=CONTAINER.fs.usableSpace,CORE.coreName&wt=javabin&version=2&group=solr.node,solr.core} status=0 QTime=33
   [junit4]   2> 312159 INFO  (qtp1715671018-526) [n:127.0.0.1:40163_solr    ] o.a.s.s.HttpSolrCall [admin] webapp=null path=/admin/metrics params={prefix=CONTAINER.fs.usableSpace,CORE.coreName&wt=javabin&version=2&group=solr.node,solr.core} status=0 QTime=0
   [junit4]   2> 312319 INFO  (qtp341942661-561) [n:127.0.0.1:40876_solr    ] o.a.s.s.HttpSolrCall [admin] webapp=null path=/admin/metrics params={wt=javabin&version=2&key=solr.core.aboveRate_collection.shard1.replica_n2:INDEX.sizeInBytes} status=0 QTime=0
   [junit4]   2> 312333 INFO  (qtp341942661-561) [n:127.0.0.1:40876_solr    ] o.a.s.s.HttpSolrCall [admin] webapp=null path=/admin/metrics params={prefix=CONTAINER.fs.usableSpace,CORE.coreName&wt=javabin&version=2&group=solr.node,solr.core} status=0 QTime=0
   [junit4]   2> 312334 DEBUG (qtp1715671018-527) [n:127.0.0.1:40163_solr    ] o.a.s.c.a.AutoScalingHandler Verified autoscaling configuration
   [junit4]   2> 312352 INFO  (qtp1715671018-527) [n:127.0.0.1:40163_solr    ] o.a.s.s.HttpSolrCall [admin] webapp=null path=/cluster/autoscaling params={wt=javabin&version=2} status=0 QTime=1827
   [junit4]   2> 312661 DEBUG (zkCallback-180-thread-1) [    ] o.a.s.c.a.OverseerTriggerThread Refreshing /autoscaling.json with znode version 4
   [junit4]   2> 312662 DEBUG (OverseerAutoScalingTriggerThread-72658183084834828-127.0.0.1:40876_solr-n_0000000000) [    ] o.a.s.c.a.OverseerTriggerThread Processed trigger updates upto znodeVersion 4
   [junit4]   2> 312662 DEBUG (OverseerAutoScalingTriggerThread-72658183084834828-127.0.0.1:40876_solr-n_0000000000) [    ] o.a.s.c.a.OverseerTriggerThread -- clean old nodeLost markers
   [junit4]   2> 312662 DEBUG (OverseerAutoScalingTriggerThread-72658183084834828-127.0.0.1:40876_solr-n_0000000000) [    ] o.a.s.c.a.OverseerTriggerThread -- clean old nodeAdded markers
   [junit4]   2> 312697 DEBUG (OverseerAutoScalingTriggerThread-72658183084834828-127.0.0.1:40876_solr-n_0000000000) [    ] o.a.s.c.a.OverseerTriggerThread Current znodeVersion 4, lastZnodeVersion 4
   [junit4]   2> 312700 INFO  (qtp581656984-546) [n:127.0.0.1:38848_solr    ] o.a.s.s.HttpSolrCall [admin] webapp=null path=/admin/metrics params={prefix=CONTAINER.fs.usableSpace,CORE.coreName&wt=javabin&version=2&group=solr.node,solr.core} status=0 QTime=0
   [junit4]   2> 312793 INFO  (qtp391138884-542) [n:127.0.0.1:46733_solr    ] o.a.s.s.HttpSolrCall [admin] webapp=null path=/admin/metrics params={prefix=CONTAINER.fs.usableSpace,CORE.coreName&wt=javabin&version=2&group=solr.node,solr.core} status=0 QTime=0
   [junit4]   2> 312974 INFO  (qtp961713455-571) [n:127.0.0.1:32805_solr    ] o.a.s.s.HttpSolrCall [admin] webapp=null path=/admin/metrics params={wt=javabin&version=2&key=solr.core.aboveRate_collection.shard1.replica_n1:INDEX.sizeInBytes} status=0 QTime=125
   [junit4]   2> 312996 INFO  (qtp961713455-572) [n:127.0.0.1:32805_solr    ] o.a.s.s.HttpSolrCall [admin] webapp=null path=/admin/metrics params={prefix=CONTAINER.fs.usableSpace,CORE.coreName&wt=javabin&version=2&group=solr.node,solr.core} status=0 QTime=19
   [junit4]   2> 313269 INFO  (qtp1715671018-527) [n:127.0.0.1:40163_solr    ] o.a.s.s.HttpSolrCall [admin] webapp=null path=/admin/metrics params={prefix=CONTAINER.fs.usableSpace,CORE.coreName&wt=javabin&version=2&group=solr.node,solr.core} status=0 QTime=0
   [junit4]   2> 313784 INFO  (qtp341942661-564) [n:127.0.0.1:40876_solr    ] o.a.s.s.HttpSolrCall [admin] webapp=null path=/admin/metrics params={wt=javabin&version=2&key=solr.core.aboveRate_collection.shard1.replica_n2:INDEX.sizeInBytes} status=0 QTime=108
   [junit4]   2> 313841 INFO  (qtp341942661-563) [n:127.0.0.1:40876_solr    ] o.a.s.s.HttpSolrCall [admin] webapp=null path=/admin/metrics params={prefix=CONTAINER.fs.usableSpace,CORE.coreName&wt=javabin&version=2&group=solr.node,solr.core} status=0 QTime=0
   [junit4]   2> 313841 DEBUG (qtp581656984-545) [n:127.0.0.1:38848_solr    ] o.a.s.c.a.AutoScalingHandler Verified autoscaling configuration
   [junit4]   2> 313856 INFO  (qtp581656984-545) [n:127.0.0.1:38848_solr    ] o.a.s.s.HttpSolrCall [admin] webapp=null path=/admin/autoscaling params={wt=javabin&version=2} status=0 QTime=1502
   [junit4]   2> 313869 DEBUG (zkCallback-180-thread-1) [    ] o.a.s.c.a.OverseerTriggerThread Refreshing /autoscaling.json with znode version 5
   [junit4]   2> 313869 DEBUG (OverseerAutoScalingTriggerThread-72658183084834828-127.0.0.1:40876_solr-n_0000000000) [    ] o.a.s.c.a.OverseerTriggerThread Processed trigger updates upto znodeVersion 5
   [junit4]   2> 313869 DEBUG (OverseerAutoScalingTriggerThread-72658183084834828-127.0.0.1:40876_solr-n_0000000000) [    ] o.a.s.c.a.OverseerTriggerThread -- clean old nodeLost markers
   [junit4]   2> 313870 DEBUG (OverseerAutoScalingTriggerThread-72658183084834828-127.0.0.1:40876_solr-n_0000000000) [    ] o.a.s.c.a.OverseerTriggerThread -- clean old nodeAdded markers
   [junit4]   2> 313870 DEBUG (OverseerAutoScalingTriggerThread-72658183084834828-127.0.0.1:40876_solr-n_0000000000) [    ] o.a.s.c.a.OverseerTriggerThread Current znodeVersion 5, lastZnodeVersion 5
   [junit4]   2> 313907 INFO  (qtp581656984-545) [n:127.0.0.1:38848_solr    ] o.a.s.s.HttpSolrCall [admin] webapp=null path=/admin/metrics params={prefix=CONTAINER.fs.usableSpace,CORE.coreName&wt=javabin&version=2&group=solr.node,solr.core} status=0 QTime=0
   [junit4]   2> 313932 INFO  (qtp391138884-540) [n:127.0.0.1:46733_solr    ] o.a.s.s.HttpSolrCall [admin] webapp=null path=/admin/metrics params={prefix=CONTAINER.fs.usableSpace,CORE.coreName&wt=javabin&version=2&group=solr.node,solr.core} status=0 QTime=0
   [junit4]   2> 313968 INFO  (qtp961713455-571) [n:127.0.0.1:32805_solr    ] o.a.s.s.HttpSolrCall [admin] webapp=null path=/admin/metrics params={wt=javabin&version=2&key=solr.core.aboveRate_collection.shard1.replica_n1:INDEX.sizeInBytes} status=0 QTime=0
   [junit4]   2> 313989 INFO  (qtp961713455-571) [n:127.0.0.1:32805_solr    ] o.a.s.s.HttpSolrCall [admin] webapp=null path=/admin/metrics params={prefix=CONTAINER.fs.usableSpace,CORE.coreName&wt=javabin&version=2&group=solr.node,solr.core} status=0 QTime=20
   [junit4]   2> 314052 INFO  (qtp1715671018-528) [n:127.0.0.1:40163_solr    ] o.a.s.s.HttpSolrCall [admin] webapp=null path=/admin/metrics params={prefix=CONTAINER.fs.usableSpace,CORE.coreName&wt=javabin&version=2&group=solr.node,solr.core} status=0 QTime=0
   [junit4]   2> 314076 INFO  (qtp341942661-564) [n:127.0.0.1:40876_solr    ] o.a.s.s.HttpSolrCall [admin] webapp=null path=/admin/metrics params={wt=javabin&version=2&key=solr.core.aboveRate_collection.shard1.replica_n2:INDEX.sizeInBytes} status=0 QTime=0
   [junit4]   2> 314078 INFO  (qtp341942661-563) [n:127.0.0.1:40876_solr    ] o.a.s.s.HttpSolrCall [admin] webapp=null path=/admin/metrics params={prefix=CONTAINER.fs.usableSpace,CORE.coreName&wt=javabin&version=2&group=solr.node,solr.core} status=0 QTime=0
   [junit4]   2> 314078 DEBUG (qtp581656984-546) [n:127.0.0.1:38848_solr    ] o.a.s.c.a.AutoScalingHandler Verified autoscaling configuration
   [junit4]   2> 314088 DEBUG (zkCallback-180-thread-1) [    ] o.a.s.c.a.OverseerTriggerThread Refreshing /autoscaling.json with znode version 6
   [junit4]   2> 314088 DEBUG (OverseerAutoScalingTriggerThread-72658183084834828-127.0.0.1:40876_solr-n_0000000000) [    ] o.a.s.c.a.OverseerTriggerThread Processed trigger updates upto znodeVersion 6
   [junit4]   2> 314088 DEBUG (OverseerAutoScalingTriggerThread-72658183084834828-127.0.0.1:40876_solr-n_0000000000) [    ] o.a.s.c.a.OverseerTriggerThread -- clean old nodeLost markers
   [junit4]   2> 314089 DEBUG (OverseerAutoScalingTriggerThread-72658183084834828-127.0.0.1:40876_solr-n_0000000000) [    ] o.a.s.c.a.OverseerTriggerThread -- clean old nodeAdded markers
   [junit4]   2> 314089 DEBUG (OverseerAutoScalingTriggerThread-72658183084834828-127.0.0.1:40876_solr-n_0000000000) [    ] o.a.s.c.a.OverseerTriggerThread Current znodeVersion 6, lastZnodeVersion 6
   [junit4]   2> 314095 INFO  (qtp581656984-546) [n:127.0.0.1:38848_solr    ] o.a.s.s.HttpSolrCall [admin] webapp=null path=/admin/autoscaling params={wt=javabin&version=2} status=0 QTime=227
   [junit4]   2> 314115 INFO  (qtp581656984-546) [n:127.0.0.1:38848_solr    ] o.a.s.s.HttpSolrCall [admin] webapp=null path=/admin/metrics params={prefix=CONTAINER.fs.usableSpace,CORE.coreName&wt=javabin&version=2&group=solr.node,solr.core} status=0 QTime=0
   [junit4]   2> 314133 INFO  (qtp391138884-540) [n:127.0.0.1:46733_solr    ] o.a.s.s.HttpSolrCall [admin] webapp=null path=/admin/metrics params={prefix=CONTAINER.fs.usableSpace,CORE.coreName&wt=javabin&version=2&group=solr.node,solr.core} status=0 QTime=0
   [junit4]   2> 314134 INFO  (qtp961713455-572) [n:127.0.0.1:32805_solr    ] o.a.s.s.HttpSolrCall [admin] webapp=null path=/admin/metrics params={wt=javabin&version=2&key=solr.core.aboveRate_collection.shard1.replica_n1:INDEX.sizeInBytes} status=0 QTime=0
   [junit4]   2> 314150 INFO  (qtp961713455-571) [n:127.0.0.1:32805_solr    ] o.a.s.s.HttpSolrCall [admin] webapp=null path=/admin/metrics params={prefix=CONTAINER.fs.usableSpace,CORE.coreName&wt=javabin&version=2&group=solr.node,solr.core} status=0 QTime=0
   [junit4]   2> 314151 INFO  (qtp1715671018-527) [n:127.0.0.1:40163_solr    ] o.a.s.s.HttpSolrCall [admin] webapp=null path=/admin/metrics params={prefix=CONTAINER.fs.usableSpace,CORE.coreName&wt=javabin&version=2&group=solr.node,solr.core} status=0 QTime=0
   [junit4]   2> 314169 INFO  (qtp341942661-564) [n:127.0.0.1:40876_solr    ] o.a.s.s.HttpSolrCall [admin] webapp=null path=/admin/metrics params={wt=javabin&version=2&key=solr.core.aboveRate_collection.shard1.replica_n2:INDEX.sizeInBytes} status=0 QTime=0
   [junit4]   2> 314188 INFO  (qtp341942661-563) [n:127.0.0.1:40876_solr    ] o.a.s.s.HttpSolrCall [admin] webapp=null path=/admin/metrics params={prefix=CONTAINER.fs.usableSpace,CORE.coreName&wt=javabin&version=2&group=solr.node,solr.core} status=0 QTime=0
   [junit4]   2> 314188 DEBUG (qtp581656984-545) [n:127.0.0.1:38848_solr    ] o.a.s.c.a.AutoScalingHandler Verified autoscaling configuration
   [junit4]   2> 314206 INFO  (qtp581656984-545) [n:127.0.0.1:38848_solr    ] o.a.s.s.HttpSolrCall [admin] webapp=null path=/admin/autoscaling params={wt=javabin&version=2} status=0 QTime=93
   [junit4]   2> 314220 DEBUG (zkCallback-180-thread-1) [    ] o.a.s.c.a.OverseerTriggerThread Refreshing /autoscaling.json with znode version 7
   [junit4]   2> 314220 DEBUG (OverseerAutoScalingTriggerThread-72658183084834828-127.0.0.1:40876_solr-n_0000000000) [    ] o.a.s.c.a.OverseerTriggerThread Processed trigger updates upto znodeVersion 7
   [junit4]   2> 314220 DEBUG (OverseerAutoScalingTriggerThread-72658183084834828-127.0.0.1:40876_solr-n_0000000000) [    ] o.a.s.c.a.OverseerTriggerThread -- clean old nodeLost markers
   [junit4]   2> 314222 INFO  (qtp341942661-561) [n:127.0.0.1:40876_solr c:aboveRate_collection s:shard1 r:core_node4 x:aboveRate_collection_shard1_replica_n2] o.a.s.c.S.Request [aboveRate_collection_shard1_replica_n2]  webapp=/solr path=/select params={q=*:*&_stateVer_=aboveRate_collection:6&wt=javabin&version=2} hits=0 status=0 QTime=0
   [junit4]   2> 314234 DEBUG (OverseerAutoScalingTriggerThread-72658183084834828-127.0.0.1:40876_solr-n_0000000000) [    ] o.a.s.c.a.OverseerTriggerThread -- clean old nodeAdded markers
   [junit4]   2> 314234 DEBUG (OverseerAutoScalingTriggerThread-72658183084834828-127.0.0.1:40876_solr-n_0000000000) [    ] o.a.s.c.a.OverseerTriggerThread Current znodeVersion 7, lastZnodeVersion 7
   [junit4]   2> 314419 INFO  (qtp961713455-572) [n:127.0.0.1:32805_solr c:aboveRate_collection s:shard1 r:core_node3 x:aboveRate_collection_shard1_replica_n1] o.a.s.c.S.Request [aboveRate_collection_shard1_replica_n1]  webapp=/solr path=/select params={q=*:*&_stateVer_=aboveRate_collection:6&wt=javabin&version=2} hits=0 status=0 QTime=1
   [junit4]   2> 314487 INFO  (qtp341942661-561) [n:127.0.0.1:40876_solr c:aboveRate_collection s:shard1 r:core_node4 x:aboveRate_collection_shard1_replica_n2] o.a.s.c.S.Request [aboveRate_collection_shard1_replica_n2]  webapp=/solr path=/select params={q=*:*&_stateVer_=aboveRate_collection:6&wt=javabin&version=2} hits=0 status=0 QTime=0
   [junit4]   2> 314506 INFO  (qtp341942661-561) [n:127.0.0.1:40876_solr c:aboveRate_collection s:shard1 r:core_node4 x:aboveRate_collection_shard1_replica_n2] o.a.s.c.S.Request [aboveRate_collection_shard1_replica_n2]  webapp=/solr path=/select params={q=*:*&_stateVer_=aboveRate_collection:6&wt=javabin&version=2} hits=0 status=0 QTime=0
   [junit4]   2> 314507 INFO  (qtp341942661-561) [n:127.0.0.1:40876_solr c:aboveRate_collection s:shard1 r:core_node4 x:aboveRate_collection_shard1_replica_n2] o.a.s.c.S.Request [aboveRate_collection_shard1_replica_n2]  webapp=/solr path=/select params={q=*:*&_stateVer_=aboveRate_collection:6&wt=javabin&version=2} hits=0 status=0 QTime=0
   [junit4]   2> 314508 INFO  (qtp341942661-561) [n:127.0.0.1:40876_solr c:aboveRate_collection s:shard1 r:core_node4 x:aboveRate_collection_shard1_replica_n2] o.a.s.c.S.Request [aboveRate_collection_shard1_replica_n2]  webapp=/solr path=/select params={q=*:*&_stateVer_=aboveRate_collection:6&wt=javabin&version=2} hits=0 status=0 QTime=0
   [junit4]   2> 314526 INFO  (qtp961713455-574) [n:127.0.0.1:32805_solr c:aboveRate_collection s:shard1 r:core_node3 x:aboveRate_collection_shard1_replica_n1] o.a.s.c.S.Request [aboveRate_collection_shard1_replica_n1]  webapp=/solr path=/select params={q=*:*&_stateVer_=aboveRate_collection:6&wt=javabin&version=2} hits=0 status=0 QTime=0
   [junit4]   2> 314528 INFO  (qtp961713455-574) [n:127.0.0.1:32805_solr c:aboveRate_collection s:shard1 r:core_node3 x:aboveRate_collection_shard1_replica_n1] o.a.s.c.S.Request [aboveRate_collection_shard1_replica_n1]  webapp=/solr path=/select params={q=*:*&_stateVer_=aboveRate_collection:6&wt=javabin&version=2} hits=0 status=0 QTime=0
   [junit4]   2> 314529 INFO  (qtp961713455-574) [n:127.0.0.1:32805_solr c:aboveRate_collection s:shard1 r:core_node3 x:aboveRate_collection_shard1_replica_n1] o.a.s.c.S.Request [aboveRate_collection_shard1_replica_n1]  webapp=/solr path=/select params={q=*:*&_stateVer_=aboveRate_collection:6&wt=javabin&version=2} hits=0 status=0 QTime=0
   [junit4]   2> 314563 INFO  (qtp961713455-574) [n:127.0.0.1:32805_solr c:aboveRate_collection s:shard1 r:core_node3 x:aboveRate_collection_shard1_replica_n1] o.a.s.c.S.Request [aboveRate_collection_shard1_replica_n1]  webapp=/solr path=/select params={q=*:*&_stateVer_=aboveRate_collection:6&wt=javabin&version=2} hits=0 status=0 QTime=20
   [junit4]   2> 314573 INFO  (qtp341942661-561) [n:127.0.0.1:40876_solr c:aboveRate_collection s:shard1 r:core_node4 x:aboveRate_collection_shard1_replica_n2] o.a.s.c.S.Request [aboveRate_collection_shard1_replica_n2]  webapp=/solr path=/select params={q=*:*&_stateVer_=aboveRate_collection:6&wt=javabin&version=2} hits=0 status=0 QTime=0
   [junit4]   2> 314574 INFO  (qtp341942661-561) [n:127.0.0.1:40876_solr c:aboveRate_collection s:shard1 r:core_node4 x:aboveRate_collection_shard1_replica_n2] o.a.s.c.S.Request [aboveRate_collection_shard1_replica_n2]  webapp=/solr path=/select params={q=*:*&_stateVer_=aboveRate_collection:6&wt=javabin&version=2} hits=0 status=0 QTime=0
   [junit4]   2> 314599 INFO  (qtp341942661-561) [n:127.0.0.1:40876_solr c:aboveRate_collection s:shard1 r:core_node4 x:aboveRate_collection_shard1_replica_n2] o.a.s.c.S.Request [aboveRate_collection_shard1_replica_n2]  webapp=/solr path=/select params={q=*:*&_stateVer_=aboveRate_collection:6&wt=javabin&version=2} hits=0 status=0 QTime=18
   [junit4]   2> 314601 INFO  (qtp341942661-561) [n:127.0.0.1:40876_solr c:aboveRate_collection s:shard1 r:core_node4 x:aboveRate_collection_shard1_replica_n2] o.a.s.c.S.Request [aboveRate_collection_shard1_replica_n2]  webapp=/solr path=/select params={q=*:*&_stateVer_=aboveRate_collection:6&wt=javabin&version=2} hits=0 status=0 QTime=0
   [junit4]   2> 314602 INFO  (qtp341942661-561) [n:127.0.0.1:40876_solr c:aboveRate_collection s:shard1 r:core_node4 x:aboveRate_collection_shard1_replica_n2] o.a.s.c.S.Request [aboveRate_collection_shard1_replica_n2]  webapp=/solr path=/select params={q=*:*&_stateVer_=aboveRate_collection:6&wt=javabin&version=2} hits=0 status=0 QTime=0
   [junit4]   2> 314616 INFO  (qtp341942661-564) [n:127.0.0.1:40876_solr c:aboveRate_collection s:shard1 r:core_node4 x:aboveRate_collection_shard1_replica_n2] o.a.s.c.S.Request [aboveRate_collection_shard1_replica_n2]  webapp=/solr path=/select params={q=*:*&_stateVer_=aboveRate_collection:6&wt=javabin&version=2} hits=0 status=0 QTime=12
   [junit4]   2> 314617 INFO  (qtp961713455-572) [n:127.0.0.1:32805_solr c:aboveRate_collection s:shard1 r:core_node3 x:aboveRate_collection_shard1_replica_n1] o.a.s.c.S.Request [aboveRate_collection_shard1_replica_n1]  webapp=/solr path=/select pa

[...truncated too long message...]

gs.xml

resolve:

ivy-availability-check:
[loadresource] Do not set property disallowed.ivy.jars.list as its length is 0.

-ivy-fail-disallowed-ivy-version:

ivy-fail:

ivy-configure:
[ivy:configure] :: loading settings :: file = /home/jenkins/jenkins-slave/workspace/Lucene-Solr-Tests-master/lucene/top-level-ivy-settings.xml

resolve:

ivy-availability-check:
[loadresource] Do not set property disallowed.ivy.jars.list as its length is 0.

-ivy-fail-disallowed-ivy-version:

ivy-fail:

ivy-configure:
[ivy:configure] :: loading settings :: file = /home/jenkins/jenkins-slave/workspace/Lucene-Solr-Tests-master/lucene/top-level-ivy-settings.xml

resolve:

ivy-availability-check:
[loadresource] Do not set property disallowed.ivy.jars.list as its length is 0.

-ivy-fail-disallowed-ivy-version:

ivy-fail:

ivy-configure:
[ivy:configure] :: loading settings :: file = /home/jenkins/jenkins-slave/workspace/Lucene-Solr-Tests-master/lucene/top-level-ivy-settings.xml

resolve:

ivy-availability-check:
[loadresource] Do not set property disallowed.ivy.jars.list as its length is 0.

-ivy-fail-disallowed-ivy-version:

ivy-fail:

ivy-configure:
[ivy:configure] :: loading settings :: file = /home/jenkins/jenkins-slave/workspace/Lucene-Solr-Tests-master/lucene/top-level-ivy-settings.xml

resolve:

jar-checksums:
    [mkdir] Created dir: /home/jenkins/jenkins-slave/workspace/Lucene-Solr-Tests-master/lucene/null626580831
     [copy] Copying 39 files to /home/jenkins/jenkins-slave/workspace/Lucene-Solr-Tests-master/lucene/null626580831
   [delete] Deleting directory /home/jenkins/jenkins-slave/workspace/Lucene-Solr-Tests-master/lucene/null626580831

resolve-example:

ivy-availability-check:
[loadresource] Do not set property disallowed.ivy.jars.list as its length is 0.

-ivy-fail-disallowed-ivy-version:

ivy-fail:

ivy-configure:
[ivy:configure] :: loading settings :: file = /home/jenkins/jenkins-slave/workspace/Lucene-Solr-Tests-master/lucene/top-level-ivy-settings.xml

resolve:

resolve-server:

ivy-availability-check:
[loadresource] Do not set property disallowed.ivy.jars.list as its length is 0.

-ivy-fail-disallowed-ivy-version:

ivy-fail:

ivy-fail:

ivy-configure:
[ivy:configure] :: loading settings :: file = /home/jenkins/jenkins-slave/workspace/Lucene-Solr-Tests-master/lucene/top-level-ivy-settings.xml

resolve:

resolve:

ivy-availability-check:
[loadresource] Do not set property disallowed.ivy.jars.list as its length is 0.

-ivy-fail-disallowed-ivy-version:

ivy-fail:

ivy-fail:

ivy-configure:
[ivy:configure] :: loading settings :: file = /home/jenkins/jenkins-slave/workspace/Lucene-Solr-Tests-master/lucene/top-level-ivy-settings.xml

resolve:

ivy-availability-check:
[loadresource] Do not set property disallowed.ivy.jars.list as its length is 0.

-ivy-fail-disallowed-ivy-version:

ivy-fail:

ivy-fail:

ivy-configure:
[ivy:configure] :: loading settings :: file = /home/jenkins/jenkins-slave/workspace/Lucene-Solr-Tests-master/lucene/top-level-ivy-settings.xml

resolve:

ivy-availability-check:
[loadresource] Do not set property disallowed.ivy.jars.list as its length is 0.

-ivy-fail-disallowed-ivy-version:

ivy-fail:

ivy-configure:
[ivy:configure] :: loading settings :: file = /home/jenkins/jenkins-slave/workspace/Lucene-Solr-Tests-master/lucene/top-level-ivy-settings.xml

resolve:

ivy-availability-check:
[loadresource] Do not set property disallowed.ivy.jars.list as its length is 0.

-ivy-fail-disallowed-ivy-version:

ivy-fail:

ivy-fail:

ivy-configure:
[ivy:configure] :: loading settings :: file = /home/jenkins/jenkins-slave/workspace/Lucene-Solr-Tests-master/lucene/top-level-ivy-settings.xml

resolve:

ivy-availability-check:
[loadresource] Do not set property disallowed.ivy.jars.list as its length is 0.

-ivy-fail-disallowed-ivy-version:

ivy-fail:

ivy-configure:
[ivy:configure] :: loading settings :: file = /home/jenkins/jenkins-slave/workspace/Lucene-Solr-Tests-master/lucene/top-level-ivy-settings.xml

resolve:

ivy-availability-check:
[loadresource] Do not set property disallowed.ivy.jars.list as its length is 0.

-ivy-fail-disallowed-ivy-version:

ivy-fail:

ivy-fail:

ivy-configure:
[ivy:configure] :: loading settings :: file = /home/jenkins/jenkins-slave/workspace/Lucene-Solr-Tests-master/lucene/top-level-ivy-settings.xml

resolve:

ivy-availability-check:
[loadresource] Do not set property disallowed.ivy.jars.list as its length is 0.

-ivy-fail-disallowed-ivy-version:

ivy-fail:

ivy-fail:

ivy-configure:
[ivy:configure] :: loading settings :: file = /home/jenkins/jenkins-slave/workspace/Lucene-Solr-Tests-master/lucene/top-level-ivy-settings.xml

resolve:

ivy-availability-check:
[loadresource] Do not set property disallowed.ivy.jars.list as its length is 0.

-ivy-fail-disallowed-ivy-version:

ivy-fail:

ivy-fail:

ivy-configure:
[ivy:configure] :: loading settings :: file = /home/jenkins/jenkins-slave/workspace/Lucene-Solr-Tests-master/lucene/top-level-ivy-settings.xml

resolve:

ivy-availability-check:
[loadresource] Do not set property disallowed.ivy.jars.list as its length is 0.

-ivy-fail-disallowed-ivy-version:

ivy-fail:

ivy-fail:

ivy-configure:
[ivy:configure] :: loading settings :: file = /home/jenkins/jenkins-slave/workspace/Lucene-Solr-Tests-master/lucene/top-level-ivy-settings.xml

resolve:

ivy-availability-check:
[loadresource] Do not set property disallowed.ivy.jars.list as its length is 0.

-ivy-fail-disallowed-ivy-version:

ivy-fail:

ivy-fail:

ivy-configure:
[ivy:configure] :: loading settings :: file = /home/jenkins/jenkins-slave/workspace/Lucene-Solr-Tests-master/lucene/top-level-ivy-settings.xml

resolve:

ivy-availability-check:
[loadresource] Do not set property disallowed.ivy.jars.list as its length is 0.

-ivy-fail-disallowed-ivy-version:

ivy-fail:

ivy-fail:

ivy-configure:
[ivy:configure] :: loading settings :: file = /home/jenkins/jenkins-slave/workspace/Lucene-Solr-Tests-master/lucene/top-level-ivy-settings.xml

resolve:

ivy-availability-check:
[loadresource] Do not set property disallowed.ivy.jars.list as its length is 0.

-ivy-fail-disallowed-ivy-version:

ivy-fail:

ivy-fail:

ivy-configure:
[ivy:configure] :: loading settings :: file = /home/jenkins/jenkins-slave/workspace/Lucene-Solr-Tests-master/lucene/top-level-ivy-settings.xml

resolve:

ivy-availability-check:
[loadresource] Do not set property disallowed.ivy.jars.list as its length is 0.

-ivy-fail-disallowed-ivy-version:

ivy-fail:

ivy-fail:

ivy-configure:
[ivy:configure] :: loading settings :: file = /home/jenkins/jenkins-slave/workspace/Lucene-Solr-Tests-master/lucene/top-level-ivy-settings.xml

resolve:

ivy-availability-check:
[loadresource] Do not set property disallowed.ivy.jars.list as its length is 0.

-ivy-fail-disallowed-ivy-version:

ivy-fail:

ivy-fail:

ivy-configure:
[ivy:configure] :: loading settings :: file = /home/jenkins/jenkins-slave/workspace/Lucene-Solr-Tests-master/lucene/top-level-ivy-settings.xml

resolve:

ivy-availability-check:
[loadresource] Do not set property disallowed.ivy.jars.list as its length is 0.

-ivy-fail-disallowed-ivy-version:

ivy-fail:

ivy-fail:

ivy-configure:
[ivy:configure] :: loading settings :: file = /home/jenkins/jenkins-slave/workspace/Lucene-Solr-Tests-master/lucene/top-level-ivy-settings.xml

resolve:

ivy-availability-check:
[loadresource] Do not set property disallowed.ivy.jars.list as its length is 0.

-ivy-fail-disallowed-ivy-version:

ivy-fail:

ivy-fail:

ivy-configure:
[ivy:configure] :: loading settings :: file = /home/jenkins/jenkins-slave/workspace/Lucene-Solr-Tests-master/lucene/top-level-ivy-settings.xml

resolve:

jar-checksums:
    [mkdir] Created dir: /home/jenkins/jenkins-slave/workspace/Lucene-Solr-Tests-master/solr/null2146049593
     [copy] Copying 246 files to /home/jenkins/jenkins-slave/workspace/Lucene-Solr-Tests-master/solr/null2146049593
   [delete] Deleting directory /home/jenkins/jenkins-slave/workspace/Lucene-Solr-Tests-master/solr/null2146049593

check-working-copy:
[ivy:cachepath] :: resolving dependencies :: org.eclipse.jgit#org.eclipse.jgit-caller;working
[ivy:cachepath] 	confs: [default]
[ivy:cachepath] 	found org.eclipse.jgit#org.eclipse.jgit;4.6.0.201612231935-r in public
[ivy:cachepath] 	found com.jcraft#jsch;0.1.53 in public
[ivy:cachepath] 	found com.googlecode.javaewah#JavaEWAH;1.1.6 in public
[ivy:cachepath] 	found org.apache.httpcomponents#httpclient;4.3.6 in public
[ivy:cachepath] 	found org.apache.httpcomponents#httpcore;4.3.3 in public
[ivy:cachepath] 	found commons-logging#commons-logging;1.1.3 in public
[ivy:cachepath] 	found commons-codec#commons-codec;1.6 in public
[ivy:cachepath] 	found org.slf4j#slf4j-api;1.7.2 in public
[ivy:cachepath] :: resolution report :: resolve 49ms :: artifacts dl 33ms
	---------------------------------------------------------------------
	|                  |            modules            ||   artifacts   |
	|       conf       | number| search|dwnlded|evicted|| number|dwnlded|
	---------------------------------------------------------------------
	|      default     |   8   |   0   |   0   |   0   ||   8   |   0   |
	---------------------------------------------------------------------
[wc-checker] Initializing working copy...
[wc-checker] SLF4J: Failed to load class "org.slf4j.impl.StaticLoggerBinder".
[wc-checker] SLF4J: Defaulting to no-operation (NOP) logger implementation
[wc-checker] SLF4J: See http://www.slf4j.org/codes.html#StaticLoggerBinder for further details.
[wc-checker] Checking working copy status...

-jenkins-base:

BUILD SUCCESSFUL
Total time: 304 minutes 41 seconds
Archiving artifacts
WARN: No artifacts found that match the file pattern "**/*.events,heapdumps/**,**/hs_err_pid*". Configuration error?
WARN: java.lang.InterruptedException: no matches found within 10000
Recording test results
Build step 'Publish JUnit test result report' changed build result to UNSTABLE
Email was triggered for: Unstable (Test Failures)
Sending email for trigger: Unstable (Test Failures)

Mime
View raw message