lucene-dev mailing list archives

Site index · List index
Message view « Date » · « Thread »
Top « Date » · « Thread »
From Policeman Jenkins Server <jenk...@thetaphi.de>
Subject [JENKINS] Lucene-Solr-master-Windows (64bit/jdk1.8.0_144) - Build # 7308 - Still Unstable!
Date Wed, 09 May 2018 13:59:16 GMT
Build: https://jenkins.thetaphi.de/job/Lucene-Solr-master-Windows/7308/
Java: 64bit/jdk1.8.0_144 -XX:+UseCompressedOops -XX:+UseParallelGC

7 tests failed.
FAILED:  org.apache.solr.common.util.TestTimeSource.testEpochTime

Error Message:
SimTimeSource:50.0 time diff=40615000

Stack Trace:
java.lang.AssertionError: SimTimeSource:50.0 time diff=40615000
	at __randomizedtesting.SeedInfo.seed([18409C1DD5ED7254:202CEF38413DD012]:0)
	at org.junit.Assert.fail(Assert.java:93)
	at org.junit.Assert.assertTrue(Assert.java:43)
	at org.apache.solr.common.util.TestTimeSource.doTestEpochTime(TestTimeSource.java:48)
	at org.apache.solr.common.util.TestTimeSource.testEpochTime(TestTimeSource.java:32)
	at sun.reflect.NativeMethodAccessorImpl.invoke0(Native Method)
	at sun.reflect.NativeMethodAccessorImpl.invoke(NativeMethodAccessorImpl.java:62)
	at sun.reflect.DelegatingMethodAccessorImpl.invoke(DelegatingMethodAccessorImpl.java:43)
	at java.lang.reflect.Method.invoke(Method.java:498)
	at com.carrotsearch.randomizedtesting.RandomizedRunner.invoke(RandomizedRunner.java:1737)
	at com.carrotsearch.randomizedtesting.RandomizedRunner$8.evaluate(RandomizedRunner.java:934)
	at com.carrotsearch.randomizedtesting.RandomizedRunner$9.evaluate(RandomizedRunner.java:970)
	at com.carrotsearch.randomizedtesting.RandomizedRunner$10.evaluate(RandomizedRunner.java:984)
	at com.carrotsearch.randomizedtesting.rules.SystemPropertiesRestoreRule$1.evaluate(SystemPropertiesRestoreRule.java:57)
	at org.apache.lucene.util.TestRuleSetupTeardownChained$1.evaluate(TestRuleSetupTeardownChained.java:49)
	at org.apache.lucene.util.AbstractBeforeAfterRule$1.evaluate(AbstractBeforeAfterRule.java:45)
	at org.apache.lucene.util.TestRuleThreadAndTestName$1.evaluate(TestRuleThreadAndTestName.java:48)
	at org.apache.lucene.util.TestRuleIgnoreAfterMaxFailures$1.evaluate(TestRuleIgnoreAfterMaxFailures.java:64)
	at org.apache.lucene.util.TestRuleMarkFailure$1.evaluate(TestRuleMarkFailure.java:47)
	at com.carrotsearch.randomizedtesting.rules.StatementAdapter.evaluate(StatementAdapter.java:36)
	at com.carrotsearch.randomizedtesting.ThreadLeakControl$StatementRunner.run(ThreadLeakControl.java:368)
	at com.carrotsearch.randomizedtesting.ThreadLeakControl.forkTimeoutingTask(ThreadLeakControl.java:817)
	at com.carrotsearch.randomizedtesting.ThreadLeakControl$3.evaluate(ThreadLeakControl.java:468)
	at com.carrotsearch.randomizedtesting.RandomizedRunner.runSingleTest(RandomizedRunner.java:943)
	at com.carrotsearch.randomizedtesting.RandomizedRunner$5.evaluate(RandomizedRunner.java:829)
	at com.carrotsearch.randomizedtesting.RandomizedRunner$6.evaluate(RandomizedRunner.java:879)
	at com.carrotsearch.randomizedtesting.RandomizedRunner$7.evaluate(RandomizedRunner.java:890)
	at com.carrotsearch.randomizedtesting.rules.StatementAdapter.evaluate(StatementAdapter.java:36)
	at com.carrotsearch.randomizedtesting.rules.SystemPropertiesRestoreRule$1.evaluate(SystemPropertiesRestoreRule.java:57)
	at org.apache.lucene.util.AbstractBeforeAfterRule$1.evaluate(AbstractBeforeAfterRule.java:45)
	at com.carrotsearch.randomizedtesting.rules.StatementAdapter.evaluate(StatementAdapter.java:36)
	at org.apache.lucene.util.TestRuleStoreClassName$1.evaluate(TestRuleStoreClassName.java:41)
	at com.carrotsearch.randomizedtesting.rules.NoShadowingOrOverridesOnMethodsRule$1.evaluate(NoShadowingOrOverridesOnMethodsRule.java:40)
	at com.carrotsearch.randomizedtesting.rules.NoShadowingOrOverridesOnMethodsRule$1.evaluate(NoShadowingOrOverridesOnMethodsRule.java:40)
	at com.carrotsearch.randomizedtesting.rules.StatementAdapter.evaluate(StatementAdapter.java:36)
	at com.carrotsearch.randomizedtesting.rules.StatementAdapter.evaluate(StatementAdapter.java:36)
	at com.carrotsearch.randomizedtesting.rules.StatementAdapter.evaluate(StatementAdapter.java:36)
	at org.apache.lucene.util.TestRuleAssertionsRequired$1.evaluate(TestRuleAssertionsRequired.java:53)
	at org.apache.lucene.util.TestRuleMarkFailure$1.evaluate(TestRuleMarkFailure.java:47)
	at org.apache.lucene.util.TestRuleIgnoreAfterMaxFailures$1.evaluate(TestRuleIgnoreAfterMaxFailures.java:64)
	at org.apache.lucene.util.TestRuleIgnoreTestSuites$1.evaluate(TestRuleIgnoreTestSuites.java:54)
	at com.carrotsearch.randomizedtesting.rules.StatementAdapter.evaluate(StatementAdapter.java:36)
	at com.carrotsearch.randomizedtesting.ThreadLeakControl$StatementRunner.run(ThreadLeakControl.java:368)
	at java.lang.Thread.run(Thread.java:748)


FAILED:  org.apache.solr.common.util.TestTimeSource.testEpochTime

Error Message:
SimTimeSource:50.0 time diff=12460000

Stack Trace:
java.lang.AssertionError: SimTimeSource:50.0 time diff=12460000
	at __randomizedtesting.SeedInfo.seed([18409C1DD5ED7254:202CEF38413DD012]:0)
	at org.junit.Assert.fail(Assert.java:93)
	at org.junit.Assert.assertTrue(Assert.java:43)
	at org.apache.solr.common.util.TestTimeSource.doTestEpochTime(TestTimeSource.java:48)
	at org.apache.solr.common.util.TestTimeSource.testEpochTime(TestTimeSource.java:32)
	at sun.reflect.NativeMethodAccessorImpl.invoke0(Native Method)
	at sun.reflect.NativeMethodAccessorImpl.invoke(NativeMethodAccessorImpl.java:62)
	at sun.reflect.DelegatingMethodAccessorImpl.invoke(DelegatingMethodAccessorImpl.java:43)
	at java.lang.reflect.Method.invoke(Method.java:498)
	at com.carrotsearch.randomizedtesting.RandomizedRunner.invoke(RandomizedRunner.java:1737)
	at com.carrotsearch.randomizedtesting.RandomizedRunner$8.evaluate(RandomizedRunner.java:934)
	at com.carrotsearch.randomizedtesting.RandomizedRunner$9.evaluate(RandomizedRunner.java:970)
	at com.carrotsearch.randomizedtesting.RandomizedRunner$10.evaluate(RandomizedRunner.java:984)
	at com.carrotsearch.randomizedtesting.rules.SystemPropertiesRestoreRule$1.evaluate(SystemPropertiesRestoreRule.java:57)
	at org.apache.lucene.util.TestRuleSetupTeardownChained$1.evaluate(TestRuleSetupTeardownChained.java:49)
	at org.apache.lucene.util.AbstractBeforeAfterRule$1.evaluate(AbstractBeforeAfterRule.java:45)
	at org.apache.lucene.util.TestRuleThreadAndTestName$1.evaluate(TestRuleThreadAndTestName.java:48)
	at org.apache.lucene.util.TestRuleIgnoreAfterMaxFailures$1.evaluate(TestRuleIgnoreAfterMaxFailures.java:64)
	at org.apache.lucene.util.TestRuleMarkFailure$1.evaluate(TestRuleMarkFailure.java:47)
	at com.carrotsearch.randomizedtesting.rules.StatementAdapter.evaluate(StatementAdapter.java:36)
	at com.carrotsearch.randomizedtesting.ThreadLeakControl$StatementRunner.run(ThreadLeakControl.java:368)
	at com.carrotsearch.randomizedtesting.ThreadLeakControl.forkTimeoutingTask(ThreadLeakControl.java:817)
	at com.carrotsearch.randomizedtesting.ThreadLeakControl$3.evaluate(ThreadLeakControl.java:468)
	at com.carrotsearch.randomizedtesting.RandomizedRunner.runSingleTest(RandomizedRunner.java:943)
	at com.carrotsearch.randomizedtesting.RandomizedRunner$5.evaluate(RandomizedRunner.java:829)
	at com.carrotsearch.randomizedtesting.RandomizedRunner$6.evaluate(RandomizedRunner.java:879)
	at com.carrotsearch.randomizedtesting.RandomizedRunner$7.evaluate(RandomizedRunner.java:890)
	at com.carrotsearch.randomizedtesting.rules.StatementAdapter.evaluate(StatementAdapter.java:36)
	at com.carrotsearch.randomizedtesting.rules.SystemPropertiesRestoreRule$1.evaluate(SystemPropertiesRestoreRule.java:57)
	at org.apache.lucene.util.AbstractBeforeAfterRule$1.evaluate(AbstractBeforeAfterRule.java:45)
	at com.carrotsearch.randomizedtesting.rules.StatementAdapter.evaluate(StatementAdapter.java:36)
	at org.apache.lucene.util.TestRuleStoreClassName$1.evaluate(TestRuleStoreClassName.java:41)
	at com.carrotsearch.randomizedtesting.rules.NoShadowingOrOverridesOnMethodsRule$1.evaluate(NoShadowingOrOverridesOnMethodsRule.java:40)
	at com.carrotsearch.randomizedtesting.rules.NoShadowingOrOverridesOnMethodsRule$1.evaluate(NoShadowingOrOverridesOnMethodsRule.java:40)
	at com.carrotsearch.randomizedtesting.rules.StatementAdapter.evaluate(StatementAdapter.java:36)
	at com.carrotsearch.randomizedtesting.rules.StatementAdapter.evaluate(StatementAdapter.java:36)
	at com.carrotsearch.randomizedtesting.rules.StatementAdapter.evaluate(StatementAdapter.java:36)
	at org.apache.lucene.util.TestRuleAssertionsRequired$1.evaluate(TestRuleAssertionsRequired.java:53)
	at org.apache.lucene.util.TestRuleMarkFailure$1.evaluate(TestRuleMarkFailure.java:47)
	at org.apache.lucene.util.TestRuleIgnoreAfterMaxFailures$1.evaluate(TestRuleIgnoreAfterMaxFailures.java:64)
	at org.apache.lucene.util.TestRuleIgnoreTestSuites$1.evaluate(TestRuleIgnoreTestSuites.java:54)
	at com.carrotsearch.randomizedtesting.rules.StatementAdapter.evaluate(StatementAdapter.java:36)
	at com.carrotsearch.randomizedtesting.ThreadLeakControl$StatementRunner.run(ThreadLeakControl.java:368)
	at java.lang.Thread.run(Thread.java:748)


FAILED:  org.apache.solr.handler.component.DistributedSpellCheckComponentTest.test

Error Message:
Error from server at http://127.0.0.1:55953//collection1: Directory (MMapDirectory@C:\Users\jenkins\workspace\Lucene-Solr-master-Windows\solr\build\solr-core\test\J0\temp\solr.handler.component.DistributedSpellCheckComponentTest_337C64C5D8853D2D-001\tempDir-001\control\cores\collection1\data\spellchecker1 lockFactory=org.apache.lucene.store.NativeFSLockFactory@6d5b0d83) still has pending deleted files; cannot initialize IndexWriter

Stack Trace:
org.apache.solr.client.solrj.impl.HttpSolrClient$RemoteSolrException: Error from server at http://127.0.0.1:55953//collection1: Directory (MMapDirectory@C:\Users\jenkins\workspace\Lucene-Solr-master-Windows\solr\build\solr-core\test\J0\temp\solr.handler.component.DistributedSpellCheckComponentTest_337C64C5D8853D2D-001\tempDir-001\control\cores\collection1\data\spellchecker1 lockFactory=org.apache.lucene.store.NativeFSLockFactory@6d5b0d83) still has pending deleted files; cannot initialize IndexWriter
	at __randomizedtesting.SeedInfo.seed([337C64C5D8853D2D:BB285B1F767950D5]:0)
	at org.apache.solr.client.solrj.impl.HttpSolrClient.executeMethod(HttpSolrClient.java:643)
	at org.apache.solr.client.solrj.impl.HttpSolrClient.request(HttpSolrClient.java:255)
	at org.apache.solr.client.solrj.impl.HttpSolrClient.request(HttpSolrClient.java:244)
	at org.apache.solr.client.solrj.SolrRequest.process(SolrRequest.java:194)
	at org.apache.solr.client.solrj.SolrClient.query(SolrClient.java:942)
	at org.apache.solr.client.solrj.SolrClient.query(SolrClient.java:957)
	at org.apache.solr.handler.component.DistributedSpellCheckComponentTest.q(DistributedSpellCheckComponentTest.java:67)
	at org.apache.solr.handler.component.DistributedSpellCheckComponentTest.test(DistributedSpellCheckComponentTest.java:146)
	at sun.reflect.NativeMethodAccessorImpl.invoke0(Native Method)
	at sun.reflect.NativeMethodAccessorImpl.invoke(NativeMethodAccessorImpl.java:62)
	at sun.reflect.DelegatingMethodAccessorImpl.invoke(DelegatingMethodAccessorImpl.java:43)
	at java.lang.reflect.Method.invoke(Method.java:498)
	at com.carrotsearch.randomizedtesting.RandomizedRunner.invoke(RandomizedRunner.java:1737)
	at com.carrotsearch.randomizedtesting.RandomizedRunner$8.evaluate(RandomizedRunner.java:934)
	at com.carrotsearch.randomizedtesting.RandomizedRunner$9.evaluate(RandomizedRunner.java:970)
	at com.carrotsearch.randomizedtesting.RandomizedRunner$10.evaluate(RandomizedRunner.java:984)
	at org.apache.solr.BaseDistributedSearchTestCase$ShardsRepeatRule$ShardsRepeatStatement.callStatement(BaseDistributedSearchTestCase.java:1019)
	at org.apache.solr.BaseDistributedSearchTestCase$ShardsRepeatRule$ShardsStatement.evaluate(BaseDistributedSearchTestCase.java:968)
	at com.carrotsearch.randomizedtesting.rules.SystemPropertiesRestoreRule$1.evaluate(SystemPropertiesRestoreRule.java:57)
	at org.apache.lucene.util.TestRuleSetupTeardownChained$1.evaluate(TestRuleSetupTeardownChained.java:49)
	at org.apache.lucene.util.AbstractBeforeAfterRule$1.evaluate(AbstractBeforeAfterRule.java:45)
	at org.apache.lucene.util.TestRuleThreadAndTestName$1.evaluate(TestRuleThreadAndTestName.java:48)
	at org.apache.lucene.util.TestRuleIgnoreAfterMaxFailures$1.evaluate(TestRuleIgnoreAfterMaxFailures.java:64)
	at org.apache.lucene.util.TestRuleMarkFailure$1.evaluate(TestRuleMarkFailure.java:47)
	at com.carrotsearch.randomizedtesting.rules.StatementAdapter.evaluate(StatementAdapter.java:36)
	at com.carrotsearch.randomizedtesting.ThreadLeakControl$StatementRunner.run(ThreadLeakControl.java:368)
	at com.carrotsearch.randomizedtesting.ThreadLeakControl.forkTimeoutingTask(ThreadLeakControl.java:817)
	at com.carrotsearch.randomizedtesting.ThreadLeakControl$3.evaluate(ThreadLeakControl.java:468)
	at com.carrotsearch.randomizedtesting.RandomizedRunner.runSingleTest(RandomizedRunner.java:943)
	at com.carrotsearch.randomizedtesting.RandomizedRunner$5.evaluate(RandomizedRunner.java:829)
	at com.carrotsearch.randomizedtesting.RandomizedRunner$6.evaluate(RandomizedRunner.java:879)
	at com.carrotsearch.randomizedtesting.RandomizedRunner$7.evaluate(RandomizedRunner.java:890)
	at com.carrotsearch.randomizedtesting.rules.StatementAdapter.evaluate(StatementAdapter.java:36)
	at com.carrotsearch.randomizedtesting.rules.SystemPropertiesRestoreRule$1.evaluate(SystemPropertiesRestoreRule.java:57)
	at org.apache.lucene.util.AbstractBeforeAfterRule$1.evaluate(AbstractBeforeAfterRule.java:45)
	at com.carrotsearch.randomizedtesting.rules.StatementAdapter.evaluate(StatementAdapter.java:36)
	at org.apache.lucene.util.TestRuleStoreClassName$1.evaluate(TestRuleStoreClassName.java:41)
	at com.carrotsearch.randomizedtesting.rules.NoShadowingOrOverridesOnMethodsRule$1.evaluate(NoShadowingOrOverridesOnMethodsRule.java:40)
	at com.carrotsearch.randomizedtesting.rules.NoShadowingOrOverridesOnMethodsRule$1.evaluate(NoShadowingOrOverridesOnMethodsRule.java:40)
	at com.carrotsearch.randomizedtesting.rules.StatementAdapter.evaluate(StatementAdapter.java:36)
	at com.carrotsearch.randomizedtesting.rules.StatementAdapter.evaluate(StatementAdapter.java:36)
	at com.carrotsearch.randomizedtesting.rules.StatementAdapter.evaluate(StatementAdapter.java:36)
	at org.apache.lucene.util.TestRuleAssertionsRequired$1.evaluate(TestRuleAssertionsRequired.java:53)
	at org.apache.lucene.util.TestRuleMarkFailure$1.evaluate(TestRuleMarkFailure.java:47)
	at org.apache.lucene.util.TestRuleIgnoreAfterMaxFailures$1.evaluate(TestRuleIgnoreAfterMaxFailures.java:64)
	at org.apache.lucene.util.TestRuleIgnoreTestSuites$1.evaluate(TestRuleIgnoreTestSuites.java:54)
	at com.carrotsearch.randomizedtesting.rules.StatementAdapter.evaluate(StatementAdapter.java:36)
	at com.carrotsearch.randomizedtesting.ThreadLeakControl$StatementRunner.run(ThreadLeakControl.java:368)
	at java.lang.Thread.run(Thread.java:748)


FAILED:  org.apache.solr.handler.component.DistributedSpellCheckComponentTest.test

Error Message:
Error from server at http://127.0.0.1:55995//collection1: Directory (MMapDirectory@C:\Users\jenkins\workspace\Lucene-Solr-master-Windows\solr\build\solr-core\test\J1\temp\solr.handler.component.DistributedSpellCheckComponentTest_337C64C5D8853D2D-002\tempDir-001\control\cores\collection1\data\spellchecker1 lockFactory=org.apache.lucene.store.NativeFSLockFactory@3898383c) still has pending deleted files; cannot initialize IndexWriter

Stack Trace:
org.apache.solr.client.solrj.impl.HttpSolrClient$RemoteSolrException: Error from server at http://127.0.0.1:55995//collection1: Directory (MMapDirectory@C:\Users\jenkins\workspace\Lucene-Solr-master-Windows\solr\build\solr-core\test\J1\temp\solr.handler.component.DistributedSpellCheckComponentTest_337C64C5D8853D2D-002\tempDir-001\control\cores\collection1\data\spellchecker1 lockFactory=org.apache.lucene.store.NativeFSLockFactory@3898383c) still has pending deleted files; cannot initialize IndexWriter
	at __randomizedtesting.SeedInfo.seed([337C64C5D8853D2D:BB285B1F767950D5]:0)
	at org.apache.solr.client.solrj.impl.HttpSolrClient.executeMethod(HttpSolrClient.java:643)
	at org.apache.solr.client.solrj.impl.HttpSolrClient.request(HttpSolrClient.java:255)
	at org.apache.solr.client.solrj.impl.HttpSolrClient.request(HttpSolrClient.java:244)
	at org.apache.solr.client.solrj.SolrRequest.process(SolrRequest.java:194)
	at org.apache.solr.client.solrj.SolrClient.query(SolrClient.java:942)
	at org.apache.solr.client.solrj.SolrClient.query(SolrClient.java:957)
	at org.apache.solr.handler.component.DistributedSpellCheckComponentTest.q(DistributedSpellCheckComponentTest.java:67)
	at org.apache.solr.handler.component.DistributedSpellCheckComponentTest.test(DistributedSpellCheckComponentTest.java:146)
	at sun.reflect.NativeMethodAccessorImpl.invoke0(Native Method)
	at sun.reflect.NativeMethodAccessorImpl.invoke(NativeMethodAccessorImpl.java:62)
	at sun.reflect.DelegatingMethodAccessorImpl.invoke(DelegatingMethodAccessorImpl.java:43)
	at java.lang.reflect.Method.invoke(Method.java:498)
	at com.carrotsearch.randomizedtesting.RandomizedRunner.invoke(RandomizedRunner.java:1737)
	at com.carrotsearch.randomizedtesting.RandomizedRunner$8.evaluate(RandomizedRunner.java:934)
	at com.carrotsearch.randomizedtesting.RandomizedRunner$9.evaluate(RandomizedRunner.java:970)
	at com.carrotsearch.randomizedtesting.RandomizedRunner$10.evaluate(RandomizedRunner.java:984)
	at org.apache.solr.BaseDistributedSearchTestCase$ShardsRepeatRule$ShardsRepeatStatement.callStatement(BaseDistributedSearchTestCase.java:1019)
	at org.apache.solr.BaseDistributedSearchTestCase$ShardsRepeatRule$ShardsStatement.evaluate(BaseDistributedSearchTestCase.java:968)
	at com.carrotsearch.randomizedtesting.rules.SystemPropertiesRestoreRule$1.evaluate(SystemPropertiesRestoreRule.java:57)
	at org.apache.lucene.util.TestRuleSetupTeardownChained$1.evaluate(TestRuleSetupTeardownChained.java:49)
	at org.apache.lucene.util.AbstractBeforeAfterRule$1.evaluate(AbstractBeforeAfterRule.java:45)
	at org.apache.lucene.util.TestRuleThreadAndTestName$1.evaluate(TestRuleThreadAndTestName.java:48)
	at org.apache.lucene.util.TestRuleIgnoreAfterMaxFailures$1.evaluate(TestRuleIgnoreAfterMaxFailures.java:64)
	at org.apache.lucene.util.TestRuleMarkFailure$1.evaluate(TestRuleMarkFailure.java:47)
	at com.carrotsearch.randomizedtesting.rules.StatementAdapter.evaluate(StatementAdapter.java:36)
	at com.carrotsearch.randomizedtesting.ThreadLeakControl$StatementRunner.run(ThreadLeakControl.java:368)
	at com.carrotsearch.randomizedtesting.ThreadLeakControl.forkTimeoutingTask(ThreadLeakControl.java:817)
	at com.carrotsearch.randomizedtesting.ThreadLeakControl$3.evaluate(ThreadLeakControl.java:468)
	at com.carrotsearch.randomizedtesting.RandomizedRunner.runSingleTest(RandomizedRunner.java:943)
	at com.carrotsearch.randomizedtesting.RandomizedRunner$5.evaluate(RandomizedRunner.java:829)
	at com.carrotsearch.randomizedtesting.RandomizedRunner$6.evaluate(RandomizedRunner.java:879)
	at com.carrotsearch.randomizedtesting.RandomizedRunner$7.evaluate(RandomizedRunner.java:890)
	at com.carrotsearch.randomizedtesting.rules.StatementAdapter.evaluate(StatementAdapter.java:36)
	at com.carrotsearch.randomizedtesting.rules.SystemPropertiesRestoreRule$1.evaluate(SystemPropertiesRestoreRule.java:57)
	at org.apache.lucene.util.AbstractBeforeAfterRule$1.evaluate(AbstractBeforeAfterRule.java:45)
	at com.carrotsearch.randomizedtesting.rules.StatementAdapter.evaluate(StatementAdapter.java:36)
	at org.apache.lucene.util.TestRuleStoreClassName$1.evaluate(TestRuleStoreClassName.java:41)
	at com.carrotsearch.randomizedtesting.rules.NoShadowingOrOverridesOnMethodsRule$1.evaluate(NoShadowingOrOverridesOnMethodsRule.java:40)
	at com.carrotsearch.randomizedtesting.rules.NoShadowingOrOverridesOnMethodsRule$1.evaluate(NoShadowingOrOverridesOnMethodsRule.java:40)
	at com.carrotsearch.randomizedtesting.rules.StatementAdapter.evaluate(StatementAdapter.java:36)
	at com.carrotsearch.randomizedtesting.rules.StatementAdapter.evaluate(StatementAdapter.java:36)
	at com.carrotsearch.randomizedtesting.rules.StatementAdapter.evaluate(StatementAdapter.java:36)
	at org.apache.lucene.util.TestRuleAssertionsRequired$1.evaluate(TestRuleAssertionsRequired.java:53)
	at org.apache.lucene.util.TestRuleMarkFailure$1.evaluate(TestRuleMarkFailure.java:47)
	at org.apache.lucene.util.TestRuleIgnoreAfterMaxFailures$1.evaluate(TestRuleIgnoreAfterMaxFailures.java:64)
	at org.apache.lucene.util.TestRuleIgnoreTestSuites$1.evaluate(TestRuleIgnoreTestSuites.java:54)
	at com.carrotsearch.randomizedtesting.rules.StatementAdapter.evaluate(StatementAdapter.java:36)
	at com.carrotsearch.randomizedtesting.ThreadLeakControl$StatementRunner.run(ThreadLeakControl.java:368)
	at java.lang.Thread.run(Thread.java:748)


FAILED:  org.apache.solr.handler.component.DistributedSpellCheckComponentTest.test

Error Message:
Error from server at http://127.0.0.1:56007//collection1: Directory (MMapDirectory@C:\Users\jenkins\workspace\Lucene-Solr-master-Windows\solr\build\solr-core\test\J0\temp\solr.handler.component.DistributedSpellCheckComponentTest_337C64C5D8853D2D-002\tempDir-001\control\cores\collection1\data\spellchecker1 lockFactory=org.apache.lucene.store.NativeFSLockFactory@6d5b0d83) still has pending deleted files; cannot initialize IndexWriter

Stack Trace:
org.apache.solr.client.solrj.impl.HttpSolrClient$RemoteSolrException: Error from server at http://127.0.0.1:56007//collection1: Directory (MMapDirectory@C:\Users\jenkins\workspace\Lucene-Solr-master-Windows\solr\build\solr-core\test\J0\temp\solr.handler.component.DistributedSpellCheckComponentTest_337C64C5D8853D2D-002\tempDir-001\control\cores\collection1\data\spellchecker1 lockFactory=org.apache.lucene.store.NativeFSLockFactory@6d5b0d83) still has pending deleted files; cannot initialize IndexWriter
	at __randomizedtesting.SeedInfo.seed([337C64C5D8853D2D:BB285B1F767950D5]:0)
	at org.apache.solr.client.solrj.impl.HttpSolrClient.executeMethod(HttpSolrClient.java:643)
	at org.apache.solr.client.solrj.impl.HttpSolrClient.request(HttpSolrClient.java:255)
	at org.apache.solr.client.solrj.impl.HttpSolrClient.request(HttpSolrClient.java:244)
	at org.apache.solr.client.solrj.SolrRequest.process(SolrRequest.java:194)
	at org.apache.solr.client.solrj.SolrClient.query(SolrClient.java:942)
	at org.apache.solr.client.solrj.SolrClient.query(SolrClient.java:957)
	at org.apache.solr.handler.component.DistributedSpellCheckComponentTest.q(DistributedSpellCheckComponentTest.java:67)
	at org.apache.solr.handler.component.DistributedSpellCheckComponentTest.test(DistributedSpellCheckComponentTest.java:146)
	at sun.reflect.NativeMethodAccessorImpl.invoke0(Native Method)
	at sun.reflect.NativeMethodAccessorImpl.invoke(NativeMethodAccessorImpl.java:62)
	at sun.reflect.DelegatingMethodAccessorImpl.invoke(DelegatingMethodAccessorImpl.java:43)
	at java.lang.reflect.Method.invoke(Method.java:498)
	at com.carrotsearch.randomizedtesting.RandomizedRunner.invoke(RandomizedRunner.java:1737)
	at com.carrotsearch.randomizedtesting.RandomizedRunner$8.evaluate(RandomizedRunner.java:934)
	at com.carrotsearch.randomizedtesting.RandomizedRunner$9.evaluate(RandomizedRunner.java:970)
	at com.carrotsearch.randomizedtesting.RandomizedRunner$10.evaluate(RandomizedRunner.java:984)
	at org.apache.solr.BaseDistributedSearchTestCase$ShardsRepeatRule$ShardsRepeatStatement.callStatement(BaseDistributedSearchTestCase.java:1019)
	at org.apache.solr.BaseDistributedSearchTestCase$ShardsRepeatRule$ShardsStatement.evaluate(BaseDistributedSearchTestCase.java:968)
	at com.carrotsearch.randomizedtesting.rules.SystemPropertiesRestoreRule$1.evaluate(SystemPropertiesRestoreRule.java:57)
	at org.apache.lucene.util.TestRuleSetupTeardownChained$1.evaluate(TestRuleSetupTeardownChained.java:49)
	at org.apache.lucene.util.AbstractBeforeAfterRule$1.evaluate(AbstractBeforeAfterRule.java:45)
	at org.apache.lucene.util.TestRuleThreadAndTestName$1.evaluate(TestRuleThreadAndTestName.java:48)
	at org.apache.lucene.util.TestRuleIgnoreAfterMaxFailures$1.evaluate(TestRuleIgnoreAfterMaxFailures.java:64)
	at org.apache.lucene.util.TestRuleMarkFailure$1.evaluate(TestRuleMarkFailure.java:47)
	at com.carrotsearch.randomizedtesting.rules.StatementAdapter.evaluate(StatementAdapter.java:36)
	at com.carrotsearch.randomizedtesting.ThreadLeakControl$StatementRunner.run(ThreadLeakControl.java:368)
	at com.carrotsearch.randomizedtesting.ThreadLeakControl.forkTimeoutingTask(ThreadLeakControl.java:817)
	at com.carrotsearch.randomizedtesting.ThreadLeakControl$3.evaluate(ThreadLeakControl.java:468)
	at com.carrotsearch.randomizedtesting.RandomizedRunner.runSingleTest(RandomizedRunner.java:943)
	at com.carrotsearch.randomizedtesting.RandomizedRunner$5.evaluate(RandomizedRunner.java:829)
	at com.carrotsearch.randomizedtesting.RandomizedRunner$6.evaluate(RandomizedRunner.java:879)
	at com.carrotsearch.randomizedtesting.RandomizedRunner$7.evaluate(RandomizedRunner.java:890)
	at com.carrotsearch.randomizedtesting.rules.StatementAdapter.evaluate(StatementAdapter.java:36)
	at com.carrotsearch.randomizedtesting.rules.SystemPropertiesRestoreRule$1.evaluate(SystemPropertiesRestoreRule.java:57)
	at org.apache.lucene.util.AbstractBeforeAfterRule$1.evaluate(AbstractBeforeAfterRule.java:45)
	at com.carrotsearch.randomizedtesting.rules.StatementAdapter.evaluate(StatementAdapter.java:36)
	at org.apache.lucene.util.TestRuleStoreClassName$1.evaluate(TestRuleStoreClassName.java:41)
	at com.carrotsearch.randomizedtesting.rules.NoShadowingOrOverridesOnMethodsRule$1.evaluate(NoShadowingOrOverridesOnMethodsRule.java:40)
	at com.carrotsearch.randomizedtesting.rules.NoShadowingOrOverridesOnMethodsRule$1.evaluate(NoShadowingOrOverridesOnMethodsRule.java:40)
	at com.carrotsearch.randomizedtesting.rules.StatementAdapter.evaluate(StatementAdapter.java:36)
	at com.carrotsearch.randomizedtesting.rules.StatementAdapter.evaluate(StatementAdapter.java:36)
	at com.carrotsearch.randomizedtesting.rules.StatementAdapter.evaluate(StatementAdapter.java:36)
	at org.apache.lucene.util.TestRuleAssertionsRequired$1.evaluate(TestRuleAssertionsRequired.java:53)
	at org.apache.lucene.util.TestRuleMarkFailure$1.evaluate(TestRuleMarkFailure.java:47)
	at org.apache.lucene.util.TestRuleIgnoreAfterMaxFailures$1.evaluate(TestRuleIgnoreAfterMaxFailures.java:64)
	at org.apache.lucene.util.TestRuleIgnoreTestSuites$1.evaluate(TestRuleIgnoreTestSuites.java:54)
	at com.carrotsearch.randomizedtesting.rules.StatementAdapter.evaluate(StatementAdapter.java:36)
	at com.carrotsearch.randomizedtesting.ThreadLeakControl$StatementRunner.run(ThreadLeakControl.java:368)
	at java.lang.Thread.run(Thread.java:748)


FAILED:  org.apache.solr.handler.component.DistributedSpellCheckComponentTest.test

Error Message:
Error from server at http://127.0.0.1:56037//collection1: Directory (MMapDirectory@C:\Users\jenkins\workspace\Lucene-Solr-master-Windows\solr\build\solr-core\test\J1\temp\solr.handler.component.DistributedSpellCheckComponentTest_337C64C5D8853D2D-003\tempDir-001\control\cores\collection1\data\spellchecker1 lockFactory=org.apache.lucene.store.NativeFSLockFactory@3898383c) still has pending deleted files; cannot initialize IndexWriter

Stack Trace:
org.apache.solr.client.solrj.impl.HttpSolrClient$RemoteSolrException: Error from server at http://127.0.0.1:56037//collection1: Directory (MMapDirectory@C:\Users\jenkins\workspace\Lucene-Solr-master-Windows\solr\build\solr-core\test\J1\temp\solr.handler.component.DistributedSpellCheckComponentTest_337C64C5D8853D2D-003\tempDir-001\control\cores\collection1\data\spellchecker1 lockFactory=org.apache.lucene.store.NativeFSLockFactory@3898383c) still has pending deleted files; cannot initialize IndexWriter
	at __randomizedtesting.SeedInfo.seed([337C64C5D8853D2D:BB285B1F767950D5]:0)
	at org.apache.solr.client.solrj.impl.HttpSolrClient.executeMethod(HttpSolrClient.java:643)
	at org.apache.solr.client.solrj.impl.HttpSolrClient.request(HttpSolrClient.java:255)
	at org.apache.solr.client.solrj.impl.HttpSolrClient.request(HttpSolrClient.java:244)
	at org.apache.solr.client.solrj.SolrRequest.process(SolrRequest.java:194)
	at org.apache.solr.client.solrj.SolrClient.query(SolrClient.java:942)
	at org.apache.solr.client.solrj.SolrClient.query(SolrClient.java:957)
	at org.apache.solr.handler.component.DistributedSpellCheckComponentTest.q(DistributedSpellCheckComponentTest.java:67)
	at org.apache.solr.handler.component.DistributedSpellCheckComponentTest.test(DistributedSpellCheckComponentTest.java:146)
	at sun.reflect.NativeMethodAccessorImpl.invoke0(Native Method)
	at sun.reflect.NativeMethodAccessorImpl.invoke(NativeMethodAccessorImpl.java:62)
	at sun.reflect.DelegatingMethodAccessorImpl.invoke(DelegatingMethodAccessorImpl.java:43)
	at java.lang.reflect.Method.invoke(Method.java:498)
	at com.carrotsearch.randomizedtesting.RandomizedRunner.invoke(RandomizedRunner.java:1737)
	at com.carrotsearch.randomizedtesting.RandomizedRunner$8.evaluate(RandomizedRunner.java:934)
	at com.carrotsearch.randomizedtesting.RandomizedRunner$9.evaluate(RandomizedRunner.java:970)
	at com.carrotsearch.randomizedtesting.RandomizedRunner$10.evaluate(RandomizedRunner.java:984)
	at org.apache.solr.BaseDistributedSearchTestCase$ShardsRepeatRule$ShardsRepeatStatement.callStatement(BaseDistributedSearchTestCase.java:1019)
	at org.apache.solr.BaseDistributedSearchTestCase$ShardsRepeatRule$ShardsStatement.evaluate(BaseDistributedSearchTestCase.java:968)
	at com.carrotsearch.randomizedtesting.rules.SystemPropertiesRestoreRule$1.evaluate(SystemPropertiesRestoreRule.java:57)
	at org.apache.lucene.util.TestRuleSetupTeardownChained$1.evaluate(TestRuleSetupTeardownChained.java:49)
	at org.apache.lucene.util.AbstractBeforeAfterRule$1.evaluate(AbstractBeforeAfterRule.java:45)
	at org.apache.lucene.util.TestRuleThreadAndTestName$1.evaluate(TestRuleThreadAndTestName.java:48)
	at org.apache.lucene.util.TestRuleIgnoreAfterMaxFailures$1.evaluate(TestRuleIgnoreAfterMaxFailures.java:64)
	at org.apache.lucene.util.TestRuleMarkFailure$1.evaluate(TestRuleMarkFailure.java:47)
	at com.carrotsearch.randomizedtesting.rules.StatementAdapter.evaluate(StatementAdapter.java:36)
	at com.carrotsearch.randomizedtesting.ThreadLeakControl$StatementRunner.run(ThreadLeakControl.java:368)
	at com.carrotsearch.randomizedtesting.ThreadLeakControl.forkTimeoutingTask(ThreadLeakControl.java:817)
	at com.carrotsearch.randomizedtesting.ThreadLeakControl$3.evaluate(ThreadLeakControl.java:468)
	at com.carrotsearch.randomizedtesting.RandomizedRunner.runSingleTest(RandomizedRunner.java:943)
	at com.carrotsearch.randomizedtesting.RandomizedRunner$5.evaluate(RandomizedRunner.java:829)
	at com.carrotsearch.randomizedtesting.RandomizedRunner$6.evaluate(RandomizedRunner.java:879)
	at com.carrotsearch.randomizedtesting.RandomizedRunner$7.evaluate(RandomizedRunner.java:890)
	at com.carrotsearch.randomizedtesting.rules.StatementAdapter.evaluate(StatementAdapter.java:36)
	at com.carrotsearch.randomizedtesting.rules.SystemPropertiesRestoreRule$1.evaluate(SystemPropertiesRestoreRule.java:57)
	at org.apache.lucene.util.AbstractBeforeAfterRule$1.evaluate(AbstractBeforeAfterRule.java:45)
	at com.carrotsearch.randomizedtesting.rules.StatementAdapter.evaluate(StatementAdapter.java:36)
	at org.apache.lucene.util.TestRuleStoreClassName$1.evaluate(TestRuleStoreClassName.java:41)
	at com.carrotsearch.randomizedtesting.rules.NoShadowingOrOverridesOnMethodsRule$1.evaluate(NoShadowingOrOverridesOnMethodsRule.java:40)
	at com.carrotsearch.randomizedtesting.rules.NoShadowingOrOverridesOnMethodsRule$1.evaluate(NoShadowingOrOverridesOnMethodsRule.java:40)
	at com.carrotsearch.randomizedtesting.rules.StatementAdapter.evaluate(StatementAdapter.java:36)
	at com.carrotsearch.randomizedtesting.rules.StatementAdapter.evaluate(StatementAdapter.java:36)
	at com.carrotsearch.randomizedtesting.rules.StatementAdapter.evaluate(StatementAdapter.java:36)
	at org.apache.lucene.util.TestRuleAssertionsRequired$1.evaluate(TestRuleAssertionsRequired.java:53)
	at org.apache.lucene.util.TestRuleMarkFailure$1.evaluate(TestRuleMarkFailure.java:47)
	at org.apache.lucene.util.TestRuleIgnoreAfterMaxFailures$1.evaluate(TestRuleIgnoreAfterMaxFailures.java:64)
	at org.apache.lucene.util.TestRuleIgnoreTestSuites$1.evaluate(TestRuleIgnoreTestSuites.java:54)
	at com.carrotsearch.randomizedtesting.rules.StatementAdapter.evaluate(StatementAdapter.java:36)
	at com.carrotsearch.randomizedtesting.ThreadLeakControl$StatementRunner.run(ThreadLeakControl.java:368)
	at java.lang.Thread.run(Thread.java:748)


FAILED:  org.apache.solr.handler.component.DistributedSpellCheckComponentTest.test

Error Message:
Error from server at http://127.0.0.1:50599//collection1: Directory (MMapDirectory@C:\Users\jenkins\workspace\Lucene-Solr-master-Windows\solr\build\solr-core\test\J0\temp\solr.handler.component.DistributedSpellCheckComponentTest_337C64C5D8853D2D-001\tempDir-001\control\cores\collection1\data\spellchecker1 lockFactory=org.apache.lucene.store.NativeFSLockFactory@7f6df56f) still has pending deleted files; cannot initialize IndexWriter

Stack Trace:
org.apache.solr.client.solrj.impl.HttpSolrClient$RemoteSolrException: Error from server at http://127.0.0.1:50599//collection1: Directory (MMapDirectory@C:\Users\jenkins\workspace\Lucene-Solr-master-Windows\solr\build\solr-core\test\J0\temp\solr.handler.component.DistributedSpellCheckComponentTest_337C64C5D8853D2D-001\tempDir-001\control\cores\collection1\data\spellchecker1 lockFactory=org.apache.lucene.store.NativeFSLockFactory@7f6df56f) still has pending deleted files; cannot initialize IndexWriter
	at __randomizedtesting.SeedInfo.seed([337C64C5D8853D2D:BB285B1F767950D5]:0)
	at org.apache.solr.client.solrj.impl.HttpSolrClient.executeMethod(HttpSolrClient.java:643)
	at org.apache.solr.client.solrj.impl.HttpSolrClient.request(HttpSolrClient.java:255)
	at org.apache.solr.client.solrj.impl.HttpSolrClient.request(HttpSolrClient.java:244)
	at org.apache.solr.client.solrj.SolrRequest.process(SolrRequest.java:194)
	at org.apache.solr.client.solrj.SolrClient.query(SolrClient.java:942)
	at org.apache.solr.client.solrj.SolrClient.query(SolrClient.java:957)
	at org.apache.solr.handler.component.DistributedSpellCheckComponentTest.q(DistributedSpellCheckComponentTest.java:67)
	at org.apache.solr.handler.component.DistributedSpellCheckComponentTest.test(DistributedSpellCheckComponentTest.java:146)
	at sun.reflect.NativeMethodAccessorImpl.invoke0(Native Method)
	at sun.reflect.NativeMethodAccessorImpl.invoke(NativeMethodAccessorImpl.java:62)
	at sun.reflect.DelegatingMethodAccessorImpl.invoke(DelegatingMethodAccessorImpl.java:43)
	at java.lang.reflect.Method.invoke(Method.java:498)
	at com.carrotsearch.randomizedtesting.RandomizedRunner.invoke(RandomizedRunner.java:1737)
	at com.carrotsearch.randomizedtesting.RandomizedRunner$8.evaluate(RandomizedRunner.java:934)
	at com.carrotsearch.randomizedtesting.RandomizedRunner$9.evaluate(RandomizedRunner.java:970)
	at com.carrotsearch.randomizedtesting.RandomizedRunner$10.evaluate(RandomizedRunner.java:984)
	at org.apache.solr.BaseDistributedSearchTestCase$ShardsRepeatRule$ShardsRepeatStatement.callStatement(BaseDistributedSearchTestCase.java:1019)
	at org.apache.solr.BaseDistributedSearchTestCase$ShardsRepeatRule$ShardsStatement.evaluate(BaseDistributedSearchTestCase.java:968)
	at com.carrotsearch.randomizedtesting.rules.SystemPropertiesRestoreRule$1.evaluate(SystemPropertiesRestoreRule.java:57)
	at org.apache.lucene.util.TestRuleSetupTeardownChained$1.evaluate(TestRuleSetupTeardownChained.java:49)
	at org.apache.lucene.util.AbstractBeforeAfterRule$1.evaluate(AbstractBeforeAfterRule.java:45)
	at org.apache.lucene.util.TestRuleThreadAndTestName$1.evaluate(TestRuleThreadAndTestName.java:48)
	at org.apache.lucene.util.TestRuleIgnoreAfterMaxFailures$1.evaluate(TestRuleIgnoreAfterMaxFailures.java:64)
	at org.apache.lucene.util.TestRuleMarkFailure$1.evaluate(TestRuleMarkFailure.java:47)
	at com.carrotsearch.randomizedtesting.rules.StatementAdapter.evaluate(StatementAdapter.java:36)
	at com.carrotsearch.randomizedtesting.ThreadLeakControl$StatementRunner.run(ThreadLeakControl.java:368)
	at com.carrotsearch.randomizedtesting.ThreadLeakControl.forkTimeoutingTask(ThreadLeakControl.java:817)
	at com.carrotsearch.randomizedtesting.ThreadLeakControl$3.evaluate(ThreadLeakControl.java:468)
	at com.carrotsearch.randomizedtesting.RandomizedRunner.runSingleTest(RandomizedRunner.java:943)
	at com.carrotsearch.randomizedtesting.RandomizedRunner$5.evaluate(RandomizedRunner.java:829)
	at com.carrotsearch.randomizedtesting.RandomizedRunner$6.evaluate(RandomizedRunner.java:879)
	at com.carrotsearch.randomizedtesting.RandomizedRunner$7.evaluate(RandomizedRunner.java:890)
	at com.carrotsearch.randomizedtesting.rules.StatementAdapter.evaluate(StatementAdapter.java:36)
	at com.carrotsearch.randomizedtesting.rules.SystemPropertiesRestoreRule$1.evaluate(SystemPropertiesRestoreRule.java:57)
	at org.apache.lucene.util.AbstractBeforeAfterRule$1.evaluate(AbstractBeforeAfterRule.java:45)
	at com.carrotsearch.randomizedtesting.rules.StatementAdapter.evaluate(StatementAdapter.java:36)
	at org.apache.lucene.util.TestRuleStoreClassName$1.evaluate(TestRuleStoreClassName.java:41)
	at com.carrotsearch.randomizedtesting.rules.NoShadowingOrOverridesOnMethodsRule$1.evaluate(NoShadowingOrOverridesOnMethodsRule.java:40)
	at com.carrotsearch.randomizedtesting.rules.NoShadowingOrOverridesOnMethodsRule$1.evaluate(NoShadowingOrOverridesOnMethodsRule.java:40)
	at com.carrotsearch.randomizedtesting.rules.StatementAdapter.evaluate(StatementAdapter.java:36)
	at com.carrotsearch.randomizedtesting.rules.StatementAdapter.evaluate(StatementAdapter.java:36)
	at com.carrotsearch.randomizedtesting.rules.StatementAdapter.evaluate(StatementAdapter.java:36)
	at org.apache.lucene.util.TestRuleAssertionsRequired$1.evaluate(TestRuleAssertionsRequired.java:53)
	at org.apache.lucene.util.TestRuleMarkFailure$1.evaluate(TestRuleMarkFailure.java:47)
	at org.apache.lucene.util.TestRuleIgnoreAfterMaxFailures$1.evaluate(TestRuleIgnoreAfterMaxFailures.java:64)
	at org.apache.lucene.util.TestRuleIgnoreTestSuites$1.evaluate(TestRuleIgnoreTestSuites.java:54)
	at com.carrotsearch.randomizedtesting.rules.StatementAdapter.evaluate(StatementAdapter.java:36)
	at com.carrotsearch.randomizedtesting.ThreadLeakControl$StatementRunner.run(ThreadLeakControl.java:368)
	at java.lang.Thread.run(Thread.java:748)




Build Log:
[...truncated 13863 lines...]
   [junit4] Suite: org.apache.solr.handler.component.DistributedSpellCheckComponentTest
   [junit4]   2> Creating dataDir: C:\Users\jenkins\workspace\Lucene-Solr-master-Windows\solr\build\solr-core\test\J0\temp\solr.handler.component.DistributedSpellCheckComponentTest_337C64C5D8853D2D-001\init-core-data-001
   [junit4]   2> 1529358 INFO  (SUITE-DistributedSpellCheckComponentTest-seed#[337C64C5D8853D2D]-worker) [    ] o.a.s.SolrTestCaseJ4 Using PointFields (NUMERIC_POINTS_SYSPROP=true) w/NUMERIC_DOCVALUES_SYSPROP=true
   [junit4]   2> 1529361 INFO  (SUITE-DistributedSpellCheckComponentTest-seed#[337C64C5D8853D2D]-worker) [    ] o.a.s.SolrTestCaseJ4 Randomized ssl (false) and clientAuth (false) via: @org.apache.solr.util.RandomizeSSL(reason=, value=NaN, ssl=NaN, clientAuth=NaN)
   [junit4]   2> 1529361 INFO  (SUITE-DistributedSpellCheckComponentTest-seed#[337C64C5D8853D2D]-worker) [    ] o.a.s.SolrTestCaseJ4 SecureRandom sanity checks: test.solr.allowed.securerandom=null & java.security.egd=file:/dev/./urandom
   [junit4]   2> 1529361 INFO  (SUITE-DistributedSpellCheckComponentTest-seed#[337C64C5D8853D2D]-worker) [    ] o.a.s.BaseDistributedSearchTestCase Setting hostContext system property: /
   [junit4]   2> 1530632 INFO  (TEST-DistributedSpellCheckComponentTest.test-seed#[337C64C5D8853D2D]) [    ] o.a.s.SolrTestCaseJ4 Writing core.properties file to C:\Users\jenkins\workspace\Lucene-Solr-master-Windows\solr\build\solr-core\test\J0\temp\solr.handler.component.DistributedSpellCheckComponentTest_337C64C5D8853D2D-001\tempDir-001\control\cores\collection1
   [junit4]   2> 1530635 INFO  (TEST-DistributedSpellCheckComponentTest.test-seed#[337C64C5D8853D2D]) [    ] o.e.j.s.Server jetty-9.4.10.v20180503; built: 2018-05-03T15:56:21.710Z; git: daa59876e6f384329b122929e70a80934569428c; jvm 1.8.0_144-b01
   [junit4]   2> 1530636 INFO  (TEST-DistributedSpellCheckComponentTest.test-seed#[337C64C5D8853D2D]) [    ] o.e.j.s.session DefaultSessionIdManager workerName=node0
   [junit4]   2> 1530636 INFO  (TEST-DistributedSpellCheckComponentTest.test-seed#[337C64C5D8853D2D]) [    ] o.e.j.s.session No SessionScavenger set, using defaults
   [junit4]   2> 1530636 INFO  (TEST-DistributedSpellCheckComponentTest.test-seed#[337C64C5D8853D2D]) [    ] o.e.j.s.session node0 Scavenging every 600000ms
   [junit4]   2> 1530636 INFO  (TEST-DistributedSpellCheckComponentTest.test-seed#[337C64C5D8853D2D]) [    ] o.e.j.s.h.ContextHandler Started o.e.j.s.ServletContextHandler@64049d0f{/,null,AVAILABLE}
   [junit4]   2> 1530640 INFO  (TEST-DistributedSpellCheckComponentTest.test-seed#[337C64C5D8853D2D]) [    ] o.e.j.s.AbstractConnector Started ServerConnector@5db0b10f{HTTP/1.1,[http/1.1]}{127.0.0.1:50578}
   [junit4]   2> 1530640 INFO  (TEST-DistributedSpellCheckComponentTest.test-seed#[337C64C5D8853D2D]) [    ] o.e.j.s.Server Started @1530673ms
   [junit4]   2> 1530640 INFO  (TEST-DistributedSpellCheckComponentTest.test-seed#[337C64C5D8853D2D]) [    ] o.a.s.c.s.e.JettySolrRunner Jetty properties: {hostContext=/, hostPort=50578, coreRootDirectory=C:\Users\jenkins\workspace\Lucene-Solr-master-Windows\solr\build\solr-core\test\J0\temp\solr.handler.component.DistributedSpellCheckComponentTest_337C64C5D8853D2D-001\tempDir-001\control\cores}
   [junit4]   2> 1530640 ERROR (TEST-DistributedSpellCheckComponentTest.test-seed#[337C64C5D8853D2D]) [    ] o.a.s.u.StartupLoggingUtils Missing Java Option solr.log.dir. Logging may be missing or incomplete.
   [junit4]   2> 1530640 INFO  (TEST-DistributedSpellCheckComponentTest.test-seed#[337C64C5D8853D2D]) [    ] o.a.s.s.SolrDispatchFilter Using logger factory org.apache.logging.slf4j.Log4jLoggerFactory
   [junit4]   2> 1530640 INFO  (TEST-DistributedSpellCheckComponentTest.test-seed#[337C64C5D8853D2D]) [    ] o.a.s.s.SolrDispatchFilter  ___      _       Welcome to Apache Solr™ version 8.0.0
   [junit4]   2> 1530640 INFO  (TEST-DistributedSpellCheckComponentTest.test-seed#[337C64C5D8853D2D]) [    ] o.a.s.s.SolrDispatchFilter / __| ___| |_ _   Starting in standalone mode on port null
   [junit4]   2> 1530640 INFO  (TEST-DistributedSpellCheckComponentTest.test-seed#[337C64C5D8853D2D]) [    ] o.a.s.s.SolrDispatchFilter \__ \/ _ \ | '_|  Install dir: null
   [junit4]   2> 1530640 INFO  (TEST-DistributedSpellCheckComponentTest.test-seed#[337C64C5D8853D2D]) [    ] o.a.s.s.SolrDispatchFilter |___/\___/_|_|    Start time: 2018-05-09T12:58:18.987Z
   [junit4]   2> 1530641 INFO  (TEST-DistributedSpellCheckComponentTest.test-seed#[337C64C5D8853D2D]) [    ] o.a.s.c.SolrXmlConfig Loading container configuration from C:\Users\jenkins\workspace\Lucene-Solr-master-Windows\solr\build\solr-core\test\J0\temp\solr.handler.component.DistributedSpellCheckComponentTest_337C64C5D8853D2D-001\tempDir-001\control\solr.xml
   [junit4]   2> 1530653 INFO  (TEST-DistributedSpellCheckComponentTest.test-seed#[337C64C5D8853D2D]) [    ] o.a.s.c.SolrXmlConfig Configuration parameter autoReplicaFailoverWorkLoopDelay is ignored
   [junit4]   2> 1530653 INFO  (TEST-DistributedSpellCheckComponentTest.test-seed#[337C64C5D8853D2D]) [    ] o.a.s.c.SolrXmlConfig Configuration parameter autoReplicaFailoverBadNodeExpiration is ignored
   [junit4]   2> 1530653 INFO  (TEST-DistributedSpellCheckComponentTest.test-seed#[337C64C5D8853D2D]) [    ] o.a.s.c.SolrXmlConfig MBean server found: com.sun.jmx.mbeanserver.JmxMBeanServer@3a118a9b, but no JMX reporters were configured - adding default JMX reporter.
   [junit4]   2> 1530751 INFO  (TEST-DistributedSpellCheckComponentTest.test-seed#[337C64C5D8853D2D]) [    ] o.a.s.m.r.SolrJmxReporter JMX monitoring for 'solr.node' (registry 'solr.node') enabled at server: com.sun.jmx.mbeanserver.JmxMBeanServer@3a118a9b
   [junit4]   2> 1530760 INFO  (TEST-DistributedSpellCheckComponentTest.test-seed#[337C64C5D8853D2D]) [    ] o.a.s.m.r.SolrJmxReporter JMX monitoring for 'solr.jvm' (registry 'solr.jvm') enabled at server: com.sun.jmx.mbeanserver.JmxMBeanServer@3a118a9b
   [junit4]   2> 1530760 INFO  (TEST-DistributedSpellCheckComponentTest.test-seed#[337C64C5D8853D2D]) [    ] o.a.s.m.r.SolrJmxReporter JMX monitoring for 'solr.jetty' (registry 'solr.jetty') enabled at server: com.sun.jmx.mbeanserver.JmxMBeanServer@3a118a9b
   [junit4]   2> 1530768 INFO  (TEST-DistributedSpellCheckComponentTest.test-seed#[337C64C5D8853D2D]) [    ] o.a.s.c.CorePropertiesLocator Found 1 core definitions underneath C:\Users\jenkins\workspace\Lucene-Solr-master-Windows\solr\build\solr-core\test\J0\temp\solr.handler.component.DistributedSpellCheckComponentTest_337C64C5D8853D2D-001\tempDir-001\control\cores
   [junit4]   2> 1530768 INFO  (TEST-DistributedSpellCheckComponentTest.test-seed#[337C64C5D8853D2D]) [    ] o.a.s.c.CorePropertiesLocator Cores are: [collection1]
   [junit4]   2> 1530768 INFO  (coreLoadExecutor-7698-thread-1) [    ] o.a.s.c.TransientSolrCoreCacheDefault Allocating transient cache for 4 transient cores
   [junit4]   2> 1530770 INFO  (coreLoadExecutor-7698-thread-1) [    x:collection1] o.a.s.c.SolrResourceLoader [null] Added 2 libs to classloader, from paths: [/C:/Users/jenkins/workspace/Lucene-Solr-master-Windows/solr/core/src/test-files/solr/collection1/lib, /C:/Users/jenkins/workspace/Lucene-Solr-master-Windows/solr/core/src/test-files/solr/collection1/lib/classes]
   [junit4]   2> 1530863 INFO  (coreLoadExecutor-7698-thread-1) [    x:collection1] o.a.s.c.SolrConfig Using Lucene MatchVersion: 8.0.0
   [junit4]   2> 1530886 INFO  (coreLoadExecutor-7698-thread-1) [    x:collection1] o.a.s.s.IndexSchema [collection1] Schema name=test
   [junit4]   2> 1530998 INFO  (coreLoadExecutor-7698-thread-1) [    x:collection1] o.a.s.s.IndexSchema Loaded schema test/1.0 with uniqueid field id
   [junit4]   2> 1531012 INFO  (coreLoadExecutor-7698-thread-1) [    x:collection1] o.a.s.c.CoreContainer Creating SolrCore 'collection1' using configuration from configset C:\Users\jenkins\workspace\Lucene-Solr-master-Windows\solr\core\src\test-files\solr\collection1, trusted=true
   [junit4]   2> 1531012 INFO  (coreLoadExecutor-7698-thread-1) [    x:collection1] o.a.s.m.r.SolrJmxReporter JMX monitoring for 'solr.core.collection1' (registry 'solr.core.collection1') enabled at server: com.sun.jmx.mbeanserver.JmxMBeanServer@3a118a9b
   [junit4]   2> 1531012 INFO  (coreLoadExecutor-7698-thread-1) [    x:collection1] o.a.s.c.SolrCore solr.RecoveryStrategy.Builder
   [junit4]   2> 1531012 INFO  (coreLoadExecutor-7698-thread-1) [    x:collection1] o.a.s.c.SolrCore [[collection1] ] Opening new SolrCore at [C:\Users\jenkins\workspace\Lucene-Solr-master-Windows\solr\core\src\test-files\solr\collection1], dataDir=[C:\Users\jenkins\workspace\Lucene-Solr-master-Windows\solr\build\solr-core\test\J0\temp\solr.handler.component.DistributedSpellCheckComponentTest_337C64C5D8853D2D-001\tempDir-001\control\cores\collection1\data\]
   [junit4]   2> 1531020 INFO  (coreLoadExecutor-7698-thread-1) [    x:collection1] o.a.s.u.RandomMergePolicy RandomMergePolicy wrapping class org.apache.lucene.index.AlcoholicMergePolicy: [AlcoholicMergePolicy: minMergeSize=0, mergeFactor=10, maxMergeSize=1038278986, maxMergeSizeForForcedMerge=9223372036854775807, calibrateSizeByDeletes=true, maxMergeDocs=2147483647, maxCFSSegmentSizeMB=8.796093022207999E12, noCFSRatio=0.1]
   [junit4]   2> 1531171 INFO  (coreLoadExecutor-7698-thread-1) [    x:collection1] o.a.s.u.UpdateHandler Using UpdateLog implementation: org.apache.solr.update.UpdateLog
   [junit4]   2> 1531172 INFO  (coreLoadExecutor-7698-thread-1) [    x:collection1] o.a.s.u.UpdateLog Initializing UpdateLog: dataDir= defaultSyncLevel=FLUSH numRecordsToKeep=100 maxNumLogsToKeep=10 numVersionBuckets=65536
   [junit4]   2> 1531175 INFO  (coreLoadExecutor-7698-thread-1) [    x:collection1] o.a.s.u.CommitTracker Hard AutoCommit: disabled
   [junit4]   2> 1531175 INFO  (coreLoadExecutor-7698-thread-1) [    x:collection1] o.a.s.u.CommitTracker Soft AutoCommit: disabled
   [junit4]   2> 1531175 INFO  (coreLoadExecutor-7698-thread-1) [    x:collection1] o.a.s.u.RandomMergePolicy RandomMergePolicy wrapping class org.apache.lucene.index.AlcoholicMergePolicy: [AlcoholicMergePolicy: minMergeSize=0, mergeFactor=10, maxMergeSize=1791984753, maxMergeSizeForForcedMerge=9223372036854775807, calibrateSizeByDeletes=true, maxMergeDocs=2147483647, maxCFSSegmentSizeMB=8.796093022207999E12, noCFSRatio=0.1]
   [junit4]   2> 1531177 INFO  (coreLoadExecutor-7698-thread-1) [    x:collection1] o.a.s.s.SolrIndexSearcher Opening [Searcher@56f5fda8[collection1] main]
   [junit4]   2> 1531177 INFO  (coreLoadExecutor-7698-thread-1) [    x:collection1] o.a.s.h.c.SpellCheckComponent Initializing spell checkers
   [junit4]   2> 1531313 INFO  (coreLoadExecutor-7698-thread-1) [    x:collection1] o.a.s.s.DirectSolrSpellChecker init: {name=direct,classname=DirectSolrSpellChecker,field=lowerfilt,minQueryLength=3}
   [junit4]   2> 1531581 INFO  (coreLoadExecutor-7698-thread-1) [    x:collection1] o.a.s.h.ReplicationHandler Commits will be reserved for 10000ms.
   [junit4]   2> 1531581 INFO  (searcherExecutor-7699-thread-1-processing-x:collection1) [    x:collection1] o.a.s.h.c.SpellCheckComponent Loading spell index for spellchecker: default
   [junit4]   2> 1531587 INFO  (coreLoadExecutor-7698-thread-1) [    x:collection1] o.a.s.u.UpdateLog Could not find max version in index or recent updates, using new clock 1599991395053993984
   [junit4]   2> 1531618 INFO  (searcherExecutor-7699-thread-1-processing-x:collection1) [    x:collection1] o.a.s.h.c.SpellCheckComponent Loading spell index for spellchecker: direct
   [junit4]   2> 1531618 INFO  (searcherExecutor-7699-thread-1-processing-x:collection1) [    x:collection1] o.a.s.h.c.SpellCheckComponent Loading spell index for spellchecker: wordbreak
   [junit4]   2> 1531618 INFO  (searcherExecutor-7699-thread-1-processing-x:collection1) [    x:collection1] o.a.s.h.c.SpellCheckComponent Loading spell index for spellchecker: multipleFields
   [junit4]   2> 1531625 INFO  (searcherExecutor-7699-thread-1-processing-x:collection1) [    x:collection1] o.a.s.h.c.SpellCheckComponent Loading spell index for spellchecker: jarowinkler
   [junit4]   2> 1531625 INFO  (searcherExecutor-7699-thread-1-processing-x:collection1) [    x:collection1] o.a.s.h.c.SpellCheckComponent Loading spell index for spellchecker: external
   [junit4]   2> 1531626 INFO  (searcherExecutor-7699-thread-1-processing-x:collection1) [    x:collection1] o.a.s.h.c.SpellCheckComponent Loading spell index for spellchecker: freq
   [junit4]   2> 1531627 INFO  (searcherExecutor-7699-thread-1-processing-x:collection1) [    x:collection1] o.a.s.h.c.SpellCheckComponent Loading spell index for spellchecker: fqcn
   [junit4]   2> 1531627 INFO  (searcherExecutor-7699-thread-1-processing-x:collection1) [    x:collection1] o.a.s.h.c.SpellCheckComponent Loading spell index for spellchecker: perDict
   [junit4]   2> 1531628 INFO  (searcherExecutor-7699-thread-1-processing-x:collection1) [    x:collection1] o.a.s.c.SolrCore [collection1] Registered new searcher Searcher@56f5fda8[collection1] main{ExitableDirectoryReader(UninvertingDirectoryReader())}
   [junit4]   2> 1533449 INFO  (TEST-DistributedSpellCheckComponentTest.test-seed#[337C64C5D8853D2D]) [    ] o.a.s.SolrTestCaseJ4 Writing core.properties file to C:\Users\jenkins\workspace\Lucene-Solr-master-Windows\solr\build\solr-core\test\J0\temp\solr.handler.component.DistributedSpellCheckComponentTest_337C64C5D8853D2D-001\tempDir-001\shard0\cores\collection1
   [junit4]   2> 1533451 INFO  (TEST-DistributedSpellCheckComponentTest.test-seed#[337C64C5D8853D2D]) [    ] o.e.j.s.Server jetty-9.4.10.v20180503; built: 2018-05-03T15:56:21.710Z; git: daa59876e6f384329b122929e70a80934569428c; jvm 1.8.0_144-b01
   [junit4]   2> 1533452 INFO  (TEST-DistributedSpellCheckComponentTest.test-seed#[337C64C5D8853D2D]) [    ] o.e.j.s.session DefaultSessionIdManager workerName=node0
   [junit4]   2> 1533452 INFO  (TEST-DistributedSpellCheckComponentTest.test-seed#[337C64C5D8853D2D]) [    ] o.e.j.s.session No SessionScavenger set, using defaults
   [junit4]   2> 1533452 INFO  (TEST-DistributedSpellCheckComponentTest.test-seed#[337C64C5D8853D2D]) [    ] o.e.j.s.session node0 Scavenging every 600000ms
   [junit4]   2> 1533452 INFO  (TEST-DistributedSpellCheckComponentTest.test-seed#[337C64C5D8853D2D]) [    ] o.e.j.s.h.ContextHandler Started o.e.j.s.ServletContextHandler@5a1734b2{/,null,AVAILABLE}
   [junit4]   2> 1533453 INFO  (TEST-DistributedSpellCheckComponentTest.test-seed#[337C64C5D8853D2D]) [    ] o.e.j.s.AbstractConnector Started ServerConnector@249e6545{HTTP/1.1,[http/1.1]}{127.0.0.1:50586}
   [junit4]   2> 1533453 INFO  (TEST-DistributedSpellCheckComponentTest.test-seed#[337C64C5D8853D2D]) [    ] o.e.j.s.Server Started @1533487ms
   [junit4]   2> 1533453 INFO  (TEST-DistributedSpellCheckComponentTest.test-seed#[337C64C5D8853D2D]) [    ] o.a.s.c.s.e.JettySolrRunner Jetty properties: {hostContext=/, hostPort=50586, coreRootDirectory=C:\Users\jenkins\workspace\Lucene-Solr-master-Windows\solr\build\solr-core\test\J0\temp\solr.handler.component.DistributedSpellCheckComponentTest_337C64C5D8853D2D-001\tempDir-001\shard0\cores}
   [junit4]   2> 1533453 ERROR (TEST-DistributedSpellCheckComponentTest.test-seed#[337C64C5D8853D2D]) [    ] o.a.s.u.StartupLoggingUtils Missing Java Option solr.log.dir. Logging may be missing or incomplete.
   [junit4]   2> 1533453 INFO  (TEST-DistributedSpellCheckComponentTest.test-seed#[337C64C5D8853D2D]) [    ] o.a.s.s.SolrDispatchFilter Using logger factory org.apache.logging.slf4j.Log4jLoggerFactory
   [junit4]   2> 1533455 INFO  (TEST-DistributedSpellCheckComponentTest.test-seed#[337C64C5D8853D2D]) [    ] o.a.s.s.SolrDispatchFilter  ___      _       Welcome to Apache Solr™ version 8.0.0
   [junit4]   2> 1533455 INFO  (TEST-DistributedSpellCheckComponentTest.test-seed#[337C64C5D8853D2D]) [    ] o.a.s.s.SolrDispatchFilter / __| ___| |_ _   Starting in standalone mode on port null
   [junit4]   2> 1533455 INFO  (TEST-DistributedSpellCheckComponentTest.test-seed#[337C64C5D8853D2D]) [    ] o.a.s.s.SolrDispatchFilter \__ \/ _ \ | '_|  Install dir: null
   [junit4]   2> 1533455 INFO  (TEST-DistributedSpellCheckComponentTest.test-seed#[337C64C5D8853D2D]) [    ] o.a.s.s.SolrDispatchFilter |___/\___/_|_|    Start time: 2018-05-09T12:58:21.802Z
   [junit4]   2> 1533455 INFO  (TEST-DistributedSpellCheckComponentTest.test-seed#[337C64C5D8853D2D]) [    ] o.a.s.c.SolrXmlConfig Loading container configuration from C:\Users\jenkins\workspace\Lucene-Solr-master-Windows\solr\build\solr-core\test\J0\temp\solr.handler.component.DistributedSpellCheckComponentTest_337C64C5D8853D2D-001\tempDir-001\shard0\solr.xml
   [junit4]   2> 1533466 INFO  (TEST-DistributedSpellCheckComponentTest.test-seed#[337C64C5D8853D2D]) [    ] o.a.s.c.SolrXmlConfig Configuration parameter autoReplicaFailoverWorkLoopDelay is ignored
   [junit4]   2> 1533466 INFO  (TEST-DistributedSpellCheckComponentTest.test-seed#[337C64C5D8853D2D]) [    ] o.a.s.c.SolrXmlConfig Configuration parameter autoReplicaFailoverBadNodeExpiration is ignored
   [junit4]   2> 1533468 INFO  (TEST-DistributedSpellCheckComponentTest.test-seed#[337C64C5D8853D2D]) [    ] o.a.s.c.SolrXmlConfig MBean server found: com.sun.jmx.mbeanserver.JmxMBeanServer@3a118a9b, but no JMX reporters were configured - adding default JMX reporter.
   [junit4]   2> 1533578 INFO  (TEST-DistributedSpellCheckComponentTest.test-seed#[337C64C5D8853D2D]) [    ] o.a.s.m.r.SolrJmxReporter JMX monitoring for 'solr.node' (registry 'solr.node') enabled at server: com.sun.jmx.mbeanserver.JmxMBeanServer@3a118a9b
   [junit4]   2> 1533589 INFO  (TEST-DistributedSpellCheckComponentTest.test-seed#[337C64C5D8853D2D]) [    ] o.a.s.m.r.SolrJmxReporter JMX monitoring for 'solr.jvm' (registry 'solr.jvm') enabled at server: com.sun.jmx.mbeanserver.JmxMBeanServer@3a118a9b
   [junit4]   2> 1533589 INFO  (TEST-DistributedSpellCheckComponentTest.test-seed#[337C64C5D8853D2D]) [    ] o.a.s.m.r.SolrJmxReporter JMX monitoring for 'solr.jetty' (registry 'solr.jetty') enabled at server: com.sun.jmx.mbeanserver.JmxMBeanServer@3a118a9b
   [junit4]   2> 1533596 INFO  (TEST-DistributedSpellCheckComponentTest.test-seed#[337C64C5D8853D2D]) [    ] o.a.s.c.CorePropertiesLocator Found 1 core definitions underneath C:\Users\jenkins\workspace\Lucene-Solr-master-Windows\solr\build\solr-core\test\J0\temp\solr.handler.component.DistributedSpellCheckComponentTest_337C64C5D8853D2D-001\tempDir-001\shard0\cores
   [junit4]   2> 1533596 INFO  (TEST-DistributedSpellCheckComponentTest.test-seed#[337C64C5D8853D2D]) [    ] o.a.s.c.CorePropertiesLocator Cores are: [collection1]
   [junit4]   2> 1533596 INFO  (coreLoadExecutor-7709-thread-1) [    ] o.a.s.c.TransientSolrCoreCacheDefault Allocating transient cache for 4 transient cores
   [junit4]   2> 1533598 INFO  (coreLoadExecutor-7709-thread-1) [    x:collection1] o.a.s.c.SolrResourceLoader [null] Added 2 libs to classloader, from paths: [/C:/Users/jenkins/workspace/Lucene-Solr-master-Windows/solr/core/src/test-files/solr/collection1/lib, /C:/Users/jenkins/workspace/Lucene-Solr-master-Windows/solr/core/src/test-files/solr/collection1/lib/classes]
   [junit4]   2> 1533682 INFO  (coreLoadExecutor-7709-thread-1) [    x:collection1] o.a.s.c.SolrConfig Using Lucene MatchVersion: 8.0.0
   [junit4]   2> 1533696 INFO  (coreLoadExecutor-7709-thread-1) [    x:collection1] o.a.s.s.IndexSchema [collection1] Schema name=test
   [junit4]   2> 1533781 INFO  (coreLoadExecutor-7709-thread-1) [    x:collection1] o.a.s.s.IndexSchema Loaded schema test/1.0 with uniqueid field id
   [junit4]   2> 1533790 INFO  (coreLoadExecutor-7709-thread-1) [    x:collection1] o.a.s.c.CoreContainer Creating SolrCore 'collection1' using configuration from configset C:\Users\jenkins\workspace\Lucene-Solr-master-Windows\solr\core\src\test-files\solr\collection1, trusted=true
   [junit4]   2> 1533791 INFO  (coreLoadExecutor-7709-thread-1) [    x:collection1] o.a.s.m.r.SolrJmxReporter JMX monitoring for 'solr.core.collection1' (registry 'solr.core.collection1') enabled at server: com.sun.jmx.mbeanserver.JmxMBeanServer@3a118a9b
   [junit4]   2> 1533791 INFO  (coreLoadExecutor-7709-thread-1) [    x:collection1] o.a.s.c.SolrCore solr.RecoveryStrategy.Builder
   [junit4]   2> 1533791 INFO  (coreLoadExecutor-7709-thread-1) [    x:collection1] o.a.s.c.SolrCore [[collection1] ] Opening new SolrCore at [C:\Users\jenkins\workspace\Lucene-Solr-master-Windows\solr\core\src\test-files\solr\collection1], dataDir=[C:\Users\jenkins\workspace\Lucene-Solr-master-Windows\solr\build\solr-core\test\J0\temp\solr.handler.component.DistributedSpellCheckComponentTest_337C64C5D8853D2D-001\tempDir-001\shard0\cores\collection1\data\]
   [junit4]   2> 1533797 INFO  (coreLoadExecutor-7709-thread-1) [    x:collection1] o.a.s.u.RandomMergePolicy RandomMergePolicy wrapping class org.apache.lucene.index.AlcoholicMergePolicy: [AlcoholicMergePolicy: minMergeSize=0, mergeFactor=10, maxMergeSize=1038278986, maxMergeSizeForForcedMerge=9223372036854775807, calibrateSizeByDeletes=true, maxMergeDocs=2147483647, maxCFSSegmentSizeMB=8.796093022207999E12, noCFSRatio=0.1]
   [junit4]   2> 1533943 INFO  (coreLoadExecutor-7709-thread-1) [    x:collection1] o.a.s.u.UpdateHandler Using UpdateLog implementation: org.apache.solr.update.UpdateLog
   [junit4]   2> 1533943 INFO  (coreLoadExecutor-7709-thread-1) [    x:collection1] o.a.s.u.UpdateLog Initializing UpdateLog: dataDir= defaultSyncLevel=FLUSH numRecordsToKeep=100 maxNumLogsToKeep=10 numVersionBuckets=65536
   [junit4]   2> 1533945 INFO  (coreLoadExecutor-7709-thread-1) [    x:collection1] o.a.s.u.CommitTracker Hard AutoCommit: disabled
   [junit4]   2> 1533945 INFO  (coreLoadExecutor-7709-thread-1) [    x:collection1] o.a.s.u.CommitTracker Soft AutoCommit: disabled
   [junit4]   2> 1533946 INFO  (coreLoadExecutor-7709-thread-1) [    x:collection1] o.a.s.u.RandomMergePolicy RandomMergePolicy wrapping class org.apache.lucene.index.AlcoholicMergePolicy: [AlcoholicMergePolicy: minMergeSize=0, mergeFactor=10, maxMergeSize=1791984753, maxMergeSizeForForcedMerge=9223372036854775807, calibrateSizeByDeletes=true, maxMergeDocs=2147483647, maxCFSSegmentSizeMB=8.796093022207999E12, noCFSRatio=0.1]
   [junit4]   2> 1533947 INFO  (coreLoadExecutor-7709-thread-1) [    x:collection1] o.a.s.s.SolrIndexSearcher Opening [Searcher@514346d3[collection1] main]
   [junit4]   2> 1533947 INFO  (coreLoadExecutor-7709-thread-1) [    x:collection1] o.a.s.h.c.SpellCheckComponent Initializing spell checkers
   [junit4]   2> 1533965 INFO  (coreLoadExecutor-7709-thread-1) [    x:collection1] o.a.s.s.DirectSolrSpellChecker init: {name=direct,classname=DirectSolrSpellChecker,field=lowerfilt,minQueryLength=3}
   [junit4]   2> 1534026 INFO  (coreLoadExecutor-7709-thread-1) [    x:collection1] o.a.s.h.ReplicationHandler Commits will be reserved for 10000ms.
   [junit4]   2> 1534026 INFO  (searcherExecutor-7710-thread-1-processing-x:collection1) [    x:collection1] o.a.s.h.c.SpellCheckComponent Loading spell index for spellchecker: default
   [junit4]   2> 1534026 INFO  (coreLoadExecutor-7709-thread-1) [    x:collection1] o.a.s.u.UpdateLog Could not find max version in index or recent updates, using new clock 1599991397611470848
   [junit4]   2> 1534026 INFO  (searcherExecutor-7710-thread-1-processing-x:collection1) [    x:collection1] o.a.s.h.c.SpellCheckComponent Loading spell index for spellchecker: direct
   [junit4]   2> 1534026 INFO  (searcherExecutor-7710-thread-1-processing-x:collection1) [    x:collection1] o.a.s.h.c.SpellCheckComponent Loading spell index for spellchecker: wordbreak
   [junit4]   2> 1534026 INFO  (searcherExecutor-7710-thread-1-processing-x:collection1) [    x:collection1] o.a.s.h.c.SpellCheckComponent Loading spell index for spellchecker: multipleFields
   [junit4]   2> 1534027 INFO  (searcherExecutor-7710-thread-1-processing-x:collection1) [    x:collection1] o.a.s.h.c.SpellCheckComponent Loading spell index for spellchecker: jarowinkler
   [junit4]   2> 1534028 INFO  (searcherExecutor-7710-thread-1-processing-x:collection1) [    x:collection1] o.a.s.h.c.SpellCheckComponent Loading spell index for spellchecker: external
   [junit4]   2> 1534028 INFO  (searcherExecutor-7710-thread-1-processing-x:collection1) [    x:collection1] o.a.s.h.c.SpellCheckComponent Loading spell index for spellchecker: freq
   [junit4]   2> 1534028 INFO  (searcherExecutor-7710-thread-1-processing-x:collection1) [    x:collection1] o.a.s.h.c.SpellCheckComponent Loading spell index for spellchecker: fqcn
   [junit4]   2> 1534029 INFO  (searcherExecutor-7710-thread-1-processing-x:collection1) [    x:collection1] o.a.s.h.c.SpellCheckComponent Loading spell index for spellchecker: perDict
   [junit4]   2> 1534029 INFO  (searcherExecutor-7710-thread-1-processing-x:collection1) [    x:collection1] o.a.s.c.SolrCore [collection1] Registered new searcher Searcher@514346d3[collection1] main{ExitableDirectoryReader(UninvertingDirectoryReader())}
   [junit4]   2> 1534030 INFO  (TEST-DistributedSpellCheckComponentTest.test-seed#[337C64C5D8853D2D]) [    ] o.a.s.SolrTestCaseJ4 ###Starting test
   [junit4]   2> 1534040 INFO  (qtp1877911070-20446) [    x:collection1] o.a.s.u.p.LogUpdateProcessorFactory [collection1]  webapp= path=/update params={wt=javabin&version=2}{deleteByQuery=*:* (-1599991397616713728)} 0 8
   [junit4]   2> 1534050 INFO  (qtp420653749-20465) [    x:collection1] o.a.s.u.p.LogUpdateProcessorFactory [collection1]  webapp= path=/update params={wt=javabin&version=2}{deleteByQuery=*:* (-1599991397627199488)} 0 8
   [junit4]   2> 1534054 INFO  (qtp1877911070-20443) [    x:collection1] o.a.s.u.p.LogUpdateProcessorFactory [collection1]  webapp= path=/update params={wt=javabin&version=2}{add=[1 (1599991397637685248)]} 0 3
   [junit4]   2> 1534056 INFO  (qtp420653749-20461) [    x:collection1] o.a.s.u.p.LogUpdateProcessorFactory [collection1]  webapp= path=/update params={wt=javabin&version=2}{add=[1 (1599991397642928128)]} 0 0
   [junit4]   2> 1534057 INFO  (qtp1877911070-20445) [    x:collection1] o.a.s.u.p.LogUpdateProcessorFactory [collection1]  webapp= path=/update params={wt=javabin&version=2}{add=[2 (1599991397643976704)]} 0 0
   [junit4]   2> 1534058 INFO  (qtp420653749-20464) [    x:collection1] o.a.s.u.p.LogUpdateProcessorFactory [collection1]  webapp= path=/update params={wt=javabin&version=2}{add=[2 (1599991397643976704)]} 0 0
   [junit4]   2> 1534058 INFO  (qtp1877911070-20448) [    x:collection1] o.a.s.u.p.LogUpdateProcessorFactory [collection1]  webapp= path=/update params={wt=javabin&version=2}{add=[3 (1599991397645025280)]} 0 0
   [junit4]   2> 1534059 INFO  (qtp420653749-20466) [    x:collection1] o.a.s.u.p.LogUpdateProcessorFactory [collection1]  webapp= path=/update params={wt=javabin&version=2}{add=[3 (1599991397646073856)]} 0 0
   [junit4]   2> 1534060 INFO  (qtp1877911070-20445) [    x:collection1] o.a.s.u.p.LogUpdateProcessorFactory [collection1]  webapp= path=/update params={wt=javabin&version=2}{add=[4 (1599991397647122432)]} 0 0
   [junit4]   2> 1534060 INFO  (qtp420653749-20464) [    x:collection1] o.a.s.u.p.LogUpdateProcessorFactory [collection1]  webapp= path=/update params={wt=javabin&version=2}{add=[4 (1599991397647122432)]} 0 0
   [junit4]   2> 1534060 INFO  (qtp1877911070-20448) [    x:collection1] o.a.s.u.p.LogUpdateProcessorFactory [collection1]  webapp= path=/update params={wt=javabin&version=2}{add=[5 (1599991397647122433)]} 0 0
   [junit4]   2> 1534061 INFO  (qtp420653749-20466) [    x:collection1] o.a.s.u.p.LogUpdateProcessorFactory [collection1]  webapp= path=/update params={wt=javabin&version=2}{add=[5 (1599991397648171008)]} 0 0
   [junit4]   2> 1534061 INFO  (qtp1877911070-20445) [    x:collection1] o.a.s.u.p.LogUpdateProcessorFactory [collection1]  webapp= path=/update params={wt=javabin&version=2}{add=[6 (1599991397648171008)]} 0 0
   [junit4]   2> 1534061 INFO  (qtp420653749-20466) [    x:collection1] o.a.s.u.p.LogUpdateProcessorFactory [collection1]  webapp= path=/update params={wt=javabin&version=2}{add=[6 (1599991397648171009)]} 0 0
   [junit4]   2> 1534061 INFO  (qtp1877911070-20448) [    x:collection1] o.a.s.u.p.LogUpdateProcessorFactory [collection1]  webapp= path=/update params={wt=javabin&version=2}{add=[7 (1599991397648171009)]} 0 0
   [junit4]   2> 1534062 INFO  (qtp420653749-20464) [    x:collection1] o.a.s.u.p.LogUpdateProcessorFactory [collection1]  webapp= path=/update params={wt=javabin&version=2}{add=[7 (1599991397649219584)]} 0 0
   [junit4]   2> 1534062 INFO  (qtp1877911070-20445) [    x:collection1] o.a.s.u.p.LogUpdateProcessorFactory [collection1]  webapp= path=/update params={wt=javabin&version=2}{add=[8 (1599991397649219584)]} 0 0
   [junit4]   2> 1534062 INFO  (qtp420653749-20466) [    x:collection1] o.a.s.u.p.LogUpdateProcessorFactory [collection1]  webapp= path=/update params={wt=javabin&version=2}{add=[8 (1599991397649219585)]} 0 0
   [junit4]   2> 1534064 INFO  (qtp1877911070-20448) [    x:collection1] o.a.s.u.p.LogUpdateProcessorFactory [collection1]  webapp= path=/update params={wt=javabin&version=2}{add=[9 (1599991397649219585)]} 0 0
   [junit4]   2> 1534064 INFO  (qtp420653749-20464) [    x:collection1] o.a.s.u.p.LogUpdateProcessorFactory [collection1]  webapp= path=/update params={wt=javabin&version=2}{add=[9 (1599991397651316736)]} 0 0
   [junit4]   2> 1534064 INFO  (qtp1877911070-20445) [    x:collection1] o.a.s.u.p.LogUpdateProcessorFactory [collection1]  webapp= path=/update params={wt=javabin&version=2}{add=[10 (1599991397651316736)]} 0 0
   [junit4]   2> 1534064 INFO  (qtp420653749-20466) [    x:collection1] o.a.s.u.p.LogUpdateProcessorFactory [collection1]  webapp= path=/update params={wt=javabin&version=2}{add=[10 (1599991397651316737)]} 0 0
   [junit4]   2> 1534064 INFO  (qtp1877911070-20448) [    x:collection1] o.a.s.u.p.LogUpdateProcessorFactory [collection1]  webapp= path=/update params={wt=javabin&version=2}{add=[12 (1599991397651316737)]} 0 0
   [junit4]   2> 1534064 INFO  (qtp420653749-20464) [    x:collection1] o.a.s.u.p.LogUpdateProcessorFactory [collection1]  webapp= path=/update params={wt=javabin&version=2}{add=[12 (1599991397651316738)]} 0 0
   [junit4]   2> 1534066 INFO  (qtp1877911070-20445) [    x:collection1] o.a.s.u.p.LogUpdateProcessorFactory [collection1]  webapp= path=/update params={wt=javabin&version=2}{add=[13 (1599991397653413888)]} 0 0
   [junit4]   2> 1534066 INFO  (qtp420653749-20466) [    x:collection1] o.a.s.u.p.LogUpdateProcessorFactory [collection1]  webapp= path=/update params={wt=javabin&version=2}{add=[13 (1599991397653413888)]} 0 0
   [junit4]   2> 1534066 INFO  (qtp1877911070-20448) [    x:collection1] o.a.s.u.p.LogUpdateProcessorFactory [collection1]  webapp= path=/update params={wt=javabin&version=2}{add=[14 (1599991397653413889)]} 0 0
   [junit4]   2> 1534066 INFO  (qtp420653749-20464) [    x:collection1] o.a.s.u.p.LogUpdateProcessorFactory [collection1]  webapp= path=/update params={wt=javabin&version=2}{add=[14 (1599991397653413889)]} 0 0
   [junit4]   2> 1534067 INFO  (qtp1877911070-20445) [    x:collection1] o.a.s.u.p.LogUpdateProcessorFactory [collection1]  webapp= path=/update params={wt=javabin&version=2}{add=[15 (1599991397654462464)]} 0 0
   [junit4]   2> 1534067 INFO  (qtp420653749-20466) [    x:collection1] o.a.s.u.p.LogUpdateProcessorFactory [collection1]  webapp= path=/update params={wt=javabin&version=2}{add=[15 (1599991397654462464)]} 0 0
   [junit4]   2> 1534067 INFO  (qtp1877911070-20448) [    x:collection1] o.a.s.u.p.LogUpdateProcessorFactory [collection1]  webapp= path=/update params={wt=javabin&version=2}{add=[16 (1599991397654462465)]} 0 0
   [junit4]   2> 1534067 INFO  (qtp420653749-20464) [    x:collection1] o.a.s.u.p.LogUpdateProcessorFactory [collection1]  webapp= path=/update params={wt=javabin&version=2}{add=[16 (1599991397654462465)]} 0 0
   [junit4]   2> 1534068 INFO  (qtp1877911070-20445) [    x:collection1] o.a.s.u.p.LogUpdateProcessorFactory [collection1]  webapp= path=/update params={wt=javabin&version=2}{add=[17 (1599991397655511040)]} 0 0
   [junit4]   2> 1534068 INFO  (qtp420653749-20466) [    x:collection1] o.a.s.u.p.LogUpdateProcessorFactory [collection1]  webapp= path=/update params={wt=javabin&version=2}{add=[17 (1599991397655511040)]} 0 0
   [junit4]   2> 1534068 INFO  (qtp1877911070-20448) [    x:collection1] o.a.s.u.p.LogUpdateProcessorFactory [collection1]  webapp= path=/update params={wt=javabin&version=2}{add=[18 (1599991397655511041)]} 0 0
   [junit4]   2> 1534069 INFO  (qtp420653749-20464) [    x:collection1] o.a.s.u.p.LogUpdateProcessorFactory [collection1]  webapp= path=/update params={wt=javabin&version=2}{add=[18 (1599991397656559616)]} 0 0
   [junit4]   2> 1534069 INFO  (qtp1877911070-20445) [    x:collection1] o.a.s.u.p.LogUpdateProcessorFactory [collection1]  webapp= path=/update params={wt=javabin&version=2}{add=[19 (1599991397656559616)]} 0 0
   [junit4]   2> 1534069 INFO  (qtp420653749-20466) [    x:collection1] o.a.s.u.p.LogUpdateProcessorFactory [collection1]  webapp= path=/update params={wt=javabin&version=2}{add=[19 (1599991397656559617)]} 0 0
   [junit4]   2> 1534069 INFO  (qtp1877911070-20448) [    x:collection1] o.a.s.u.p.LogUpdateProcessorFactory [collection1]  webapp= path=/update params={wt=javabin&version=2}{add=[20 (1599991397656559617)]} 0 0
   [junit4]   2> 1534069 INFO  (qtp420653749-20464) [    x:collection1] o.a.s.u.p.LogUpdateProcessorFactory [collection1]  webapp= path=/update params={wt=javabin&version=2}{add=[20 (1599991397656559618)]} 0 0
   [junit4]   2> 1534070 INFO  (qtp1877911070-20445) [    x:collection1] o.a.s.u.p.LogUpdateProcessorFactory [collection1]  webapp= path=/update params={wt=javabin&version=2}{add=[21 (1599991397657608192)]} 0 0
   [junit4]   2> 1534070 INFO  (qtp420653749-20466) [    x:collection1] o.a.s.u.p.LogUpdateProcessorFactory [collection1]  webapp= path=/update params={wt=javabin&version=2}{add=[21 (1599991397657608192)]} 0 0
   [junit4]   2> 1534070 INFO  (qtp1877911070-20448) [    x:collection1] o.a.s.u.p.LogUpdateProcessorFactory [collection1]  webapp= path=/update params={wt=javabin&version=2}{add=[22 (1599991397657608193)]} 0 0
   [junit4]   2> 1534071 INFO  (qtp420653749-20464) [    x:collection1] o.a.s.u.p.LogUpdateProcessorFactory [collection1]  webapp= path=/update params={wt=javabin&version=2}{add=[22 (1599991397658656768)]} 0 0
   [junit4]   2> 1534071 INFO  (qtp1877911070-20445) [    x:collection1] o.a.s.u.p.LogUpdateProcessorFactory [collection1]  webapp= path=/update params={wt=javabin&version=2}{add=[23 (1599991397658656768)]} 0 0
   [junit4]   2> 1534071 INFO  (qtp420653749-20466) [    x:collection1] o.a.s.u.p.LogUpdateProcessorFactory [collection1]  webapp= path=/update params={wt=javabin&version=2}{add=[23 (1599991397658656769)]} 0 0
   [junit4]   2> 1534072 INFO  (qtp1877911070-20448) [    x:collection1] o.a.s.u.p.LogUpdateProcessorFactory [collection1]  webapp= path=/update params={wt=javabin&version=2}{add=[24 (1599991397659705344)]} 0 0
   [junit4]   2> 1534072 INFO  (qtp420653749-20464) [    x:collection1] o.a.s.u.p.LogUpdateProcessorFactory [collection1]  webapp= path=/update params={wt=javabin&version=2}{add=[24 (1599991397659705344)]} 0 0
   [junit4]   2> 1534072 INFO  (qtp1877911070-20445) [    x:collection1] o.a.s.u.p.LogUpdateProcessorFactory [collection1]  webapp= path=/update params={wt=javabin&version=2}{add=[25 (1599991397659705345)]} 0 0
   [junit4]   2> 1534073 INFO  (qtp420653749-20466) [    x:collection1] o.a.s.u.p.LogUpdateProcessorFactory [collection1]  webapp= path=/update params={wt=javabin&version=2}{add=[25 (1599991397660753920)]} 0 0
   [junit4]   2> 1534073 INFO  (qtp1877911070-20448) [    x:collection1] o.a.s.u.p.LogUpdateProcessorFactory [collection1]  webapp= path=/update params={wt=javabin&version=2}{add=[26 (1599991397660753920)]} 0 0
   [junit4]   2> 1534073 INFO  (qtp420653749-20464) [    x:collection1] o.a.s.u.p.LogUpdateProcessorFactory [collection1]  webapp= path=/update params={wt=javabin&version=2}{add=[26 (1599991397660753921)]} 0 0
   [junit4]   2> 1534074 INFO  (qtp1877911070-20445) [    x:collection1] o.a.s.u.DirectUpdateHandler2 start commit{_version_=1599991397661802496,optimize=false,openSearcher=true,waitSearcher=true,expungeDeletes=false,softCommit=false,prepareCommit=false}
   [junit4]   2> 1534074 INFO  (qtp1877911070-20445) [    x:collection1] o.a.s.u.SolrIndexWriter Calling setCommitData with IW:org.apache.solr.update.SolrIndexWriter@48cf1634 commitCommandVersion:1599991397661802496
   [junit4]   2> 1534192 INFO  (qtp1877911070-20445) [    x:collection1] o.a.s.s.SolrIndexSearcher Opening [Searcher@16fde623[collection1] main]
   [junit4]   2> 1534193 INFO  (qtp1877911070-20445) [    x:collection1] o.a.s.u.DirectUpdateHandler2 end_commit_flush
   [junit4]   2> 1534193 INFO  (searcherExecutor-7699-thread-1-processing-x:collection1) [    x:collection1] o.a.s.c.SolrCore [collection1] Registered new searcher Searcher@16fde623[collection1] main{ExitableDirectoryReader(UninvertingDirectoryReader(Uninverting(_0(8.0.0):C25)))}
   [junit4]   2> 1534194 INFO  (qtp1877911070-20445) [    x:collection1] o.a.s.u.p.LogUpdateProcessorFactory [collection1]  webapp= path=/update params={waitSearcher=true&commit=true&softCommit=false&wt=javabin&version=2}{commit=} 0 119
   [junit4]   2> 1534194 INFO  (qtp420653749-20466) [    x:collection1] o.a.s.u.DirectUpdateHandler2 start commit{_version_=1599991397787631616,optimize=false,openSearcher=true,waitSearcher=true,expungeDeletes=false,softCommit=false,prepareCommit=false}
   [junit4]   2> 1534194 INFO  (qtp420653749-20466) [    x:collection1] o.a.s.u.SolrIndexWriter Calling setCommitData with IW:org.apache.solr.update.SolrIndexWriter@22c4b4f4 commitCommandVersion:1599991397787631616
   [junit4]   2> 1534320 INFO  (qtp420653749-20466) [    x:collection1] o.a.s.s.SolrIndexSearcher Opening [Searcher@ee1b982[collection1] main]
   [junit4]   2> 1534321 INFO  (qtp420653749-20466) [    x:collection1] o.a.s.u.DirectUpdateHandler2 end_commit_flush
   [junit4]   2> 1534322 INFO  (searcherExecutor-7710-thread-1-processing-x:collection1) [    x:collection1] o.a.s.c.SolrCore [collection1] Registered new searcher Searcher@ee1b982[collection1] main{ExitableDirectoryReader(UninvertingDirectoryReader(Uninverting(_0(8.0.0):C25)))}
   [junit4]   2> 1534322 INFO  (qtp420653749-20466) [    x:collection1] o.a.s.u.p.LogUpdateProcessorFactory [collection1]  webapp= path=/update params={waitSearcher=true&commit=true&softCommit=false&wt=javabin&version=2}{commit=} 0 128
   [junit4]   2> 1534392 INFO  (qtp1877911070-20448) [    x:collection1] o.a.s.c.S.Request [collection1]  webapp= path=/spellCheckCompRH params={q=*:*&qt=/spellCheckCompRH&spellcheck=true&fl=id,lowerfilt&wt=javabin&version=2&spellcheck.build=true&shards.qt=/spellCheckCompRH} hits=25 status=0 QTime=69
   [junit4]   2> 1534558 INFO  (qtp420653749-20466) [    x:collection1] o.a.s.c.S.Request [collection1]  webapp= path=/spellCheckCompRH params={df=text&distrib=false&qt=/spellCheckCompRH&fl=id&fl=score&shards.purpose=4&start=0&fsv=true&shard.url=http://127.0.0.1:50586//collection1&rows=10&version=2&spellcheck.build=true&shards.qt=/spellCheckCompRH&spellcheck.extendedResults=false&q=*:*&spellcheck=true&NOW=1525870702740&spellcheck.onlyMorePopular=false&isShard=true&spellcheck.count=5&wt=javabin} hits=25 status=0 QTime=71
   [junit4]   2> 1534559 INFO  (qtp420653749-20467) [    x:collection1] o.a.s.c.S.Request [collection1]  webapp= path=/spellCheckCompRH params={df=text&distrib=false&qt=/spellCheckCompRH&fl=id,lowerfilt&shards.purpose=64&shard.url=http://127.0.0.1:50586//collection1&version=2&spellcheck.build=true&shards.qt=/spellCheckCompRH&spellcheck.extendedResults=false&q=*:*&spellcheck=false&NOW=1525870702740&spellcheck.onlyMorePopular=false&ids=1,2,3,4,5,6,7,8,9,10&isShard=true&spellcheck.count=1&wt=javabin} status=0 QTime=0
   [junit4]   2> 1534560 INFO  (qtp420653749-20464) [    x:collection1] o.a.s.h.c.SpellCheckComponent http://127.0.0.1:50586//collection1 null
   [junit4]   2> 1534560 INFO  (qtp420653749-20464) [    x:collection1] o.a.s.h.c.SpellCheckComponent http://127.0.0.1:50586//collection1 null
   [junit4]   2> 1534560 INFO  (qtp420653749-20464) [    x:collection1] o.a.s.c.S.Request [collection1]  webapp= path=/spellCheckCompRH params={q=*:*&shards=http://127.0.0.1:50586//collection1&qt=/spellCheckCompRH&spellcheck=true&fl=id,lowerfilt&wt=javabin&version=2&spellcheck.build=true&shards.qt=/spellCheckCompRH} hits=25 status=0 QTime=166
   [junit4]   2> 1534580 INFO  (qtp1877911070-20445) [    x:collection1] o.a.s.c.S.Request [collection1]  webapp= path=/spellCheckCompRH_Direct params={q=*:*&spellcheck.q=toyata&distrib=false&qt=/spellCheckCompRH_Direct&spellcheck=true&fl=id,lowerfilt&wt=javabin&version=2&group.field=id&shards.qt=/spellCheckCompRH_Direct&group=true} hits=25 status=0 QTime=15
   [junit4]   2> 1534609 INFO  (qtp420653749-20464) [    x:collection1] o.a.s.c.S.Request [collection1]  webapp= path=/spellCheckCompRH_Direct params={df=text&group.distributed.first=true&distrib=false&qt=/spellCheckCompRH_Direct&spellcheck.dictionary=direct&fl=id,score&shards.purpose=2048&start=0&shard.url=[ff01::083]:33332/|http://127.0.0.1:50586//collection1&rows=10&version=2&shards.qt=/spellCheckCompRH_Direct&spellcheck.extendedResults=false&q=*:*&spellcheck.q=toyata&spellcheck=true&NOW=1525870702945&spellcheck.onlyMorePopular=false&isShard=true&spellcheck.count=5&wt=javabin&group.field=id&group=true} status=0 QTime=4
   [junit4]   2> 1534620 INFO  (qtp420653749-20464) [    x:collection1] o.a.s.c.S.Request [collection1]  webapp= path=/spellCheckCompRH_Direct params={df=text&distrib=false&qt=/spellCheckCompRH_Direct&spellcheck.dictionary=direct&fl=id,score&shards.purpose=4&start=0&shard.url=[ff01::083]:33332/|http://127.0.0.1:50586//collection1&rows=10&group.topgroups.id=1&group.topgroups.id=2&group.topgroups.id=3&group.topgroups.id=4&group.topgroups.id=5&group.topgroups.id=6&group.topgroups.id=7&group.topgroups.id=8&group.topgroups.id=9&group.topgroups.id=10&version=2&group.distributed.second=true&shards.qt=/spellCheckCompRH_Direct&spellcheck.extendedResults=false&q=*:*&spellcheck.q=toyata&spellcheck=false&NOW=1525870702945&spellcheck.onlyMorePopular=false&isShard=true&spellcheck.count=1&wt=javabin&group.field=id&group=true} status=0 QTime=0
   [junit4]   2> 1534622 INFO  (qtp420653749-20464) [    x:collection1] o.a.s.c.S.Request [collection1]  webapp= path=/spellCheckCompRH_Direct params={df=text&distrib=false&qt=/spellCheckCompRH_Direct&spellcheck.dictionary=direct&fl=id,lowerfilt,id&shards.purpose=64&shard.url=[ff01::083]:33332/|http://127.0.0.1:50586//collection1&version=2&shards.qt=/spellCheckCompRH_Direct&spellcheck.extendedResults=false&q=*:*&spellcheck.q=toyata&spellcheck=false&NOW=1525870702945&spellcheck.onlyMorePopular=false&ids=1,2,3,4,5,6,7,8,9,10&isShard=true&spellcheck.count=1&wt=javabin&group.field=id} status=0 QTime=0
   [junit4]   2> 1534622 INFO  (qtp420653749-20466) [    x:collection1] o.a.s.h.c.SpellCheckComponent [ff01::083]:33332/|http://127.0.0.1:50586//collection1 {suggestions={toyata={numFound=1,startOffset=0,endOffset=6,suggestion=[toyota]}},originalTerms=[toyata]}
   [junit4]   2> 1534622 INFO  (qtp420653749-20466) [    x:collection1] o.a.s.h.c.SpellCheckComponent [ff01::083]:33332/|http://127.0.0.1:50586//collection1 null
   [junit4]   2> 1534622 INFO  (qtp420653749-20466) [    x:collection1] o.a.s.h.c.SpellCheckComponent [ff01::083]:33332/|http://127.0.0.1:50586//collection1 null
   [junit4]   2> 1534622 INFO  (qtp420653749-20466) [    x:collection1] o.a.s.c.S.Request [collection1]  webapp= path=/spellCheckCompRH_Direct params={q=*:*&shards=[ff01::083]:33332/|http://127.0.0.1:50586//collection1&spellcheck.q=toyata&qt=/spellCheckCompRH_Direct&spellcheck=true&fl=id,lowerfilt&wt=javabin&version=2&group.field=id&shards.qt=/spellCheckCompRH_Direct&group=true} status=0 QTime=24
   [junit4]   2> 1534627 INFO  (qtp1877911070-20448) [    x:collection1] o.a.s.c.S.Request [collection1]  webapp= path=/spellCheckCompRH_Direct params={q=*:*&spellcheck.q=toyata&distrib=false&qt=/spellCheckCompRH_Direct&spellcheck=true&fl=id,lowerfilt&wt=javabin&version=2&shards.qt=/spellCheckCompRH_Direct&spellcheck.extendedResults=true} hits=25 status=0 QTime=3
   [junit4]   2> 1534636 INFO  (qtp420653749-20467) [    x:collection1] o.a.s.c.S.Request [collection1]  webapp= path=/spellCheckCompRH_Direct params={df=text&distrib=false&qt=/spellCheckCompRH_Direct&spellcheck.dictionary=direct&fl=id&fl=score&shards.purpose=4&start=0&fsv=true&shard.url=http://127.0.0.1:50586//collection1&rows=10&version=2&shards.qt=/spellCheckCompRH_Direct&spellcheck.extendedResults=true&q=*:*&spellcheck.q=toyata&spellcheck=true&NOW=1525870702975&spellcheck.onlyMorePopular=false&isShard=true&spellcheck.count=5&wt=javabin} hits=25 status=0 QTime=7
   [junit4]   2> 1534638 INFO  (qtp420653749-20467) [    x:collection1] o.a.s.c.S.Request [collection1]  webapp= path=/spellCheckCompRH_Direct params={df=text&distrib=false&qt=/spellCheckCompRH_Direct&spellcheck.dictionary=direct&fl=id,lowerfilt&shards.purpose=64&shard.url=http://127.0.0.1:50586//collection1&version=2&shards.qt=/spellCheckCompRH_Direct&spellcheck.extendedResults=true&q=*:*&spellcheck.q=toyata&spellcheck=false&NOW=1525870702975&spellcheck.onlyMorePopular=false&ids=1,2,3,4,5,6,7,8,9,10&isShard=true&spellcheck.count=1&wt=javabin} status=0 QTime=0
   [junit4]   2> 1534638 INFO  (qtp420653749-20464) [    x:collection1] o.a.s.h.c.SpellCheckComponent http://127.0.0.1:50586//collection1 {suggestions={toyata={numFound=1,startOffset=0,endOffset=6,origFreq=0,suggestion=[{word=toyota,freq=1}]}},correctlySpelled=true,originalTerms=[toyata]}
   [junit4]   2> 1534638 INFO  (qtp420653749-20464) [    x:collection1] o.a.s.h.c.SpellCheckComponent http://127.0.0.1:50586//collection1 null
   [junit4]   2> 1534638 INFO  (qtp420653749-20464) [    x:collection1] o.a.s.c.S.Request [collection1]  webapp= path=/spellCheckCompRH_Direct params={q=*:*&shards=http://127.0.0.1:50586//collection1&spellcheck.q=toyata&qt=/spellCheckCompRH_Direct&spellcheck=true&fl=id,lowerfilt&wt=javabin&version=2&shards.qt=/spellCheckCompRH_Direct&spellcheck.extendedResults=true} hits=25 status=0 QTime=10
   [junit4]   2> 1534641 INFO  (qtp1877911070-20448) [    x:collection1] o.a.s.c.S.Request [collection1]  webapp= path=/spellCheckCompRH_Direct params={distrib=false&qt=/spellCheckCompRH_Direct&fl=id,lowerfilt&version=2&shards.qt=/spellCheckCompRH_Direct&spellcheck.extendedResults=true&q=*:*&spellcheck.q=bluo&spellcheck=true&spellcheck.count=4&wt=javabin&group.field=id&group=true} hits=25 status=0 QTime=1
   [junit4]   2> 1534644 INFO  (qtp420653749-20464) [    x:collection1] o.a.s.c.S.Request [collection1]  webapp= path=/spellCheckCompRH_Direct params={df=text&group.distributed.first=true&distrib=false&qt=/spellCheckCompRH_Direct&spellcheck.dictionary=direct&fl=id,score&shards.purpose=2048&start=0&shard.url=http://127.0.0.1:50586//collection1&rows=10&version=2&shards.qt=/spellCheckCompRH_Direct&spellcheck.extendedResults=true&q=*:*&spellcheck.q=bluo&spellcheck=true&NOW=1525870702989&spellcheck.onlyMorePopular=false&isShard=true&spellcheck.count=5&wt=javabin&group.field=id&group=true} status=0 QTime=2
   [junit4]   2> 1534646 INFO  (qtp420653749-20464) [    x:collection1] o.a.s.c.S.Request [collection1]  webapp= path=/spellCheckCompRH_Direct params={df=text&distrib=false&qt=/spellCheckCompRH_Direct&spellcheck.dictionary=direct&fl=id,score&shards.purpose=4&start=0&shard.url=http://127.0.0.1:50586//collection1&rows=10&group.topgroups.id=1&group.topgroups.id=2&group.topgroups.id=3&group.topgroups.id=4&group.topgroups.id=5&group.topgroups.id=6&group.topgroups.id=7&group.topgroups.id=8&group.topgroups.id=9&group.topgroups.id=10&version=2&group.distributed.second=true&shards.qt=/spellCheckCompRH_Direct&spellcheck.extendedResults=true&q=*:*&spellcheck.q=bluo&spellcheck=false&NOW=1525870702989&spellcheck.onlyMorePopular=false&isShard=true&spellcheck.count=4&wt=javabin&group.field=id&group=true} status=0 QTime=0
   [junit4]   2> 1534646 INFO  (qtp420653749-20464) [    x:collection1] o.a.s.c.S.Request [collection1]  webapp= path=/spellCheckCompRH_Direct params={df=text&distrib=false&qt=/spellCheckCompRH_Direct&spellcheck.dictionary=direct&fl=id,lowerfilt,id&shards.purpose=64&shard.url=http://127.0.0.1:50586//collection1&version=2&shards.qt=/spellCheckCompRH_Direct&spellcheck.extendedResults=true&q=*:*&spellcheck.q=bluo&spellcheck=false&NOW=1525870702989&spellcheck.onlyMorePopular=false&ids=1,2,3,4,5,6,7,8,9,10&isShard=true&spellcheck.count=4&wt=javabin&group.field=id} status=0 QTime=0
   [junit4]   2> 1534646 INFO  (qtp420653749-20467) [    x:collection1] o.a.s.h.c.SpellCheckComponent http://127.0.0.1:50586//collection1 {suggestions={bluo={numFound=1,startOffset=0,endOffset=4,origFreq=0,suggestion=[{word=blue,freq=1}]}},correctlySpelled=false,originalTerms=[bluo]}
   [junit4]   2> 1534646 INFO  (qtp420653749-20467) [    x:collection1] o.a.s.h.c.SpellCheckComponent http://127.0.0.1:50586//collection1 null
   [junit4]   2> 1534646 INFO  (qtp420653749-20467) [    x:collection1] o.a.s.h.c.SpellCheckComponent http://127.0.0.1:50586//collection1 null
   [junit4]   2> 1534646 INFO  (qtp420653749-20467) [    x:collection1] o.a.s.c.S.Request [collection1]  webapp= path=/spellCheckCompRH_Direct params={qt=/spellCheckCompRH_Direct&fl=id,lowerfilt&version=2&shards.qt=/spellCheckCompRH_Direct&spellcheck.extendedResults=true&q=*:*&shards=http://127.0.0.1:50586//collection1&spellcheck.q=bluo&spellcheck=true&spellcheck.count=4&wt=javabin&group.field=id&group=true} status=0 QTime=6
   [junit4]   2> 1534653 INFO  (qtp1877911070-20448) [    x:collection1] o.a.s.c.S.Request [collection1]  webapp= path=/spellCheckCompRH_Direct params={q=The+quick+reb+fox+jumped+over+the+lazy+brown+dogs&distrib=false&qt=/spellCheckCompRH_Direct&spellcheck=true&fl=id,lowerfilt&spellcheck.count=4&wt=javabin&version=2&shards.qt=/spellCheckCompRH_Direct&spellcheck.extendedResults=true&spellcheck.collate=true} hits=0 status=0 QTime=4
   [junit4]   2> 1534660 INFO  (qtp420653749-20467) [    x:collection1] o.a.s.c.S.Request [collection1]  webapp= path=/spellCheckCompRH_Direct params={df=text&distrib=false&qt=/spellCheckCompRH_Direct&spellcheck.dictionary=direct&fl=id&fl=score&shards.purpose=4&start=0&fsv=true&shard.url=http://127.0.0.1:50586//collection1|[ff01::083]:33332/&rows=10&version=2&shards.qt=/spellCheckCompRH_Direct&spellcheck.extendedResults=true&q=The+quick+reb+fox+jumped+over+the+lazy+brown+dogs&spellcheck=true&NOW=1525870703004&spellcheck.onlyMorePopular=false&isShard=true&spellcheck.count=5&wt=javabin&spellcheck.collate=true} hits=0 status=0 QTime=2
   [junit4]   2> 1534661 INFO  (qtp420653749-20464) [    x:collection1] o.a.s.h.c.SpellCheckComponent http://127.0.0.1:50586//collection1|[ff01::083]:33332/ {suggestions={reb={numFound=1,startOffset=10,endOffset=13,origFreq=0,suggestion=[{word=red,freq=14}]},dogs={numFound=1,startOffset=45,endOffset=49,origFreq=0,suggestion=[{word=dogs.,freq=14}]}},correctlySpelled=false,collations={collation=The quick red fox jumped over the lazy brown dogs.},originalTerms=[the, quick, reb, fox, jumped, over, the, lazy, brown, dogs]}
   [junit4]   2> 1534661 INFO  (qtp420653749-20464) [    x:collection1] o.a.s.c.S.Request [collection1]  webapp= p

[...truncated too long message...]

\workspace\Lucene-Solr-master-Windows\solr\build\solr-solrj\test\J1\temp\solr.common.util.TestTimeSource_18409C1DD5ED7254-001\init-core-data-001
   [junit4]   2> 9577 INFO  (SUITE-TestTimeSource-seed#[18409C1DD5ED7254]-worker) [    ] o.a.s.SolrTestCaseJ4 Using PointFields (NUMERIC_POINTS_SYSPROP=true) w/NUMERIC_DOCVALUES_SYSPROP=false
   [junit4]   2> 9706 INFO  (SUITE-TestTimeSource-seed#[18409C1DD5ED7254]-worker) [    ] o.e.j.u.log Logging initialized @9735ms to org.eclipse.jetty.util.log.Slf4jLog
   [junit4]   2> 9718 INFO  (SUITE-TestTimeSource-seed#[18409C1DD5ED7254]-worker) [    ] o.a.s.SolrTestCaseJ4 Randomized ssl (false) and clientAuth (true) via: @org.apache.solr.util.RandomizeSSL(reason=, value=NaN, ssl=NaN, clientAuth=NaN)
   [junit4]   2> 9753 INFO  (TEST-TestTimeSource.testEpochTime-seed#[18409C1DD5ED7254]) [    ] o.a.s.SolrTestCaseJ4 ###Starting testEpochTime
   [junit4]   2> 19781 INFO  (TEST-TestTimeSource.testEpochTime-seed#[18409C1DD5ED7254]) [    ] o.a.s.SolrTestCaseJ4 ###Ending testEpochTime
   [junit4]   2> NOTE: reproduce with: ant test  -Dtestcase=TestTimeSource -Dtests.method=testEpochTime -Dtests.seed=18409C1DD5ED7254 -Dtests.slow=true -Dtests.badapples=true -Dtests.locale=ja-JP -Dtests.timezone=Europe/San_Marino -Dtests.asserts=true -Dtests.file.encoding=ISO-8859-1
   [junit4] FAILURE 10.1s J1 | TestTimeSource.testEpochTime <<<
   [junit4]    > Throwable #1: java.lang.AssertionError: SimTimeSource:50.0 time diff=35720000
   [junit4]    > 	at __randomizedtesting.SeedInfo.seed([18409C1DD5ED7254:202CEF38413DD012]:0)
   [junit4]    > 	at org.apache.solr.common.util.TestTimeSource.doTestEpochTime(TestTimeSource.java:48)
   [junit4]    > 	at org.apache.solr.common.util.TestTimeSource.testEpochTime(TestTimeSource.java:32)
   [junit4]    > 	at java.lang.Thread.run(Thread.java:748)
   [junit4]   2> NOTE: leaving temporary files on disk at: C:\Users\jenkins\workspace\Lucene-Solr-master-Windows\solr\build\solr-solrj\test\J1\temp\solr.common.util.TestTimeSource_18409C1DD5ED7254-001
   [junit4]   2> NOTE: test params are: codec=Asserting(Lucene70): {}, docValues:{}, maxPointsInLeafNode=1888, maxMBSortInHeap=6.818184377930524, sim=Asserting(org.apache.lucene.search.similarities.AssertingSimilarity@5a5118f3), locale=ja-JP, timezone=Europe/San_Marino
   [junit4]   2> NOTE: Windows 10 10.0 amd64/Oracle Corporation 1.8.0_144 (64-bit)/cpus=3,threads=1,free=81184056,total=94896128
   [junit4]   2> NOTE: All tests run in this JVM: [TestTimeSource]
   [junit4] Completed [1/5 (1!)] on J1 in 18.71s, 1 test, 1 failure <<< FAILURES!
   [junit4] 
   [junit4] Suite: org.apache.solr.common.util.TestTimeSource
   [junit4]   2> SLF4J: Class path contains multiple SLF4J bindings.
   [junit4]   2> SLF4J: Found binding in [jar:file:/C:/Users/jenkins/workspace/Lucene-Solr-master-Windows/solr/solrj/test-lib/log4j-slf4j-impl-2.11.0.jar!/org/slf4j/impl/StaticLoggerBinder.class]
   [junit4]   2> SLF4J: Found binding in [jar:file:/C:/Users/jenkins/workspace/Lucene-Solr-master-Windows/solr/core/lib/log4j-slf4j-impl-2.11.0.jar!/org/slf4j/impl/StaticLoggerBinder.class]
   [junit4]   2> SLF4J: See http://www.slf4j.org/codes.html#multiple_bindings for an explanation.
   [junit4]   2> SLF4J: Actual binding is of type [org.apache.logging.slf4j.Log4jLoggerFactory]
   [junit4]   2> 9238 INFO  (SUITE-TestTimeSource-seed#[18409C1DD5ED7254]-worker) [    ] o.a.s.SolrTestCaseJ4 SecureRandom sanity checks: test.solr.allowed.securerandom=null & java.security.egd=file:/dev/./urandom
   [junit4]   2> Creating dataDir: C:\Users\jenkins\workspace\Lucene-Solr-master-Windows\solr\build\solr-solrj\test\J0\temp\solr.common.util.TestTimeSource_18409C1DD5ED7254-001\init-core-data-001
   [junit4]   2> 9519 INFO  (SUITE-TestTimeSource-seed#[18409C1DD5ED7254]-worker) [    ] o.a.s.SolrTestCaseJ4 Using PointFields (NUMERIC_POINTS_SYSPROP=true) w/NUMERIC_DOCVALUES_SYSPROP=false
   [junit4]   2> 9638 INFO  (SUITE-TestTimeSource-seed#[18409C1DD5ED7254]-worker) [    ] o.e.j.u.log Logging initialized @9667ms to org.eclipse.jetty.util.log.Slf4jLog
   [junit4]   2> 9653 INFO  (SUITE-TestTimeSource-seed#[18409C1DD5ED7254]-worker) [    ] o.a.s.SolrTestCaseJ4 Randomized ssl (false) and clientAuth (true) via: @org.apache.solr.util.RandomizeSSL(reason=, value=NaN, ssl=NaN, clientAuth=NaN)
   [junit4]   2> 9694 INFO  (TEST-TestTimeSource.testEpochTime-seed#[18409C1DD5ED7254]) [    ] o.a.s.SolrTestCaseJ4 ###Starting testEpochTime
   [junit4]   2> 19719 INFO  (TEST-TestTimeSource.testEpochTime-seed#[18409C1DD5ED7254]) [    ] o.a.s.SolrTestCaseJ4 ###Ending testEpochTime
   [junit4]   2> NOTE: reproduce with: ant test  -Dtestcase=TestTimeSource -Dtests.method=testEpochTime -Dtests.seed=18409C1DD5ED7254 -Dtests.slow=true -Dtests.badapples=true -Dtests.locale=ja-JP -Dtests.timezone=Europe/San_Marino -Dtests.asserts=true -Dtests.file.encoding=ISO-8859-1
   [junit4] FAILURE 10.1s J0 | TestTimeSource.testEpochTime <<<
   [junit4]    > Throwable #1: java.lang.AssertionError: SimTimeSource:50.0 time diff=40615000
   [junit4]    > 	at __randomizedtesting.SeedInfo.seed([18409C1DD5ED7254:202CEF38413DD012]:0)
   [junit4]    > 	at org.apache.solr.common.util.TestTimeSource.doTestEpochTime(TestTimeSource.java:48)
   [junit4]    > 	at org.apache.solr.common.util.TestTimeSource.testEpochTime(TestTimeSource.java:32)
   [junit4]    > 	at java.lang.Thread.run(Thread.java:748)
   [junit4]   2> NOTE: leaving temporary files on disk at: C:\Users\jenkins\workspace\Lucene-Solr-master-Windows\solr\build\solr-solrj\test\J0\temp\solr.common.util.TestTimeSource_18409C1DD5ED7254-001
   [junit4]   2> NOTE: test params are: codec=Asserting(Lucene70): {}, docValues:{}, maxPointsInLeafNode=1888, maxMBSortInHeap=6.818184377930524, sim=Asserting(org.apache.lucene.search.similarities.AssertingSimilarity@56b01046), locale=ja-JP, timezone=Europe/San_Marino
   [junit4]   2> NOTE: Windows 10 10.0 amd64/Oracle Corporation 1.8.0_144 (64-bit)/cpus=3,threads=1,free=80634176,total=94371840
   [junit4]   2> NOTE: All tests run in this JVM: [TestTimeSource]
   [junit4] Completed [2/5 (2!)] on J0 in 18.65s, 1 test, 1 failure <<< FAILURES!
   [junit4] 
   [junit4] Duplicate suite name used with XML reports: org.apache.solr.common.util.TestTimeSource. This may confuse tools that process XML reports. Set 'ignoreDuplicateSuites' to true to skip this message.
   [junit4] Suite: org.apache.solr.common.util.TestTimeSource
   [junit4] OK      10.1s J0 | TestTimeSource.testEpochTime
   [junit4] Completed [3/5 (2!)] on J0 in 10.17s, 1 test
   [junit4] 
   [junit4] Suite: org.apache.solr.common.util.TestTimeSource
   [junit4] OK      10.1s J1 | TestTimeSource.testEpochTime
   [junit4] Completed [4/5 (2!)] on J1 in 10.17s, 1 test
   [junit4] 
   [junit4] Suite: org.apache.solr.common.util.TestTimeSource
   [junit4] OK      10.1s J0 | TestTimeSource.testEpochTime
   [junit4] Completed [5/5 (2!)] on J0 in 10.15s, 1 test
   [junit4] 
   [junit4] 
   [junit4] Tests with failures [seed: 18409C1DD5ED7254]:
   [junit4]   - org.apache.solr.common.util.TestTimeSource.testEpochTime
   [junit4]   - org.apache.solr.common.util.TestTimeSource.testEpochTime
   [junit4] 
   [junit4] 
   [junit4] JVM J0:     0.64 ..    40.51 =    39.87s
   [junit4] JVM J1:     0.63 ..    30.72 =    30.09s
   [junit4] Execution time total: 40 seconds
   [junit4] Tests summary: 5 suites, 5 tests, 2 failures

BUILD FAILED
C:\Users\jenkins\workspace\Lucene-Solr-master-Windows\lucene\common-build.xml:1568: The following error occurred while executing this line:
C:\Users\jenkins\workspace\Lucene-Solr-master-Windows\lucene\common-build.xml:1092: There were test failures: 5 suites, 5 tests, 2 failures [seed: 18409C1DD5ED7254]

Total time: 41 seconds

[repro] Setting last failure code to 1

[repro] Failures:
[repro]   2/5 failed: org.apache.solr.common.util.TestTimeSource
[repro]   5/5 failed: org.apache.solr.handler.component.DistributedSpellCheckComponentTest
[repro] Exiting with code 1

C:\Users\jenkins\workspace\Lucene-Solr-master-Windows>IF EXIST lucene\build move /y lucene\build lucene\build.repro 
        1 dir(s) moved.

C:\Users\jenkins\workspace\Lucene-Solr-master-Windows>IF EXIST solr\build move /y solr\build solr\build.repro 
        1 dir(s) moved.

C:\Users\jenkins\workspace\Lucene-Solr-master-Windows>IF EXIST lucene\build.orig move /y lucene\build.orig lucene\build 
        1 dir(s) moved.

C:\Users\jenkins\workspace\Lucene-Solr-master-Windows>IF EXIST solr\build.orig move /y solr\build.orig solr\build 
        1 dir(s) moved.

C:\Users\jenkins\workspace\Lucene-Solr-master-Windows>exit 0 
Archiving artifacts
Setting ANT_1_8_2_HOME=C:\Users\jenkins\tools\hudson.tasks.Ant_AntInstallation\ANT_1.8.2
[WARNINGS] Parsing warnings in console log with parser Java Compiler (javac)
Setting ANT_1_8_2_HOME=C:\Users\jenkins\tools\hudson.tasks.Ant_AntInstallation\ANT_1.8.2
Setting ANT_1_8_2_HOME=C:\Users\jenkins\tools\hudson.tasks.Ant_AntInstallation\ANT_1.8.2
<Git Blamer> Using GitBlamer to create author and commit information for all warnings.
<Git Blamer> GIT_COMMIT=b53ee58023636b0ad3f59fcfedf10400723c87e2, workspace=C:\Users\jenkins\workspace\Lucene-Solr-master-Windows
[WARNINGS] Computing warning deltas based on reference build #7307
Recording test results
Setting ANT_1_8_2_HOME=C:\Users\jenkins\tools\hudson.tasks.Ant_AntInstallation\ANT_1.8.2
Build step 'Publish JUnit test result report' changed build result to UNSTABLE
Email was triggered for: Unstable (Test Failures)
Sending email for trigger: Unstable (Test Failures)
Setting ANT_1_8_2_HOME=C:\Users\jenkins\tools\hudson.tasks.Ant_AntInstallation\ANT_1.8.2
Setting ANT_1_8_2_HOME=C:\Users\jenkins\tools\hudson.tasks.Ant_AntInstallation\ANT_1.8.2
Setting ANT_1_8_2_HOME=C:\Users\jenkins\tools\hudson.tasks.Ant_AntInstallation\ANT_1.8.2
Setting ANT_1_8_2_HOME=C:\Users\jenkins\tools\hudson.tasks.Ant_AntInstallation\ANT_1.8.2

Mime
View raw message