lucene-dev mailing list archives

Site index · List index
Message view « Date » · « Thread »
Top « Date » · « Thread »
From Apache Jenkins Server <jenk...@builds.apache.org>
Subject [JENKINS] Lucene-Solr-NightlyTests-master - Build # 1541 - Still Failing
Date Fri, 11 May 2018 11:48:00 GMT
Build: https://builds.apache.org/job/Lucene-Solr-NightlyTests-master/1541/

2 tests failed.
FAILED:  org.apache.lucene.codecs.simpletext.TestSimpleTextLiveDocsFormat.testOverflow

Error Message:
Java heap space

Stack Trace:
java.lang.OutOfMemoryError: Java heap space
	at __randomizedtesting.SeedInfo.seed([97A9A7241DF6776D:AC018FCB1EC7F65B]:0)
	at org.apache.lucene.store.RAMFile.newBuffer(RAMFile.java:78)
	at org.apache.lucene.store.RAMFile.addBuffer(RAMFile.java:51)
	at org.apache.lucene.store.RAMOutputStream.switchCurrentBuffer(RAMOutputStream.java:164)
	at org.apache.lucene.store.RAMOutputStream.writeByte(RAMOutputStream.java:133)
	at org.apache.lucene.codecs.simpletext.SimpleTextUtil.write(SimpleTextUtil.java:48)
	at org.apache.lucene.codecs.simpletext.SimpleTextLiveDocsFormat.writeLiveDocs(SimpleTextLiveDocsFormat.java:113)
	at org.apache.lucene.index.BaseLiveDocsFormatTestCase.testSerialization(BaseLiveDocsFormatTestCase.java:129)
	at org.apache.lucene.index.BaseLiveDocsFormatTestCase.testOverflow(BaseLiveDocsFormatTestCase.java:78)
	at sun.reflect.NativeMethodAccessorImpl.invoke0(Native Method)
	at sun.reflect.NativeMethodAccessorImpl.invoke(NativeMethodAccessorImpl.java:62)
	at sun.reflect.DelegatingMethodAccessorImpl.invoke(DelegatingMethodAccessorImpl.java:43)
	at java.lang.reflect.Method.invoke(Method.java:498)
	at com.carrotsearch.randomizedtesting.RandomizedRunner.invoke(RandomizedRunner.java:1737)
	at com.carrotsearch.randomizedtesting.RandomizedRunner$8.evaluate(RandomizedRunner.java:934)
	at com.carrotsearch.randomizedtesting.RandomizedRunner$9.evaluate(RandomizedRunner.java:970)
	at com.carrotsearch.randomizedtesting.RandomizedRunner$10.evaluate(RandomizedRunner.java:984)
	at org.apache.lucene.util.TestRuleSetupTeardownChained$1.evaluate(TestRuleSetupTeardownChained.java:49)
	at org.apache.lucene.util.AbstractBeforeAfterRule$1.evaluate(AbstractBeforeAfterRule.java:45)
	at org.apache.lucene.util.TestRuleThreadAndTestName$1.evaluate(TestRuleThreadAndTestName.java:48)
	at org.apache.lucene.util.TestRuleIgnoreAfterMaxFailures$1.evaluate(TestRuleIgnoreAfterMaxFailures.java:64)
	at org.apache.lucene.util.TestRuleMarkFailure$1.evaluate(TestRuleMarkFailure.java:47)
	at com.carrotsearch.randomizedtesting.rules.StatementAdapter.evaluate(StatementAdapter.java:36)
	at com.carrotsearch.randomizedtesting.ThreadLeakControl$StatementRunner.run(ThreadLeakControl.java:368)
	at com.carrotsearch.randomizedtesting.ThreadLeakControl.forkTimeoutingTask(ThreadLeakControl.java:817)
	at com.carrotsearch.randomizedtesting.ThreadLeakControl$3.evaluate(ThreadLeakControl.java:468)
	at com.carrotsearch.randomizedtesting.RandomizedRunner.runSingleTest(RandomizedRunner.java:943)
	at com.carrotsearch.randomizedtesting.RandomizedRunner$5.evaluate(RandomizedRunner.java:829)
	at com.carrotsearch.randomizedtesting.RandomizedRunner$6.evaluate(RandomizedRunner.java:879)
	at com.carrotsearch.randomizedtesting.RandomizedRunner$7.evaluate(RandomizedRunner.java:890)
	at org.apache.lucene.util.AbstractBeforeAfterRule$1.evaluate(AbstractBeforeAfterRule.java:45)
	at com.carrotsearch.randomizedtesting.rules.StatementAdapter.evaluate(StatementAdapter.java:36)
	at org.apache.lucene.util.TestRuleStoreClassName$1.evaluate(TestRuleStoreClassName.java:41)


FAILED:  org.apache.lucene.codecs.lucene50.TestLucene50LiveDocsFormat.testOverflow

Error Message:
Java heap space

Stack Trace:
java.lang.OutOfMemoryError: Java heap space
	at __randomizedtesting.SeedInfo.seed([BACA40CA979D1E99:8162682594AC9FAF]:0)
	at org.apache.lucene.store.RAMFile.newBuffer(RAMFile.java:78)
	at org.apache.lucene.store.RAMFile.addBuffer(RAMFile.java:51)
	at org.apache.lucene.store.RAMOutputStream.switchCurrentBuffer(RAMOutputStream.java:164)
	at org.apache.lucene.store.RAMOutputStream.writeBytes(RAMOutputStream.java:150)
	at org.apache.lucene.store.MockIndexOutputWrapper.writeBytes(MockIndexOutputWrapper.java:141)
	at org.apache.lucene.store.MockIndexOutputWrapper.writeByte(MockIndexOutputWrapper.java:126)
	at org.apache.lucene.store.DataOutput.writeInt(DataOutput.java:71)
	at org.apache.lucene.store.DataOutput.writeLong(DataOutput.java:213)
	at org.apache.lucene.codecs.lucene50.Lucene50LiveDocsFormat.writeLiveDocs(Lucene50LiveDocsFormat.java:110)
	at org.apache.lucene.index.BaseLiveDocsFormatTestCase.testSerialization(BaseLiveDocsFormatTestCase.java:129)
	at org.apache.lucene.index.BaseLiveDocsFormatTestCase.testOverflow(BaseLiveDocsFormatTestCase.java:78)
	at sun.reflect.NativeMethodAccessorImpl.invoke0(Native Method)
	at sun.reflect.NativeMethodAccessorImpl.invoke(NativeMethodAccessorImpl.java:62)
	at sun.reflect.DelegatingMethodAccessorImpl.invoke(DelegatingMethodAccessorImpl.java:43)
	at java.lang.reflect.Method.invoke(Method.java:498)
	at com.carrotsearch.randomizedtesting.RandomizedRunner.invoke(RandomizedRunner.java:1737)
	at com.carrotsearch.randomizedtesting.RandomizedRunner$8.evaluate(RandomizedRunner.java:934)
	at com.carrotsearch.randomizedtesting.RandomizedRunner$9.evaluate(RandomizedRunner.java:970)
	at com.carrotsearch.randomizedtesting.RandomizedRunner$10.evaluate(RandomizedRunner.java:984)
	at org.apache.lucene.util.TestRuleSetupTeardownChained$1.evaluate(TestRuleSetupTeardownChained.java:49)
	at org.apache.lucene.util.AbstractBeforeAfterRule$1.evaluate(AbstractBeforeAfterRule.java:45)
	at org.apache.lucene.util.TestRuleThreadAndTestName$1.evaluate(TestRuleThreadAndTestName.java:48)
	at org.apache.lucene.util.TestRuleIgnoreAfterMaxFailures$1.evaluate(TestRuleIgnoreAfterMaxFailures.java:64)
	at org.apache.lucene.util.TestRuleMarkFailure$1.evaluate(TestRuleMarkFailure.java:47)
	at com.carrotsearch.randomizedtesting.rules.StatementAdapter.evaluate(StatementAdapter.java:36)
	at com.carrotsearch.randomizedtesting.ThreadLeakControl$StatementRunner.run(ThreadLeakControl.java:368)
	at com.carrotsearch.randomizedtesting.ThreadLeakControl.forkTimeoutingTask(ThreadLeakControl.java:817)
	at com.carrotsearch.randomizedtesting.ThreadLeakControl$3.evaluate(ThreadLeakControl.java:468)
	at com.carrotsearch.randomizedtesting.RandomizedRunner.runSingleTest(RandomizedRunner.java:943)
	at com.carrotsearch.randomizedtesting.RandomizedRunner$5.evaluate(RandomizedRunner.java:829)
	at com.carrotsearch.randomizedtesting.RandomizedRunner$6.evaluate(RandomizedRunner.java:879)
	at com.carrotsearch.randomizedtesting.RandomizedRunner$7.evaluate(RandomizedRunner.java:890)




Build Log:
[...truncated 866 lines...]
   [junit4] Suite: org.apache.lucene.codecs.lucene50.TestLucene50LiveDocsFormat
   [junit4]   2> NOTE: download the large Jenkins line-docs file by running 'ant get-jenkins-line-docs'
in the lucene directory.
   [junit4]   2> NOTE: reproduce with: ant test  -Dtestcase=TestLucene50LiveDocsFormat
-Dtests.method=testOverflow -Dtests.seed=BACA40CA979D1E99 -Dtests.multiplier=2 -Dtests.nightly=true
-Dtests.slow=true -Dtests.linedocsfile=/home/jenkins/jenkins-slave/workspace/Lucene-Solr-NightlyTests-master/test-data/enwiki.random.lines.txt
-Dtests.locale=ar-EG -Dtests.timezone=Europe/Busingen -Dtests.asserts=true -Dtests.file.encoding=US-ASCII
   [junit4] ERROR    102s J2 | TestLucene50LiveDocsFormat.testOverflow <<<
   [junit4]    > Throwable #1: java.lang.OutOfMemoryError: Java heap space
   [junit4]    > 	at __randomizedtesting.SeedInfo.seed([BACA40CA979D1E99:8162682594AC9FAF]:0)
   [junit4]    > 	at org.apache.lucene.store.RAMFile.newBuffer(RAMFile.java:78)
   [junit4]    > 	at org.apache.lucene.store.RAMFile.addBuffer(RAMFile.java:51)
   [junit4]    > 	at org.apache.lucene.store.RAMOutputStream.switchCurrentBuffer(RAMOutputStream.java:164)
   [junit4]    > 	at org.apache.lucene.store.RAMOutputStream.writeBytes(RAMOutputStream.java:150)
   [junit4]    > 	at org.apache.lucene.store.MockIndexOutputWrapper.writeBytes(MockIndexOutputWrapper.java:141)
   [junit4]    > 	at org.apache.lucene.store.MockIndexOutputWrapper.writeByte(MockIndexOutputWrapper.java:126)
   [junit4]    > 	at org.apache.lucene.store.DataOutput.writeInt(DataOutput.java:71)
   [junit4]    > 	at org.apache.lucene.store.DataOutput.writeLong(DataOutput.java:213)
   [junit4]    > 	at org.apache.lucene.codecs.lucene50.Lucene50LiveDocsFormat.writeLiveDocs(Lucene50LiveDocsFormat.java:110)
   [junit4]    > 	at org.apache.lucene.index.BaseLiveDocsFormatTestCase.testSerialization(BaseLiveDocsFormatTestCase.java:129)
   [junit4]    > 	at org.apache.lucene.index.BaseLiveDocsFormatTestCase.testOverflow(BaseLiveDocsFormatTestCase.java:78)
   [junit4]   2> NOTE: leaving temporary files on disk at: /x1/jenkins/jenkins-slave/workspace/Lucene-Solr-NightlyTests-master/checkout/lucene/build/core/test/J2/temp/lucene.codecs.lucene50.TestLucene50LiveDocsFormat_BACA40CA979D1E99-001
   [junit4]   2> NOTE: test params are: codec=FastDecompressionCompressingStoredFields(storedFieldsFormat=CompressingStoredFieldsFormat(compressionMode=FAST_DECOMPRESSION,
chunkSize=30606, maxDocsPerChunk=4, blockSize=10), termVectorsFormat=CompressingTermVectorsFormat(compressionMode=FAST_DECOMPRESSION,
chunkSize=30606, blockSize=10)), sim=Asserting(org.apache.lucene.search.similarities.AssertingSimilarity@1a9b1bf5),
locale=ar-EG, timezone=Europe/Busingen
   [junit4]   2> NOTE: Linux 3.13.0-88-generic amd64/Oracle Corporation 1.8.0_172 (64-bit)/cpus=4,threads=1,free=269412304,total=533725184
   [junit4]   2> NOTE: All tests run in this JVM: [TestMultiCollector, TestMixedDocValuesUpdates,
TestComplexExplanationsOfNonMatches, TestControlledRealTimeReopenThread, TestIndexWriterReader,
TestLongRange, TestBasics, TestRegexpQuery, TestDocsWithFieldSet, TestSpanBoostQuery, TestIndexWriterMergePolicy,
TestCompiledAutomaton, TestFilterCodecReader, TestNRTThreads, TestNRTReaderWithThreads, TestReadOnlyIndex,
TestSimpleFSDirectory, TestConsistentFieldNumbers, TestReaderClosed, FiniteStringsIteratorTest,
TestSparseFixedBitDocIdSet, TestFutureObjects, FuzzyTermOnShortTermsTest, TestAxiomaticF3EXP,
TestStopFilter, TestTermRangeQuery, TestBKD, TestSynonymQuery, TestSegmentTermEnum, TestPerFieldPostingsFormat2,
TestSentinelIntSet, TestPositiveScoresOnlyCollector, TestSortedSetDocValues, TestExitableDirectoryReader,
TestNIOFSDirectory, TestSearchWithThreads, TestIndexManyDocuments, TestRollingUpdates, TestNeedsScores,
TestMultiTermQueryRewrites, TestRecyclingIntBlockAllocator, TestTermStates, TestIndexWriterCommit,
TestDoubleRangeFieldQueries, TestManyFields, TestDateTools, TestFieldsReader, TestTopDocsMerge,
TestSameTokenSamePosition, TestSimpleExplanationsOfNonMatches, TestSpanTermQuery, TestShardSearching,
TestDocInverterPerFieldErrorInfo, TestIndependenceChiSquared, TestDocument, TestScorerPerf,
Test2BSortedDocValuesFixedSorted, TestLucene70SegmentInfoFormat, TestMatchNoDocsQuery, TestMultiFields,
TestIndexWriterMerging, TestFilterDirectory, TestNamedSPILoader, TestWildcardRandom, TestPackedTokenAttributeImpl,
TestSegmentReader, TestBlendedTermQuery, TestSpanNearQuery, TestLucene50LiveDocsFormat]
   [junit4] Completed [178/495 (1!)] on J2 in 101.59s, 4 tests, 1 error <<< FAILURES!

[...truncated 1147 lines...]
   [junit4] JVM J2: stdout was not empty, see: /x1/jenkins/jenkins-slave/workspace/Lucene-Solr-NightlyTests-master/checkout/lucene/build/core/test/temp/junit4-J2-20180511_052626_8573789069166163672932.sysout
   [junit4] >>> JVM J2 emitted unexpected output (verbatim) ----
   [junit4] java.lang.OutOfMemoryError: Java heap space
   [junit4] Dumping heap to /x1/jenkins/jenkins-slave/workspace/Lucene-Solr-NightlyTests-master/checkout/heapdumps/java_pid31830.hprof
...
   [junit4] Heap dump file created [536292018 bytes in 2.869 secs]
   [junit4] <<< JVM J2: EOF ----

[...truncated 5614 lines...]
   [junit4] Suite: org.apache.lucene.codecs.simpletext.TestSimpleTextLiveDocsFormat
   [junit4]   2> NOTE: download the large Jenkins line-docs file by running 'ant get-jenkins-line-docs'
in the lucene directory.
   [junit4]   2> NOTE: reproduce with: ant test  -Dtestcase=TestSimpleTextLiveDocsFormat
-Dtests.method=testOverflow -Dtests.seed=97A9A7241DF6776D -Dtests.multiplier=2 -Dtests.nightly=true
-Dtests.slow=true -Dtests.linedocsfile=/home/jenkins/jenkins-slave/workspace/Lucene-Solr-NightlyTests-master/test-data/enwiki.random.lines.txt
-Dtests.locale=is -Dtests.timezone=America/Bahia_Banderas -Dtests.asserts=true -Dtests.file.encoding=ISO-8859-1
   [junit4] ERROR    203s J2 | TestSimpleTextLiveDocsFormat.testOverflow <<<
   [junit4]    > Throwable #1: java.lang.OutOfMemoryError: Java heap space
   [junit4]    > 	at __randomizedtesting.SeedInfo.seed([97A9A7241DF6776D:AC018FCB1EC7F65B]:0)
   [junit4]    > 	at org.apache.lucene.store.RAMFile.newBuffer(RAMFile.java:78)
   [junit4]    > 	at org.apache.lucene.store.RAMFile.addBuffer(RAMFile.java:51)
   [junit4]    > 	at org.apache.lucene.store.RAMOutputStream.switchCurrentBuffer(RAMOutputStream.java:164)
   [junit4]    > 	at org.apache.lucene.store.RAMOutputStream.writeByte(RAMOutputStream.java:133)
   [junit4]    > 	at org.apache.lucene.codecs.simpletext.SimpleTextUtil.write(SimpleTextUtil.java:48)
   [junit4]    > 	at org.apache.lucene.codecs.simpletext.SimpleTextLiveDocsFormat.writeLiveDocs(SimpleTextLiveDocsFormat.java:113)
   [junit4]    > 	at org.apache.lucene.index.BaseLiveDocsFormatTestCase.testSerialization(BaseLiveDocsFormatTestCase.java:129)
   [junit4]    > 	at org.apache.lucene.index.BaseLiveDocsFormatTestCase.testOverflow(BaseLiveDocsFormatTestCase.java:78)
   [junit4]   2> NOTE: leaving temporary files on disk at: /x1/jenkins/jenkins-slave/workspace/Lucene-Solr-NightlyTests-master/checkout/lucene/build/codecs/test/J2/temp/lucene.codecs.simpletext.TestSimpleTextLiveDocsFormat_97A9A7241DF6776D-001
   [junit4]   2> NOTE: test params are: codec=CheapBastard, sim=Asserting(org.apache.lucene.search.similarities.AssertingSimilarity@1aa53427),
locale=is, timezone=America/Bahia_Banderas
   [junit4]   2> NOTE: Linux 3.13.0-88-generic amd64/Oracle Corporation 1.8.0_172 (64-bit)/cpus=4,threads=1,free=264397256,total=477626368
   [junit4]   2> NOTE: All tests run in this JVM: [TestFixedGapPostingsFormat, TestFSTPostingsFormat,
TestDirectPostingsFormat, TestSimpleTextLiveDocsFormat]
   [junit4] Completed [5/19 (1!)] on J2 in 203.53s, 4 tests, 1 error <<< FAILURES!

[...truncated 71 lines...]
   [junit4] JVM J2: stdout was not empty, see: /x1/jenkins/jenkins-slave/workspace/Lucene-Solr-NightlyTests-master/checkout/lucene/build/codecs/test/temp/junit4-J2-20180511_080916_9998513066334616091460.sysout
   [junit4] >>> JVM J2 emitted unexpected output (verbatim) ----
   [junit4] java.lang.OutOfMemoryError: Java heap space
   [junit4] Dumping heap to /x1/jenkins/jenkins-slave/workspace/Lucene-Solr-NightlyTests-master/checkout/heapdumps/java_pid7944.hprof
...
   [junit4] Heap dump file created [484866645 bytes in 0.949 secs]
   [junit4] <<< JVM J2: EOF ----

[...truncated 17540 lines...]
BUILD FAILED
/x1/jenkins/jenkins-slave/workspace/Lucene-Solr-NightlyTests-master/checkout/build.xml:651:
The following error occurred while executing this line:
/x1/jenkins/jenkins-slave/workspace/Lucene-Solr-NightlyTests-master/checkout/build.xml:585:
Some of the tests produced a heap dump, but did not fail. Maybe a suppressed OutOfMemoryError?
Dumps created:
* java_pid31830.hprof
* java_pid7944.hprof

Total time: 382 minutes 5 seconds
Build step 'Invoke Ant' marked build as failure
Archiving artifacts
Recording test results
Email was triggered for: Failure - Any
Sending email for trigger: Failure - Any

Mime
View raw message