lucene-dev mailing list archives

Site index · List index
Message view « Date » · « Thread »
Top « Date » · « Thread »
From Apache Jenkins Server <jenk...@builds.apache.org>
Subject [JENKINS] Lucene-Solr-Tests-master - Build # 2533 - Still Unstable
Date Fri, 18 May 2018 06:40:30 GMT
Build: https://builds.apache.org/job/Lucene-Solr-Tests-master/2533/

1 tests failed.
FAILED:  org.apache.solr.cloud.autoscaling.SearchRateTriggerTest.testTrigger

Error Message:
expected:<1> but was:<2>

Stack Trace:
java.lang.AssertionError: expected:<1> but was:<2>
	at __randomizedtesting.SeedInfo.seed([530F4649DF8F02FC:30C470CB464071D1]:0)
	at org.junit.Assert.fail(Assert.java:93)
	at org.junit.Assert.failNotEquals(Assert.java:647)
	at org.junit.Assert.assertEquals(Assert.java:128)
	at org.junit.Assert.assertEquals(Assert.java:472)
	at org.junit.Assert.assertEquals(Assert.java:456)
	at org.apache.solr.cloud.autoscaling.SearchRateTriggerTest.testTrigger(SearchRateTriggerTest.java:133)
	at sun.reflect.NativeMethodAccessorImpl.invoke0(Native Method)
	at sun.reflect.NativeMethodAccessorImpl.invoke(NativeMethodAccessorImpl.java:62)
	at sun.reflect.DelegatingMethodAccessorImpl.invoke(DelegatingMethodAccessorImpl.java:43)
	at java.lang.reflect.Method.invoke(Method.java:498)
	at com.carrotsearch.randomizedtesting.RandomizedRunner.invoke(RandomizedRunner.java:1737)
	at com.carrotsearch.randomizedtesting.RandomizedRunner$8.evaluate(RandomizedRunner.java:934)
	at com.carrotsearch.randomizedtesting.RandomizedRunner$9.evaluate(RandomizedRunner.java:970)
	at com.carrotsearch.randomizedtesting.RandomizedRunner$10.evaluate(RandomizedRunner.java:984)
	at com.carrotsearch.randomizedtesting.rules.SystemPropertiesRestoreRule$1.evaluate(SystemPropertiesRestoreRule.java:57)
	at org.apache.lucene.util.TestRuleSetupTeardownChained$1.evaluate(TestRuleSetupTeardownChained.java:49)
	at org.apache.lucene.util.AbstractBeforeAfterRule$1.evaluate(AbstractBeforeAfterRule.java:45)
	at org.apache.lucene.util.TestRuleThreadAndTestName$1.evaluate(TestRuleThreadAndTestName.java:48)
	at org.apache.lucene.util.TestRuleIgnoreAfterMaxFailures$1.evaluate(TestRuleIgnoreAfterMaxFailures.java:64)
	at org.apache.lucene.util.TestRuleMarkFailure$1.evaluate(TestRuleMarkFailure.java:47)
	at com.carrotsearch.randomizedtesting.rules.StatementAdapter.evaluate(StatementAdapter.java:36)
	at com.carrotsearch.randomizedtesting.ThreadLeakControl$StatementRunner.run(ThreadLeakControl.java:368)
	at com.carrotsearch.randomizedtesting.ThreadLeakControl.forkTimeoutingTask(ThreadLeakControl.java:817)
	at com.carrotsearch.randomizedtesting.ThreadLeakControl$3.evaluate(ThreadLeakControl.java:468)
	at com.carrotsearch.randomizedtesting.RandomizedRunner.runSingleTest(RandomizedRunner.java:943)
	at com.carrotsearch.randomizedtesting.RandomizedRunner$5.evaluate(RandomizedRunner.java:829)
	at com.carrotsearch.randomizedtesting.RandomizedRunner$6.evaluate(RandomizedRunner.java:879)
	at com.carrotsearch.randomizedtesting.RandomizedRunner$7.evaluate(RandomizedRunner.java:890)
	at com.carrotsearch.randomizedtesting.rules.StatementAdapter.evaluate(StatementAdapter.java:36)
	at com.carrotsearch.randomizedtesting.rules.SystemPropertiesRestoreRule$1.evaluate(SystemPropertiesRestoreRule.java:57)
	at org.apache.lucene.util.AbstractBeforeAfterRule$1.evaluate(AbstractBeforeAfterRule.java:45)
	at com.carrotsearch.randomizedtesting.rules.StatementAdapter.evaluate(StatementAdapter.java:36)
	at org.apache.lucene.util.TestRuleStoreClassName$1.evaluate(TestRuleStoreClassName.java:41)
	at com.carrotsearch.randomizedtesting.rules.NoShadowingOrOverridesOnMethodsRule$1.evaluate(NoShadowingOrOverridesOnMethodsRule.java:40)
	at com.carrotsearch.randomizedtesting.rules.NoShadowingOrOverridesOnMethodsRule$1.evaluate(NoShadowingOrOverridesOnMethodsRule.java:40)
	at com.carrotsearch.randomizedtesting.rules.StatementAdapter.evaluate(StatementAdapter.java:36)
	at com.carrotsearch.randomizedtesting.rules.StatementAdapter.evaluate(StatementAdapter.java:36)
	at com.carrotsearch.randomizedtesting.rules.StatementAdapter.evaluate(StatementAdapter.java:36)
	at org.apache.lucene.util.TestRuleAssertionsRequired$1.evaluate(TestRuleAssertionsRequired.java:53)
	at org.apache.lucene.util.TestRuleMarkFailure$1.evaluate(TestRuleMarkFailure.java:47)
	at org.apache.lucene.util.TestRuleIgnoreAfterMaxFailures$1.evaluate(TestRuleIgnoreAfterMaxFailures.java:64)
	at org.apache.lucene.util.TestRuleIgnoreTestSuites$1.evaluate(TestRuleIgnoreTestSuites.java:54)
	at com.carrotsearch.randomizedtesting.rules.StatementAdapter.evaluate(StatementAdapter.java:36)
	at com.carrotsearch.randomizedtesting.ThreadLeakControl$StatementRunner.run(ThreadLeakControl.java:368)
	at java.lang.Thread.run(Thread.java:748)




Build Log:
[...truncated 13622 lines...]
   [junit4] Suite: org.apache.solr.cloud.autoscaling.SearchRateTriggerTest
   [junit4]   2> Creating dataDir: /x1/jenkins/jenkins-slave/workspace/Lucene-Solr-Tests-master/solr/build/solr-core/test/J0/temp/solr.cloud.autoscaling.SearchRateTriggerTest_530F4649DF8F02FC-001/init-core-data-001
   [junit4]   2> 1738614 WARN  (SUITE-SearchRateTriggerTest-seed#[530F4649DF8F02FC]-worker) [    ] o.a.s.SolrTestCaseJ4 startTrackingSearchers: numOpens=1 numCloses=1
   [junit4]   2> 1738614 INFO  (SUITE-SearchRateTriggerTest-seed#[530F4649DF8F02FC]-worker) [    ] o.a.s.SolrTestCaseJ4 Using PointFields (NUMERIC_POINTS_SYSPROP=true) w/NUMERIC_DOCVALUES_SYSPROP=true
   [junit4]   2> 1738616 INFO  (SUITE-SearchRateTriggerTest-seed#[530F4649DF8F02FC]-worker) [    ] o.a.s.SolrTestCaseJ4 Randomized ssl (true) and clientAuth (false) via: @org.apache.solr.util.RandomizeSSL(reason=, ssl=NaN, value=NaN, clientAuth=NaN)
   [junit4]   2> 1738616 INFO  (SUITE-SearchRateTriggerTest-seed#[530F4649DF8F02FC]-worker) [    ] o.a.s.SolrTestCaseJ4 SecureRandom sanity checks: test.solr.allowed.securerandom=null & java.security.egd=file:/dev/./urandom
   [junit4]   2> 1738617 INFO  (SUITE-SearchRateTriggerTest-seed#[530F4649DF8F02FC]-worker) [    ] o.a.s.c.MiniSolrCloudCluster Starting cluster of 4 servers in /x1/jenkins/jenkins-slave/workspace/Lucene-Solr-Tests-master/solr/build/solr-core/test/J0/temp/solr.cloud.autoscaling.SearchRateTriggerTest_530F4649DF8F02FC-001/tempDir-001
   [junit4]   2> 1738617 INFO  (SUITE-SearchRateTriggerTest-seed#[530F4649DF8F02FC]-worker) [    ] o.a.s.c.ZkTestServer STARTING ZK TEST SERVER
   [junit4]   2> 1738643 INFO  (Thread-2324) [    ] o.a.s.c.ZkTestServer client port:0.0.0.0/0.0.0.0:0
   [junit4]   2> 1738643 INFO  (Thread-2324) [    ] o.a.s.c.ZkTestServer Starting server
   [junit4]   2> 1738663 ERROR (Thread-2324) [    ] o.a.z.s.ZooKeeperServer ZKShutdownHandler is not registered, so ZooKeeper server won't take any action on ERROR or SHUTDOWN server state changes
   [junit4]   2> 1738743 INFO  (SUITE-SearchRateTriggerTest-seed#[530F4649DF8F02FC]-worker) [    ] o.a.s.c.ZkTestServer start zk server on port:50797
   [junit4]   2> 1738779 INFO  (zkConnectionManagerCallback-2680-thread-1) [    ] o.a.s.c.c.ConnectionManager zkClient has connected
   [junit4]   2> 1738789 INFO  (jetty-launcher-2677-thread-1) [    ] o.e.j.s.Server jetty-9.4.10.v20180503; built: 2018-05-03T15:56:21.710Z; git: daa59876e6f384329b122929e70a80934569428c; jvm 1.8.0_172-b11
   [junit4]   2> 1738805 INFO  (jetty-launcher-2677-thread-3) [    ] o.e.j.s.Server jetty-9.4.10.v20180503; built: 2018-05-03T15:56:21.710Z; git: daa59876e6f384329b122929e70a80934569428c; jvm 1.8.0_172-b11
   [junit4]   2> 1738835 INFO  (jetty-launcher-2677-thread-2) [    ] o.e.j.s.Server jetty-9.4.10.v20180503; built: 2018-05-03T15:56:21.710Z; git: daa59876e6f384329b122929e70a80934569428c; jvm 1.8.0_172-b11
   [junit4]   2> 1738942 INFO  (jetty-launcher-2677-thread-2) [    ] o.e.j.s.session DefaultSessionIdManager workerName=node0
   [junit4]   2> 1738942 INFO  (jetty-launcher-2677-thread-2) [    ] o.e.j.s.session No SessionScavenger set, using defaults
   [junit4]   2> 1738942 INFO  (jetty-launcher-2677-thread-2) [    ] o.e.j.s.session node0 Scavenging every 660000ms
   [junit4]   2> 1738955 INFO  (jetty-launcher-2677-thread-2) [    ] o.e.j.s.h.ContextHandler Started o.e.j.s.ServletContextHandler@5f52e60f{/solr,null,AVAILABLE}
   [junit4]   2> 1738965 INFO  (jetty-launcher-2677-thread-4) [    ] o.e.j.s.Server jetty-9.4.10.v20180503; built: 2018-05-03T15:56:21.710Z; git: daa59876e6f384329b122929e70a80934569428c; jvm 1.8.0_172-b11
   [junit4]   2> 1738999 INFO  (jetty-launcher-2677-thread-3) [    ] o.e.j.s.session DefaultSessionIdManager workerName=node0
   [junit4]   2> 1738999 INFO  (jetty-launcher-2677-thread-3) [    ] o.e.j.s.session No SessionScavenger set, using defaults
   [junit4]   2> 1738999 INFO  (jetty-launcher-2677-thread-3) [    ] o.e.j.s.session node0 Scavenging every 600000ms
   [junit4]   2> 1739000 INFO  (jetty-launcher-2677-thread-3) [    ] o.e.j.s.h.ContextHandler Started o.e.j.s.ServletContextHandler@1c1149d1{/solr,null,AVAILABLE}
   [junit4]   2> 1739001 INFO  (jetty-launcher-2677-thread-3) [    ] o.e.j.s.AbstractConnector Started ServerConnector@5af39947{SSL,[ssl, http/1.1]}{127.0.0.1:45659}
   [junit4]   2> 1739001 INFO  (jetty-launcher-2677-thread-3) [    ] o.e.j.s.Server Started @1739122ms
   [junit4]   2> 1739001 INFO  (jetty-launcher-2677-thread-3) [    ] o.a.s.c.s.e.JettySolrRunner Jetty properties: {hostContext=/solr, hostPort=45659}
   [junit4]   2> 1739002 ERROR (jetty-launcher-2677-thread-3) [    ] o.a.s.u.StartupLoggingUtils Missing Java Option solr.log.dir. Logging may be missing or incomplete.
   [junit4]   2> 1739002 INFO  (jetty-launcher-2677-thread-3) [    ] o.a.s.s.SolrDispatchFilter Using logger factory org.apache.logging.slf4j.Log4jLoggerFactory
   [junit4]   2> 1739002 INFO  (jetty-launcher-2677-thread-3) [    ] o.a.s.s.SolrDispatchFilter  ___      _       Welcome to Apache Solr™ version 8.0.0
   [junit4]   2> 1739002 INFO  (jetty-launcher-2677-thread-3) [    ] o.a.s.s.SolrDispatchFilter / __| ___| |_ _   Starting in cloud mode on port null
   [junit4]   2> 1739002 INFO  (jetty-launcher-2677-thread-3) [    ] o.a.s.s.SolrDispatchFilter \__ \/ _ \ | '_|  Install dir: null
   [junit4]   2> 1739002 INFO  (jetty-launcher-2677-thread-3) [    ] o.a.s.s.SolrDispatchFilter |___/\___/_|_|    Start time: 2018-05-18T05:37:06.734Z
   [junit4]   2> 1739165 INFO  (jetty-launcher-2677-thread-2) [    ] o.e.j.s.AbstractConnector Started ServerConnector@398314e6{SSL,[ssl, http/1.1]}{127.0.0.1:46437}
   [junit4]   2> 1739165 INFO  (jetty-launcher-2677-thread-2) [    ] o.e.j.s.Server Started @1739285ms
   [junit4]   2> 1739165 INFO  (jetty-launcher-2677-thread-2) [    ] o.a.s.c.s.e.JettySolrRunner Jetty properties: {hostContext=/solr, hostPort=46437}
   [junit4]   2> 1739165 ERROR (jetty-launcher-2677-thread-2) [    ] o.a.s.u.StartupLoggingUtils Missing Java Option solr.log.dir. Logging may be missing or incomplete.
   [junit4]   2> 1739165 INFO  (jetty-launcher-2677-thread-2) [    ] o.a.s.s.SolrDispatchFilter Using logger factory org.apache.logging.slf4j.Log4jLoggerFactory
   [junit4]   2> 1739165 INFO  (jetty-launcher-2677-thread-2) [    ] o.a.s.s.SolrDispatchFilter  ___      _       Welcome to Apache Solr™ version 8.0.0
   [junit4]   2> 1739165 INFO  (jetty-launcher-2677-thread-2) [    ] o.a.s.s.SolrDispatchFilter / __| ___| |_ _   Starting in cloud mode on port null
   [junit4]   2> 1739165 INFO  (jetty-launcher-2677-thread-2) [    ] o.a.s.s.SolrDispatchFilter \__ \/ _ \ | '_|  Install dir: null
   [junit4]   2> 1739165 INFO  (jetty-launcher-2677-thread-2) [    ] o.a.s.s.SolrDispatchFilter |___/\___/_|_|    Start time: 2018-05-18T05:37:06.897Z
   [junit4]   2> 1739233 INFO  (jetty-launcher-2677-thread-4) [    ] o.e.j.s.session DefaultSessionIdManager workerName=node0
   [junit4]   2> 1739233 INFO  (jetty-launcher-2677-thread-4) [    ] o.e.j.s.session No SessionScavenger set, using defaults
   [junit4]   2> 1739233 INFO  (jetty-launcher-2677-thread-4) [    ] o.e.j.s.session node0 Scavenging every 600000ms
   [junit4]   2> 1739233 INFO  (jetty-launcher-2677-thread-1) [    ] o.e.j.s.session DefaultSessionIdManager workerName=node0
   [junit4]   2> 1739233 INFO  (jetty-launcher-2677-thread-1) [    ] o.e.j.s.session No SessionScavenger set, using defaults
   [junit4]   2> 1739233 INFO  (jetty-launcher-2677-thread-1) [    ] o.e.j.s.session node0 Scavenging every 600000ms
   [junit4]   2> 1739239 INFO  (zkConnectionManagerCallback-2682-thread-1) [    ] o.a.s.c.c.ConnectionManager zkClient has connected
   [junit4]   2> 1739240 INFO  (jetty-launcher-2677-thread-3) [    ] o.a.s.s.SolrDispatchFilter solr.xml found in ZooKeeper. Loading...
   [junit4]   2> 1739259 INFO  (jetty-launcher-2677-thread-1) [    ] o.e.j.s.h.ContextHandler Started o.e.j.s.ServletContextHandler@abc9395{/solr,null,AVAILABLE}
   [junit4]   2> 1739260 INFO  (jetty-launcher-2677-thread-1) [    ] o.e.j.s.AbstractConnector Started ServerConnector@48e60cdd{SSL,[ssl, http/1.1]}{127.0.0.1:36550}
   [junit4]   2> 1739285 INFO  (jetty-launcher-2677-thread-1) [    ] o.e.j.s.Server Started @1739406ms
   [junit4]   2> 1739285 INFO  (jetty-launcher-2677-thread-1) [    ] o.a.s.c.s.e.JettySolrRunner Jetty properties: {hostContext=/solr, hostPort=36550}
   [junit4]   2> 1739285 ERROR (jetty-launcher-2677-thread-1) [    ] o.a.s.u.StartupLoggingUtils Missing Java Option solr.log.dir. Logging may be missing or incomplete.
   [junit4]   2> 1739285 INFO  (jetty-launcher-2677-thread-1) [    ] o.a.s.s.SolrDispatchFilter Using logger factory org.apache.logging.slf4j.Log4jLoggerFactory
   [junit4]   2> 1739285 INFO  (jetty-launcher-2677-thread-1) [    ] o.a.s.s.SolrDispatchFilter  ___      _       Welcome to Apache Solr™ version 8.0.0
   [junit4]   2> 1739285 INFO  (jetty-launcher-2677-thread-1) [    ] o.a.s.s.SolrDispatchFilter / __| ___| |_ _   Starting in cloud mode on port null
   [junit4]   2> 1739285 INFO  (jetty-launcher-2677-thread-1) [    ] o.a.s.s.SolrDispatchFilter \__ \/ _ \ | '_|  Install dir: null
   [junit4]   2> 1739285 INFO  (jetty-launcher-2677-thread-1) [    ] o.a.s.s.SolrDispatchFilter |___/\___/_|_|    Start time: 2018-05-18T05:37:07.017Z
   [junit4]   2> 1739283 INFO  (jetty-launcher-2677-thread-4) [    ] o.e.j.s.h.ContextHandler Started o.e.j.s.ServletContextHandler@3adea202{/solr,null,AVAILABLE}
   [junit4]   2> 1739300 INFO  (jetty-launcher-2677-thread-4) [    ] o.e.j.s.AbstractConnector Started ServerConnector@2d66277b{SSL,[ssl, http/1.1]}{127.0.0.1:51759}
   [junit4]   2> 1739300 INFO  (jetty-launcher-2677-thread-4) [    ] o.e.j.s.Server Started @1739421ms
   [junit4]   2> 1739300 INFO  (jetty-launcher-2677-thread-4) [    ] o.a.s.c.s.e.JettySolrRunner Jetty properties: {hostContext=/solr, hostPort=51759}
   [junit4]   2> 1739301 ERROR (jetty-launcher-2677-thread-4) [    ] o.a.s.u.StartupLoggingUtils Missing Java Option solr.log.dir. Logging may be missing or incomplete.
   [junit4]   2> 1739301 INFO  (jetty-launcher-2677-thread-4) [    ] o.a.s.s.SolrDispatchFilter Using logger factory org.apache.logging.slf4j.Log4jLoggerFactory
   [junit4]   2> 1739301 INFO  (jetty-launcher-2677-thread-4) [    ] o.a.s.s.SolrDispatchFilter  ___      _       Welcome to Apache Solr™ version 8.0.0
   [junit4]   2> 1739301 INFO  (jetty-launcher-2677-thread-4) [    ] o.a.s.s.SolrDispatchFilter / __| ___| |_ _   Starting in cloud mode on port null
   [junit4]   2> 1739301 INFO  (jetty-launcher-2677-thread-4) [    ] o.a.s.s.SolrDispatchFilter \__ \/ _ \ | '_|  Install dir: null
   [junit4]   2> 1739301 INFO  (jetty-launcher-2677-thread-4) [    ] o.a.s.s.SolrDispatchFilter |___/\___/_|_|    Start time: 2018-05-18T05:37:07.033Z
   [junit4]   2> 1739345 INFO  (zkConnectionManagerCallback-2684-thread-1) [    ] o.a.s.c.c.ConnectionManager zkClient has connected
   [junit4]   2> 1739346 INFO  (jetty-launcher-2677-thread-2) [    ] o.a.s.s.SolrDispatchFilter solr.xml found in ZooKeeper. Loading...
   [junit4]   2> 1739536 INFO  (zkConnectionManagerCallback-2686-thread-1) [    ] o.a.s.c.c.ConnectionManager zkClient has connected
   [junit4]   2> 1739537 INFO  (jetty-launcher-2677-thread-1) [    ] o.a.s.s.SolrDispatchFilter solr.xml found in ZooKeeper. Loading...
   [junit4]   2> 1739545 INFO  (jetty-launcher-2677-thread-3) [    ] o.a.s.c.ZkContainer Zookeeper client=127.0.0.1:50797/solr
   [junit4]   2> 1739562 INFO  (zkConnectionManagerCallback-2688-thread-1) [    ] o.a.s.c.c.ConnectionManager zkClient has connected
   [junit4]   2> 1739563 INFO  (zkConnectionManagerCallback-2692-thread-1) [    ] o.a.s.c.c.ConnectionManager zkClient has connected
   [junit4]   2> 1739565 INFO  (jetty-launcher-2677-thread-4) [    ] o.a.s.s.SolrDispatchFilter solr.xml found in ZooKeeper. Loading...
   [junit4]   2> 1739575 INFO  (jetty-launcher-2677-thread-2) [    ] o.a.s.c.ZkContainer Zookeeper client=127.0.0.1:50797/solr
   [junit4]   2> 1739631 INFO  (zkConnectionManagerCallback-2698-thread-1) [    ] o.a.s.c.c.ConnectionManager zkClient has connected
   [junit4]   2> 1739655 INFO  (zkConnectionManagerCallback-2696-thread-1) [    ] o.a.s.c.c.ConnectionManager zkClient has connected
   [junit4]   2> 1739656 WARN  (NIOServerCxn.Factory:0.0.0.0/0.0.0.0:0) [    ] o.a.z.s.NIOServerCnxn Unable to read additional data from client sessionid 0x10641cc7a210006, likely client has closed socket
   [junit4]   2> 1739704 INFO  (jetty-launcher-2677-thread-1) [    ] o.a.s.c.ZkContainer Zookeeper client=127.0.0.1:50797/solr
   [junit4]   2> 1739738 INFO  (jetty-launcher-2677-thread-3) [n:127.0.0.1:45659_solr    ] o.a.s.c.Overseer Overseer (id=null) closing
   [junit4]   2> 1739739 INFO  (jetty-launcher-2677-thread-3) [n:127.0.0.1:45659_solr    ] o.a.s.c.OverseerElectionContext I am going to be the leader 127.0.0.1:45659_solr
   [junit4]   2> 1739740 INFO  (jetty-launcher-2677-thread-3) [n:127.0.0.1:45659_solr    ] o.a.s.c.Overseer Overseer (id=73818790376308743-127.0.0.1:45659_solr-n_0000000000) starting
   [junit4]   2> 1739800 INFO  (jetty-launcher-2677-thread-4) [    ] o.a.s.c.ZkContainer Zookeeper client=127.0.0.1:50797/solr
   [junit4]   2> 1739835 INFO  (zkConnectionManagerCallback-2704-thread-1) [    ] o.a.s.c.c.ConnectionManager zkClient has connected
   [junit4]   2> 1739854 INFO  (zkConnectionManagerCallback-2715-thread-1) [    ] o.a.s.c.c.ConnectionManager zkClient has connected
   [junit4]   2> 1739857 INFO  (jetty-launcher-2677-thread-3) [n:127.0.0.1:45659_solr    ] o.a.s.c.s.i.ZkClientClusterStateProvider Cluster at 127.0.0.1:50797/solr ready
   [junit4]   2> 1739937 INFO  (jetty-launcher-2677-thread-3) [n:127.0.0.1:45659_solr    ] o.a.s.c.ZkController Register node as live in ZooKeeper:/live_nodes/127.0.0.1:45659_solr
   [junit4]   2> 1739977 INFO  (zkConnectionManagerCallback-2707-thread-1) [    ] o.a.s.c.c.ConnectionManager zkClient has connected
   [junit4]   2> 1739993 INFO  (OverseerStateUpdate-73818790376308743-127.0.0.1:45659_solr-n_0000000000) [    ] o.a.s.c.c.ZkStateReader Updated live nodes from ZooKeeper... (0) -> (1)
   [junit4]   2> 1740009 INFO  (jetty-launcher-2677-thread-2) [n:127.0.0.1:46437_solr    ] o.a.s.c.c.ZkStateReader Updated live nodes from ZooKeeper... (0) -> (1)
   [junit4]   2> 1740012 INFO  (jetty-launcher-2677-thread-2) [n:127.0.0.1:46437_solr    ] o.a.s.c.Overseer Overseer (id=null) closing
   [junit4]   2> 1740014 INFO  (jetty-launcher-2677-thread-2) [n:127.0.0.1:46437_solr    ] o.a.s.c.TransientSolrCoreCacheDefault Allocating transient cache for 2147483647 transient cores
   [junit4]   2> 1740014 INFO  (jetty-launcher-2677-thread-2) [n:127.0.0.1:46437_solr    ] o.a.s.c.ZkController Register node as live in ZooKeeper:/live_nodes/127.0.0.1:46437_solr
   [junit4]   2> 1740023 INFO  (zkConnectionManagerCallback-2711-thread-1) [    ] o.a.s.c.c.ConnectionManager zkClient has connected
   [junit4]   2> 1740023 WARN  (NIOServerCxn.Factory:0.0.0.0/0.0.0.0:0) [    ] o.a.z.s.NIOServerCnxn Unable to read additional data from client sessionid 0x10641cc7a21000b, likely client has closed socket
   [junit4]   2> 1740054 INFO  (zkConnectionManagerCallback-2717-thread-1) [    ] o.a.s.c.c.ConnectionManager zkClient has connected
   [junit4]   2> 1740061 INFO  (jetty-launcher-2677-thread-1) [n:127.0.0.1:36550_solr    ] o.a.s.c.c.ZkStateReader Updated live nodes from ZooKeeper... (0) -> (2)
   [junit4]   2> 1740063 INFO  (jetty-launcher-2677-thread-1) [n:127.0.0.1:36550_solr    ] o.a.s.c.Overseer Overseer (id=null) closing
   [junit4]   2> 1740065 INFO  (jetty-launcher-2677-thread-1) [n:127.0.0.1:36550_solr    ] o.a.s.c.TransientSolrCoreCacheDefault Allocating transient cache for 2147483647 transient cores
   [junit4]   2> 1740065 INFO  (jetty-launcher-2677-thread-1) [n:127.0.0.1:36550_solr    ] o.a.s.c.ZkController Register node as live in ZooKeeper:/live_nodes/127.0.0.1:36550_solr
   [junit4]   2> 1740070 INFO  (zkCallback-2714-thread-1) [    ] o.a.s.c.c.ZkStateReader Updated live nodes from ZooKeeper... (0) -> (3)
   [junit4]   2> 1740231 INFO  (zkCallback-2716-thread-1) [    ] o.a.s.c.c.ZkStateReader Updated live nodes from ZooKeeper... (2) -> (3)
   [junit4]   2> 1740231 INFO  (zkCallback-2697-thread-1) [    ] o.a.s.c.c.ZkStateReader Updated live nodes from ZooKeeper... (1) -> (3)
   [junit4]   2> 1740231 INFO  (zkCallback-2706-thread-1) [    ] o.a.s.c.c.ZkStateReader Updated live nodes from ZooKeeper... (1) -> (3)
   [junit4]   2> 1740256 INFO  (zkConnectionManagerCallback-2723-thread-1) [    ] o.a.s.c.c.ConnectionManager zkClient has connected
   [junit4]   2> 1740264 INFO  (jetty-launcher-2677-thread-4) [n:127.0.0.1:51759_solr    ] o.a.s.c.c.ZkStateReader Updated live nodes from ZooKeeper... (0) -> (3)
   [junit4]   2> 1740266 INFO  (jetty-launcher-2677-thread-4) [n:127.0.0.1:51759_solr    ] o.a.s.c.Overseer Overseer (id=null) closing
   [junit4]   2> 1740268 INFO  (jetty-launcher-2677-thread-4) [n:127.0.0.1:51759_solr    ] o.a.s.c.TransientSolrCoreCacheDefault Allocating transient cache for 2147483647 transient cores
   [junit4]   2> 1740269 INFO  (jetty-launcher-2677-thread-4) [n:127.0.0.1:51759_solr    ] o.a.s.c.ZkController Register node as live in ZooKeeper:/live_nodes/127.0.0.1:51759_solr
   [junit4]   2> 1740270 INFO  (zkCallback-2714-thread-1) [    ] o.a.s.c.c.ZkStateReader Updated live nodes from ZooKeeper... (3) -> (4)
   [junit4]   2> 1740270 INFO  (zkCallback-2706-thread-1) [    ] o.a.s.c.c.ZkStateReader Updated live nodes from ZooKeeper... (3) -> (4)
   [junit4]   2> 1740271 INFO  (zkCallback-2716-thread-1) [    ] o.a.s.c.c.ZkStateReader Updated live nodes from ZooKeeper... (3) -> (4)
   [junit4]   2> 1740271 INFO  (zkCallback-2697-thread-1) [    ] o.a.s.c.c.ZkStateReader Updated live nodes from ZooKeeper... (3) -> (4)
   [junit4]   2> 1740347 INFO  (zkCallback-2722-thread-1) [    ] o.a.s.c.c.ZkStateReader Updated live nodes from ZooKeeper... (3) -> (4)
   [junit4]   2> 1741555 INFO  (jetty-launcher-2677-thread-4) [n:127.0.0.1:51759_solr    ] o.a.s.m.r.SolrJmxReporter JMX monitoring for 'solr_51759.solr.node' (registry 'solr.node') enabled at server: com.sun.jmx.mbeanserver.JmxMBeanServer@6839015f
   [junit4]   2> 1741627 INFO  (jetty-launcher-2677-thread-2) [n:127.0.0.1:46437_solr    ] o.a.s.m.r.SolrJmxReporter JMX monitoring for 'solr_46437.solr.node' (registry 'solr.node') enabled at server: com.sun.jmx.mbeanserver.JmxMBeanServer@6839015f
   [junit4]   2> 1741669 INFO  (jetty-launcher-2677-thread-2) [n:127.0.0.1:46437_solr    ] o.a.s.m.r.SolrJmxReporter JMX monitoring for 'solr_46437.solr.jvm' (registry 'solr.jvm') enabled at server: com.sun.jmx.mbeanserver.JmxMBeanServer@6839015f
   [junit4]   2> 1741669 INFO  (jetty-launcher-2677-thread-2) [n:127.0.0.1:46437_solr    ] o.a.s.m.r.SolrJmxReporter JMX monitoring for 'solr_46437.solr.jetty' (registry 'solr.jetty') enabled at server: com.sun.jmx.mbeanserver.JmxMBeanServer@6839015f
   [junit4]   2> 1741673 INFO  (jetty-launcher-2677-thread-4) [n:127.0.0.1:51759_solr    ] o.a.s.m.r.SolrJmxReporter JMX monitoring for 'solr_51759.solr.jvm' (registry 'solr.jvm') enabled at server: com.sun.jmx.mbeanserver.JmxMBeanServer@6839015f
   [junit4]   2> 1741673 INFO  (jetty-launcher-2677-thread-4) [n:127.0.0.1:51759_solr    ] o.a.s.m.r.SolrJmxReporter JMX monitoring for 'solr_51759.solr.jetty' (registry 'solr.jetty') enabled at server: com.sun.jmx.mbeanserver.JmxMBeanServer@6839015f
   [junit4]   2> 1741691 INFO  (jetty-launcher-2677-thread-2) [n:127.0.0.1:46437_solr    ] o.a.s.c.CorePropertiesLocator Found 0 core definitions underneath /x1/jenkins/jenkins-slave/workspace/Lucene-Solr-Tests-master/solr/build/solr-core/test/J0/temp/solr.cloud.autoscaling.SearchRateTriggerTest_530F4649DF8F02FC-001/tempDir-001/node2/.
   [junit4]   2> 1741691 INFO  (jetty-launcher-2677-thread-4) [n:127.0.0.1:51759_solr    ] o.a.s.c.CorePropertiesLocator Found 0 core definitions underneath /x1/jenkins/jenkins-slave/workspace/Lucene-Solr-Tests-master/solr/build/solr-core/test/J0/temp/solr.cloud.autoscaling.SearchRateTriggerTest_530F4649DF8F02FC-001/tempDir-001/node4/.
   [junit4]   2> 1741813 INFO  (zkConnectionManagerCallback-2731-thread-1) [    ] o.a.s.c.c.ConnectionManager zkClient has connected
   [junit4]   2> 1741817 INFO  (jetty-launcher-2677-thread-2) [n:127.0.0.1:46437_solr    ] o.a.s.c.c.ZkStateReader Updated live nodes from ZooKeeper... (0) -> (4)
   [junit4]   2> 1741818 INFO  (zkConnectionManagerCallback-2735-thread-1) [    ] o.a.s.c.c.ConnectionManager zkClient has connected
   [junit4]   2> 1741819 INFO  (jetty-launcher-2677-thread-2) [n:127.0.0.1:46437_solr    ] o.a.s.c.s.i.ZkClientClusterStateProvider Cluster at 127.0.0.1:50797/solr ready
   [junit4]   2> 1741828 INFO  (jetty-launcher-2677-thread-4) [n:127.0.0.1:51759_solr    ] o.a.s.c.c.ZkStateReader Updated live nodes from ZooKeeper... (0) -> (4)
   [junit4]   2> 1741829 INFO  (jetty-launcher-2677-thread-4) [n:127.0.0.1:51759_solr    ] o.a.s.c.s.i.ZkClientClusterStateProvider Cluster at 127.0.0.1:50797/solr ready
   [junit4]   2> 1741843 INFO  (jetty-launcher-2677-thread-1) [n:127.0.0.1:36550_solr    ] o.a.s.m.r.SolrJmxReporter JMX monitoring for 'solr_36550.solr.node' (registry 'solr.node') enabled at server: com.sun.jmx.mbeanserver.JmxMBeanServer@6839015f
   [junit4]   2> 1741858 INFO  (jetty-launcher-2677-thread-3) [n:127.0.0.1:45659_solr    ] o.a.s.m.r.SolrJmxReporter JMX monitoring for 'solr_45659.solr.node' (registry 'solr.node') enabled at server: com.sun.jmx.mbeanserver.JmxMBeanServer@6839015f
   [junit4]   2> 1741938 INFO  (jetty-launcher-2677-thread-1) [n:127.0.0.1:36550_solr    ] o.a.s.m.r.SolrJmxReporter JMX monitoring for 'solr_36550.solr.jvm' (registry 'solr.jvm') enabled at server: com.sun.jmx.mbeanserver.JmxMBeanServer@6839015f
   [junit4]   2> 1741938 INFO  (jetty-launcher-2677-thread-1) [n:127.0.0.1:36550_solr    ] o.a.s.m.r.SolrJmxReporter JMX monitoring for 'solr_36550.solr.jetty' (registry 'solr.jetty') enabled at server: com.sun.jmx.mbeanserver.JmxMBeanServer@6839015f
   [junit4]   2> 1741976 INFO  (jetty-launcher-2677-thread-3) [n:127.0.0.1:45659_solr    ] o.a.s.m.r.SolrJmxReporter JMX monitoring for 'solr_45659.solr.jvm' (registry 'solr.jvm') enabled at server: com.sun.jmx.mbeanserver.JmxMBeanServer@6839015f
   [junit4]   2> 1741976 INFO  (jetty-launcher-2677-thread-3) [n:127.0.0.1:45659_solr    ] o.a.s.m.r.SolrJmxReporter JMX monitoring for 'solr_45659.solr.jetty' (registry 'solr.jetty') enabled at server: com.sun.jmx.mbeanserver.JmxMBeanServer@6839015f
   [junit4]   2> 1741978 INFO  (jetty-launcher-2677-thread-3) [n:127.0.0.1:45659_solr    ] o.a.s.c.CorePropertiesLocator Found 0 core definitions underneath /x1/jenkins/jenkins-slave/workspace/Lucene-Solr-Tests-master/solr/build/solr-core/test/J0/temp/solr.cloud.autoscaling.SearchRateTriggerTest_530F4649DF8F02FC-001/tempDir-001/node3/.
   [junit4]   2> 1741984 INFO  (jetty-launcher-2677-thread-1) [n:127.0.0.1:36550_solr    ] o.a.s.c.CorePropertiesLocator Found 0 core definitions underneath /x1/jenkins/jenkins-slave/workspace/Lucene-Solr-Tests-master/solr/build/solr-core/test/J0/temp/solr.cloud.autoscaling.SearchRateTriggerTest_530F4649DF8F02FC-001/tempDir-001/node1/.
   [junit4]   2> 1742028 INFO  (zkConnectionManagerCallback-2740-thread-1) [    ] o.a.s.c.c.ConnectionManager zkClient has connected
   [junit4]   2> 1742029 INFO  (jetty-launcher-2677-thread-1) [n:127.0.0.1:36550_solr    ] o.a.s.c.c.ZkStateReader Updated live nodes from ZooKeeper... (0) -> (4)
   [junit4]   2> 1742030 INFO  (jetty-launcher-2677-thread-1) [n:127.0.0.1:36550_solr    ] o.a.s.c.s.i.ZkClientClusterStateProvider Cluster at 127.0.0.1:50797/solr ready
   [junit4]   2> 1742807 INFO  (zkConnectionManagerCallback-2742-thread-1) [    ] o.a.s.c.c.ConnectionManager zkClient has connected
   [junit4]   2> 1742827 INFO  (zkConnectionManagerCallback-2747-thread-1) [    ] o.a.s.c.c.ConnectionManager zkClient has connected
   [junit4]   2> 1742828 INFO  (SUITE-SearchRateTriggerTest-seed#[530F4649DF8F02FC]-worker) [    ] o.a.s.c.c.ZkStateReader Updated live nodes from ZooKeeper... (0) -> (4)
   [junit4]   2> 1742829 INFO  (SUITE-SearchRateTriggerTest-seed#[530F4649DF8F02FC]-worker) [    ] o.a.s.c.s.i.ZkClientClusterStateProvider Cluster at 127.0.0.1:50797/solr ready
   [junit4]   2> 1743373 INFO  (TEST-SearchRateTriggerTest.testWaitForElapsed-seed#[530F4649DF8F02FC]) [    ] o.a.s.SolrTestCaseJ4 ###Starting testWaitForElapsed
   [junit4]   2> 1743374 INFO  (TEST-SearchRateTriggerTest.testWaitForElapsed-seed#[530F4649DF8F02FC]) [    ] o.a.s.c.c.ZkStateReader Updated live nodes from ZooKeeper... (0) -> (4)
   [junit4]   2> 1743607 INFO  (qtp924348450-10840) [n:127.0.0.1:45659_solr    ] o.a.s.h.a.CollectionsHandler Invoked Collection Action :create with params replicationFactor=2&collection.configName=conf&maxShardsPerNode=1&name=SearchRateTriggerTest-collection1&nrtReplicas=2&action=CREATE&numShards=2&wt=javabin&version=2 and sendToOCPQueue=true
   [junit4]   2> 1743623 INFO  (OverseerThreadFactory-3544-thread-1) [    ] o.a.s.c.a.c.CreateCollectionCmd Create collection SearchRateTriggerTest-collection1
   [junit4]   2> 1743782 INFO  (OverseerStateUpdate-73818790376308743-127.0.0.1:45659_solr-n_0000000000) [    ] o.a.s.c.o.SliceMutator createReplica() {
   [junit4]   2>   "operation":"ADDREPLICA",
   [junit4]   2>   "collection":"SearchRateTriggerTest-collection1",
   [junit4]   2>   "shard":"shard1",
   [junit4]   2>   "core":"SearchRateTriggerTest-collection1_shard1_replica_n1",
   [junit4]   2>   "state":"down",
   [junit4]   2>   "base_url":"https://127.0.0.1:45659/solr",
   [junit4]   2>   "type":"NRT",
   [junit4]   2>   "waitForFinalState":"false"} 
   [junit4]   2> 1743786 INFO  (OverseerStateUpdate-73818790376308743-127.0.0.1:45659_solr-n_0000000000) [    ] o.a.s.c.o.SliceMutator createReplica() {
   [junit4]   2>   "operation":"ADDREPLICA",
   [junit4]   2>   "collection":"SearchRateTriggerTest-collection1",
   [junit4]   2>   "shard":"shard1",
   [junit4]   2>   "core":"SearchRateTriggerTest-collection1_shard1_replica_n3",
   [junit4]   2>   "state":"down",
   [junit4]   2>   "base_url":"https://127.0.0.1:51759/solr",
   [junit4]   2>   "type":"NRT",
   [junit4]   2>   "waitForFinalState":"false"} 
   [junit4]   2> 1743789 INFO  (OverseerStateUpdate-73818790376308743-127.0.0.1:45659_solr-n_0000000000) [    ] o.a.s.c.o.SliceMutator createReplica() {
   [junit4]   2>   "operation":"ADDREPLICA",
   [junit4]   2>   "collection":"SearchRateTriggerTest-collection1",
   [junit4]   2>   "shard":"shard2",
   [junit4]   2>   "core":"SearchRateTriggerTest-collection1_shard2_replica_n5",
   [junit4]   2>   "state":"down",
   [junit4]   2>   "base_url":"https://127.0.0.1:46437/solr",
   [junit4]   2>   "type":"NRT",
   [junit4]   2>   "waitForFinalState":"false"} 
   [junit4]   2> 1743793 INFO  (OverseerStateUpdate-73818790376308743-127.0.0.1:45659_solr-n_0000000000) [    ] o.a.s.c.o.SliceMutator createReplica() {
   [junit4]   2>   "operation":"ADDREPLICA",
   [junit4]   2>   "collection":"SearchRateTriggerTest-collection1",
   [junit4]   2>   "shard":"shard2",
   [junit4]   2>   "core":"SearchRateTriggerTest-collection1_shard2_replica_n7",
   [junit4]   2>   "state":"down",
   [junit4]   2>   "base_url":"https://127.0.0.1:36550/solr",
   [junit4]   2>   "type":"NRT",
   [junit4]   2>   "waitForFinalState":"false"} 
   [junit4]   2> 1744108 INFO  (qtp1077484287-10850) [n:127.0.0.1:36550_solr    x:SearchRateTriggerTest-collection1_shard2_replica_n7] o.a.s.h.a.CoreAdminOperation core create command qt=/admin/cores&coreNodeName=core_node8&collection.configName=conf&newCollection=true&name=SearchRateTriggerTest-collection1_shard2_replica_n7&action=CREATE&numShards=2&collection=SearchRateTriggerTest-collection1&shard=shard2&wt=javabin&version=2&replicaType=NRT
   [junit4]   2> 1744128 INFO  (qtp1091253632-10827) [n:127.0.0.1:46437_solr    x:SearchRateTriggerTest-collection1_shard2_replica_n5] o.a.s.h.a.CoreAdminOperation core create command qt=/admin/cores&coreNodeName=core_node6&collection.configName=conf&newCollection=true&name=SearchRateTriggerTest-collection1_shard2_replica_n5&action=CREATE&numShards=2&collection=SearchRateTriggerTest-collection1&shard=shard2&wt=javabin&version=2&replicaType=NRT
   [junit4]   2> 1744185 INFO  (qtp1281400165-10858) [n:127.0.0.1:51759_solr    x:SearchRateTriggerTest-collection1_shard1_replica_n3] o.a.s.h.a.CoreAdminOperation core create command qt=/admin/cores&coreNodeName=core_node4&collection.configName=conf&newCollection=true&name=SearchRateTriggerTest-collection1_shard1_replica_n3&action=CREATE&numShards=2&collection=SearchRateTriggerTest-collection1&shard=shard1&wt=javabin&version=2&replicaType=NRT
   [junit4]   2> 1744186 INFO  (qtp924348450-10839) [n:127.0.0.1:45659_solr    x:SearchRateTriggerTest-collection1_shard1_replica_n1] o.a.s.h.a.CoreAdminOperation core create command qt=/admin/cores&coreNodeName=core_node2&collection.configName=conf&newCollection=true&name=SearchRateTriggerTest-collection1_shard1_replica_n1&action=CREATE&numShards=2&collection=SearchRateTriggerTest-collection1&shard=shard1&wt=javabin&version=2&replicaType=NRT
   [junit4]   2> 1744186 INFO  (qtp924348450-10839) [n:127.0.0.1:45659_solr    x:SearchRateTriggerTest-collection1_shard1_replica_n1] o.a.s.c.TransientSolrCoreCacheDefault Allocating transient cache for 2147483647 transient cores
   [junit4]   2> 1745153 INFO  (qtp1091253632-10827) [n:127.0.0.1:46437_solr c:SearchRateTriggerTest-collection1 s:shard2 r:core_node6 x:SearchRateTriggerTest-collection1_shard2_replica_n5] o.a.s.c.SolrConfig Using Lucene MatchVersion: 8.0.0
   [junit4]   2> 1745175 INFO  (qtp1077484287-10850) [n:127.0.0.1:36550_solr c:SearchRateTriggerTest-collection1 s:shard2 r:core_node8 x:SearchRateTriggerTest-collection1_shard2_replica_n7] o.a.s.c.SolrConfig Using Lucene MatchVersion: 8.0.0
   [junit4]   2> 1745236 INFO  (qtp1077484287-10850) [n:127.0.0.1:36550_solr c:SearchRateTriggerTest-collection1 s:shard2 r:core_node8 x:SearchRateTriggerTest-collection1_shard2_replica_n7] o.a.s.s.IndexSchema [SearchRateTriggerTest-collection1_shard2_replica_n7] Schema name=minimal
   [junit4]   2> 1745239 INFO  (qtp1091253632-10827) [n:127.0.0.1:46437_solr c:SearchRateTriggerTest-collection1 s:shard2 r:core_node6 x:SearchRateTriggerTest-collection1_shard2_replica_n5] o.a.s.s.IndexSchema [SearchRateTriggerTest-collection1_shard2_replica_n5] Schema name=minimal
   [junit4]   2> 1745255 INFO  (qtp1077484287-10850) [n:127.0.0.1:36550_solr c:SearchRateTriggerTest-collection1 s:shard2 r:core_node8 x:SearchRateTriggerTest-collection1_shard2_replica_n7] o.a.s.s.IndexSchema Loaded schema minimal/1.1 with uniqueid field id
   [junit4]   2> 1745256 INFO  (qtp1077484287-10850) [n:127.0.0.1:36550_solr c:SearchRateTriggerTest-collection1 s:shard2 r:core_node8 x:SearchRateTriggerTest-collection1_shard2_replica_n7] o.a.s.c.CoreContainer Creating SolrCore 'SearchRateTriggerTest-collection1_shard2_replica_n7' using configuration from collection SearchRateTriggerTest-collection1, trusted=true
   [junit4]   2> 1745256 INFO  (qtp1077484287-10850) [n:127.0.0.1:36550_solr c:SearchRateTriggerTest-collection1 s:shard2 r:core_node8 x:SearchRateTriggerTest-collection1_shard2_replica_n7] o.a.s.m.r.SolrJmxReporter JMX monitoring for 'solr_36550.solr.core.SearchRateTriggerTest-collection1.shard2.replica_n7' (registry 'solr.core.SearchRateTriggerTest-collection1.shard2.replica_n7') enabled at server: com.sun.jmx.mbeanserver.JmxMBeanServer@6839015f
   [junit4]   2> 1745256 INFO  (qtp1077484287-10850) [n:127.0.0.1:36550_solr c:SearchRateTriggerTest-collection1 s:shard2 r:core_node8 x:SearchRateTriggerTest-collection1_shard2_replica_n7] o.a.s.c.SolrCore solr.RecoveryStrategy.Builder
   [junit4]   2> 1745257 INFO  (qtp1077484287-10850) [n:127.0.0.1:36550_solr c:SearchRateTriggerTest-collection1 s:shard2 r:core_node8 x:SearchRateTriggerTest-collection1_shard2_replica_n7] o.a.s.c.SolrCore [[SearchRateTriggerTest-collection1_shard2_replica_n7] ] Opening new SolrCore at [/x1/jenkins/jenkins-slave/workspace/Lucene-Solr-Tests-master/solr/build/solr-core/test/J0/temp/solr.cloud.autoscaling.SearchRateTriggerTest_530F4649DF8F02FC-001/tempDir-001/node1/SearchRateTriggerTest-collection1_shard2_replica_n7], dataDir=[/x1/jenkins/jenkins-slave/workspace/Lucene-Solr-Tests-master/solr/build/solr-core/test/J0/temp/solr.cloud.autoscaling.SearchRateTriggerTest_530F4649DF8F02FC-001/tempDir-001/node1/./SearchRateTriggerTest-collection1_shard2_replica_n7/data/]
   [junit4]   2> 1745255 INFO  (qtp1091253632-10827) [n:127.0.0.1:46437_solr c:SearchRateTriggerTest-collection1 s:shard2 r:core_node6 x:SearchRateTriggerTest-collection1_shard2_replica_n5] o.a.s.s.IndexSchema Loaded schema minimal/1.1 with uniqueid field id
   [junit4]   2> 1745257 INFO  (qtp1091253632-10827) [n:127.0.0.1:46437_solr c:SearchRateTriggerTest-collection1 s:shard2 r:core_node6 x:SearchRateTriggerTest-collection1_shard2_replica_n5] o.a.s.c.CoreContainer Creating SolrCore 'SearchRateTriggerTest-collection1_shard2_replica_n5' using configuration from collection SearchRateTriggerTest-collection1, trusted=true
   [junit4]   2> 1745258 INFO  (qtp1091253632-10827) [n:127.0.0.1:46437_solr c:SearchRateTriggerTest-collection1 s:shard2 r:core_node6 x:SearchRateTriggerTest-collection1_shard2_replica_n5] o.a.s.m.r.SolrJmxReporter JMX monitoring for 'solr_46437.solr.core.SearchRateTriggerTest-collection1.shard2.replica_n5' (registry 'solr.core.SearchRateTriggerTest-collection1.shard2.replica_n5') enabled at server: com.sun.jmx.mbeanserver.JmxMBeanServer@6839015f
   [junit4]   2> 1745258 INFO  (qtp1091253632-10827) [n:127.0.0.1:46437_solr c:SearchRateTriggerTest-collection1 s:shard2 r:core_node6 x:SearchRateTriggerTest-collection1_shard2_replica_n5] o.a.s.c.SolrCore solr.RecoveryStrategy.Builder
   [junit4]   2> 1745258 INFO  (qtp1091253632-10827) [n:127.0.0.1:46437_solr c:SearchRateTriggerTest-collection1 s:shard2 r:core_node6 x:SearchRateTriggerTest-collection1_shard2_replica_n5] o.a.s.c.SolrCore [[SearchRateTriggerTest-collection1_shard2_replica_n5] ] Opening new SolrCore at [/x1/jenkins/jenkins-slave/workspace/Lucene-Solr-Tests-master/solr/build/solr-core/test/J0/temp/solr.cloud.autoscaling.SearchRateTriggerTest_530F4649DF8F02FC-001/tempDir-001/node2/SearchRateTriggerTest-collection1_shard2_replica_n5], dataDir=[/x1/jenkins/jenkins-slave/workspace/Lucene-Solr-Tests-master/solr/build/solr-core/test/J0/temp/solr.cloud.autoscaling.SearchRateTriggerTest_530F4649DF8F02FC-001/tempDir-001/node2/./SearchRateTriggerTest-collection1_shard2_replica_n5/data/]
   [junit4]   2> 1745283 INFO  (qtp1281400165-10858) [n:127.0.0.1:51759_solr c:SearchRateTriggerTest-collection1 s:shard1 r:core_node4 x:SearchRateTriggerTest-collection1_shard1_replica_n3] o.a.s.c.SolrConfig Using Lucene MatchVersion: 8.0.0
   [junit4]   2> 1745285 INFO  (qtp924348450-10839) [n:127.0.0.1:45659_solr c:SearchRateTriggerTest-collection1 s:shard1 r:core_node2 x:SearchRateTriggerTest-collection1_shard1_replica_n1] o.a.s.c.SolrConfig Using Lucene MatchVersion: 8.0.0
   [junit4]   2> 1745304 INFO  (qtp1281400165-10858) [n:127.0.0.1:51759_solr c:SearchRateTriggerTest-collection1 s:shard1 r:core_node4 x:SearchRateTriggerTest-collection1_shard1_replica_n3] o.a.s.s.IndexSchema [SearchRateTriggerTest-collection1_shard1_replica_n3] Schema name=minimal
   [junit4]   2> 1745309 INFO  (qtp924348450-10839) [n:127.0.0.1:45659_solr c:SearchRateTriggerTest-collection1 s:shard1 r:core_node2 x:SearchRateTriggerTest-collection1_shard1_replica_n1] o.a.s.s.IndexSchema [SearchRateTriggerTest-collection1_shard1_replica_n1] Schema name=minimal
   [junit4]   2> 1745330 INFO  (qtp924348450-10839) [n:127.0.0.1:45659_solr c:SearchRateTriggerTest-collection1 s:shard1 r:core_node2 x:SearchRateTriggerTest-collection1_shard1_replica_n1] o.a.s.s.IndexSchema Loaded schema minimal/1.1 with uniqueid field id
   [junit4]   2> 1745330 INFO  (qtp924348450-10839) [n:127.0.0.1:45659_solr c:SearchRateTriggerTest-collection1 s:shard1 r:core_node2 x:SearchRateTriggerTest-collection1_shard1_replica_n1] o.a.s.c.CoreContainer Creating SolrCore 'SearchRateTriggerTest-collection1_shard1_replica_n1' using configuration from collection SearchRateTriggerTest-collection1, trusted=true
   [junit4]   2> 1745332 INFO  (qtp1281400165-10858) [n:127.0.0.1:51759_solr c:SearchRateTriggerTest-collection1 s:shard1 r:core_node4 x:SearchRateTriggerTest-collection1_shard1_replica_n3] o.a.s.s.IndexSchema Loaded schema minimal/1.1 with uniqueid field id
   [junit4]   2> 1745332 INFO  (qtp1281400165-10858) [n:127.0.0.1:51759_solr c:SearchRateTriggerTest-collection1 s:shard1 r:core_node4 x:SearchRateTriggerTest-collection1_shard1_replica_n3] o.a.s.c.CoreContainer Creating SolrCore 'SearchRateTriggerTest-collection1_shard1_replica_n3' using configuration from collection SearchRateTriggerTest-collection1, trusted=true
   [junit4]   2> 1745333 INFO  (qtp1281400165-10858) [n:127.0.0.1:51759_solr c:SearchRateTriggerTest-collection1 s:shard1 r:core_node4 x:SearchRateTriggerTest-collection1_shard1_replica_n3] o.a.s.m.r.SolrJmxReporter JMX monitoring for 'solr_51759.solr.core.SearchRateTriggerTest-collection1.shard1.replica_n3' (registry 'solr.core.SearchRateTriggerTest-collection1.shard1.replica_n3') enabled at server: com.sun.jmx.mbeanserver.JmxMBeanServer@6839015f
   [junit4]   2> 1745333 INFO  (qtp1281400165-10858) [n:127.0.0.1:51759_solr c:SearchRateTriggerTest-collection1 s:shard1 r:core_node4 x:SearchRateTriggerTest-collection1_shard1_replica_n3] o.a.s.c.SolrCore solr.RecoveryStrategy.Builder
   [junit4]   2> 1745333 INFO  (qtp1281400165-10858) [n:127.0.0.1:51759_solr c:SearchRateTriggerTest-collection1 s:shard1 r:core_node4 x:SearchRateTriggerTest-collection1_shard1_replica_n3] o.a.s.c.SolrCore [[SearchRateTriggerTest-collection1_shard1_replica_n3] ] Opening new SolrCore at [/x1/jenkins/jenkins-slave/workspace/Lucene-Solr-Tests-master/solr/build/solr-core/test/J0/temp/solr.cloud.autoscaling.SearchRateTriggerTest_530F4649DF8F02FC-001/tempDir-001/node4/SearchRateTriggerTest-collection1_shard1_replica_n3], dataDir=[/x1/jenkins/jenkins-slave/workspace/Lucene-Solr-Tests-master/solr/build/solr-core/test/J0/temp/solr.cloud.autoscaling.SearchRateTriggerTest_530F4649DF8F02FC-001/tempDir-001/node4/./SearchRateTriggerTest-collection1_shard1_replica_n3/data/]
   [junit4]   2> 1745404 INFO  (qtp924348450-10839) [n:127.0.0.1:45659_solr c:SearchRateTriggerTest-collection1 s:shard1 r:core_node2 x:SearchRateTriggerTest-collection1_shard1_replica_n1] o.a.s.m.r.SolrJmxReporter JMX monitoring for 'solr_45659.solr.core.SearchRateTriggerTest-collection1.shard1.replica_n1' (registry 'solr.core.SearchRateTriggerTest-collection1.shard1.replica_n1') enabled at server: com.sun.jmx.mbeanserver.JmxMBeanServer@6839015f
   [junit4]   2> 1745405 INFO  (qtp924348450-10839) [n:127.0.0.1:45659_solr c:SearchRateTriggerTest-collection1 s:shard1 r:core_node2 x:SearchRateTriggerTest-collection1_shard1_replica_n1] o.a.s.c.SolrCore solr.RecoveryStrategy.Builder
   [junit4]   2> 1745405 INFO  (qtp924348450-10839) [n:127.0.0.1:45659_solr c:SearchRateTriggerTest-collection1 s:shard1 r:core_node2 x:SearchRateTriggerTest-collection1_shard1_replica_n1] o.a.s.c.SolrCore [[SearchRateTriggerTest-collection1_shard1_replica_n1] ] Opening new SolrCore at [/x1/jenkins/jenkins-slave/workspace/Lucene-Solr-Tests-master/solr/build/solr-core/test/J0/temp/solr.cloud.autoscaling.SearchRateTriggerTest_530F4649DF8F02FC-001/tempDir-001/node3/SearchRateTriggerTest-collection1_shard1_replica_n1], dataDir=[/x1/jenkins/jenkins-slave/workspace/Lucene-Solr-Tests-master/solr/build/solr-core/test/J0/temp/solr.cloud.autoscaling.SearchRateTriggerTest_530F4649DF8F02FC-001/tempDir-001/node3/./SearchRateTriggerTest-collection1_shard1_replica_n1/data/]
   [junit4]   2> 1745667 INFO  (qtp1077484287-10850) [n:127.0.0.1:36550_solr c:SearchRateTriggerTest-collection1 s:shard2 r:core_node8 x:SearchRateTriggerTest-collection1_shard2_replica_n7] o.a.s.u.UpdateHandler Using UpdateLog implementation: org.apache.solr.update.UpdateLog
   [junit4]   2> 1745667 INFO  (qtp1077484287-10850) [n:127.0.0.1:36550_solr c:SearchRateTriggerTest-collection1 s:shard2 r:core_node8 x:SearchRateTriggerTest-collection1_shard2_replica_n7] o.a.s.u.UpdateLog Initializing UpdateLog: dataDir=null defaultSyncLevel=FLUSH numRecordsToKeep=100 maxNumLogsToKeep=10 numVersionBuckets=65536
   [junit4]   2> 1745698 INFO  (qtp1077484287-10850) [n:127.0.0.1:36550_solr c:SearchRateTriggerTest-collection1 s:shard2 r:core_node8 x:SearchRateTriggerTest-collection1_shard2_replica_n7] o.a.s.u.CommitTracker Hard AutoCommit: disabled
   [junit4]   2> 1745698 INFO  (qtp1077484287-10850) [n:127.0.0.1:36550_solr c:SearchRateTriggerTest-collection1 s:shard2 r:core_node8 x:SearchRateTriggerTest-collection1_shard2_replica_n7] o.a.s.u.CommitTracker Soft AutoCommit: disabled
   [junit4]   2> 1745719 INFO  (qtp1077484287-10850) [n:127.0.0.1:36550_solr c:SearchRateTriggerTest-collection1 s:shard2 r:core_node8 x:SearchRateTriggerTest-collection1_shard2_replica_n7] o.a.s.s.SolrIndexSearcher Opening [Searcher@693e7c95[SearchRateTriggerTest-collection1_shard2_replica_n7] main]
   [junit4]   2> 1745720 INFO  (qtp1077484287-10850) [n:127.0.0.1:36550_solr c:SearchRateTriggerTest-collection1 s:shard2 r:core_node8 x:SearchRateTriggerTest-collection1_shard2_replica_n7] o.a.s.r.ManagedResourceStorage Configured ZooKeeperStorageIO with znodeBase: /configs/conf
   [junit4]   2> 1745725 INFO  (qtp1077484287-10850) [n:127.0.0.1:36550_solr c:SearchRateTriggerTest-collection1 s:shard2 r:core_node8 x:SearchRateTriggerTest-collection1_shard2_replica_n7] o.a.s.r.ManagedResourceStorage Loaded null at path _rest_managed.json using ZooKeeperStorageIO:path=/configs/conf
   [junit4]   2> 1745726 INFO  (qtp1077484287-10850) [n:127.0.0.1:36550_solr c:SearchRateTriggerTest-collection1 s:shard2 r:core_node8 x:SearchRateTriggerTest-collection1_shard2_replica_n7] o.a.s.h.ReplicationHandler Commits will be reserved for 10000ms.
   [junit4]   2> 1745747 INFO  (searcherExecutor-3553-thread-1-processing-n:127.0.0.1:36550_solr x:SearchRateTriggerTest-collection1_shard2_replica_n7 c:SearchRateTriggerTest-collection1 s:shard2 r:core_node8) [n:127.0.0.1:36550_solr c:SearchRateTriggerTest-collection1 s:shard2 r:core_node8 x:SearchRateTriggerTest-collection1_shard2_replica_n7] o.a.s.c.SolrCore [SearchRateTriggerTest-collection1_shard2_replica_n7] Registered new searcher Searcher@693e7c95[SearchRateTriggerTest-collection1_shard2_replica_n7] main{ExitableDirectoryReader(UninvertingDirectoryReader())}
   [junit4]   2> 1745753 INFO  (qtp1077484287-10850) [n:127.0.0.1:36550_solr c:SearchRateTriggerTest-collection1 s:shard2 r:core_node8 x:SearchRateTriggerTest-collection1_shard2_replica_n7] o.a.s.u.UpdateLog Could not find max version in index or recent updates, using new clock 1600779015668367360
   [junit4]   2> 1745972 INFO  (qtp1281400165-10858) [n:127.0.0.1:51759_solr c:SearchRateTriggerTest-collection1 s:shard1 r:core_node4 x:SearchRateTriggerTest-collection1_shard1_replica_n3] o.a.s.u.UpdateHandler Using UpdateLog implementation: org.apache.solr.update.UpdateLog
   [junit4]   2> 1745972 INFO  (qtp1281400165-10858) [n:127.0.0.1:51759_solr c:SearchRateTriggerTest-collection1 s:shard1 r:core_node4 x:SearchRateTriggerTest-collection1_shard1_replica_n3] o.a.s.u.UpdateLog Initializing UpdateLog: dataDir=null defaultSyncLevel=FLUSH numRecordsToKeep=100 maxNumLogsToKeep=10 numVersionBuckets=65536
   [junit4]   2> 1745974 INFO  (qtp1281400165-10858) [n:127.0.0.1:51759_solr c:SearchRateTriggerTest-collection1 s:shard1 r:core_node4 x:SearchRateTriggerTest-collection1_shard1_replica_n3] o.a.s.u.CommitTracker Hard AutoCommit: disabled
   [junit4]   2> 1745974 INFO  (qtp1281400165-10858) [n:127.0.0.1:51759_solr c:SearchRateTriggerTest-collection1 s:shard1 r:core_node4 x:SearchRateTriggerTest-collection1_shard1_replica_n3] o.a.s.u.CommitTracker Soft AutoCommit: disabled
   [junit4]   2> 1745978 INFO  (qtp1077484287-10850) [n:127.0.0.1:36550_solr c:SearchRateTriggerTest-collection1 s:shard2 r:core_node8 x:SearchRateTriggerTest-collection1_shard2_replica_n7] o.a.s.c.ZkShardTerms Successful update of terms at /collections/SearchRateTriggerTest-collection1/terms/shard2 to Terms{values={core_node8=0}, version=0}
   [junit4]   2> 1745985 INFO  (qtp1077484287-10850) [n:127.0.0.1:36550_solr c:SearchRateTriggerTest-collection1 s:shard2 r:core_node8 x:SearchRateTriggerTest-collection1_shard2_replica_n7] o.a.s.c.ShardLeaderElectionContext Waiting until we see more replicas up for shard shard2: total=2 found=1 timeoutin=9998ms
   [junit4]   2> 1745985 INFO  (qtp1281400165-10858) [n:127.0.0.1:51759_solr c:SearchRateTriggerTest-collection1 s:shard1 r:core_node4 x:SearchRateTriggerTest-collection1_shard1_replica_n3] o.a.s.s.SolrIndexSearcher Opening [Searcher@3d9cbcc[SearchRateTriggerTest-collection1_shard1_replica_n3] main]
   [junit4]   2> 1745987 INFO  (qtp1281400165-10858) [n:127.0.0.1:51759_solr c:SearchRateTriggerTest-collection1 s:shard1 r:core_node4 x:SearchRateTriggerTest-collection1_shard1_replica_n3] o.a.s.r.ManagedResourceStorage Configured ZooKeeperStorageIO with znodeBase: /configs/conf
   [junit4]   2> 1745987 INFO  (qtp1281400165-10858) [n:127.0.0.1:51759_solr c:SearchRateTriggerTest-collection1 s:shard1 r:core_node4 x:SearchRateTriggerTest-collection1_shard1_replica_n3] o.a.s.r.ManagedResourceStorage Loaded null at path _rest_managed.json using ZooKeeperStorageIO:path=/configs/conf
   [junit4]   2> 1745988 INFO  (qtp1281400165-10858) [n:127.0.0.1:51759_solr c:SearchRateTriggerTest-collection1 s:shard1 r:core_node4 x:SearchRateTriggerTest-collection1_shard1_replica_n3] o.a.s.h.ReplicationHandler Commits will be reserved for 10000ms.
   [junit4]   2> 1745992 INFO  (qtp1281400165-10858) [n:127.0.0.1:51759_solr c:SearchRateTriggerTest-collection1 s:shard1 r:core_node4 x:SearchRateTriggerTest-collection1_shard1_replica_n3] o.a.s.u.UpdateLog Could not find max version in index or recent updates, using new clock 1600779015918977024
   [junit4]   2> 1746004 INFO  (qtp924348450-10839) [n:127.0.0.1:45659_solr c:SearchRateTriggerTest-collection1 s:shard1 r:core_node2 x:SearchRateTriggerTest-collection1_shard1_replica_n1] o.a.s.u.UpdateHandler Using UpdateLog implementation: org.apache.solr.update.UpdateLog
   [junit4]   2> 1746004 INFO  (qtp924348450-10839) [n:127.0.0.1:45659_solr c:SearchRateTriggerTest-collection1 s:shard1 r:core_node2 x:SearchRateTriggerTest-collection1_shard1_replica_n1] o.a.s.u.UpdateLog Initializing UpdateLog: dataDir=null defaultSyncLevel=FLUSH numRecordsToKeep=100 maxNumLogsToKeep=10 numVersionBuckets=65536
   [junit4]   2> 1746006 INFO  (qtp924348450-10839) [n:127.0.0.1:45659_solr c:SearchRateTriggerTest-collection1 s:shard1 r:core_node2 x:SearchRateTriggerTest-collection1_shard1_replica_n1] o.a.s.u.CommitTracker Hard AutoCommit: disabled
   [junit4]   2> 1746006 INFO  (qtp924348450-10839) [n:127.0.0.1:45659_solr c:SearchRateTriggerTest-collection1 s:shard1 r:core_node2 x:SearchRateTriggerTest-collection1_shard1_replica_n1] o.a.s.u.CommitTracker Soft AutoCommit: disabled
   [junit4]   2> 1746012 INFO  (qtp1281400165-10858) [n:127.0.0.1:51759_solr c:SearchRateTriggerTest-collection1 s:shard1 r:core_node4 x:SearchRateTriggerTest-collection1_shard1_replica_n3] o.a.s.c.ZkShardTerms Successful update of terms at /collections/SearchRateTriggerTest-collection1/terms/shard1 to Terms{values={core_node4=0}, version=0}
   [junit4]   2> 1746021 INFO  (qtp1281400165-10858) [n:127.0.0.1:51759_solr c:SearchRateTriggerTest-collection1 s:shard1 r:core_node4 x:SearchRateTriggerTest-collection1_shard1_replica_n3] o.a.s.c.ShardLeaderElectionContext Waiting until we see more replicas up for shard shard1: total=2 found=1 timeoutin=9999ms
   [junit4]   2> 1746035 INFO  (qtp924348450-10839) [n:127.0.0.1:45659_solr c:SearchRateTriggerTest-collection1 s:shard1 r:core_node2 x:SearchRateTriggerTest-collection1_shard1_replica_n1] o.a.s.s.SolrIndexSearcher Opening [Searcher@5db6da9a[SearchRateTriggerTest-collection1_shard1_replica_n1] main]
   [junit4]   2> 1746037 INFO  (searcherExecutor-3556-thread-1-processing-n:127.0.0.1:51759_solr x:SearchRateTriggerTest-collection1_shard1_replica_n3 c:SearchRateTriggerTest-collection1 s:shard1 r:core_node4) [n:127.0.0.1:51759_solr c:SearchRateTriggerTest-collection1 s:shard1 r:core_node4 x:SearchRateTriggerTest-collection1_shard1_replica_n3] o.a.s.c.SolrCore [SearchRateTriggerTest-collection1_shard1_replica_n3] Registered new searcher Searcher@3d9cbcc[SearchRateTriggerTest-collection1_shard1_replica_n3] main{ExitableDirectoryReader(UninvertingDirectoryReader())}
   [junit4]   2> 1746038 INFO  (qtp924348450-10839) [n:127.0.0.1:45659_solr c:SearchRateTriggerTest-collection1 s:shard1 r:core_node2 x:SearchRateTriggerTest-collection1_shard1_replica_n1] o.a.s.r.ManagedResourceStorage Configured ZooKeeperStorageIO with znodeBase: /configs/conf
   [junit4]   2> 1746038 INFO  (qtp924348450-10839) [n:127.0.0.1:45659_solr c:SearchRateTriggerTest-collection1 s:shard1 r:core_node2 x:SearchRateTriggerTest-collection1_shard1_replica_n1] o.a.s.r.ManagedResourceStorage Loaded null at path _rest_managed.json using ZooKeeperStorageIO:path=/configs/conf
   [junit4]   2> 1746039 INFO  (qtp924348450-10839) [n:127.0.0.1:45659_solr c:SearchRateTriggerTest-collection1 s:shard1 r:core_node2 x:SearchRateTriggerTest-collection1_shard1_replica_n1] o.a.s.h.ReplicationHandler Commits will be reserved for 10000ms.
   [junit4]   2> 1746039 INFO  (qtp924348450-10839) [n:127.0.0.1:45659_solr c:SearchRateTriggerTest-collection1 s:shard1 r:core_node2 x:SearchRateTriggerTest-collection1_shard1_replica_n1] o.a.s.u.UpdateLog Could not find max version in index or recent updates, using new clock 1600779015968260096
   [junit4]   2> 1746054 INFO  (qtp924348450-10839) [n:127.0.0.1:45659_solr c:SearchRateTriggerTest-collection1 s:shard1 r:core_node2 x:SearchRateTriggerTest-collection1_shard1_replica_n1] o.a.s.c.ZkShardTerms Successful update of terms at /collections/SearchRateTriggerTest-collection1/terms/shard1 to Terms{values={core_node2=0, core_node4=0}, version=1}
   [junit4]   2> 1746060 INFO  (searcherExecutor-3555-thread-1-processing-n:127.0.0.1:45659_solr x:SearchRateTriggerTest-collection1_shard1_replica_n1 c:SearchRateTriggerTest-collection1 s:shard1 r:core_node2) [n:127.0.0.1:45659_solr c:SearchRateTriggerTest-collection1 s:shard1 r:core_node2 x:SearchRateTriggerTest-collection1_shard1_replica_n1] o.a.s.c.SolrCore [SearchRateTriggerTest-collection1_shard1_replica_n1] Registered new searcher Searcher@5db6da9a[SearchRateTriggerTest-collection1_shard1_replica_n1] main{ExitableDirectoryReader(UninvertingDirectoryReader())}
   [junit4]   2> 1746064 INFO  (qtp1091253632-10827) [n:127.0.0.1:46437_solr c:SearchRateTriggerTest-collection1 s:shard2 r:core_node6 x:SearchRateTriggerTest-collection1_shard2_replica_n5] o.a.s.u.UpdateHandler Using UpdateLog implementation: org.apache.solr.update.UpdateLog
   [junit4]   2> 1746064 INFO  (qtp1091253632-10827) [n:127.0.0.1:46437_solr c:SearchRateTriggerTest-collection1 s:shard2 r:core_node6 x:SearchRateTriggerTest-collection1_shard2_replica_n5] o.a.s.u.UpdateLog Initializing UpdateLog: dataDir=null defaultSyncLevel=FLUSH numRecordsToKeep=100 maxNumLogsToKeep=10 numVersionBuckets=65536
   [junit4]   2> 1746065 INFO  (qtp1091253632-10827) [n:127.0.0.1:46437_solr c:SearchRateTriggerTest-collection1 s:shard2 r:core_node6 x:SearchRateTriggerTest-collection1_shard2_replica_n5] o.a.s.u.CommitTracker Hard AutoCommit: disabled
   [junit4]   2> 1746065 INFO  (qtp1091253632-10827) [n:127.0.0.1:46437_solr c:SearchRateTriggerTest-collection1 s:shard2 r:core_node6 x:SearchRateTriggerTest-collection1_shard2_replica_n5] o.a.s.u.CommitTracker Soft AutoCommit: disabled
   [junit4]   2> 1746068 INFO  (qtp1091253632-10827) [n:127.0.0.1:46437_solr c:SearchRateTriggerTest-collection1 s:shard2 r:core_node6 x:SearchRateTriggerTest-collection1_shard2_replica_n5] o.a.s.s.SolrIndexSearcher Opening [Searcher@620a5f6[SearchRateTriggerTest-collection1_shard2_replica_n5] main]
   [junit4]   2> 1746070 INFO  (qtp1091253632-10827) [n:127.0.0.1:46437_solr c:SearchRateTriggerTest-collection1 s:shard2 r:core_node6 x:SearchRateTriggerTest-collection1_shard2_replica_n5] o.a.s.r.ManagedResourceStorage Configured ZooKeeperStorageIO with znodeBase: /configs/conf
   [junit4]   2> 1746070 INFO  (qtp1091253632-10827) [n:127.0.0.1:46437_solr c:SearchRateTriggerTest-collection1 s:shard2 r:core_node6 x:SearchRateTriggerTest-collection1_shard2_replica_n5] o.a.s.r.ManagedResourceStorage Loaded null at path _rest_managed.json using ZooKeeperStorageIO:path=/configs/conf
   [junit4]   2> 1746071 INFO  (qtp1091253632-10827) [n:127.0.0.1:46437_solr c:SearchRateTriggerTest-collection1 s:shard2 r:core_node6 x:SearchRateTriggerTest-collection1_shard2_replica_n5] o.a.s.h.ReplicationHandler Commits will be reserved for 10000ms.
   [junit4]   2> 1746071 INFO  (qtp1091253632-10827) [n:127.0.0.1:46437_solr c:SearchRateTriggerTest-collection1 s:shard2 r:core_node6 x:SearchRateTriggerTest-collection1_shard2_replica_n5] o.a.s.u.UpdateLog Could not find max version in index or recent updates, using new clock 1600779016001814528
   [junit4]   2> 1746079 INFO  (qtp1091253632-10827) [n:127.0.0.1:46437_solr c:SearchRateTriggerTest-collection1 s:shard2 r:core_node6 x:SearchRateTriggerTest-collection1_shard2_replica_n5] o.a.s.c.ZkShardTerms Successful update of terms at /collections/SearchRateTriggerTest-collection1/terms/shard2 to Terms{values={core_node6=0, core_node8=0}, version=1}
   [junit4]   2> 1746082 INFO  (searcherExecutor-3554-thread-1-processing-n:127.0.0.1:46437_solr x:SearchRateTriggerTest-collection1_shard2_replica_n5 c:SearchRateTriggerTest-collection1 s:shard2 r:core_node6) [n:127.0.0.1:46437_solr c:SearchRateTriggerTest-collection1 s:shard2 r:core_node6 x:SearchRateTriggerTest-collection1_shard2_replica_n5] o.a.s.c.SolrCore [SearchRateTriggerTest-collection1_shard2_replica_n5] Registered new searcher Searcher@620a5f6[SearchRateTriggerTest-collection1_shard2_replica_n5] main{ExitableDirectoryReader(UninvertingDirectoryReader())}
   [junit4]   2> 1746486 INFO  (qtp1077484287-10850) [n:127.0.0.1:36550_solr c:SearchRateTriggerTest-collection1 s:shard2 r:core_node8 x:SearchRateTriggerTest-collection1_shard2_replica_n7] o.a.s.c.ShardLeaderElectionContext Enough replicas found to continue.
   [junit4]   2> 1746486 INFO  (qtp1077484287-10850) [n:127.0.0.1:36550_solr c:SearchRateTriggerTest-collection1 s:shard2 r:core_node8 x:SearchRateTriggerTest-collection1_shard2_replica_n7] o.a.s.c.ShardLeaderElectionContext I may be the new leader - try and sync
   [junit4]   2> 1746486 INFO  (qtp1077484287-10850) [n:127.0.0.1:36550_solr c:SearchRateTriggerTest-collection1 s:shard2 r:core_node8 x:SearchRateTriggerTest-collection1_shard2_replica_n7] o.a.s.c.SyncStrategy Sync replicas to https://127.0.0.1:36550/solr/SearchRateTriggerTest-collection1_shard2_replica_n7/
   [junit4]   2> 1746487 INFO  (qtp1077484287-10850) [n:127.0.0.1:36550_solr c:SearchRateTriggerTest-collection1 s:shard2 r:core_node8 x:SearchRateTriggerTest-collection1_shard2_replica_n7] o.a.s.u.PeerSync PeerSync: core=SearchRateTriggerTest-collection1_shard2_replica_n7 url=https://127.0.0.1:36550/solr START replicas=[https://127.0.0.1:46437/solr/SearchRateTriggerTest-collection1_shard2_replica_n5/] nUpdates=100
   [junit4]   2> 1746500 INFO  (qtp1091253632-10826) [n:127.0.0.1:46437_solr c:SearchRateTriggerTest-collection1 s:shard2 r:core_node6 x:SearchRateTriggerTest-collection1_shard2_replica_n5] o.a.s.c.S.Request [SearchRateTriggerTest-collection1_shard2_replica_n5]  webapp=/solr path=/get params={distrib=false&qt=/get&fingerprint=false&getVersions=100&wt=javabin&version=2} status=0 QTime=2
   [junit4]   2> 1746522 INFO  (qtp1281400165-10858) [n:127.0.0.1:51759_solr c:SearchRateTriggerTest-collection1 s:shard1 r:core_node4 x:SearchRateTriggerTest-collection1_shard1_replica_n3] o.a.s.c.ShardLeaderElectionContext Enough replicas found to continue.
   [junit4]   2> 1746522 INFO  (qtp1281400165-10858) [n:127.0.0.1:51759_solr c:SearchRateTriggerTest-collection1 s:shard1 r:core_node4 x:SearchRateTriggerTest-collection1_shard1_replica_n3] o.a.s.c.ShardLeaderElectionContext I may be the new leader - try and sync
   [junit4]   2> 1746522 INFO  (qtp1281400165-10858) [n:127.0.0.1:51759_solr c:SearchRateTriggerTest-collection1 s:shard1 r:core_node4 x:SearchRateTriggerTest-collection1_shard1_replica_n3] o.a.s.c.SyncStrategy Sync replicas to https://127.0.0.1:51759/solr/SearchRateTriggerTest-collection1_shard1_replica_n3/
   [junit4]   2> 1746523 INFO  (qtp1281400165-10858) [n:127.0.0.1:51759_solr c:SearchRateTriggerTest-collection1 s:shard1 r:core_node4 x:SearchRateTriggerTest-collection1_shard1_replica_n3] o.a.s.u.PeerSync PeerSync: core=SearchRateTriggerTest-collection1_shard1_replica_n3 url=https://127.0.0.1:51759/solr START replicas=[https://127.0.0.1:45659/solr/SearchRateTriggerTest-collection1_shard1_replica_n1/] nUpdates=100
   [junit4]   2> 1746559 INFO  (qtp924348450-10836) [n:127.0.0.1:45659_solr c:SearchRateTriggerTest-collection1 s:shard1 r:core_node2 x:SearchRateTriggerTest-collection1_shard1_replica_n1] o.a.s.c.S.Request [SearchRateTriggerTest-collection1_shard1_replica_n1]  webapp=/solr path=/get params={distrib=false&qt=/get&fingerprint=false&getVersions=100&wt=javabin&version=2} status=0 QTime=26
   [junit4]   2> 1746787 INFO  (qtp1077484287-10850) [n:127.0.0.1:36550_solr c:SearchRateTriggerTest-collection1 s:shard2 r:core_node8 x:SearchRateTriggerTest-collection1_shard2_replica_n7] o.a.s.u.PeerSync PeerSync: core=SearchRateTriggerTest-collection1_shard2_replica_n7 url=https://127.0.0.1:36550/solr DONE.  We have no versions.  sync failed.
   [junit4]   2> 1746788 INFO  (qtp1077484287-10850) [n:127.0.0.1:36550_solr c:SearchRateTriggerTest-collection1 s:shard2 r:core_node8 x:SearchRateTriggerTest-collection1_shard2_replica_n7] o.a.s.c.SyncStrategy Leader's attempt to sync with shard failed, moving to the next candidate
   [junit4]   2> 1746788 INFO  (qtp1077484287-10850) [n:127.0.0.1:36550_solr c:SearchRateTriggerTest-collection1 s:shard2 r:core_node8 x:SearchRateTriggerTest-collection1_shard2_replica_n7] o.a.s.c.ShardLeaderElectionContext We failed sync, but we have no versions - we can't sync in that case - we were active before, so become leader anyway
   [junit4]   2> 1746788 INFO  (qtp1077484287-10850) [n:127.0.0.1:36550_solr c:SearchRateTriggerTest-collection1 s:shard2 r:core_node8 x:SearchRateTriggerTest-collection1_shard2_replica_n7] o.a.s.c.ShardLeaderElectionContext Found all replicas participating in election, clear LIR
   [junit4]   2> 1746792 INFO  (qtp1077484287-10850) [n:127.0.0.1:36550_solr c:SearchRateTriggerTest-collection1 s:shard2 r:core_node8 x:SearchRateTriggerTest-collection1_shard2_replica_n7] o.a.s.c.ShardLeaderElectionContext I am the new leader: https://127.0.0.1:36550/solr/SearchRateTriggerTest-collection1_shard2_replica_n7/ shard2
   [junit4]   2> 1746823 INFO  (qtp1281400165-10858) [n:127.0.0.1:51759_solr c:SearchRateTriggerTest-collection1 s:shard1 r:core_node4 x:SearchRateTriggerTest-collection1_shard1_replica_n3] o.a.s.u.PeerSync PeerSync: core=SearchRateTriggerTest-collection1_shard1_replica_n3 url=https://127.0.0.1:51759/solr DONE.  We have no versions.  sync failed.
   [junit4]   2> 1746823 INFO  (qtp1281400165-10858) [n:127.0.0.1:51759_solr c:SearchRateTriggerTest-collection1 s:shard1 r:core_node4 x:SearchRateTriggerTest-collection1_shard1_replica_n3] o.a.s.c.SyncStrategy Leader's attempt to sync with shard failed, moving to the next candidate
   [junit4]   2> 1746823 INFO  (qtp1281400165-10858) [n:127.0.0.1:51759_solr c:SearchRateTriggerTest-collection1 s:shard1 r:core_node4 x:SearchRateTriggerTest-collection1_shard1_replica_n3] o.a.s.c.ShardLeaderElectionContext We failed sync, but we have no versions - we can't sync in that case - we were active before, so become leader anyway
   [junit4]   2> 1746823 INFO  (qtp1281400165-10858) [n:127.0.0.1:51759_solr c:SearchRateTriggerTest-collection1 s:shard1 r:core_node4 x:SearchRateTriggerTest-collection1_shard1_replica_n3] o.a.s.c.ShardLeaderElectionContext Found all replicas participating in election, clear LIR
   [junit4]   2> 1746829 INFO  (qtp1281400165-10858) [n:127.0.0.1:51759_solr c:SearchRateTriggerTest-collection1 s:shard1 r:core_node4 x:SearchRateTriggerTest-collection1_shard1_replica_n3] o.a.s.c.ShardLeaderElectionContext I am the new leader: https://127.0.0.1:51759/solr/SearchRateTriggerTest-collection1_shard1_replica_n3/ shard1
   [junit4]   2> 1747038 INFO  (qtp1077484287-10850) [n:127.0.0.1:36550_solr c:SearchRateTriggerTest-collection1 s:shard2 r:core_node8 x:SearchRateTriggerTest-collection1_shard2_replica_n7] o.a.s.c.ZkController I am the leader, no recovery necessary
   [junit4]   2> 1747041 INFO  (qtp1077484287-10850) [n:127.0.0.1:36550_solr c:SearchRateTriggerTest-collection1 s:shard2 r:core_node8 x:SearchRateTriggerTest-collection1_shard2_replica_n7] o.a.s.s.HttpSolrCall [admin] webapp=null path=/admin/cores params={qt=/admin/cores&coreNodeName=core_node8&collection.configName=conf&newCollection=true&name=SearchRateTriggerTest-collection1_shard2_replica_n7&action=CREATE&numShards=2&collection=SearchRateTriggerTest-collection1&shard=shard2&wt=javabin&version=2&replicaType=NRT} status=0 QTime=2933
   [junit4]   2> 1747048 INFO  (qtp1281400165-10858) [n:127.0.0.1:51759_solr c:SearchRateTriggerTest-collection1 s:shard1 r:core_node4 x:SearchRateTriggerTest-collection1_shard1_replica_n3] o.a.s.c.ZkController I am the leader, no recovery necessary
   [junit4]   2> 1747050 INFO  (qtp1281400165-10858) [n:127.0.0.1:51759_solr c:SearchRateTriggerTest-collection1 s:shard1 r:core_node4 x:SearchRateTriggerTest-collection1_shard1_replica_n3] o.a.s.s.HttpSolrCall [admin] webapp=null path=/admin/cores params={qt=/admin/cores&coreNodeName=core_node4&collection.configName=conf&newCollection=true&name=SearchRateTriggerTest-collection1_shard1_replica_n3&action=CREATE&numShards=2&collection=SearchRateTriggerTest-collection1&shard=shard1&wt=javabin&version=2&replicaType=NRT} status=0 QTime=2865
   [junit4]   2> 1747059 INFO  (qtp924348450-10839) [n:127.0.0.1:45659_solr c:SearchRateTriggerTest-collection1 s:shard1 r:core_node2 x:SearchRateTriggerTest-collection1_shard1_replica_n1] o.a.s.s.HttpSolrCall [admin] webapp=null path=/admin/cores params={qt=/admin/cores&coreNodeName=core_node2&collection.configName=conf&newCollection=true&name=SearchRateTriggerTest-collection1_shard1_replica_n1&action=CREATE&numShards=2&collection=SearchRateTriggerTest-collection1&shard=shard1&wt=javabin&version=2&replicaType=NRT} status=0 QTime=2873
   [junit4]   2> 1747088 INFO  (qtp1091253632-10827) [n:127.0.0.1:46437_solr c:SearchRateTriggerTest-collection1 s:shard2 r:core_node6 x:SearchRateTriggerTest-collection1_shard2_replica_n5] o.a.s.s.HttpSolrCall [admin] webapp=null path=/admin/cores params={qt=/admin/cores&coreNodeName=core_node6&collection.configName=conf&newCollection=true&name=SearchRateTriggerTest-collection1_shard2_replica_n5&action=CREATE&numShards=2&collection=SearchRateTriggerTest-collection1&shard=shard2&wt=javabin&version=2&replicaType=NRT} status=0 QTime=2960
   [junit4]   2> 1747093 INFO  (qtp924348450-10840) [n:127.0.0.1:45659_solr    ] o.a.s.h.a.CollectionsHandler Wait for new collection to be active for at most 30 seconds. Check all shard replicas
   [junit4]   2> 1747188 INFO  (zkCallback-2706-thread-1) [    ] o.a.s.c.c.ZkStateReader A cluster state change: [WatchedEvent state:SyncConnected type:NodeDataChanged path:/collections/SearchRateTriggerTest-collection1/state.json] for collection [SearchRateTriggerTest-collection1] has occurred - updating... (live nodes size: [4])
   [junit4]   2> 1747188 INFO  (zkCallback-2716-thread-1) [    ] o.a.s.c.c.ZkStateReader A cluster state change: [WatchedEvent state:SyncConnected type:NodeDataChanged path:/collections/SearchRateTriggerTest-collection1/state.json] for collection [SearchRateTriggerTest-collection1] has occurred - updating... (live nodes size: [4])
   [junit4]   2> 1747188 INFO  (zkCallback-2722-thread-1) [    ] o.a.s.c.c.ZkStateReader A cluster state change: [WatchedEvent state:SyncConnected type:NodeDataChanged path:/collections/SearchRateTriggerTest-collection1/state.json] for collection [SearchRateTriggerTest-collection1] has occurred - updating... (live nodes size: [4])
   [junit4]   2> 1747189 INFO  (zkCallback-2697-thread-1) [    ] o.a.s.c.c.ZkStateReader A cluster state change: [WatchedEvent state:SyncConnected type:NodeDataChanged path:/collections/SearchRateTriggerTest-collection1/state.json] for collection [SearchRateTriggerTest-collection1] has occurred - updating... (live nodes size: [4])
   [junit4]   2> 1747631 INFO  (OverseerCollectionConfigSetProcessor-73818790376308743-127.0.0.1:45659_solr-n_0000000000) [    ] o.a.s.c.OverseerTaskQueue Response ZK path: /overseer/collection-queue-work/qnr-0000000000 doesn't exist.  Requestor may have disconnected from ZooKeeper
   [junit4]   2> 1748095 INFO  (qtp924348450-10840) [n:127.0.0.1:45659_solr    ] o.a.s.s.HttpSolrCall [admin] webapp=null path=/admin/collections params={replicationFactor=2&collection.configName=conf&maxShardsPerNode=1&name=SearchRateTriggerTest-collection1&nrtReplicas=2&action=CREATE&numShards=2&wt=javabin&version=2} status=0 QTime=4487
   [junit4]   2> 1748113 INFO  (qtp924348450-10838) [n:127.0.0.1:45659_solr    ] o.a.s.s.HttpSolrCall [admin] webapp=null path=/admin/metrics params={wt=javabin&version=2&key=solr.core.SearchRateTriggerTest-collection1.shard1.replica_n1:QUERY./select.requestTimes:1minRate} status=0 QTime=7
   [junit4]   2> 1748132 INFO  (qtp1077484287-10851) [n:127.0.0.1:36550_solr    ] o.a.s.s.HttpSolrCall [admin] webapp=null path=/admin/metrics params={wt=javabin&version=2&key=solr.core.SearchRateTriggerTest-collection1.shard2.replica_n7:QUERY./select.requestTimes:1minRate} status=0 QTime=0
   [junit4]   2> 1748171 INFO  (qtp1281400165-10858) [n:127.0.0.1:51759_solr    ] o.a.s.s.HttpSolrCall [admin] webapp=null path=/admin/metrics params={wt=javabin&version=2&key=solr.core.SearchRateTriggerTest-collection1.shard1.replica_n3:QUERY./select.requestTimes:1minRate} status=0 QTime=6
   [junit4]   2> 1748178 INFO  (qtp1091253632-10829) [n:127.0.0.1:46437_solr    ] o.a.s.s.HttpSolrCall [admin] webapp=null path=/admin/metrics params={wt=javabin&version=2&key=solr.core.SearchRateTriggerTest-collection1.shard2.replica_n5:QUERY./select.requestTimes:1minRate} status=0 QTime=0
   [junit4]   2> 1748287 INFO  (qtp924348450-10839) [n:127.0.0.1:45659_solr    ] o.a.s.s.HttpSolrCall [admin] webapp=null path=/admin/metrics params={wt=javabin&version=2&key=solr.core.SearchRateTriggerTest-collection1.shard1.replica_n1:QUERY./select.requestTimes:1minRate} status=0 QTime=0
   [junit4]   2> 1748289 INFO  (qtp1077484287-10848) [n:127.0.0.1:36550_solr    ] o.a.s.s.HttpSolrCall [admin] webapp=null path=/admin/metrics params={wt=javabin&version=2&key=solr.core.SearchRateTriggerTest-collection1.shard2.replica_n7:QUERY./select.requestTimes:1minRate} status=0 QTime=0
   [junit4]   2> 1748296 INFO  (qtp1281400165-10855) [n:127.0.0.1:51759_solr    ] o.a.s.s.HttpSolrCall [admin] webapp=null path=/admin/metrics params={wt=javabin&version=2&key=solr.core.SearchRateTriggerTest-collection1.shard1.replica_n3:QUERY./select.requestTimes:1minRate} status=0 QTime=0
   [junit4]   2> 1748304 INFO  (qtp1091253632-10830) [n:127.0.0.1:46437_solr    ] o.a.s.s.HttpSolrCall [admin] webapp=null path=/admin/metrics params={wt=javabin&version=2&key=solr.core.SearchRateTriggerTest-collection1.shard2.replica_n5:QUERY./select.requestTimes:1minRate} status=0 QTime=0
   [junit4]   2> 1749307 INFO  (qtp924348450-10839) [n:127.0.0.1:45659_solr    ] o.a.s.s.HttpSolrCall [admin] webapp=null path=/admin/metrics params={wt=javabin&version=2&key=solr.core.SearchRateTriggerTest-collection1.shard1.replica_n1:QUERY./select.requestTimes:1minRate} status=0 QTime=0
   [junit4]   2> 1749308 INFO  (qtp1077484287-10848) [n:127.0.0.1:36550_solr    ] o.a.s.s.HttpSolrCall [admin] webapp=null path=/admin/metrics params={wt=javabin&version=2&key=solr.core.SearchRateTriggerTest-collection1.shard2.replica_n7:QUERY./select.requestTimes:1minRate} status=0 QTime=0
   [junit4]   2> 1749310 INFO  (qtp1281400165-10858) [n:127.0.0.1:51759_solr    ] o.a.s.s.HttpSolrCall [admin] webapp=null path=/admin/metrics params={wt=javabin&version=2&key=solr.core.SearchRateTriggerTest-collection1.shard1.replica_n3:QUERY./select.requestTimes:1minRate} status=0 QTime=0
   [junit4]   2> 1749311 INFO  (qtp1091253632-10829) [n:127.0.0.1:46437_solr    ] o.a.s.s.HttpSolrCall [admin] webapp=null path=/admin/metrics params={wt=javabin&version=2&key=solr.core.SearchRateTriggerTest-collection1.shard2.replica_n5:QUERY./select.requestTimes:1minRate} status=0 QTime=0
   [junit4]   2> 1750313 INFO  (qtp924348450-10839) [n:127.0.0.1:45659_solr    ] o.a.s.s.HttpSolrCall [admin] webapp=null path=/admin/metrics params={wt=javabin&version=2&key=solr.core.SearchRateTriggerTest-collection1.shard1.replica_n1:QUERY./select.requestTimes:1minRate} status=0 QTime=0
   [junit4]   2> 1750315 INFO  (qtp1077484287-10848) [n:127.0.0.1:36550_solr    ] o.a.s.s.HttpSolrCall [admin] webapp=null path=/admin/metrics params={wt=javabin&version=2&key=solr.core.SearchRateTriggerTest-collection1.shard2.replica_n7:QUERY./select.requestTimes:1minRate} status=0 QTime=0
   [junit4]   2> 1750316 INFO  (qtp1281400165-10858) [n:127.0.0.1:51759_solr    ] o.a.s.s.HttpSolrCall [admin] webapp=null path=/admin/metrics params={wt=javabin&version=2&key=solr.core.SearchRateTriggerTest-collection1.shard1.replica_n3:QUERY./select.requestTimes:1minRate} status=0 QTime=0
   [junit4]   2> 1750317 INFO  (qtp1091253632-10829) [n:127.0.0.1:46437_solr    ] o.a.s.s.HttpSolrCall [admin] webapp=null path=/admin/metrics params={wt=javabin&version=2&key=solr.core.SearchRateTriggerTest-collection1.shard2.replica_n5:QUERY./select.requestTimes:1minRate} status=0 QTime=0
   [junit4]   2> 1751320 INFO  (qtp924348450-10839) [n:127.0.0.1:45659_solr    ] o.a.s.s.HttpSolrCall [admin] webapp=null path=/admin/metrics params={wt=javabin&version=2&key=solr.core.SearchRateTriggerTest-collection1.shard1.replica_n1:QUERY./select.requestTimes:1minRate} status=0 QTime=0
   [junit4]   2> 1751321 INFO  (qtp1077484287-10848) [n:127.0.0.1:36550_solr    ] o.a.s.s.HttpSolrCall [admin] webapp=null path=/admin/metrics params={wt=javabin&version=2&key=solr.core.SearchRateTriggerTest-collection1.shard2.replica_n7:QUERY./select.requestTimes:1minRate} status=0 QTime=0
   [junit4]   2> 1751322 INFO  (qtp1281400165-10858) [n:127.0.0.1:51759_solr    ] o.a.s.s.HttpSolrCall [admin] webapp=null path=/admin/metrics params={wt=javabin&version=2&key=solr.core.SearchRateTriggerTest-collection1.shard1.replica_n3:QUERY./select.requestTimes:1minRate} status=0 QTime=0
   [junit4]   2> 1751325 INFO  (qtp1091253632-10829) [n:127.0.0.1:46437_solr    ] o.a.s.s.HttpSolrCall [admin] webapp=null path=/admin/metrics params={wt=javabin&version=2&key=solr.core.SearchRateTriggerTest-collection1.shard2.replica_n5:QUERY./select.requestTimes:1minRate} status=0 QTime=0
   [junit4]   2> 1752339 INFO  (qtp924348450-10839) [n:127.0.0.1:45659_solr    ] o.a.s.s.HttpSolrCall [admin] webapp=null path=/admin/metrics params={wt=javabin&version=2&key=solr.core.SearchRateTriggerTest-collection1.shard1.replica_n1:QUERY./select.requestTimes:1minRate} status=0 QTime=0
   [junit4]   2> 1752424 INFO  (qtp1077484287-10848) [n:127.0.0.1:36550_solr    ] o.a.s.s.HttpSolrCall [admin] webapp=null path=/admin/metrics params={wt=javabin&version=2&key=solr.core.SearchRateTriggerTest-collection1.shard2.replica_n7:QUERY./select.requestTimes:1minRate} status=0 QTime=0
   [junit4]   2> 1752425 INFO  (qtp1281400165-10858) [n:127.0.0.1:51759_solr    ] o.a.s.s.HttpSolrCall [admin] webapp=null path=/admin/metrics params={wt=javabin&version=2&key=solr.core.SearchRateTriggerTest-collection1.shard1.replica_n3:QUERY./select.requestTimes:1minRate} status=0 QTime=0
   [junit4]   2> 1752427 INFO  (qtp1091253632-10829) [n:127.0.0.1:46437_solr    ] o.a.s.s.HttpSolrCall [admin] webapp=null path=/admin/metrics params={wt=javabin&version=2&key=solr.core.SearchRateTriggerTest-collection1.shard2.replica_n5:QUERY./select.requestTimes:1minRate} status=0 QTime=0
   [junit4]   2> 1753490 INFO  (qtp924348450-10839) [n:127.0.0.1:45659_solr    ] o.a.s.s.HttpSolrCall [admin] webapp=null path=/admin/metrics params={wt=javabin&version=2&key=solr.core.SearchRateTriggerTest-collection1.shard1.replica_n1:QUERY./select.requestTimes:1minRate} status=0 QTime=0
   [junit4]   2> 1753492 INFO  (qtp1077484287-10848) [n:127.0.0.1:36550_solr    ] o.a.s.s.HttpSolrCall [admin] webapp=null path=/admin/metrics params={wt=javabin&version=2&key=solr.core.SearchRateTriggerTest-collection1.shard2.replica_n7:QUERY./select.requestTimes:1minRate} status=0 QTime=0
   [junit4]   2> 1753494 INFO  (qtp1281400165-10858) [n:127.0.0.1:51759_solr    ] o.a.s.s.HttpSolrCall [admin] webapp=null path=/admin/metrics params={wt=javabin&version=2&key=solr.core.SearchRateTriggerTest-collection1.shard1.replica_n3:QUERY./select.requestTimes:1minRate} status=0 QTime=0
   [junit4]   2> 1753495 INFO  (qtp1091253632-10829) [n:127.0.0.1:46437_solr    ] o.a.s.s.HttpSolrCall [admin] webapp=null path=/admin/metrics params={wt=javabin&version=2&key=solr.core.SearchRateTriggerTest-collection1.shard2.replica_n5:QUERY./select.requestTimes:1minRate} status=0 QTime=0
   [junit4]   2> 1754557 INFO  (qtp924348450-10838) [n:127.0.0.1:45659_solr    ] o.a.s.s.HttpSolrCall [admin] webapp=null path=/admin/metrics params={wt=javabin&version=2&key=solr.core.SearchRateTriggerTest-collection1.shard1.replica_n1:QUERY./select.requestTimes:1minRate} status=0 QTime=0
   [junit4]   2> 1754560 INFO  (qtp1077484287-10848) [n:127.0.0.1:36550_solr    ] o.a.s.s.HttpSolrCall [admin] webapp=null path=/admin/metrics params={wt=javabin&version=2&key=solr.core.SearchRateTriggerTest-collection1.shard2.replica_n7:QUERY./select.requestTimes:1minRate} status=0 QTime=0
   [junit4]   2> 1754568 INFO  (qtp1281400165-10858) [n:127.0.0.1:51759_solr    ] o.a.s.s.HttpSolrCall [admin] webapp=null path=/admin/metrics params={wt=javabin&version=2&key=solr.core.SearchRateTriggerTest-collection1.shard1.replica_n3:QUERY./select.requestTimes:1minRate} status=0 QTime=0
   [junit4]   2> 1754571 INFO  (qtp1091253632-10829) [n:127.0.0.1:46437_solr    ] o.a.s.s.HttpSolrCall [admin] webapp=null path=/admin/metrics params={wt=javabin&version=2&key=solr.core.SearchRateTriggerTest-collection1.shard2.replica_n5:QUERY./select.requestTimes:1minRate} status=0 QTime=0
   [junit4]   2> 1755581 INFO  (qtp924348450-10838) [n:127.0.0.1:45659_solr    ] o.a.s.s.HttpSolrCall [admin] webapp=null path=/admin/metrics params={wt=javabin&version=2&key=solr.core.SearchRateTriggerTest-collection1.shard1.replica_n1:QUERY./select.requestTimes:1minRate} status=0 QTime=0
   [junit4]   2> 1755583 INFO  (qtp1077484287-10848) [n:127.0.0.1:36550_solr    ] o.a.s.s.HttpSolrCall [admin] webapp=null path=/admin/metrics params={wt=javabin&version=2&key=solr.core.SearchRateTriggerTest-collection1.shard2.replica_n7:QUERY./select.requestTimes:1minRate} status=0 QTime=0
   [junit4]   2> 1755584 INFO  (qtp1281400165-10858) [n:127.0.0.1:51759_solr    ] o.a.s.s.HttpSolrCall [admin] webapp=null path=/admin/metrics params={wt=javabin&version=2&key=solr.core.SearchRateTriggerTest-collection1.shard1.replica_n3:QUERY./select.requestTimes:1minRate} status=0 QTime=0
   [junit4]   2> 1755586 INFO  (qtp1091253632-10829) [n:127.0.0.1:46437_solr    ] o.a.s.s.HttpSolrCall [admin] webapp=null path=/admin/metrics params={wt=javabin&version=2&key=solr.core.SearchRateTriggerTest-collection1.shard2.replica_n5:QUERY./select.requestTimes:1minRate} status=0 QTime=0
   [junit4]   2> 1755588 INFO  (qtp924348450-10838) [n:127.0.0.1:45659_solr    ] o.a.s.s.HttpSolrCall [admin] webapp=null path=/admin/metrics params={wt=javabin&version=2&key=solr.core.SearchRateTriggerTest-collection1.shard1.replica_n1:QUERY./select.requestTimes:1minRate} status=0 QTime=0
   [junit4]   2> 1755590 INFO  (qtp1077484287-10848) [n:127.0.0.1:36550_solr    ] o.a.s.s.HttpSolrCall [admin] webapp=null path=/admin/metrics params={wt=javabin&version=2&key=solr.core.SearchRateTriggerTest-collection1.shard2.replica_n7:QUERY./select.requestTimes:1minRate} status=0 QTime=0
   [junit4]   2> 1755591 INFO  (qtp1281400165-10858) [n:127.0.0.1:51759_solr    ] o.a.s.s.HttpSolrCall [admin] webapp=null path=/admin/metrics params={wt=javabin&version=2&key=solr.core.SearchRateTriggerTest-collection1.shard1.replica_n3:QUERY./select.requestTimes:1minRate} status=0 QTime=0
   [junit4]   2> 1755593 INFO  (qtp1091253632-10829) [n:127.0.0.1:46437_solr    ] o.a.s.s.HttpSolrCall [admin] webapp=null path=/admin/metrics params={wt=javabin&version=2&key=solr.core.SearchRateTriggerTest-collection1.shard2.replica_n5:QUERY./select.requestTimes:1minRate} status=0 QTime=0
   [junit4]   2> 1756595 INFO  (qtp924348450-10839) [n:127.0.0.1:45659_solr    ] o.a.s.s.HttpSolrCall [admin] webapp=null path=/admin/metrics params={wt=javabin&version=2&key=solr.core.SearchRateTriggerTest-collection1.shard1.replica_n1:QUERY./select.requestTimes:1minRate} status=0 QTime=0
   [junit4]   2> 1756597 INFO  (qtp1077484287-10848) [n:127.0.0.1:36550_solr    ] o.a.s.s.HttpSolrCall [admin] webapp=null path=/admin/metrics params={wt=javabin&version=2&key=solr.core.SearchRateTriggerTest-collection1.shard2.replica_n7:QUERY./select.requestTimes:1minRate} status=0 QTime=0
   [junit4]   2> 1756598 INFO  (qtp1281400165-10858) [n:127.0.0.1:51759_solr    ] o.a.s.s.HttpSolrCall [admin] webapp=null path=/admin/metrics params={wt=javabin&version=2&key=solr.core.SearchRateTriggerTest-collection1.shard1.replica_n3:QUERY./select.requestTimes:1minRate} status=0 QTime=0
   [junit4]   2> 1756599 INFO  (qtp1091253632-10829) [n:127.0.0.1:46437_solr    ] o.a.s.s.HttpSolrCall [admin] webapp=null path=/admin/metrics params={wt=javabin&version=2&key=solr.core.SearchRateTriggerTest-collection1.shard2.replica_n5:QUERY./select.requestTimes:1minRate} status=0 QTime=0
   [junit4]   2> 1757694 INFO  (qtp924348450-10838) [n:127.0.0.1:45659_solr    ] o.a.s.s.HttpSolrCall [admin] webapp=null path=/admin/metrics params={wt=javabin&version=2&key=solr.core.SearchRateTriggerTest-collection1.shard1.replica_n1:QUERY./select.requestTimes:1minRate} status=0 QTime=0
   [junit4]   2> 1757697 INFO  (qtp1077484287-10848) [n:127.0.0.1:36550_solr    ] o.a.s.s.HttpSolrCall [admin] webapp=null path=/admin/metrics params={wt=javabin&version=2&key=solr.core.SearchRateTriggerTest-collection1.shard2.replica_n7:QUERY./select.requestTimes:1minRate} status=0 QTime=0
   [junit4]   2> 1757698 INFO  (qtp1281400165-10858) [n:127.0.0.1:51759_solr    ] o.a.s.s.HttpSolrCall [admin] webapp=null path=/admin/metrics params={wt=javabin&version=2&key=solr.core.SearchRateTriggerTest-collection1.shard1.replica_n3:QUERY./select.requestTimes:1minRate} status=0 QTime=0
   [junit4]   2> 1757704 INFO  (qtp1091253632-10829) [n:127.0.0.1:46437_solr    ] o.a.s.s.HttpSolrCall [admin] webapp=null path=/admin/metrics params={wt=javabin&version=2&key=solr.core.SearchRateTriggerTest-collection1.shard2.replica_n5:QUERY./select.requestTimes:1minRate} status=0 QTime=0
   [junit4]   2> 1760715 INFO  (qtp924348450-10839) [n:127.0.0.1:45659_solr    ] o.a.s.s.HttpSolrCall [admin] webapp=null path=/admin/metrics params={wt=javabin&version=2&key=solr.core.SearchRateTriggerTest-collection1.shard1.replica_n1:QUERY./select.requestTimes:1minRate} status=0 QTime=0
   [junit4]   2> 1760721 INFO  (qtp1077484287-10848) [n:127.0.0.1:36550_solr    ] o.a.s.s.HttpSolrCall [admin] webapp=null path=/admin/metrics params={wt=javabin&version=2&key=solr.core.SearchRateTriggerTest-collection1.shard2.replica_n7:QUERY./select.requestTimes:1minRate} status=0 QTime=0
   [junit4]   2> 1760724 INFO  (qtp1281400165-10858) [n:127.0.0.1:51759_solr    ] o.a.s.s.HttpSolrCall [admin] webapp=null path=/admin/metrics params={wt=javabin&version=2&key=solr.core.SearchRateTriggerTest-collection1.shard1.replica_n3:QUERY./select.requestTimes:1minRate} status=0 QTime=0
   [junit4]   2> 1760726 INFO  (qtp1091253632-10829) [n:127.0.0.1:46437_solr    ] o.a.s.s.HttpSolrCall [admin] webapp=null path=/admin/metrics params={wt=javabin&version=2&key=solr.core.SearchRateTriggerTest-collection1.shard2.replica_n5:QUERY./select.requestTimes:1minRate} status=0 QTime=0
   [junit4]   2> 1760735 INFO  (TEST-SearchRateTriggerTest.testWaitForElapsed-seed#[530F4649DF8F02FC]) [    ] o.a.s.SolrTestCaseJ4 ###Ending testWaitForElapsed
   [junit4]   2> 1761593 INFO  (TEST-SearchRateTriggerTest.testDefaultsAndBackcompat-seed#[530F4649DF8F02FC]) [    ] o.a.s.SolrTestCaseJ4 ###Starting testDefaultsAndBackcompat
   [junit4]   2> 1761594 INFO  (TEST-SearchRateTriggerTest.testDefaultsAndBackcompat-seed#[530F4649DF8F02FC]) [    ] o.a.s.c.c.ZkStateReader Updated live nodes from ZooKeeper... (0) -> (4)
   [junit4]   2> 1761601 INFO  (qtp924348450-10839) [n:127.0.0.1:45659_solr    ] o.a.s.h.a.CollectionsHandler Invoked Collection Action :delete with params name=SearchRateTriggerTest-collection1&action=DELETE&wt=javabin&version=2 and sendToOCPQueue=true
   [junit4]   2> 1761640 INFO  (OverseerThreadFactory-3544-thread-2) [    ] o.a.s.c.a.c.OverseerCollectionMessageHandler Executing Collection Cmd=action=UNLOAD&deleteInstanceDir=true&deleteDataDir=true, asyncId=null
   [junit4]   2> 1761791 INFO  (qtp1281400165-10856) [n:127.0.0.1:51759_solr    x:SearchRateTriggerTest-collection1_shard1_replica_n3] o.a.s.m.SolrMetricManager Closing metric reporters for registry=solr.core.SearchRateTriggerTest-collection1.shard1.replica_n3, tag=null
   [junit4]   2> 1761791 INFO  (qtp1281400165-10856) [n:127.0.0.1:51759_solr    x:SearchRateTriggerTest-collection1_shard1_replica_n3] o.a.s.m.r.SolrJmxReporter Closing reporter [org.apache.solr.metrics.reporters.SolrJmxReporter@70e99243: rootName = solr_51759, domain = solr.core.SearchRateTriggerTest-collection1.shard1.replica_n3, service url = null, agent id = null] for registry solr.core.SearchRateTriggerTest-collection1.shard1.replica_n3 / com.codahale.metrics.MetricRegistry@3d6b0101
   [junit4]   2> 1761791 INFO  (qtp1091253632-10829) [n:127.0.0.1:46437_solr    x:SearchRateTriggerTest-collection1_shard2_replica_n5] o.a.s.m.SolrMetricManager Closing metric reporters for registry=solr.core.SearchRateTriggerTest-collection1.shard2.replica_n5, tag=null
   [junit4]   2> 1761791 INFO  (qtp1091253632-10829) [n:127.0.0.1:46437_solr    x:SearchRateTriggerTest-collection1_shard2_replica_n5] o.a.s.m.r.SolrJmxReporter Closing reporter [org.apache.solr.metrics.reporters.SolrJmxReporter@4b521c71: rootName = solr_46437, domain = solr.core.SearchRateTriggerTest-collection1.shard2.replica_n5, service url = null, agent id = null] for registry solr.core.SearchRateTriggerTest-collection1.shard2.replica_n5 / com.codahale.metrics.MetricRegistry@7b68a7ef
   [junit4]   2> 1761792 INFO  (qtp924348450-10842) [n:127.0.0.1:45659_solr    x:SearchRateTriggerTest-collection1_shard1_replica_n1] o.a.s.m.SolrMetricManager Closing metric reporters for registry=solr.core.SearchRateTriggerTest-collection1.shard1.replica_n1, tag=null
   [junit4]   2> 1761792 INFO  (qtp924348450-10842) [n:127.0.0.1:45659_solr    x:SearchRateTriggerTest-collection1_shard1_replica_n1] o.a.s.m.r.SolrJmxReporter Closing reporter [org.apache.solr.metrics.reporters.SolrJmxReporter@9b5dad4: rootName = solr_45659, domain = solr.core.SearchRateTriggerTest-collection1.shard1.replica_n1, service url = null, agent id = null] for registry solr.core.SearchRateTriggerTest-collection1.shard1.replica_n1 / com.codahale.metrics.MetricRegistry@4003f30
   [junit4]   2> 1761799 INFO  (qtp1077484287-10847) [n:127.0.0.1:36550_solr    x:SearchRateTriggerTest-collection1_shard2_replica_n7] o.a.s.m.SolrMetricManager Closing metric reporters for registry=solr.core.SearchRateTriggerTest-collection1.shard2.replica_n7, tag=null
   [junit4]   2> 1761799 INFO  (qtp1077484287-10847) [n:127.0.0.1:36550_solr    x:SearchRateTriggerTest-collection1_shard2_replica_n7] o.a.s.m.r.SolrJmxReporter Closing reporter [org.apache.solr.metrics.reporters.SolrJmxReporter@2cb52438: rootName = solr_36550, domain = solr.core.SearchRateTriggerTest-collection1.shard2.replica_n7, service url = null, agent id = null] for registry solr.core.SearchRateTriggerTest-collection1.shard2.replica_n7 / com.codahale.metrics.MetricRegistry@6d5e003d
   [junit4]   2> 1762075 INFO  (qtp1077484287-10847) [n:127.0.0.1:36550_solr    x:SearchRateTriggerTest-collection1_shard2_replica_n7] o.a.s.c.SolrCore [SearchRateTriggerTest-collection1_shard2_replica_n7]  CLOSING SolrCore org.apache.solr.core.SolrCore@19e989ed
   [junit4]   2> 1762075 INFO  (qtp1077484287-10847) [n:127.0.0.1:36550_solr    x:SearchRateTriggerTest-collection1_shard2_replica_n7] o.a.s.m.SolrMetricManager Closing metric reporters for registry=solr.core.SearchRateTriggerTest-collection1.shard2.replica_n7, tag=19e989ed
   [junit4]   2> 1762075 INFO  (qtp1077484287-10847) [n:127.0.0.1:36550_solr    x:SearchRateTri

[...truncated too long message...]

pace/Lucene-Solr-Tests-master/lucene/top-level-ivy-settings.xml

resolve:

ivy-availability-check:
[loadresource] Do not set property disallowed.ivy.jars.list as its length is 0.

-ivy-fail-disallowed-ivy-version:

ivy-fail:

ivy-configure:
[ivy:configure] :: loading settings :: file = /x1/jenkins/jenkins-slave/workspace/Lucene-Solr-Tests-master/lucene/top-level-ivy-settings.xml

resolve:

ivy-availability-check:
[loadresource] Do not set property disallowed.ivy.jars.list as its length is 0.

-ivy-fail-disallowed-ivy-version:

ivy-fail:

ivy-configure:
[ivy:configure] :: loading settings :: file = /x1/jenkins/jenkins-slave/workspace/Lucene-Solr-Tests-master/lucene/top-level-ivy-settings.xml

resolve:

ivy-availability-check:
[loadresource] Do not set property disallowed.ivy.jars.list as its length is 0.

-ivy-fail-disallowed-ivy-version:

ivy-fail:

ivy-configure:
[ivy:configure] :: loading settings :: file = /x1/jenkins/jenkins-slave/workspace/Lucene-Solr-Tests-master/lucene/top-level-ivy-settings.xml

resolve:

ivy-availability-check:
[loadresource] Do not set property disallowed.ivy.jars.list as its length is 0.

-ivy-fail-disallowed-ivy-version:

ivy-fail:

ivy-configure:
[ivy:configure] :: loading settings :: file = /x1/jenkins/jenkins-slave/workspace/Lucene-Solr-Tests-master/lucene/top-level-ivy-settings.xml

resolve:

jar-checksums:
    [mkdir] Created dir: /x1/jenkins/jenkins-slave/workspace/Lucene-Solr-Tests-master/lucene/null1582835298
     [copy] Copying 39 files to /x1/jenkins/jenkins-slave/workspace/Lucene-Solr-Tests-master/lucene/null1582835298
   [delete] Deleting directory /x1/jenkins/jenkins-slave/workspace/Lucene-Solr-Tests-master/lucene/null1582835298

resolve-example:

ivy-availability-check:
[loadresource] Do not set property disallowed.ivy.jars.list as its length is 0.

-ivy-fail-disallowed-ivy-version:

ivy-fail:

ivy-configure:
[ivy:configure] :: loading settings :: file = /x1/jenkins/jenkins-slave/workspace/Lucene-Solr-Tests-master/lucene/top-level-ivy-settings.xml

resolve:

resolve-server:

ivy-availability-check:
[loadresource] Do not set property disallowed.ivy.jars.list as its length is 0.

-ivy-fail-disallowed-ivy-version:

ivy-fail:

ivy-fail:

ivy-configure:
[ivy:configure] :: loading settings :: file = /x1/jenkins/jenkins-slave/workspace/Lucene-Solr-Tests-master/lucene/top-level-ivy-settings.xml

resolve:

resolve:

ivy-availability-check:
[loadresource] Do not set property disallowed.ivy.jars.list as its length is 0.

-ivy-fail-disallowed-ivy-version:

ivy-fail:

ivy-fail:

ivy-configure:
[ivy:configure] :: loading settings :: file = /x1/jenkins/jenkins-slave/workspace/Lucene-Solr-Tests-master/lucene/top-level-ivy-settings.xml

resolve:

ivy-availability-check:
[loadresource] Do not set property disallowed.ivy.jars.list as its length is 0.

-ivy-fail-disallowed-ivy-version:

ivy-fail:

ivy-fail:

ivy-configure:
[ivy:configure] :: loading settings :: file = /x1/jenkins/jenkins-slave/workspace/Lucene-Solr-Tests-master/lucene/top-level-ivy-settings.xml

resolve:

ivy-availability-check:
[loadresource] Do not set property disallowed.ivy.jars.list as its length is 0.

-ivy-fail-disallowed-ivy-version:

ivy-fail:

ivy-configure:
[ivy:configure] :: loading settings :: file = /x1/jenkins/jenkins-slave/workspace/Lucene-Solr-Tests-master/lucene/top-level-ivy-settings.xml

resolve:

ivy-availability-check:
[loadresource] Do not set property disallowed.ivy.jars.list as its length is 0.

-ivy-fail-disallowed-ivy-version:

ivy-fail:

ivy-fail:

ivy-configure:
[ivy:configure] :: loading settings :: file = /x1/jenkins/jenkins-slave/workspace/Lucene-Solr-Tests-master/lucene/top-level-ivy-settings.xml

resolve:

ivy-availability-check:
[loadresource] Do not set property disallowed.ivy.jars.list as its length is 0.

-ivy-fail-disallowed-ivy-version:

ivy-fail:

ivy-configure:
[ivy:configure] :: loading settings :: file = /x1/jenkins/jenkins-slave/workspace/Lucene-Solr-Tests-master/lucene/top-level-ivy-settings.xml

resolve:

ivy-availability-check:
[loadresource] Do not set property disallowed.ivy.jars.list as its length is 0.

-ivy-fail-disallowed-ivy-version:

ivy-fail:

ivy-fail:

ivy-configure:
[ivy:configure] :: loading settings :: file = /x1/jenkins/jenkins-slave/workspace/Lucene-Solr-Tests-master/lucene/top-level-ivy-settings.xml

resolve:

ivy-availability-check:
[loadresource] Do not set property disallowed.ivy.jars.list as its length is 0.

-ivy-fail-disallowed-ivy-version:

ivy-fail:

ivy-fail:

ivy-configure:
[ivy:configure] :: loading settings :: file = /x1/jenkins/jenkins-slave/workspace/Lucene-Solr-Tests-master/lucene/top-level-ivy-settings.xml

resolve:

ivy-availability-check:
[loadresource] Do not set property disallowed.ivy.jars.list as its length is 0.

-ivy-fail-disallowed-ivy-version:

ivy-fail:

ivy-fail:

ivy-configure:
[ivy:configure] :: loading settings :: file = /x1/jenkins/jenkins-slave/workspace/Lucene-Solr-Tests-master/lucene/top-level-ivy-settings.xml

resolve:

ivy-availability-check:
[loadresource] Do not set property disallowed.ivy.jars.list as its length is 0.

-ivy-fail-disallowed-ivy-version:

ivy-fail:

ivy-fail:

ivy-configure:
[ivy:configure] :: loading settings :: file = /x1/jenkins/jenkins-slave/workspace/Lucene-Solr-Tests-master/lucene/top-level-ivy-settings.xml

resolve:

ivy-availability-check:
[loadresource] Do not set property disallowed.ivy.jars.list as its length is 0.

-ivy-fail-disallowed-ivy-version:

ivy-fail:

ivy-fail:

ivy-configure:
[ivy:configure] :: loading settings :: file = /x1/jenkins/jenkins-slave/workspace/Lucene-Solr-Tests-master/lucene/top-level-ivy-settings.xml

resolve:

ivy-availability-check:
[loadresource] Do not set property disallowed.ivy.jars.list as its length is 0.

-ivy-fail-disallowed-ivy-version:

ivy-fail:

ivy-fail:

ivy-configure:
[ivy:configure] :: loading settings :: file = /x1/jenkins/jenkins-slave/workspace/Lucene-Solr-Tests-master/lucene/top-level-ivy-settings.xml

resolve:

ivy-availability-check:
[loadresource] Do not set property disallowed.ivy.jars.list as its length is 0.

-ivy-fail-disallowed-ivy-version:

ivy-fail:

ivy-fail:

ivy-configure:
[ivy:configure] :: loading settings :: file = /x1/jenkins/jenkins-slave/workspace/Lucene-Solr-Tests-master/lucene/top-level-ivy-settings.xml

resolve:

ivy-availability-check:
[loadresource] Do not set property disallowed.ivy.jars.list as its length is 0.

-ivy-fail-disallowed-ivy-version:

ivy-fail:

ivy-fail:

ivy-configure:
[ivy:configure] :: loading settings :: file = /x1/jenkins/jenkins-slave/workspace/Lucene-Solr-Tests-master/lucene/top-level-ivy-settings.xml

resolve:

ivy-availability-check:
[loadresource] Do not set property disallowed.ivy.jars.list as its length is 0.

-ivy-fail-disallowed-ivy-version:

ivy-fail:

ivy-fail:

ivy-configure:
[ivy:configure] :: loading settings :: file = /x1/jenkins/jenkins-slave/workspace/Lucene-Solr-Tests-master/lucene/top-level-ivy-settings.xml

resolve:

ivy-availability-check:
[loadresource] Do not set property disallowed.ivy.jars.list as its length is 0.

-ivy-fail-disallowed-ivy-version:

ivy-fail:

ivy-fail:

ivy-configure:
[ivy:configure] :: loading settings :: file = /x1/jenkins/jenkins-slave/workspace/Lucene-Solr-Tests-master/lucene/top-level-ivy-settings.xml

resolve:

ivy-availability-check:
[loadresource] Do not set property disallowed.ivy.jars.list as its length is 0.

-ivy-fail-disallowed-ivy-version:

ivy-fail:

ivy-fail:

ivy-configure:
[ivy:configure] :: loading settings :: file = /x1/jenkins/jenkins-slave/workspace/Lucene-Solr-Tests-master/lucene/top-level-ivy-settings.xml

resolve:

jar-checksums:
    [mkdir] Created dir: /x1/jenkins/jenkins-slave/workspace/Lucene-Solr-Tests-master/solr/null897355973
     [copy] Copying 246 files to /x1/jenkins/jenkins-slave/workspace/Lucene-Solr-Tests-master/solr/null897355973
   [delete] Deleting directory /x1/jenkins/jenkins-slave/workspace/Lucene-Solr-Tests-master/solr/null897355973

check-working-copy:
[ivy:cachepath] :: resolving dependencies :: org.eclipse.jgit#org.eclipse.jgit-caller;working
[ivy:cachepath] 	confs: [default]
[ivy:cachepath] 	found org.eclipse.jgit#org.eclipse.jgit;4.6.0.201612231935-r in public
[ivy:cachepath] 	found com.jcraft#jsch;0.1.53 in public
[ivy:cachepath] 	found com.googlecode.javaewah#JavaEWAH;1.1.6 in public
[ivy:cachepath] 	found org.apache.httpcomponents#httpclient;4.3.6 in public
[ivy:cachepath] 	found org.apache.httpcomponents#httpcore;4.3.3 in public
[ivy:cachepath] 	found commons-logging#commons-logging;1.1.3 in public
[ivy:cachepath] 	found commons-codec#commons-codec;1.6 in public
[ivy:cachepath] 	found org.slf4j#slf4j-api;1.7.2 in public
[ivy:cachepath] :: resolution report :: resolve 58ms :: artifacts dl 9ms
	---------------------------------------------------------------------
	|                  |            modules            ||   artifacts   |
	|       conf       | number| search|dwnlded|evicted|| number|dwnlded|
	---------------------------------------------------------------------
	|      default     |   8   |   0   |   0   |   0   ||   8   |   0   |
	---------------------------------------------------------------------
[wc-checker] Initializing working copy...
[wc-checker] SLF4J: Failed to load class "org.slf4j.impl.StaticLoggerBinder".
[wc-checker] SLF4J: Defaulting to no-operation (NOP) logger implementation
[wc-checker] SLF4J: See http://www.slf4j.org/codes.html#StaticLoggerBinder for further details.
[wc-checker] Checking working copy status...

-jenkins-base:

BUILD SUCCESSFUL
Total time: 159 minutes 22 seconds
Archiving artifacts
WARN: No artifacts found that match the file pattern "**/*.events,heapdumps/**,**/hs_err_pid*". Configuration error?
WARN: java.lang.InterruptedException: no matches found within 10000
Recording test results
Build step 'Publish JUnit test result report' changed build result to UNSTABLE
Email was triggered for: Unstable (Test Failures)
Sending email for trigger: Unstable (Test Failures)

Mime
View raw message