lucene-dev mailing list archives

Site index · List index
Message view « Date » · « Thread »
Top « Date » · « Thread »
From Policeman Jenkins Server <jenk...@thetaphi.de>
Subject [JENKINS] Lucene-Solr-7.x-Linux (64bit/jdk-9.0.4) - Build # 1936 - Still Unstable!
Date Sat, 19 May 2018 21:05:07 GMT
Build: https://jenkins.thetaphi.de/job/Lucene-Solr-7.x-Linux/1936/
Java: 64bit/jdk-9.0.4 -XX:-UseCompressedOops -XX:+UseParallelGC

1 tests failed.
FAILED:  org.apache.solr.cloud.autoscaling.SearchRateTriggerTest.testTrigger

Error Message:
expected:<1> but was:<2>

Stack Trace:
java.lang.AssertionError: expected:<1> but was:<2>
	at __randomizedtesting.SeedInfo.seed([BE518230236D5A63:DD9AB4B2BAA2294E]:0)
	at org.junit.Assert.fail(Assert.java:93)
	at org.junit.Assert.failNotEquals(Assert.java:647)
	at org.junit.Assert.assertEquals(Assert.java:128)
	at org.junit.Assert.assertEquals(Assert.java:472)
	at org.junit.Assert.assertEquals(Assert.java:456)
	at org.apache.solr.cloud.autoscaling.SearchRateTriggerTest.testTrigger(SearchRateTriggerTest.java:133)
	at java.base/jdk.internal.reflect.NativeMethodAccessorImpl.invoke0(Native Method)
	at java.base/jdk.internal.reflect.NativeMethodAccessorImpl.invoke(NativeMethodAccessorImpl.java:62)
	at java.base/jdk.internal.reflect.DelegatingMethodAccessorImpl.invoke(DelegatingMethodAccessorImpl.java:43)
	at java.base/java.lang.reflect.Method.invoke(Method.java:564)
	at com.carrotsearch.randomizedtesting.RandomizedRunner.invoke(RandomizedRunner.java:1737)
	at com.carrotsearch.randomizedtesting.RandomizedRunner$8.evaluate(RandomizedRunner.java:934)
	at com.carrotsearch.randomizedtesting.RandomizedRunner$9.evaluate(RandomizedRunner.java:970)
	at com.carrotsearch.randomizedtesting.RandomizedRunner$10.evaluate(RandomizedRunner.java:984)
	at com.carrotsearch.randomizedtesting.rules.SystemPropertiesRestoreRule$1.evaluate(SystemPropertiesRestoreRule.java:57)
	at org.apache.lucene.util.TestRuleSetupTeardownChained$1.evaluate(TestRuleSetupTeardownChained.java:49)
	at org.apache.lucene.util.AbstractBeforeAfterRule$1.evaluate(AbstractBeforeAfterRule.java:45)
	at org.apache.lucene.util.TestRuleThreadAndTestName$1.evaluate(TestRuleThreadAndTestName.java:48)
	at org.apache.lucene.util.TestRuleIgnoreAfterMaxFailures$1.evaluate(TestRuleIgnoreAfterMaxFailures.java:64)
	at org.apache.lucene.util.TestRuleMarkFailure$1.evaluate(TestRuleMarkFailure.java:47)
	at com.carrotsearch.randomizedtesting.rules.StatementAdapter.evaluate(StatementAdapter.java:36)
	at com.carrotsearch.randomizedtesting.ThreadLeakControl$StatementRunner.run(ThreadLeakControl.java:368)
	at com.carrotsearch.randomizedtesting.ThreadLeakControl.forkTimeoutingTask(ThreadLeakControl.java:817)
	at com.carrotsearch.randomizedtesting.ThreadLeakControl$3.evaluate(ThreadLeakControl.java:468)
	at com.carrotsearch.randomizedtesting.RandomizedRunner.runSingleTest(RandomizedRunner.java:943)
	at com.carrotsearch.randomizedtesting.RandomizedRunner$5.evaluate(RandomizedRunner.java:829)
	at com.carrotsearch.randomizedtesting.RandomizedRunner$6.evaluate(RandomizedRunner.java:879)
	at com.carrotsearch.randomizedtesting.RandomizedRunner$7.evaluate(RandomizedRunner.java:890)
	at com.carrotsearch.randomizedtesting.rules.StatementAdapter.evaluate(StatementAdapter.java:36)
	at com.carrotsearch.randomizedtesting.rules.SystemPropertiesRestoreRule$1.evaluate(SystemPropertiesRestoreRule.java:57)
	at org.apache.lucene.util.AbstractBeforeAfterRule$1.evaluate(AbstractBeforeAfterRule.java:45)
	at com.carrotsearch.randomizedtesting.rules.StatementAdapter.evaluate(StatementAdapter.java:36)
	at org.apache.lucene.util.TestRuleStoreClassName$1.evaluate(TestRuleStoreClassName.java:41)
	at com.carrotsearch.randomizedtesting.rules.NoShadowingOrOverridesOnMethodsRule$1.evaluate(NoShadowingOrOverridesOnMethodsRule.java:40)
	at com.carrotsearch.randomizedtesting.rules.NoShadowingOrOverridesOnMethodsRule$1.evaluate(NoShadowingOrOverridesOnMethodsRule.java:40)
	at com.carrotsearch.randomizedtesting.rules.StatementAdapter.evaluate(StatementAdapter.java:36)
	at com.carrotsearch.randomizedtesting.rules.StatementAdapter.evaluate(StatementAdapter.java:36)
	at org.apache.lucene.util.TestRuleAssertionsRequired$1.evaluate(TestRuleAssertionsRequired.java:53)
	at org.apache.lucene.util.TestRuleMarkFailure$1.evaluate(TestRuleMarkFailure.java:47)
	at org.apache.lucene.util.TestRuleIgnoreAfterMaxFailures$1.evaluate(TestRuleIgnoreAfterMaxFailures.java:64)
	at org.apache.lucene.util.TestRuleIgnoreTestSuites$1.evaluate(TestRuleIgnoreTestSuites.java:54)
	at com.carrotsearch.randomizedtesting.rules.StatementAdapter.evaluate(StatementAdapter.java:36)
	at com.carrotsearch.randomizedtesting.ThreadLeakControl$StatementRunner.run(ThreadLeakControl.java:368)
	at java.base/java.lang.Thread.run(Thread.java:844)




Build Log:
[...truncated 12840 lines...]
   [junit4] Suite: org.apache.solr.cloud.autoscaling.SearchRateTriggerTest
   [junit4]   2> Creating dataDir: /home/jenkins/workspace/Lucene-Solr-7.x-Linux/solr/build/solr-core/test/J2/temp/solr.cloud.autoscaling.SearchRateTriggerTest_BE518230236D5A63-001/init-core-data-001
   [junit4]   2> 275323 WARN  (SUITE-SearchRateTriggerTest-seed#[BE518230236D5A63]-worker) [    ] o.a.s.SolrTestCaseJ4 startTrackingSearchers: numOpens=300 numCloses=300
   [junit4]   2> 275323 INFO  (SUITE-SearchRateTriggerTest-seed#[BE518230236D5A63]-worker) [    ] o.a.s.SolrTestCaseJ4 Using PointFields (NUMERIC_POINTS_SYSPROP=true) w/NUMERIC_DOCVALUES_SYSPROP=false
   [junit4]   2> 275324 INFO  (SUITE-SearchRateTriggerTest-seed#[BE518230236D5A63]-worker) [    ] o.a.s.SolrTestCaseJ4 Randomized ssl (false) and clientAuth (true) via: @org.apache.solr.util.RandomizeSSL(reason="", ssl=0.0/0.0, value=0.0/0.0, clientAuth=0.0/0.0)
   [junit4]   2> 275324 INFO  (SUITE-SearchRateTriggerTest-seed#[BE518230236D5A63]-worker) [    ] o.a.s.SolrTestCaseJ4 SecureRandom sanity checks: test.solr.allowed.securerandom=null & java.security.egd=file:/dev/./urandom
   [junit4]   2> 275324 INFO  (SUITE-SearchRateTriggerTest-seed#[BE518230236D5A63]-worker) [    ] o.a.s.c.MiniSolrCloudCluster Starting cluster of 4 servers in /home/jenkins/workspace/Lucene-Solr-7.x-Linux/solr/build/solr-core/test/J2/temp/solr.cloud.autoscaling.SearchRateTriggerTest_BE518230236D5A63-001/tempDir-001
   [junit4]   2> 275324 INFO  (SUITE-SearchRateTriggerTest-seed#[BE518230236D5A63]-worker) [    ] o.a.s.c.ZkTestServer STARTING ZK TEST SERVER
   [junit4]   2> 275324 INFO  (Thread-401) [    ] o.a.s.c.ZkTestServer client port:0.0.0.0/0.0.0.0:0
   [junit4]   2> 275324 INFO  (Thread-401) [    ] o.a.s.c.ZkTestServer Starting server
   [junit4]   2> 275325 ERROR (Thread-401) [    ] o.a.z.s.ZooKeeperServer ZKShutdownHandler is not registered, so ZooKeeper server won't take any action on ERROR or SHUTDOWN server state changes
   [junit4]   2> 275424 INFO  (SUITE-SearchRateTriggerTest-seed#[BE518230236D5A63]-worker) [    ] o.a.s.c.ZkTestServer start zk server on port:40729
   [junit4]   2> 275426 INFO  (zkConnectionManagerCallback-627-thread-1) [    ] o.a.s.c.c.ConnectionManager zkClient has connected
   [junit4]   2> 275431 INFO  (jetty-launcher-624-thread-1) [    ] o.e.j.s.Server jetty-9.4.10.v20180503; built: 2018-05-03T15:56:21.710Z; git: daa59876e6f384329b122929e70a80934569428c; jvm 9.0.4+11
   [junit4]   2> 275434 INFO  (jetty-launcher-624-thread-3) [    ] o.e.j.s.Server jetty-9.4.10.v20180503; built: 2018-05-03T15:56:21.710Z; git: daa59876e6f384329b122929e70a80934569428c; jvm 9.0.4+11
   [junit4]   2> 275434 INFO  (jetty-launcher-624-thread-2) [    ] o.e.j.s.Server jetty-9.4.10.v20180503; built: 2018-05-03T15:56:21.710Z; git: daa59876e6f384329b122929e70a80934569428c; jvm 9.0.4+11
   [junit4]   2> 275440 INFO  (jetty-launcher-624-thread-4) [    ] o.e.j.s.Server jetty-9.4.10.v20180503; built: 2018-05-03T15:56:21.710Z; git: daa59876e6f384329b122929e70a80934569428c; jvm 9.0.4+11
   [junit4]   2> 275462 INFO  (jetty-launcher-624-thread-1) [    ] o.e.j.s.session DefaultSessionIdManager workerName=node0
   [junit4]   2> 275462 INFO  (jetty-launcher-624-thread-1) [    ] o.e.j.s.session No SessionScavenger set, using defaults
   [junit4]   2> 275462 INFO  (jetty-launcher-624-thread-1) [    ] o.e.j.s.session node0 Scavenging every 660000ms
   [junit4]   2> 275468 INFO  (jetty-launcher-624-thread-3) [    ] o.e.j.s.session DefaultSessionIdManager workerName=node0
   [junit4]   2> 275468 INFO  (jetty-launcher-624-thread-3) [    ] o.e.j.s.session No SessionScavenger set, using defaults
   [junit4]   2> 275468 INFO  (jetty-launcher-624-thread-3) [    ] o.e.j.s.session node0 Scavenging every 660000ms
   [junit4]   2> 275469 INFO  (jetty-launcher-624-thread-1) [    ] o.e.j.s.h.ContextHandler Started o.e.j.s.ServletContextHandler@783f24c4{/solr,null,AVAILABLE}
   [junit4]   2> 275469 INFO  (jetty-launcher-624-thread-4) [    ] o.e.j.s.session DefaultSessionIdManager workerName=node0
   [junit4]   2> 275469 INFO  (jetty-launcher-624-thread-4) [    ] o.e.j.s.session No SessionScavenger set, using defaults
   [junit4]   2> 275470 INFO  (jetty-launcher-624-thread-4) [    ] o.e.j.s.session node0 Scavenging every 660000ms
   [junit4]   2> 275472 INFO  (jetty-launcher-624-thread-4) [    ] o.e.j.s.h.ContextHandler Started o.e.j.s.ServletContextHandler@3abf31fe{/solr,null,AVAILABLE}
   [junit4]   2> 275472 INFO  (jetty-launcher-624-thread-3) [    ] o.e.j.s.h.ContextHandler Started o.e.j.s.ServletContextHandler@27c309e{/solr,null,AVAILABLE}
   [junit4]   2> 275473 INFO  (jetty-launcher-624-thread-1) [    ] o.e.j.s.AbstractConnector Started ServerConnector@6f8009e4{HTTP/1.1,[http/1.1]}{127.0.0.1:35719}
   [junit4]   2> 275473 INFO  (jetty-launcher-624-thread-1) [    ] o.e.j.s.Server Started @275518ms
   [junit4]   2> 275473 INFO  (jetty-launcher-624-thread-1) [    ] o.a.s.c.s.e.JettySolrRunner Jetty properties: {hostContext=/solr, hostPort=35719}
   [junit4]   2> 275473 ERROR (jetty-launcher-624-thread-1) [    ] o.a.s.u.StartupLoggingUtils Missing Java Option solr.log.dir. Logging may be missing or incomplete.
   [junit4]   2> 275473 INFO  (jetty-launcher-624-thread-1) [    ] o.a.s.s.SolrDispatchFilter Using logger factory org.apache.logging.slf4j.Log4jLoggerFactory
   [junit4]   2> 275473 INFO  (jetty-launcher-624-thread-1) [    ] o.a.s.s.SolrDispatchFilter  ___      _       Welcome to Apache Solr? version 7.4.0
   [junit4]   2> 275473 INFO  (jetty-launcher-624-thread-1) [    ] o.a.s.s.SolrDispatchFilter / __| ___| |_ _   Starting in cloud mode on port null
   [junit4]   2> 275473 INFO  (jetty-launcher-624-thread-1) [    ] o.a.s.s.SolrDispatchFilter \__ \/ _ \ | '_|  Install dir: null
   [junit4]   2> 275473 INFO  (jetty-launcher-624-thread-1) [    ] o.a.s.s.SolrDispatchFilter |___/\___/_|_|    Start time: 2018-05-19T20:21:06.623659Z
   [junit4]   2> 275474 INFO  (jetty-launcher-624-thread-2) [    ] o.e.j.s.session DefaultSessionIdManager workerName=node0
   [junit4]   2> 275474 INFO  (jetty-launcher-624-thread-2) [    ] o.e.j.s.session No SessionScavenger set, using defaults
   [junit4]   2> 275474 INFO  (jetty-launcher-624-thread-2) [    ] o.e.j.s.session node0 Scavenging every 660000ms
   [junit4]   2> 275474 INFO  (jetty-launcher-624-thread-4) [    ] o.e.j.s.AbstractConnector Started ServerConnector@724913e6{HTTP/1.1,[http/1.1]}{127.0.0.1:44731}
   [junit4]   2> 275474 INFO  (jetty-launcher-624-thread-3) [    ] o.e.j.s.AbstractConnector Started ServerConnector@2800a30b{HTTP/1.1,[http/1.1]}{127.0.0.1:45127}
   [junit4]   2> 275474 INFO  (jetty-launcher-624-thread-4) [    ] o.e.j.s.Server Started @275519ms
   [junit4]   2> 275474 INFO  (jetty-launcher-624-thread-3) [    ] o.e.j.s.Server Started @275519ms
   [junit4]   2> 275474 INFO  (jetty-launcher-624-thread-2) [    ] o.e.j.s.h.ContextHandler Started o.e.j.s.ServletContextHandler@78aaec48{/solr,null,AVAILABLE}
   [junit4]   2> 275474 INFO  (jetty-launcher-624-thread-3) [    ] o.a.s.c.s.e.JettySolrRunner Jetty properties: {hostContext=/solr, hostPort=45127}
   [junit4]   2> 275474 INFO  (jetty-launcher-624-thread-2) [    ] o.e.j.s.AbstractConnector Started ServerConnector@625c939b{HTTP/1.1,[http/1.1]}{127.0.0.1:39667}
   [junit4]   2> 275474 INFO  (jetty-launcher-624-thread-2) [    ] o.e.j.s.Server Started @275520ms
   [junit4]   2> 275474 ERROR (jetty-launcher-624-thread-3) [    ] o.a.s.u.StartupLoggingUtils Missing Java Option solr.log.dir. Logging may be missing or incomplete.
   [junit4]   2> 275474 INFO  (jetty-launcher-624-thread-3) [    ] o.a.s.s.SolrDispatchFilter Using logger factory org.apache.logging.slf4j.Log4jLoggerFactory
   [junit4]   2> 275474 INFO  (jetty-launcher-624-thread-2) [    ] o.a.s.c.s.e.JettySolrRunner Jetty properties: {hostContext=/solr, hostPort=39667}
   [junit4]   2> 275474 INFO  (jetty-launcher-624-thread-3) [    ] o.a.s.s.SolrDispatchFilter  ___      _       Welcome to Apache Solr? version 7.4.0
   [junit4]   2> 275474 INFO  (jetty-launcher-624-thread-4) [    ] o.a.s.c.s.e.JettySolrRunner Jetty properties: {hostContext=/solr, hostPort=44731}
   [junit4]   2> 275475 INFO  (jetty-launcher-624-thread-3) [    ] o.a.s.s.SolrDispatchFilter / __| ___| |_ _   Starting in cloud mode on port null
   [junit4]   2> 275475 INFO  (zkConnectionManagerCallback-629-thread-1) [    ] o.a.s.c.c.ConnectionManager zkClient has connected
   [junit4]   2> 275475 INFO  (jetty-launcher-624-thread-3) [    ] o.a.s.s.SolrDispatchFilter \__ \/ _ \ | '_|  Install dir: null
   [junit4]   2> 275475 INFO  (jetty-launcher-624-thread-3) [    ] o.a.s.s.SolrDispatchFilter |___/\___/_|_|    Start time: 2018-05-19T20:21:06.625102Z
   [junit4]   2> 275475 ERROR (jetty-launcher-624-thread-2) [    ] o.a.s.u.StartupLoggingUtils Missing Java Option solr.log.dir. Logging may be missing or incomplete.
   [junit4]   2> 275475 INFO  (jetty-launcher-624-thread-2) [    ] o.a.s.s.SolrDispatchFilter Using logger factory org.apache.logging.slf4j.Log4jLoggerFactory
   [junit4]   2> 275475 ERROR (jetty-launcher-624-thread-4) [    ] o.a.s.u.StartupLoggingUtils Missing Java Option solr.log.dir. Logging may be missing or incomplete.
   [junit4]   2> 275475 INFO  (jetty-launcher-624-thread-2) [    ] o.a.s.s.SolrDispatchFilter  ___      _       Welcome to Apache Solr? version 7.4.0
   [junit4]   2> 275475 INFO  (jetty-launcher-624-thread-4) [    ] o.a.s.s.SolrDispatchFilter Using logger factory org.apache.logging.slf4j.Log4jLoggerFactory
   [junit4]   2> 275475 INFO  (jetty-launcher-624-thread-2) [    ] o.a.s.s.SolrDispatchFilter / __| ___| |_ _   Starting in cloud mode on port null
   [junit4]   2> 275475 INFO  (jetty-launcher-624-thread-4) [    ] o.a.s.s.SolrDispatchFilter  ___      _       Welcome to Apache Solr? version 7.4.0
   [junit4]   2> 275475 INFO  (jetty-launcher-624-thread-2) [    ] o.a.s.s.SolrDispatchFilter \__ \/ _ \ | '_|  Install dir: null
   [junit4]   2> 275475 INFO  (jetty-launcher-624-thread-4) [    ] o.a.s.s.SolrDispatchFilter / __| ___| |_ _   Starting in cloud mode on port null
   [junit4]   2> 275475 INFO  (jetty-launcher-624-thread-2) [    ] o.a.s.s.SolrDispatchFilter |___/\___/_|_|    Start time: 2018-05-19T20:21:06.625304Z
   [junit4]   2> 275475 INFO  (jetty-launcher-624-thread-4) [    ] o.a.s.s.SolrDispatchFilter \__ \/ _ \ | '_|  Install dir: null
   [junit4]   2> 275475 INFO  (jetty-launcher-624-thread-4) [    ] o.a.s.s.SolrDispatchFilter |___/\___/_|_|    Start time: 2018-05-19T20:21:06.625349Z
   [junit4]   2> 275475 INFO  (jetty-launcher-624-thread-1) [    ] o.a.s.s.SolrDispatchFilter solr.xml found in ZooKeeper. Loading...
   [junit4]   2> 275486 INFO  (zkConnectionManagerCallback-633-thread-1) [    ] o.a.s.c.c.ConnectionManager zkClient has connected
   [junit4]   2> 275486 INFO  (jetty-launcher-624-thread-2) [    ] o.a.s.s.SolrDispatchFilter solr.xml found in ZooKeeper. Loading...
   [junit4]   2> 275489 INFO  (zkConnectionManagerCallback-635-thread-1) [    ] o.a.s.c.c.ConnectionManager zkClient has connected
   [junit4]   2> 275489 INFO  (jetty-launcher-624-thread-4) [    ] o.a.s.s.SolrDispatchFilter solr.xml found in ZooKeeper. Loading...
   [junit4]   2> 275490 INFO  (zkConnectionManagerCallback-631-thread-1) [    ] o.a.s.c.c.ConnectionManager zkClient has connected
   [junit4]   2> 275490 INFO  (jetty-launcher-624-thread-3) [    ] o.a.s.s.SolrDispatchFilter solr.xml found in ZooKeeper. Loading...
   [junit4]   2> 275507 INFO  (jetty-launcher-624-thread-1) [    ] o.a.s.c.ZkContainer Zookeeper client=127.0.0.1:40729/solr
   [junit4]   2> 275514 INFO  (jetty-launcher-624-thread-2) [    ] o.a.s.c.ZkContainer Zookeeper client=127.0.0.1:40729/solr
   [junit4]   2> 275515 INFO  (zkConnectionManagerCallback-641-thread-1) [    ] o.a.s.c.c.ConnectionManager zkClient has connected
   [junit4]   2> 275515 INFO  (jetty-launcher-624-thread-4) [    ] o.a.s.c.ZkContainer Zookeeper client=127.0.0.1:40729/solr
   [junit4]   2> 275515 INFO  (zkConnectionManagerCallback-645-thread-1) [    ] o.a.s.c.c.ConnectionManager zkClient has connected
   [junit4]   2> 275516 INFO  (jetty-launcher-624-thread-3) [    ] o.a.s.c.ZkContainer Zookeeper client=127.0.0.1:40729/solr
   [junit4]   2> 275516 INFO  (zkConnectionManagerCallback-648-thread-1) [    ] o.a.s.c.c.ConnectionManager zkClient has connected
   [junit4]   2> 275516 INFO  (zkConnectionManagerCallback-651-thread-1) [    ] o.a.s.c.c.ConnectionManager zkClient has connected
   [junit4]   2> 275517 INFO  (zkConnectionManagerCallback-653-thread-1) [    ] o.a.s.c.c.ConnectionManager zkClient has connected
   [junit4]   2> 275517 INFO  (zkConnectionManagerCallback-655-thread-1) [    ] o.a.s.c.c.ConnectionManager zkClient has connected
   [junit4]   2> 275518 INFO  (zkConnectionManagerCallback-657-thread-1) [    ] o.a.s.c.c.ConnectionManager zkClient has connected
   [junit4]   2> 275524 INFO  (zkConnectionManagerCallback-659-thread-1) [    ] o.a.s.c.c.ConnectionManager zkClient has connected
   [junit4]   2> 275529 INFO  (jetty-launcher-624-thread-3) [n:127.0.0.1:45127_solr    ] o.a.s.c.Overseer Overseer (id=null) closing
   [junit4]   2> 275529 INFO  (jetty-launcher-624-thread-3) [n:127.0.0.1:45127_solr    ] o.a.s.c.OverseerElectionContext I am going to be the leader 127.0.0.1:45127_solr
   [junit4]   2> 275530 INFO  (jetty-launcher-624-thread-3) [n:127.0.0.1:45127_solr    ] o.a.s.c.Overseer Overseer (id=72190452510949388-127.0.0.1:45127_solr-n_0000000000) starting
   [junit4]   2> 275539 INFO  (zkConnectionManagerCallback-672-thread-1) [    ] o.a.s.c.c.ConnectionManager zkClient has connected
   [junit4]   2> 275541 INFO  (jetty-launcher-624-thread-3) [n:127.0.0.1:45127_solr    ] o.a.s.c.s.i.ZkClientClusterStateProvider Cluster at 127.0.0.1:40729/solr ready
   [junit4]   2> 275542 INFO  (jetty-launcher-624-thread-3) [n:127.0.0.1:45127_solr    ] o.a.s.c.ZkController Register node as live in ZooKeeper:/live_nodes/127.0.0.1:45127_solr
   [junit4]   2> 275543 INFO  (OverseerStateUpdate-72190452510949388-127.0.0.1:45127_solr-n_0000000000) [    ] o.a.s.c.c.ZkStateReader Updated live nodes from ZooKeeper... (0) -> (1)
   [junit4]   2> 275546 INFO  (zkCallback-671-thread-1) [    ] o.a.s.c.c.ZkStateReader Updated live nodes from ZooKeeper... (0) -> (1)
   [junit4]   2> 275569 INFO  (jetty-launcher-624-thread-1) [n:127.0.0.1:35719_solr    ] o.a.s.c.c.ZkStateReader Updated live nodes from ZooKeeper... (0) -> (1)
   [junit4]   2> 275569 INFO  (jetty-launcher-624-thread-4) [n:127.0.0.1:44731_solr    ] o.a.s.c.c.ZkStateReader Updated live nodes from ZooKeeper... (0) -> (1)
   [junit4]   2> 275570 INFO  (jetty-launcher-624-thread-1) [n:127.0.0.1:35719_solr    ] o.a.s.c.Overseer Overseer (id=null) closing
   [junit4]   2> 275570 INFO  (jetty-launcher-624-thread-4) [n:127.0.0.1:44731_solr    ] o.a.s.c.Overseer Overseer (id=null) closing
   [junit4]   2> 275571 INFO  (jetty-launcher-624-thread-1) [n:127.0.0.1:35719_solr    ] o.a.s.c.TransientSolrCoreCacheDefault Allocating transient cache for 2147483647 transient cores
   [junit4]   2> 275571 INFO  (jetty-launcher-624-thread-2) [n:127.0.0.1:39667_solr    ] o.a.s.c.c.ZkStateReader Updated live nodes from ZooKeeper... (0) -> (1)
   [junit4]   2> 275571 INFO  (jetty-launcher-624-thread-1) [n:127.0.0.1:35719_solr    ] o.a.s.c.ZkController Register node as live in ZooKeeper:/live_nodes/127.0.0.1:35719_solr
   [junit4]   2> 275571 INFO  (jetty-launcher-624-thread-4) [n:127.0.0.1:44731_solr    ] o.a.s.c.TransientSolrCoreCacheDefault Allocating transient cache for 2147483647 transient cores
   [junit4]   2> 275571 INFO  (jetty-launcher-624-thread-4) [n:127.0.0.1:44731_solr    ] o.a.s.c.ZkController Register node as live in ZooKeeper:/live_nodes/127.0.0.1:44731_solr
   [junit4]   2> 275571 INFO  (zkCallback-671-thread-1) [    ] o.a.s.c.c.ZkStateReader Updated live nodes from ZooKeeper... (1) -> (3)
   [junit4]   2> 275571 INFO  (zkCallback-658-thread-1) [    ] o.a.s.c.c.ZkStateReader Updated live nodes from ZooKeeper... (1) -> (3)
   [junit4]   2> 275572 INFO  (jetty-launcher-624-thread-2) [n:127.0.0.1:39667_solr    ] o.a.s.c.Overseer Overseer (id=null) closing
   [junit4]   2> 275573 INFO  (jetty-launcher-624-thread-2) [n:127.0.0.1:39667_solr    ] o.a.s.c.TransientSolrCoreCacheDefault Allocating transient cache for 2147483647 transient cores
   [junit4]   2> 275573 INFO  (jetty-launcher-624-thread-2) [n:127.0.0.1:39667_solr    ] o.a.s.c.ZkController Register node as live in ZooKeeper:/live_nodes/127.0.0.1:39667_solr
   [junit4]   2> 275580 INFO  (zkCallback-671-thread-1) [    ] o.a.s.c.c.ZkStateReader Updated live nodes from ZooKeeper... (3) -> (4)
   [junit4]   2> 275580 INFO  (zkCallback-658-thread-1) [    ] o.a.s.c.c.ZkStateReader Updated live nodes from ZooKeeper... (3) -> (4)
   [junit4]   2> 275598 INFO  (zkCallback-656-thread-1) [    ] o.a.s.c.c.ZkStateReader Updated live nodes from ZooKeeper... (1) -> (4)
   [junit4]   2> 275598 INFO  (zkCallback-654-thread-1) [    ] o.a.s.c.c.ZkStateReader Updated live nodes from ZooKeeper... (1) -> (4)
   [junit4]   2> 275602 INFO  (zkCallback-650-thread-1) [    ] o.a.s.c.c.ZkStateReader Updated live nodes from ZooKeeper... (1) -> (4)
   [junit4]   2> 275625 INFO  (jetty-launcher-624-thread-4) [n:127.0.0.1:44731_solr    ] o.a.s.m.r.SolrJmxReporter JMX monitoring for 'solr_44731.solr.node' (registry 'solr.node') enabled at server: com.sun.jmx.mbeanserver.JmxMBeanServer@702d27cb
   [junit4]   2> 275630 INFO  (jetty-launcher-624-thread-4) [n:127.0.0.1:44731_solr    ] o.a.s.m.r.SolrJmxReporter JMX monitoring for 'solr_44731.solr.jvm' (registry 'solr.jvm') enabled at server: com.sun.jmx.mbeanserver.JmxMBeanServer@702d27cb
   [junit4]   2> 275631 INFO  (jetty-launcher-624-thread-4) [n:127.0.0.1:44731_solr    ] o.a.s.m.r.SolrJmxReporter JMX monitoring for 'solr_44731.solr.jetty' (registry 'solr.jetty') enabled at server: com.sun.jmx.mbeanserver.JmxMBeanServer@702d27cb
   [junit4]   2> 275631 INFO  (jetty-launcher-624-thread-4) [n:127.0.0.1:44731_solr    ] o.a.s.c.CorePropertiesLocator Found 0 core definitions underneath /home/jenkins/workspace/Lucene-Solr-7.x-Linux/solr/build/solr-core/test/J2/temp/solr.cloud.autoscaling.SearchRateTriggerTest_BE518230236D5A63-001/tempDir-001/node4/.
   [junit4]   2> 275649 INFO  (zkConnectionManagerCallback-677-thread-1) [    ] o.a.s.c.c.ConnectionManager zkClient has connected
   [junit4]   2> 275650 INFO  (jetty-launcher-624-thread-4) [n:127.0.0.1:44731_solr    ] o.a.s.c.c.ZkStateReader Updated live nodes from ZooKeeper... (0) -> (4)
   [junit4]   2> 275651 INFO  (jetty-launcher-624-thread-4) [n:127.0.0.1:44731_solr    ] o.a.s.c.s.i.ZkClientClusterStateProvider Cluster at 127.0.0.1:40729/solr ready
   [junit4]   2> 275710 INFO  (jetty-launcher-624-thread-1) [n:127.0.0.1:35719_solr    ] o.a.s.m.r.SolrJmxReporter JMX monitoring for 'solr_35719.solr.node' (registry 'solr.node') enabled at server: com.sun.jmx.mbeanserver.JmxMBeanServer@702d27cb
   [junit4]   2> 275717 INFO  (jetty-launcher-624-thread-1) [n:127.0.0.1:35719_solr    ] o.a.s.m.r.SolrJmxReporter JMX monitoring for 'solr_35719.solr.jvm' (registry 'solr.jvm') enabled at server: com.sun.jmx.mbeanserver.JmxMBeanServer@702d27cb
   [junit4]   2> 275718 INFO  (jetty-launcher-624-thread-1) [n:127.0.0.1:35719_solr    ] o.a.s.m.r.SolrJmxReporter JMX monitoring for 'solr_35719.solr.jetty' (registry 'solr.jetty') enabled at server: com.sun.jmx.mbeanserver.JmxMBeanServer@702d27cb
   [junit4]   2> 275719 INFO  (jetty-launcher-624-thread-1) [n:127.0.0.1:35719_solr    ] o.a.s.c.CorePropertiesLocator Found 0 core definitions underneath /home/jenkins/workspace/Lucene-Solr-7.x-Linux/solr/build/solr-core/test/J2/temp/solr.cloud.autoscaling.SearchRateTriggerTest_BE518230236D5A63-001/tempDir-001/node1/.
   [junit4]   2> 275730 INFO  (zkConnectionManagerCallback-682-thread-1) [    ] o.a.s.c.c.ConnectionManager zkClient has connected
   [junit4]   2> 275730 INFO  (jetty-launcher-624-thread-1) [n:127.0.0.1:35719_solr    ] o.a.s.c.c.ZkStateReader Updated live nodes from ZooKeeper... (0) -> (4)
   [junit4]   2> 275731 INFO  (jetty-launcher-624-thread-1) [n:127.0.0.1:35719_solr    ] o.a.s.c.s.i.ZkClientClusterStateProvider Cluster at 127.0.0.1:40729/solr ready
   [junit4]   2> 275786 INFO  (jetty-launcher-624-thread-3) [n:127.0.0.1:45127_solr    ] o.a.s.m.r.SolrJmxReporter JMX monitoring for 'solr_45127.solr.node' (registry 'solr.node') enabled at server: com.sun.jmx.mbeanserver.JmxMBeanServer@702d27cb
   [junit4]   2> 275790 INFO  (jetty-launcher-624-thread-3) [n:127.0.0.1:45127_solr    ] o.a.s.m.r.SolrJmxReporter JMX monitoring for 'solr_45127.solr.jvm' (registry 'solr.jvm') enabled at server: com.sun.jmx.mbeanserver.JmxMBeanServer@702d27cb
   [junit4]   2> 275790 INFO  (jetty-launcher-624-thread-3) [n:127.0.0.1:45127_solr    ] o.a.s.m.r.SolrJmxReporter JMX monitoring for 'solr_45127.solr.jetty' (registry 'solr.jetty') enabled at server: com.sun.jmx.mbeanserver.JmxMBeanServer@702d27cb
   [junit4]   2> 275791 INFO  (jetty-launcher-624-thread-3) [n:127.0.0.1:45127_solr    ] o.a.s.c.CorePropertiesLocator Found 0 core definitions underneath /home/jenkins/workspace/Lucene-Solr-7.x-Linux/solr/build/solr-core/test/J2/temp/solr.cloud.autoscaling.SearchRateTriggerTest_BE518230236D5A63-001/tempDir-001/node3/.
   [junit4]   2> 275793 INFO  (jetty-launcher-624-thread-2) [n:127.0.0.1:39667_solr    ] o.a.s.m.r.SolrJmxReporter JMX monitoring for 'solr_39667.solr.node' (registry 'solr.node') enabled at server: com.sun.jmx.mbeanserver.JmxMBeanServer@702d27cb
   [junit4]   2> 275797 INFO  (jetty-launcher-624-thread-2) [n:127.0.0.1:39667_solr    ] o.a.s.m.r.SolrJmxReporter JMX monitoring for 'solr_39667.solr.jvm' (registry 'solr.jvm') enabled at server: com.sun.jmx.mbeanserver.JmxMBeanServer@702d27cb
   [junit4]   2> 275797 INFO  (jetty-launcher-624-thread-2) [n:127.0.0.1:39667_solr    ] o.a.s.m.r.SolrJmxReporter JMX monitoring for 'solr_39667.solr.jetty' (registry 'solr.jetty') enabled at server: com.sun.jmx.mbeanserver.JmxMBeanServer@702d27cb
   [junit4]   2> 275798 INFO  (jetty-launcher-624-thread-2) [n:127.0.0.1:39667_solr    ] o.a.s.c.CorePropertiesLocator Found 0 core definitions underneath /home/jenkins/workspace/Lucene-Solr-7.x-Linux/solr/build/solr-core/test/J2/temp/solr.cloud.autoscaling.SearchRateTriggerTest_BE518230236D5A63-001/tempDir-001/node2/.
   [junit4]   2> 275800 INFO  (zkConnectionManagerCallback-687-thread-1) [    ] o.a.s.c.c.ConnectionManager zkClient has connected
   [junit4]   2> 275800 INFO  (jetty-launcher-624-thread-2) [n:127.0.0.1:39667_solr    ] o.a.s.c.c.ZkStateReader Updated live nodes from ZooKeeper... (0) -> (4)
   [junit4]   2> 275801 INFO  (jetty-launcher-624-thread-2) [n:127.0.0.1:39667_solr    ] o.a.s.c.s.i.ZkClientClusterStateProvider Cluster at 127.0.0.1:40729/solr ready
   [junit4]   2> 275828 INFO  (zkConnectionManagerCallback-689-thread-1) [    ] o.a.s.c.c.ConnectionManager zkClient has connected
   [junit4]   2> 275831 INFO  (zkConnectionManagerCallback-694-thread-1) [    ] o.a.s.c.c.ConnectionManager zkClient has connected
   [junit4]   2> 275832 INFO  (SUITE-SearchRateTriggerTest-seed#[BE518230236D5A63]-worker) [    ] o.a.s.c.c.ZkStateReader Updated live nodes from ZooKeeper... (0) -> (4)
   [junit4]   2> 275833 INFO  (SUITE-SearchRateTriggerTest-seed#[BE518230236D5A63]-worker) [    ] o.a.s.c.s.i.ZkClientClusterStateProvider Cluster at 127.0.0.1:40729/solr ready
   [junit4]   2> 275848 INFO  (TEST-SearchRateTriggerTest.testWaitForElapsed-seed#[BE518230236D5A63]) [    ] o.a.s.SolrTestCaseJ4 ###Starting testWaitForElapsed
   [junit4]   2> 275849 INFO  (TEST-SearchRateTriggerTest.testWaitForElapsed-seed#[BE518230236D5A63]) [    ] o.a.s.c.c.ZkStateReader Updated live nodes from ZooKeeper... (0) -> (4)
   [junit4]   2> 275852 INFO  (qtp969350272-2791) [n:127.0.0.1:45127_solr    ] o.a.s.h.a.CollectionsHandler Invoked Collection Action :create with params replicationFactor=2&collection.configName=conf&maxShardsPerNode=1&name=SearchRateTriggerTest-collection1&nrtReplicas=2&action=CREATE&numShards=2&wt=javabin&version=2 and sendToOCPQueue=true
   [junit4]   2> 275854 INFO  (OverseerThreadFactory-1323-thread-1) [    ] o.a.s.c.a.c.CreateCollectionCmd Create collection SearchRateTriggerTest-collection1
   [junit4]   2> 275961 INFO  (OverseerStateUpdate-72190452510949388-127.0.0.1:45127_solr-n_0000000000) [    ] o.a.s.c.o.SliceMutator createReplica() {
   [junit4]   2>   "operation":"ADDREPLICA",
   [junit4]   2>   "collection":"SearchRateTriggerTest-collection1",
   [junit4]   2>   "shard":"shard1",
   [junit4]   2>   "core":"SearchRateTriggerTest-collection1_shard1_replica_n1",
   [junit4]   2>   "state":"down",
   [junit4]   2>   "base_url":"http://127.0.0.1:44731/solr",
   [junit4]   2>   "type":"NRT",
   [junit4]   2>   "waitForFinalState":"false"} 
   [junit4]   2> 275961 INFO  (OverseerStateUpdate-72190452510949388-127.0.0.1:45127_solr-n_0000000000) [    ] o.a.s.c.o.SliceMutator createReplica() {
   [junit4]   2>   "operation":"ADDREPLICA",
   [junit4]   2>   "collection":"SearchRateTriggerTest-collection1",
   [junit4]   2>   "shard":"shard1",
   [junit4]   2>   "core":"SearchRateTriggerTest-collection1_shard1_replica_n2",
   [junit4]   2>   "state":"down",
   [junit4]   2>   "base_url":"http://127.0.0.1:45127/solr",
   [junit4]   2>   "type":"NRT",
   [junit4]   2>   "waitForFinalState":"false"} 
   [junit4]   2> 275962 INFO  (OverseerStateUpdate-72190452510949388-127.0.0.1:45127_solr-n_0000000000) [    ] o.a.s.c.o.SliceMutator createReplica() {
   [junit4]   2>   "operation":"ADDREPLICA",
   [junit4]   2>   "collection":"SearchRateTriggerTest-collection1",
   [junit4]   2>   "shard":"shard2",
   [junit4]   2>   "core":"SearchRateTriggerTest-collection1_shard2_replica_n4",
   [junit4]   2>   "state":"down",
   [junit4]   2>   "base_url":"http://127.0.0.1:35719/solr",
   [junit4]   2>   "type":"NRT",
   [junit4]   2>   "waitForFinalState":"false"} 
   [junit4]   2> 275963 INFO  (OverseerStateUpdate-72190452510949388-127.0.0.1:45127_solr-n_0000000000) [    ] o.a.s.c.o.SliceMutator createReplica() {
   [junit4]   2>   "operation":"ADDREPLICA",
   [junit4]   2>   "collection":"SearchRateTriggerTest-collection1",
   [junit4]   2>   "shard":"shard2",
   [junit4]   2>   "core":"SearchRateTriggerTest-collection1_shard2_replica_n6",
   [junit4]   2>   "state":"down",
   [junit4]   2>   "base_url":"http://127.0.0.1:39667/solr",
   [junit4]   2>   "type":"NRT",
   [junit4]   2>   "waitForFinalState":"false"} 
   [junit4]   2> 276167 INFO  (qtp969350272-2771) [n:127.0.0.1:45127_solr    x:SearchRateTriggerTest-collection1_shard1_replica_n2] o.a.s.h.a.CoreAdminOperation core create command qt=/admin/cores&coreNodeName=core_node5&collection.configName=conf&newCollection=true&name=SearchRateTriggerTest-collection1_shard1_replica_n2&action=CREATE&numShards=2&collection=SearchRateTriggerTest-collection1&shard=shard1&wt=javabin&version=2&replicaType=NRT
   [junit4]   2> 276168 INFO  (qtp969350272-2771) [n:127.0.0.1:45127_solr    x:SearchRateTriggerTest-collection1_shard1_replica_n2] o.a.s.c.TransientSolrCoreCacheDefault Allocating transient cache for 2147483647 transient cores
   [junit4]   2> 276173 INFO  (qtp1363186586-2795) [n:127.0.0.1:44731_solr    x:SearchRateTriggerTest-collection1_shard1_replica_n1] o.a.s.h.a.CoreAdminOperation core create command qt=/admin/cores&coreNodeName=core_node3&collection.configName=conf&newCollection=true&name=SearchRateTriggerTest-collection1_shard1_replica_n1&action=CREATE&numShards=2&collection=SearchRateTriggerTest-collection1&shard=shard1&wt=javabin&version=2&replicaType=NRT
   [junit4]   2> 276192 INFO  (qtp2126009066-2788) [n:127.0.0.1:35719_solr    x:SearchRateTriggerTest-collection1_shard2_replica_n4] o.a.s.h.a.CoreAdminOperation core create command qt=/admin/cores&coreNodeName=core_node7&collection.configName=conf&newCollection=true&name=SearchRateTriggerTest-collection1_shard2_replica_n4&action=CREATE&numShards=2&collection=SearchRateTriggerTest-collection1&shard=shard2&wt=javabin&version=2&replicaType=NRT
   [junit4]   2> 276192 INFO  (qtp1416107910-2798) [n:127.0.0.1:39667_solr    x:SearchRateTriggerTest-collection1_shard2_replica_n6] o.a.s.h.a.CoreAdminOperation core create command qt=/admin/cores&coreNodeName=core_node8&collection.configName=conf&newCollection=true&name=SearchRateTriggerTest-collection1_shard2_replica_n6&action=CREATE&numShards=2&collection=SearchRateTriggerTest-collection1&shard=shard2&wt=javabin&version=2&replicaType=NRT
   [junit4]   2> 277189 INFO  (qtp1363186586-2795) [n:127.0.0.1:44731_solr c:SearchRateTriggerTest-collection1 s:shard1 r:core_node3 x:SearchRateTriggerTest-collection1_shard1_replica_n1] o.a.s.c.SolrConfig Using Lucene MatchVersion: 7.4.0
   [junit4]   2> 277193 INFO  (qtp1363186586-2795) [n:127.0.0.1:44731_solr c:SearchRateTriggerTest-collection1 s:shard1 r:core_node3 x:SearchRateTriggerTest-collection1_shard1_replica_n1] o.a.s.s.IndexSchema [SearchRateTriggerTest-collection1_shard1_replica_n1] Schema name=minimal
   [junit4]   2> 277194 INFO  (qtp1363186586-2795) [n:127.0.0.1:44731_solr c:SearchRateTriggerTest-collection1 s:shard1 r:core_node3 x:SearchRateTriggerTest-collection1_shard1_replica_n1] o.a.s.s.IndexSchema Loaded schema minimal/1.1 with uniqueid field id
   [junit4]   2> 277194 INFO  (qtp1363186586-2795) [n:127.0.0.1:44731_solr c:SearchRateTriggerTest-collection1 s:shard1 r:core_node3 x:SearchRateTriggerTest-collection1_shard1_replica_n1] o.a.s.c.CoreContainer Creating SolrCore 'SearchRateTriggerTest-collection1_shard1_replica_n1' using configuration from collection SearchRateTriggerTest-collection1, trusted=true
   [junit4]   2> 277194 INFO  (qtp1363186586-2795) [n:127.0.0.1:44731_solr c:SearchRateTriggerTest-collection1 s:shard1 r:core_node3 x:SearchRateTriggerTest-collection1_shard1_replica_n1] o.a.s.m.r.SolrJmxReporter JMX monitoring for 'solr_44731.solr.core.SearchRateTriggerTest-collection1.shard1.replica_n1' (registry 'solr.core.SearchRateTriggerTest-collection1.shard1.replica_n1') enabled at server: com.sun.jmx.mbeanserver.JmxMBeanServer@702d27cb
   [junit4]   2> 277195 INFO  (qtp1363186586-2795) [n:127.0.0.1:44731_solr c:SearchRateTriggerTest-collection1 s:shard1 r:core_node3 x:SearchRateTriggerTest-collection1_shard1_replica_n1] o.a.s.c.SolrCore solr.RecoveryStrategy.Builder
   [junit4]   2> 277195 INFO  (qtp1363186586-2795) [n:127.0.0.1:44731_solr c:SearchRateTriggerTest-collection1 s:shard1 r:core_node3 x:SearchRateTriggerTest-collection1_shard1_replica_n1] o.a.s.c.SolrCore [[SearchRateTriggerTest-collection1_shard1_replica_n1] ] Opening new SolrCore at [/home/jenkins/workspace/Lucene-Solr-7.x-Linux/solr/build/solr-core/test/J2/temp/solr.cloud.autoscaling.SearchRateTriggerTest_BE518230236D5A63-001/tempDir-001/node4/SearchRateTriggerTest-collection1_shard1_replica_n1], dataDir=[/home/jenkins/workspace/Lucene-Solr-7.x-Linux/solr/build/solr-core/test/J2/temp/solr.cloud.autoscaling.SearchRateTriggerTest_BE518230236D5A63-001/tempDir-001/node4/./SearchRateTriggerTest-collection1_shard1_replica_n1/data/]
   [junit4]   2> 277200 INFO  (qtp969350272-2771) [n:127.0.0.1:45127_solr c:SearchRateTriggerTest-collection1 s:shard1 r:core_node5 x:SearchRateTriggerTest-collection1_shard1_replica_n2] o.a.s.c.SolrConfig Using Lucene MatchVersion: 7.4.0
   [junit4]   2> 277200 INFO  (qtp1416107910-2798) [n:127.0.0.1:39667_solr c:SearchRateTriggerTest-collection1 s:shard2 r:core_node8 x:SearchRateTriggerTest-collection1_shard2_replica_n6] o.a.s.c.SolrConfig Using Lucene MatchVersion: 7.4.0
   [junit4]   2> 277204 INFO  (qtp2126009066-2788) [n:127.0.0.1:35719_solr c:SearchRateTriggerTest-collection1 s:shard2 r:core_node7 x:SearchRateTriggerTest-collection1_shard2_replica_n4] o.a.s.c.SolrConfig Using Lucene MatchVersion: 7.4.0
   [junit4]   2> 277214 INFO  (qtp969350272-2771) [n:127.0.0.1:45127_solr c:SearchRateTriggerTest-collection1 s:shard1 r:core_node5 x:SearchRateTriggerTest-collection1_shard1_replica_n2] o.a.s.s.IndexSchema [SearchRateTriggerTest-collection1_shard1_replica_n2] Schema name=minimal
   [junit4]   2> 277214 INFO  (qtp1416107910-2798) [n:127.0.0.1:39667_solr c:SearchRateTriggerTest-collection1 s:shard2 r:core_node8 x:SearchRateTriggerTest-collection1_shard2_replica_n6] o.a.s.s.IndexSchema [SearchRateTriggerTest-collection1_shard2_replica_n6] Schema name=minimal
   [junit4]   2> 277216 INFO  (qtp1416107910-2798) [n:127.0.0.1:39667_solr c:SearchRateTriggerTest-collection1 s:shard2 r:core_node8 x:SearchRateTriggerTest-collection1_shard2_replica_n6] o.a.s.s.IndexSchema Loaded schema minimal/1.1 with uniqueid field id
   [junit4]   2> 277216 INFO  (qtp1416107910-2798) [n:127.0.0.1:39667_solr c:SearchRateTriggerTest-collection1 s:shard2 r:core_node8 x:SearchRateTriggerTest-collection1_shard2_replica_n6] o.a.s.c.CoreContainer Creating SolrCore 'SearchRateTriggerTest-collection1_shard2_replica_n6' using configuration from collection SearchRateTriggerTest-collection1, trusted=true
   [junit4]   2> 277217 INFO  (qtp1416107910-2798) [n:127.0.0.1:39667_solr c:SearchRateTriggerTest-collection1 s:shard2 r:core_node8 x:SearchRateTriggerTest-collection1_shard2_replica_n6] o.a.s.m.r.SolrJmxReporter JMX monitoring for 'solr_39667.solr.core.SearchRateTriggerTest-collection1.shard2.replica_n6' (registry 'solr.core.SearchRateTriggerTest-collection1.shard2.replica_n6') enabled at server: com.sun.jmx.mbeanserver.JmxMBeanServer@702d27cb
   [junit4]   2> 277217 INFO  (qtp1416107910-2798) [n:127.0.0.1:39667_solr c:SearchRateTriggerTest-collection1 s:shard2 r:core_node8 x:SearchRateTriggerTest-collection1_shard2_replica_n6] o.a.s.c.SolrCore solr.RecoveryStrategy.Builder
   [junit4]   2> 277217 INFO  (qtp1416107910-2798) [n:127.0.0.1:39667_solr c:SearchRateTriggerTest-collection1 s:shard2 r:core_node8 x:SearchRateTriggerTest-collection1_shard2_replica_n6] o.a.s.c.SolrCore [[SearchRateTriggerTest-collection1_shard2_replica_n6] ] Opening new SolrCore at [/home/jenkins/workspace/Lucene-Solr-7.x-Linux/solr/build/solr-core/test/J2/temp/solr.cloud.autoscaling.SearchRateTriggerTest_BE518230236D5A63-001/tempDir-001/node2/SearchRateTriggerTest-collection1_shard2_replica_n6], dataDir=[/home/jenkins/workspace/Lucene-Solr-7.x-Linux/solr/build/solr-core/test/J2/temp/solr.cloud.autoscaling.SearchRateTriggerTest_BE518230236D5A63-001/tempDir-001/node2/./SearchRateTriggerTest-collection1_shard2_replica_n6/data/]
   [junit4]   2> 277217 INFO  (qtp2126009066-2788) [n:127.0.0.1:35719_solr c:SearchRateTriggerTest-collection1 s:shard2 r:core_node7 x:SearchRateTriggerTest-collection1_shard2_replica_n4] o.a.s.s.IndexSchema [SearchRateTriggerTest-collection1_shard2_replica_n4] Schema name=minimal
   [junit4]   2> 277219 INFO  (qtp969350272-2771) [n:127.0.0.1:45127_solr c:SearchRateTriggerTest-collection1 s:shard1 r:core_node5 x:SearchRateTriggerTest-collection1_shard1_replica_n2] o.a.s.s.IndexSchema Loaded schema minimal/1.1 with uniqueid field id
   [junit4]   2> 277219 INFO  (qtp2126009066-2788) [n:127.0.0.1:35719_solr c:SearchRateTriggerTest-collection1 s:shard2 r:core_node7 x:SearchRateTriggerTest-collection1_shard2_replica_n4] o.a.s.s.IndexSchema Loaded schema minimal/1.1 with uniqueid field id
   [junit4]   2> 277219 INFO  (qtp969350272-2771) [n:127.0.0.1:45127_solr c:SearchRateTriggerTest-collection1 s:shard1 r:core_node5 x:SearchRateTriggerTest-collection1_shard1_replica_n2] o.a.s.c.CoreContainer Creating SolrCore 'SearchRateTriggerTest-collection1_shard1_replica_n2' using configuration from collection SearchRateTriggerTest-collection1, trusted=true
   [junit4]   2> 277219 INFO  (qtp2126009066-2788) [n:127.0.0.1:35719_solr c:SearchRateTriggerTest-collection1 s:shard2 r:core_node7 x:SearchRateTriggerTest-collection1_shard2_replica_n4] o.a.s.c.CoreContainer Creating SolrCore 'SearchRateTriggerTest-collection1_shard2_replica_n4' using configuration from collection SearchRateTriggerTest-collection1, trusted=true
   [junit4]   2> 277219 INFO  (qtp969350272-2771) [n:127.0.0.1:45127_solr c:SearchRateTriggerTest-collection1 s:shard1 r:core_node5 x:SearchRateTriggerTest-collection1_shard1_replica_n2] o.a.s.m.r.SolrJmxReporter JMX monitoring for 'solr_45127.solr.core.SearchRateTriggerTest-collection1.shard1.replica_n2' (registry 'solr.core.SearchRateTriggerTest-collection1.shard1.replica_n2') enabled at server: com.sun.jmx.mbeanserver.JmxMBeanServer@702d27cb
   [junit4]   2> 277219 INFO  (qtp2126009066-2788) [n:127.0.0.1:35719_solr c:SearchRateTriggerTest-collection1 s:shard2 r:core_node7 x:SearchRateTriggerTest-collection1_shard2_replica_n4] o.a.s.m.r.SolrJmxReporter JMX monitoring for 'solr_35719.solr.core.SearchRateTriggerTest-collection1.shard2.replica_n4' (registry 'solr.core.SearchRateTriggerTest-collection1.shard2.replica_n4') enabled at server: com.sun.jmx.mbeanserver.JmxMBeanServer@702d27cb
   [junit4]   2> 277219 INFO  (qtp969350272-2771) [n:127.0.0.1:45127_solr c:SearchRateTriggerTest-collection1 s:shard1 r:core_node5 x:SearchRateTriggerTest-collection1_shard1_replica_n2] o.a.s.c.SolrCore solr.RecoveryStrategy.Builder
   [junit4]   2> 277219 INFO  (qtp2126009066-2788) [n:127.0.0.1:35719_solr c:SearchRateTriggerTest-collection1 s:shard2 r:core_node7 x:SearchRateTriggerTest-collection1_shard2_replica_n4] o.a.s.c.SolrCore solr.RecoveryStrategy.Builder
   [junit4]   2> 277219 INFO  (qtp969350272-2771) [n:127.0.0.1:45127_solr c:SearchRateTriggerTest-collection1 s:shard1 r:core_node5 x:SearchRateTriggerTest-collection1_shard1_replica_n2] o.a.s.c.SolrCore [[SearchRateTriggerTest-collection1_shard1_replica_n2] ] Opening new SolrCore at [/home/jenkins/workspace/Lucene-Solr-7.x-Linux/solr/build/solr-core/test/J2/temp/solr.cloud.autoscaling.SearchRateTriggerTest_BE518230236D5A63-001/tempDir-001/node3/SearchRateTriggerTest-collection1_shard1_replica_n2], dataDir=[/home/jenkins/workspace/Lucene-Solr-7.x-Linux/solr/build/solr-core/test/J2/temp/solr.cloud.autoscaling.SearchRateTriggerTest_BE518230236D5A63-001/tempDir-001/node3/./SearchRateTriggerTest-collection1_shard1_replica_n2/data/]
   [junit4]   2> 277219 INFO  (qtp2126009066-2788) [n:127.0.0.1:35719_solr c:SearchRateTriggerTest-collection1 s:shard2 r:core_node7 x:SearchRateTriggerTest-collection1_shard2_replica_n4] o.a.s.c.SolrCore [[SearchRateTriggerTest-collection1_shard2_replica_n4] ] Opening new SolrCore at [/home/jenkins/workspace/Lucene-Solr-7.x-Linux/solr/build/solr-core/test/J2/temp/solr.cloud.autoscaling.SearchRateTriggerTest_BE518230236D5A63-001/tempDir-001/node1/SearchRateTriggerTest-collection1_shard2_replica_n4], dataDir=[/home/jenkins/workspace/Lucene-Solr-7.x-Linux/solr/build/solr-core/test/J2/temp/solr.cloud.autoscaling.SearchRateTriggerTest_BE518230236D5A63-001/tempDir-001/node1/./SearchRateTriggerTest-collection1_shard2_replica_n4/data/]
   [junit4]   2> 277266 INFO  (qtp2126009066-2788) [n:127.0.0.1:35719_solr c:SearchRateTriggerTest-collection1 s:shard2 r:core_node7 x:SearchRateTriggerTest-collection1_shard2_replica_n4] o.a.s.u.UpdateHandler Using UpdateLog implementation: org.apache.solr.update.UpdateLog
   [junit4]   2> 277266 INFO  (qtp2126009066-2788) [n:127.0.0.1:35719_solr c:SearchRateTriggerTest-collection1 s:shard2 r:core_node7 x:SearchRateTriggerTest-collection1_shard2_replica_n4] o.a.s.u.UpdateLog Initializing UpdateLog: dataDir=null defaultSyncLevel=FLUSH numRecordsToKeep=100 maxNumLogsToKeep=10 numVersionBuckets=65536
   [junit4]   2> 277267 INFO  (qtp2126009066-2788) [n:127.0.0.1:35719_solr c:SearchRateTriggerTest-collection1 s:shard2 r:core_node7 x:SearchRateTriggerTest-collection1_shard2_replica_n4] o.a.s.u.CommitTracker Hard AutoCommit: disabled
   [junit4]   2> 277267 INFO  (qtp2126009066-2788) [n:127.0.0.1:35719_solr c:SearchRateTriggerTest-collection1 s:shard2 r:core_node7 x:SearchRateTriggerTest-collection1_shard2_replica_n4] o.a.s.u.CommitTracker Soft AutoCommit: disabled
   [junit4]   2> 277268 INFO  (qtp1416107910-2798) [n:127.0.0.1:39667_solr c:SearchRateTriggerTest-collection1 s:shard2 r:core_node8 x:SearchRateTriggerTest-collection1_shard2_replica_n6] o.a.s.u.UpdateHandler Using UpdateLog implementation: org.apache.solr.update.UpdateLog
   [junit4]   2> 277268 INFO  (qtp1416107910-2798) [n:127.0.0.1:39667_solr c:SearchRateTriggerTest-collection1 s:shard2 r:core_node8 x:SearchRateTriggerTest-collection1_shard2_replica_n6] o.a.s.u.UpdateLog Initializing UpdateLog: dataDir=null defaultSyncLevel=FLUSH numRecordsToKeep=100 maxNumLogsToKeep=10 numVersionBuckets=65536
   [junit4]   2> 277269 INFO  (qtp1416107910-2798) [n:127.0.0.1:39667_solr c:SearchRateTriggerTest-collection1 s:shard2 r:core_node8 x:SearchRateTriggerTest-collection1_shard2_replica_n6] o.a.s.u.CommitTracker Hard AutoCommit: disabled
   [junit4]   2> 277270 INFO  (qtp1416107910-2798) [n:127.0.0.1:39667_solr c:SearchRateTriggerTest-collection1 s:shard2 r:core_node8 x:SearchRateTriggerTest-collection1_shard2_replica_n6] o.a.s.u.CommitTracker Soft AutoCommit: disabled
   [junit4]   2> 277271 INFO  (qtp1416107910-2798) [n:127.0.0.1:39667_solr c:SearchRateTriggerTest-collection1 s:shard2 r:core_node8 x:SearchRateTriggerTest-collection1_shard2_replica_n6] o.a.s.s.SolrIndexSearcher Opening [Searcher@2e8bf581[SearchRateTriggerTest-collection1_shard2_replica_n6] main]
   [junit4]   2> 277272 INFO  (qtp2126009066-2788) [n:127.0.0.1:35719_solr c:SearchRateTriggerTest-collection1 s:shard2 r:core_node7 x:SearchRateTriggerTest-collection1_shard2_replica_n4] o.a.s.s.SolrIndexSearcher Opening [Searcher@78350c10[SearchRateTriggerTest-collection1_shard2_replica_n4] main]
   [junit4]   2> 277273 INFO  (qtp1416107910-2798) [n:127.0.0.1:39667_solr c:SearchRateTriggerTest-collection1 s:shard2 r:core_node8 x:SearchRateTriggerTest-collection1_shard2_replica_n6] o.a.s.r.ManagedResourceStorage Configured ZooKeeperStorageIO with znodeBase: /configs/conf
   [junit4]   2> 277273 INFO  (qtp2126009066-2788) [n:127.0.0.1:35719_solr c:SearchRateTriggerTest-collection1 s:shard2 r:core_node7 x:SearchRateTriggerTest-collection1_shard2_replica_n4] o.a.s.r.ManagedResourceStorage Configured ZooKeeperStorageIO with znodeBase: /configs/conf
   [junit4]   2> 277273 INFO  (qtp1416107910-2798) [n:127.0.0.1:39667_solr c:SearchRateTriggerTest-collection1 s:shard2 r:core_node8 x:SearchRateTriggerTest-collection1_shard2_replica_n6] o.a.s.r.ManagedResourceStorage Loaded null at path _rest_managed.json using ZooKeeperStorageIO:path=/configs/conf
   [junit4]   2> 277274 INFO  (qtp1416107910-2798) [n:127.0.0.1:39667_solr c:SearchRateTriggerTest-collection1 s:shard2 r:core_node8 x:SearchRateTriggerTest-collection1_shard2_replica_n6] o.a.s.h.ReplicationHandler Commits will be reserved for 10000ms.
   [junit4]   2> 277274 INFO  (qtp2126009066-2788) [n:127.0.0.1:35719_solr c:SearchRateTriggerTest-collection1 s:shard2 r:core_node7 x:SearchRateTriggerTest-collection1_shard2_replica_n4] o.a.s.r.ManagedResourceStorage Loaded null at path _rest_managed.json using ZooKeeperStorageIO:path=/configs/conf
   [junit4]   2> 277275 INFO  (qtp2126009066-2788) [n:127.0.0.1:35719_solr c:SearchRateTriggerTest-collection1 s:shard2 r:core_node7 x:SearchRateTriggerTest-collection1_shard2_replica_n4] o.a.s.h.ReplicationHandler Commits will be reserved for 10000ms.
   [junit4]   2> 277286 INFO  (qtp1416107910-2798) [n:127.0.0.1:39667_solr c:SearchRateTriggerTest-collection1 s:shard2 r:core_node8 x:SearchRateTriggerTest-collection1_shard2_replica_n6] o.a.s.u.UpdateLog Could not find max version in index or recent updates, using new clock 1600925223811547136
   [junit4]   2> 277287 INFO  (qtp1363186586-2795) [n:127.0.0.1:44731_solr c:SearchRateTriggerTest-collection1 s:shard1 r:core_node3 x:SearchRateTriggerTest-collection1_shard1_replica_n1] o.a.s.u.UpdateHandler Using UpdateLog implementation: org.apache.solr.update.UpdateLog
   [junit4]   2> 277287 INFO  (qtp1363186586-2795) [n:127.0.0.1:44731_solr c:SearchRateTriggerTest-collection1 s:shard1 r:core_node3 x:SearchRateTriggerTest-collection1_shard1_replica_n1] o.a.s.u.UpdateLog Initializing UpdateLog: dataDir=null defaultSyncLevel=FLUSH numRecordsToKeep=100 maxNumLogsToKeep=10 numVersionBuckets=65536
   [junit4]   2> 277288 INFO  (searcherExecutor-1333-thread-1-processing-n:127.0.0.1:39667_solr x:SearchRateTriggerTest-collection1_shard2_replica_n6 c:SearchRateTriggerTest-collection1 s:shard2 r:core_node8) [n:127.0.0.1:39667_solr c:SearchRateTriggerTest-collection1 s:shard2 r:core_node8 x:SearchRateTriggerTest-collection1_shard2_replica_n6] o.a.s.c.SolrCore [SearchRateTriggerTest-collection1_shard2_replica_n6] Registered new searcher Searcher@2e8bf581[SearchRateTriggerTest-collection1_shard2_replica_n6] main{ExitableDirectoryReader(UninvertingDirectoryReader())}
   [junit4]   2> 277288 INFO  (searcherExecutor-1335-thread-1-processing-n:127.0.0.1:35719_solr x:SearchRateTriggerTest-collection1_shard2_replica_n4 c:SearchRateTriggerTest-collection1 s:shard2 r:core_node7) [n:127.0.0.1:35719_solr c:SearchRateTriggerTest-collection1 s:shard2 r:core_node7 x:SearchRateTriggerTest-collection1_shard2_replica_n4] o.a.s.c.SolrCore [SearchRateTriggerTest-collection1_shard2_replica_n4] Registered new searcher Searcher@78350c10[SearchRateTriggerTest-collection1_shard2_replica_n4] main{ExitableDirectoryReader(UninvertingDirectoryReader())}
   [junit4]   2> 277288 INFO  (qtp2126009066-2788) [n:127.0.0.1:35719_solr c:SearchRateTriggerTest-collection1 s:shard2 r:core_node7 x:SearchRateTriggerTest-collection1_shard2_replica_n4] o.a.s.u.UpdateLog Could not find max version in index or recent updates, using new clock 1600925223813644288
   [junit4]   2> 277289 INFO  (qtp1363186586-2795) [n:127.0.0.1:44731_solr c:SearchRateTriggerTest-collection1 s:shard1 r:core_node3 x:SearchRateTriggerTest-collection1_shard1_replica_n1] o.a.s.u.CommitTracker Hard AutoCommit: disabled
   [junit4]   2> 277289 INFO  (qtp1363186586-2795) [n:127.0.0.1:44731_solr c:SearchRateTriggerTest-collection1 s:shard1 r:core_node3 x:SearchRateTriggerTest-collection1_shard1_replica_n1] o.a.s.u.CommitTracker Soft AutoCommit: disabled
   [junit4]   2> 277289 INFO  (qtp1416107910-2798) [n:127.0.0.1:39667_solr c:SearchRateTriggerTest-collection1 s:shard2 r:core_node8 x:SearchRateTriggerTest-collection1_shard2_replica_n6] o.a.s.c.ZkShardTerms Successful update of terms at /collections/SearchRateTriggerTest-collection1/terms/shard2 to Terms{values={core_node8=0}, version=0}
   [junit4]   2> 277292 INFO  (qtp1416107910-2798) [n:127.0.0.1:39667_solr c:SearchRateTriggerTest-collection1 s:shard2 r:core_node8 x:SearchRateTriggerTest-collection1_shard2_replica_n6] o.a.s.c.ShardLeaderElectionContext Waiting until we see more replicas up for shard shard2: total=2 found=1 timeoutin=9999ms
   [junit4]   2> 277294 INFO  (qtp1363186586-2795) [n:127.0.0.1:44731_solr c:SearchRateTriggerTest-collection1 s:shard1 r:core_node3 x:SearchRateTriggerTest-collection1_shard1_replica_n1] o.a.s.s.SolrIndexSearcher Opening [Searcher@4f3c7820[SearchRateTriggerTest-collection1_shard1_replica_n1] main]
   [junit4]   2> 277294 INFO  (qtp969350272-2771) [n:127.0.0.1:45127_solr c:SearchRateTriggerTest-collection1 s:shard1 r:core_node5 x:SearchRateTriggerTest-collection1_shard1_replica_n2] o.a.s.u.UpdateHandler Using UpdateLog implementation: org.apache.solr.update.UpdateLog
   [junit4]   2> 277294 INFO  (qtp969350272-2771) [n:127.0.0.1:45127_solr c:SearchRateTriggerTest-collection1 s:shard1 r:core_node5 x:SearchRateTriggerTest-collection1_shard1_replica_n2] o.a.s.u.UpdateLog Initializing UpdateLog: dataDir=null defaultSyncLevel=FLUSH numRecordsToKeep=100 maxNumLogsToKeep=10 numVersionBuckets=65536
   [junit4]   2> 277295 INFO  (qtp969350272-2771) [n:127.0.0.1:45127_solr c:SearchRateTriggerTest-collection1 s:shard1 r:core_node5 x:SearchRateTriggerTest-collection1_shard1_replica_n2] o.a.s.u.CommitTracker Hard AutoCommit: disabled
   [junit4]   2> 277295 INFO  (qtp969350272-2771) [n:127.0.0.1:45127_solr c:SearchRateTriggerTest-collection1 s:shard1 r:core_node5 x:SearchRateTriggerTest-collection1_shard1_replica_n2] o.a.s.u.CommitTracker Soft AutoCommit: disabled
   [junit4]   2> 277297 INFO  (qtp969350272-2771) [n:127.0.0.1:45127_solr c:SearchRateTriggerTest-collection1 s:shard1 r:core_node5 x:SearchRateTriggerTest-collection1_shard1_replica_n2] o.a.s.s.SolrIndexSearcher Opening [Searcher@69a8a8e6[SearchRateTriggerTest-collection1_shard1_replica_n2] main]
   [junit4]   2> 277304 INFO  (qtp2126009066-2788) [n:127.0.0.1:35719_solr c:SearchRateTriggerTest-collection1 s:shard2 r:core_node7 x:SearchRateTriggerTest-collection1_shard2_replica_n4] o.a.s.c.ZkShardTerms Successful update of terms at /collections/SearchRateTriggerTest-collection1/terms/shard2 to Terms{values={core_node7=0, core_node8=0}, version=1}
   [junit4]   2> 277314 INFO  (qtp1363186586-2795) [n:127.0.0.1:44731_solr c:SearchRateTriggerTest-collection1 s:shard1 r:core_node3 x:SearchRateTriggerTest-collection1_shard1_replica_n1] o.a.s.r.ManagedResourceStorage Configured ZooKeeperStorageIO with znodeBase: /configs/conf
   [junit4]   2> 277314 INFO  (qtp969350272-2771) [n:127.0.0.1:45127_solr c:SearchRateTriggerTest-collection1 s:shard1 r:core_node5 x:SearchRateTriggerTest-collection1_shard1_replica_n2] o.a.s.r.ManagedResourceStorage Configured ZooKeeperStorageIO with znodeBase: /configs/conf
   [junit4]   2> 277314 INFO  (qtp1363186586-2795) [n:127.0.0.1:44731_solr c:SearchRateTriggerTest-collection1 s:shard1 r:core_node3 x:SearchRateTriggerTest-collection1_shard1_replica_n1] o.a.s.r.ManagedResourceStorage Loaded null at path _rest_managed.json using ZooKeeperStorageIO:path=/configs/conf
   [junit4]   2> 277314 INFO  (qtp969350272-2771) [n:127.0.0.1:45127_solr c:SearchRateTriggerTest-collection1 s:shard1 r:core_node5 x:SearchRateTriggerTest-collection1_shard1_replica_n2] o.a.s.r.ManagedResourceStorage Loaded null at path _rest_managed.json using ZooKeeperStorageIO:path=/configs/conf
   [junit4]   2> 277315 INFO  (qtp1363186586-2795) [n:127.0.0.1:44731_solr c:SearchRateTriggerTest-collection1 s:shard1 r:core_node3 x:SearchRateTriggerTest-collection1_shard1_replica_n1] o.a.s.h.ReplicationHandler Commits will be reserved for 10000ms.
   [junit4]   2> 277315 INFO  (qtp969350272-2771) [n:127.0.0.1:45127_solr c:SearchRateTriggerTest-collection1 s:shard1 r:core_node5 x:SearchRateTriggerTest-collection1_shard1_replica_n2] o.a.s.h.ReplicationHandler Commits will be reserved for 10000ms.
   [junit4]   2> 277315 INFO  (searcherExecutor-1332-thread-1-processing-n:127.0.0.1:44731_solr x:SearchRateTriggerTest-collection1_shard1_replica_n1 c:SearchRateTriggerTest-collection1 s:shard1 r:core_node3) [n:127.0.0.1:44731_solr c:SearchRateTriggerTest-collection1 s:shard1 r:core_node3 x:SearchRateTriggerTest-collection1_shard1_replica_n1] o.a.s.c.SolrCore [SearchRateTriggerTest-collection1_shard1_replica_n1] Registered new searcher Searcher@4f3c7820[SearchRateTriggerTest-collection1_shard1_replica_n1] main{ExitableDirectoryReader(UninvertingDirectoryReader())}
   [junit4]   2> 277315 INFO  (qtp1363186586-2795) [n:127.0.0.1:44731_solr c:SearchRateTriggerTest-collection1 s:shard1 r:core_node3 x:SearchRateTriggerTest-collection1_shard1_replica_n1] o.a.s.u.UpdateLog Could not find max version in index or recent updates, using new clock 1600925223841955840
   [junit4]   2> 277315 INFO  (searcherExecutor-1334-thread-1-processing-n:127.0.0.1:45127_solr x:SearchRateTriggerTest-collection1_shard1_replica_n2 c:SearchRateTriggerTest-collection1 s:shard1 r:core_node5) [n:127.0.0.1:45127_solr c:SearchRateTriggerTest-collection1 s:shard1 r:core_node5 x:SearchRateTriggerTest-collection1_shard1_replica_n2] o.a.s.c.SolrCore [SearchRateTriggerTest-collection1_shard1_replica_n2] Registered new searcher Searcher@69a8a8e6[SearchRateTriggerTest-collection1_shard1_replica_n2] main{ExitableDirectoryReader(UninvertingDirectoryReader())}
   [junit4]   2> 277316 INFO  (qtp969350272-2771) [n:127.0.0.1:45127_solr c:SearchRateTriggerTest-collection1 s:shard1 r:core_node5 x:SearchRateTriggerTest-collection1_shard1_replica_n2] o.a.s.u.UpdateLog Could not find max version in index or recent updates, using new clock 1600925223843004416
   [junit4]   2> 277318 INFO  (qtp1363186586-2795) [n:127.0.0.1:44731_solr c:SearchRateTriggerTest-collection1 s:shard1 r:core_node3 x:SearchRateTriggerTest-collection1_shard1_replica_n1] o.a.s.c.ZkShardTerms Successful update of terms at /collections/SearchRateTriggerTest-collection1/terms/shard1 to Terms{values={core_node3=0}, version=0}
   [junit4]   2> 277319 INFO  (qtp969350272-2771) [n:127.0.0.1:45127_solr c:SearchRateTriggerTest-collection1 s:shard1 r:core_node5 x:SearchRateTriggerTest-collection1_shard1_replica_n2] o.a.s.c.ZkShardTerms Failed to save terms, version is not a match, retrying
   [junit4]   2> 277319 INFO  (qtp969350272-2771) [n:127.0.0.1:45127_solr c:SearchRateTriggerTest-collection1 s:shard1 r:core_node5 x:SearchRateTriggerTest-collection1_shard1_replica_n2] o.a.s.c.ZkShardTerms Successful update of terms at /collections/SearchRateTriggerTest-collection1/terms/shard1 to Terms{values={core_node3=0, core_node5=0}, version=1}
   [junit4]   2> 277320 INFO  (qtp1363186586-2795) [n:127.0.0.1:44731_solr c:SearchRateTriggerTest-collection1 s:shard1 r:core_node3 x:SearchRateTriggerTest-collection1_shard1_replica_n1] o.a.s.c.ShardLeaderElectionContext Enough replicas found to continue.
   [junit4]   2> 277320 INFO  (qtp1363186586-2795) [n:127.0.0.1:44731_solr c:SearchRateTriggerTest-collection1 s:shard1 r:core_node3 x:SearchRateTriggerTest-collection1_shard1_replica_n1] o.a.s.c.ShardLeaderElectionContext I may be the new leader - try and sync
   [junit4]   2> 277320 INFO  (qtp1363186586-2795) [n:127.0.0.1:44731_solr c:SearchRateTriggerTest-collection1 s:shard1 r:core_node3 x:SearchRateTriggerTest-collection1_shard1_replica_n1] o.a.s.c.SyncStrategy Sync replicas to http://127.0.0.1:44731/solr/SearchRateTriggerTest-collection1_shard1_replica_n1/
   [junit4]   2> 277321 INFO  (qtp1363186586-2795) [n:127.0.0.1:44731_solr c:SearchRateTriggerTest-collection1 s:shard1 r:core_node3 x:SearchRateTriggerTest-collection1_shard1_replica_n1] o.a.s.u.PeerSync PeerSync: core=SearchRateTriggerTest-collection1_shard1_replica_n1 url=http://127.0.0.1:44731/solr START replicas=[http://127.0.0.1:45127/solr/SearchRateTriggerTest-collection1_shard1_replica_n2/] nUpdates=100
   [junit4]   2> 277323 INFO  (qtp969350272-2774) [n:127.0.0.1:45127_solr c:SearchRateTriggerTest-collection1 s:shard1 r:core_node5 x:SearchRateTriggerTest-collection1_shard1_replica_n2] o.a.s.c.S.Request [SearchRateTriggerTest-collection1_shard1_replica_n2]  webapp=/solr path=/get params={distrib=false&qt=/get&fingerprint=false&getVersions=100&wt=javabin&version=2} status=0 QTime=0
   [junit4]   2> 277621 INFO  (qtp1363186586-2795) [n:127.0.0.1:44731_solr c:SearchRateTriggerTest-collection1 s:shard1 r:core_node3 x:SearchRateTriggerTest-collection1_shard1_replica_n1] o.a.s.u.PeerSync PeerSync: core=SearchRateTriggerTest-collection1_shard1_replica_n1 url=http://127.0.0.1:44731/solr DONE.  We have no versions.  sync failed.
   [junit4]   2> 277621 INFO  (qtp1363186586-2795) [n:127.0.0.1:44731_solr c:SearchRateTriggerTest-collection1 s:shard1 r:core_node3 x:SearchRateTriggerTest-collection1_shard1_replica_n1] o.a.s.c.SyncStrategy Leader's attempt to sync with shard failed, moving to the next candidate
   [junit4]   2> 277621 INFO  (qtp1363186586-2795) [n:127.0.0.1:44731_solr c:SearchRateTriggerTest-collection1 s:shard1 r:core_node3 x:SearchRateTriggerTest-collection1_shard1_replica_n1] o.a.s.c.ShardLeaderElectionContext We failed sync, but we have no versions - we can't sync in that case - we were active before, so become leader anyway
   [junit4]   2> 277621 INFO  (qtp1363186586-2795) [n:127.0.0.1:44731_solr c:SearchRateTriggerTest-collection1 s:shard1 r:core_node3 x:SearchRateTriggerTest-collection1_shard1_replica_n1] o.a.s.c.ShardLeaderElectionContext Found all replicas participating in election, clear LIR
   [junit4]   2> 277623 INFO  (qtp1363186586-2795) [n:127.0.0.1:44731_solr c:SearchRateTriggerTest-collection1 s:shard1 r:core_node3 x:SearchRateTriggerTest-collection1_shard1_replica_n1] o.a.s.c.ShardLeaderElectionContext I am the new leader: http://127.0.0.1:44731/solr/SearchRateTriggerTest-collection1_shard1_replica_n1/ shard1
   [junit4]   2> 277775 INFO  (qtp1363186586-2795) [n:127.0.0.1:44731_solr c:SearchRateTriggerTest-collection1 s:shard1 r:core_node3 x:SearchRateTriggerTest-collection1_shard1_replica_n1] o.a.s.c.ZkController I am the leader, no recovery necessary
   [junit4]   2> 277776 INFO  (qtp1363186586-2795) [n:127.0.0.1:44731_solr c:SearchRateTriggerTest-collection1 s:shard1 r:core_node3 x:SearchRateTriggerTest-collection1_shard1_replica_n1] o.a.s.s.HttpSolrCall [admin] webapp=null path=/admin/cores params={qt=/admin/cores&coreNodeName=core_node3&collection.configName=conf&newCollection=true&name=SearchRateTriggerTest-collection1_shard1_replica_n1&action=CREATE&numShards=2&collection=SearchRateTriggerTest-collection1&shard=shard1&wt=javabin&version=2&replicaType=NRT} status=0 QTime=1602
   [junit4]   2> 277793 INFO  (qtp1416107910-2798) [n:127.0.0.1:39667_solr c:SearchRateTriggerTest-collection1 s:shard2 r:core_node8 x:SearchRateTriggerTest-collection1_shard2_replica_n6] o.a.s.c.ShardLeaderElectionContext Enough replicas found to continue.
   [junit4]   2> 277793 INFO  (qtp1416107910-2798) [n:127.0.0.1:39667_solr c:SearchRateTriggerTest-collection1 s:shard2 r:core_node8 x:SearchRateTriggerTest-collection1_shard2_replica_n6] o.a.s.c.ShardLeaderElectionContext I may be the new leader - try and sync
   [junit4]   2> 277793 INFO  (qtp1416107910-2798) [n:127.0.0.1:39667_solr c:SearchRateTriggerTest-collection1 s:shard2 r:core_node8 x:SearchRateTriggerTest-collection1_shard2_replica_n6] o.a.s.c.SyncStrategy Sync replicas to http://127.0.0.1:39667/solr/SearchRateTriggerTest-collection1_shard2_replica_n6/
   [junit4]   2> 277793 INFO  (qtp1416107910-2798) [n:127.0.0.1:39667_solr c:SearchRateTriggerTest-collection1 s:shard2 r:core_node8 x:SearchRateTriggerTest-collection1_shard2_replica_n6] o.a.s.u.PeerSync PeerSync: core=SearchRateTriggerTest-collection1_shard2_replica_n6 url=http://127.0.0.1:39667/solr START replicas=[http://127.0.0.1:35719/solr/SearchRateTriggerTest-collection1_shard2_replica_n4/] nUpdates=100
   [junit4]   2> 277796 INFO  (qtp2126009066-2765) [n:127.0.0.1:35719_solr c:SearchRateTriggerTest-collection1 s:shard2 r:core_node7 x:SearchRateTriggerTest-collection1_shard2_replica_n4] o.a.s.c.S.Request [SearchRateTriggerTest-collection1_shard2_replica_n4]  webapp=/solr path=/get params={distrib=false&qt=/get&fingerprint=false&getVersions=100&wt=javabin&version=2} status=0 QTime=0
   [junit4]   2> 277876 INFO  (zkCallback-656-thread-1) [    ] o.a.s.c.c.ZkStateReader A cluster state change: [WatchedEvent state:SyncConnected type:NodeDataChanged path:/collections/SearchRateTriggerTest-collection1/state.json] for collection [SearchRateTriggerTest-collection1] has occurred - updating... (live nodes size: [4])
   [junit4]   2> 278093 INFO  (qtp1416107910-2798) [n:127.0.0.1:39667_solr c:SearchRateTriggerTest-collection1 s:shard2 r:core_node8 x:SearchRateTriggerTest-collection1_shard2_replica_n6] o.a.s.u.PeerSync PeerSync: core=SearchRateTriggerTest-collection1_shard2_replica_n6 url=http://127.0.0.1:39667/solr DONE.  We have no versions.  sync failed.
   [junit4]   2> 278094 INFO  (qtp1416107910-2798) [n:127.0.0.1:39667_solr c:SearchRateTriggerTest-collection1 s:shard2 r:core_node8 x:SearchRateTriggerTest-collection1_shard2_replica_n6] o.a.s.c.SyncStrategy Leader's attempt to sync with shard failed, moving to the next candidate
   [junit4]   2> 278094 INFO  (qtp1416107910-2798) [n:127.0.0.1:39667_solr c:SearchRateTriggerTest-collection1 s:shard2 r:core_node8 x:SearchRateTriggerTest-collection1_shard2_replica_n6] o.a.s.c.ShardLeaderElectionContext We failed sync, but we have no versions - we can't sync in that case - we were active before, so become leader anyway
   [junit4]   2> 278094 INFO  (qtp1416107910-2798) [n:127.0.0.1:39667_solr c:SearchRateTriggerTest-collection1 s:shard2 r:core_node8 x:SearchRateTriggerTest-collection1_shard2_replica_n6] o.a.s.c.ShardLeaderElectionContext Found all replicas participating in election, clear LIR
   [junit4]   2> 278096 INFO  (qtp1416107910-2798) [n:127.0.0.1:39667_solr c:SearchRateTriggerTest-collection1 s:shard2 r:core_node8 x:SearchRateTriggerTest-collection1_shard2_replica_n6] o.a.s.c.ShardLeaderElectionContext I am the new leader: http://127.0.0.1:39667/solr/SearchRateTriggerTest-collection1_shard2_replica_n6/ shard2
   [junit4]   2> 278197 INFO  (zkCallback-656-thread-1) [    ] o.a.s.c.c.ZkStateReader A cluster state change: [WatchedEvent state:SyncConnected type:NodeDataChanged path:/collections/SearchRateTriggerTest-collection1/state.json] for collection [SearchRateTriggerTest-collection1] has occurred - updating... (live nodes size: [4])
   [junit4]   2> 278198 INFO  (qtp1416107910-2798) [n:127.0.0.1:39667_solr c:SearchRateTriggerTest-collection1 s:shard2 r:core_node8 x:SearchRateTriggerTest-collection1_shard2_replica_n6] o.a.s.c.ZkController I am the leader, no recovery necessary
   [junit4]   2> 278199 INFO  (qtp1416107910-2798) [n:127.0.0.1:39667_solr c:SearchRateTriggerTest-collection1 s:shard2 r:core_node8 x:SearchRateTriggerTest-collection1_shard2_replica_n6] o.a.s.s.HttpSolrCall [admin] webapp=null path=/admin/cores params={qt=/admin/cores&coreNodeName=core_node8&collection.configName=conf&newCollection=true&name=SearchRateTriggerTest-collection1_shard2_replica_n6&action=CREATE&numShards=2&collection=SearchRateTriggerTest-collection1&shard=shard2&wt=javabin&version=2&replicaType=NRT} status=0 QTime=2006
   [junit4]   2> 278299 INFO  (zkCallback-654-thread-1) [    ] o.a.s.c.c.ZkStateReader A cluster state change: [WatchedEvent state:SyncConnected type:NodeDataChanged path:/collections/SearchRateTriggerTest-collection1/state.json] for collection [SearchRateTriggerTest-collection1] has occurred - updating... (live nodes size: [4])
   [junit4]   2> 278299 INFO  (zkCallback-656-thread-1) [    ] o.a.s.c.c.ZkStateReader A cluster state change: [WatchedEvent state:SyncConnected type:NodeDataChanged path:/collections/SearchRateTriggerTest-collection1/state.json] for collection [SearchRateTriggerTest-collection1] has occurred - updating... (live nodes size: [4])
   [junit4]   2> 278308 INFO  (qtp2126009066-2788) [n:127.0.0.1:35719_solr c:SearchRateTriggerTest-collection1 s:shard2 r:core_node7 x:SearchRateTriggerTest-collection1_shard2_replica_n4] o.a.s.s.HttpSolrCall [admin] webapp=null path=/admin/cores params={qt=/admin/cores&coreNodeName=core_node7&collection.configName=conf&newCollection=true&name=SearchRateTriggerTest-collection1_shard2_replica_n4&action=CREATE&numShards=2&collection=SearchRateTriggerTest-collection1&shard=shard2&wt=javabin&version=2&replicaType=NRT} status=0 QTime=2116
   [junit4]   2> 278322 INFO  (qtp969350272-2771) [n:127.0.0.1:45127_solr c:SearchRateTriggerTest-collection1 s:shard1 r:core_node5 x:SearchRateTriggerTest-collection1_shard1_replica_n2] o.a.s.s.HttpSolrCall [admin] webapp=null path=/admin/cores params={qt=/admin/cores&coreNodeName=core_node5&collection.configName=conf&newCollection=true&name=SearchRateTriggerTest-collection1_shard1_replica_n2&action=CREATE&numShards=2&collection=SearchRateTriggerTest-collection1&shard=shard1&wt=javabin&version=2&replicaType=NRT} status=0 QTime=2155
   [junit4]   2> 278325 INFO  (qtp969350272-2791) [n:127.0.0.1:45127_solr    ] o.a.s.h.a.CollectionsHandler Wait for new collection to be active for at most 30 seconds. Check all shard replicas
   [junit4]   2> 278423 INFO  (zkCallback-650-thread-1) [    ] o.a.s.c.c.ZkStateReader A cluster state change: [WatchedEvent state:SyncConnected type:NodeDataChanged path:/collections/SearchRateTriggerTest-collection1/state.json] for collection [SearchRateTriggerTest-collection1] has occurred - updating... (live nodes size: [4])
   [junit4]   2> 278423 INFO  (zkCallback-656-thread-1) [    ] o.a.s.c.c.ZkStateReader A cluster state change: [WatchedEvent state:SyncConnected type:NodeDataChanged path:/collections/SearchRateTriggerTest-collection1/state.json] for collection [SearchRateTriggerTest-collection1] has occurred - updating... (live nodes size: [4])
   [junit4]   2> 278423 INFO  (zkCallback-654-thread-1) [    ] o.a.s.c.c.ZkStateReader A cluster state change: [WatchedEvent state:SyncConnected type:NodeDataChanged path:/collections/SearchRateTriggerTest-collection1/state.json] for collection [SearchRateTriggerTest-collection1] has occurred - updating... (live nodes size: [4])
   [junit4]   2> 278423 INFO  (zkCallback-658-thread-1) [    ] o.a.s.c.c.ZkStateReader A cluster state change: [WatchedEvent state:SyncConnected type:NodeDataChanged path:/collections/SearchRateTriggerTest-collection1/state.json] for collection [SearchRateTriggerTest-collection1] has occurred - updating... (live nodes size: [4])
   [junit4]   2> 279325 INFO  (qtp969350272-2791) [n:127.0.0.1:45127_solr    ] o.a.s.s.HttpSolrCall [admin] webapp=null path=/admin/collections params={replicationFactor=2&collection.configName=conf&maxShardsPerNode=1&name=SearchRateTriggerTest-collection1&nrtReplicas=2&action=CREATE&numShards=2&wt=javabin&version=2} status=0 QTime=3472
   [junit4]   2> 279341 INFO  (qtp969350272-2770) [n:127.0.0.1:45127_solr    ] o.a.s.s.HttpSolrCall [admin] webapp=null path=/admin/metrics params={wt=javabin&version=2&key=solr.core.SearchRateTriggerTest-collection1.shard1.replica_n2:QUERY./select.requestTimes:1minRate} status=0 QTime=1
   [junit4]   2> 279345 INFO  (qtp2126009066-2769) [n:127.0.0.1:35719_solr    ] o.a.s.s.HttpSolrCall [admin] webapp=null path=/admin/metrics params={wt=javabin&version=2&key=solr.core.SearchRateTriggerTest-collection1.shard2.replica_n4:QUERY./select.requestTimes:1minRate} status=0 QTime=0
   [junit4]   2> 279349 INFO  (qtp1363186586-2781) [n:127.0.0.1:44731_solr    ] o.a.s.s.HttpSolrCall [admin] webapp=null path=/admin/metrics params={wt=javabin&version=2&key=solr.core.SearchRateTriggerTest-collection1.shard1.replica_n1:QUERY./select.requestTimes:1minRate} status=0 QTime=0
   [junit4]   2> 279352 INFO  (qtp1416107910-2777) [n:127.0.0.1:39667_solr    ] o.a.s.s.HttpSolrCall [admin] webapp=null path=/admin/metrics params={wt=javabin&version=2&key=solr.core.SearchRateTriggerTest-collection1.shard2.replica_n6:QUERY./select.requestTimes:1minRate} status=0 QTime=0
   [junit4]   2> 279363 INFO  (qtp969350272-2783) [n:127.0.0.1:45127_solr    ] o.a.s.s.HttpSolrCall [admin] webapp=null path=/admin/metrics params={wt=javabin&version=2&key=solr.core.SearchRateTriggerTest-collection1.shard1.replica_n2:QUERY./select.requestTimes:1minRate} status=0 QTime=0
   [junit4]   2> 279364 INFO  (qtp2126009066-2779) [n:127.0.0.1:35719_solr    ] o.a.s.s.HttpSolrCall [admin] webapp=null path=/admin/metrics params={wt=javabin&version=2&key=solr.core.SearchRateTriggerTest-collection1.shard2.replica_n4:QUERY./select.requestTimes:1minRate} status=0 QTime=0
   [junit4]   2> 279366 INFO  (qtp1363186586-2793) [n:127.0.0.1:44731_solr    ] o.a.s.s.HttpSolrCall [admin] webapp=null path=/admin/metrics params={wt=javabin&version=2&key=solr.core.SearchRateTriggerTest-collection1.shard1.replica_n1:QUERY./select.requestTimes:1minRate} status=0 QTime=0
   [junit4]   2> 279367 INFO  (qtp1416107910-2796) [n:127.0.0.1:39667_solr    ] o.a.s.s.HttpSolrCall [admin] webapp=null path=/admin/metrics params={wt=javabin&version=2&key=solr.core.SearchRateTriggerTest-collection1.shard2.replica_n6:QUERY./select.requestTimes:1minRate} status=0 QTime=0
   [junit4]   2> 279856 INFO  (OverseerCollectionConfigSetProcessor-72190452510949388-127.0.0.1:45127_solr-n_0000000000) [    ] o.a.s.c.OverseerTaskQueue Response ZK path: /overseer/collection-queue-work/qnr-0000000000 doesn't exist.  Requestor may have disconnected from ZooKeeper
   [junit4]   2> 280369 INFO  (qtp969350272-2906) [n:127.0.0.1:45127_solr    ] o.a.s.s.HttpSolrCall [admin] webapp=null path=/admin/metrics params={wt=javabin&version=2&key=solr.core.SearchRateTriggerTest-collection1.shard1.replica_n2:QUERY./select.requestTimes:1minRate} status=0 QTime=0
   [junit4]   2> 280370 INFO  (qtp2126009066-2765) [n:127.0.0.1:35719_solr    ] o.a.s.s.HttpSolrCall [admin] webapp=null path=/admin/metrics params={wt=javabin&version=2&key=solr.core.SearchRateTriggerTest-collection1.shard2.replica_n4:QUERY./select.requestTimes:1minRate} status=0 QTime=0
   [junit4]   2> 280371 INFO  (qtp1363186586-2795) [n:127.0.0.1:44731_solr    ] o.a.s.s.HttpSolrCall [admin] webapp=null path=/admin/metrics params={wt=javabin&version=2&key=solr.core.SearchRateTriggerTest-collection1.shard1.replica_n1:QUERY./select.requestTimes:1minRate} status=0 QTime=0
   [junit4]   2> 280372 INFO  (qtp1416107910-2798) [n:127.0.0.1:39667_solr    ] o.a.s.s.HttpSolrCall [admin] webapp=null path=/admin/metrics params={wt=javabin&version=2&key=solr.core.SearchRateTriggerTest-collection1.shard2.replica_n6:QUERY./select.requestTimes:1minRate} status=0 QTime=0
   [junit4]   2> 281374 INFO  (qtp969350272-2783) [n:127.0.0.1:45127_solr    ] o.a.s.s.HttpSolrCall [admin] webapp=null path=/admin/metrics params={wt=javabin&version=2&key=solr.core.SearchRateTriggerTest-collection1.shard1.replica_n2:QUERY./select.requestTimes:1minRate} status=0 QTime=0
   [junit4]   2> 281375 INFO  (qtp2126009066-2788) [n:127.0.0.1:35719_solr    ] o.a.s.s.HttpSolrCall [admin] webapp=null path=/admin/metrics params={wt=javabin&version=2&key=solr.core.SearchRateTriggerTest-collection1.shard2.replica_n4:QUERY./select.requestTimes:1minRate} status=0 QTime=0
   [junit4]   2> 281376 INFO  (qtp1363186586-2793) [n:127.0.0.1:44731_solr    ] o.a.s.s.HttpSolrCall [admin] webapp=null path=/admin/metrics params={wt=javabin&version=2&key=solr.core.SearchRateTriggerTest-collection1.shard1.replica_n1:QUERY./select.requestTimes:1minRate} status=0 QTime=0
   [junit4]   2> 281377 INFO  (qtp1416107910-2792) [n:127.0.0.1:39667_solr    ] o.a.s.s.HttpSolrCall [admin] webapp=null path=/admin/metrics params={wt=javabin&version=2&key=solr.core.SearchRateTriggerTest-collection1.shard2.replica_n6:QUERY./select.requestTimes:1minRate} status=0 QTime=0
   [junit4]   2> 282378 INFO  (qtp969350272-2906) [n:127.0.0.1:45127_solr    ] o.a.s.s.HttpSolrCall [admin] webapp=null path=/admin/metrics params={wt=javabin&version=2&key=solr.core.SearchRateTriggerTest-collection1.shard1.replica_n2:QUERY./select.requestTimes:1minRate} status=0 QTime=0
   [junit4]   2> 282380 INFO  (qtp2126009066-2765) [n:127.0.0.1:35719_solr    ] o.a.s.s.HttpSolrCall [admin] webapp=null path=/admin/metrics params={wt=javabin&version=2&key=solr.core.SearchRateTriggerTest-collection1.shard2.replica_n4:QUERY./select.requestTimes:1minRate} status=0 QTime=0
   [junit4]   2> 282381 INFO  (qtp1363186586-2795) [n:127.0.0.1:44731_solr    ] o.a.s.s.HttpSolrCall [admin] webapp=null path=/admin/metrics params={wt=javabin&version=2&key=solr.core.SearchRateTriggerTest-collection1.shard1.replica_n1:QUERY./select.requestTimes:1minRate} status=0 QTime=0
   [junit4]   2> 282382 INFO  (qtp1416107910-2798) [n:127.0.0.1:39667_solr    ] o.a.s.s.HttpSolrCall [admin] webapp=null path=/admin/metrics params={wt=javabin&version=2&key=solr.core.SearchRateTriggerTest-collection1.shard2.replica_n6:QUERY./select.requestTimes:1minRate} status=0 QTime=0
   [junit4]   2> 283383 INFO  (qtp969350272-2783) [n:127.0.0.1:45127_solr    ] o.a.s.s.HttpSolrCall [admin] webapp=null path=/admin/metrics params={wt=javabin&version=2&key=solr.core.SearchRateTriggerTest-collection1.shard1.replica_n2:QUERY./select.requestTimes:1minRate} status=0 QTime=0
   [junit4]   2> 283384 INFO  (qtp2126009066-2788) [n:127.0.0.1:35719_solr    ] o.a.s.s.HttpSolrCall [admin] webapp=null path=/admin/metrics params={wt=javabin&version=2&key=solr.core.SearchRateTriggerTest-collection1.shard2.replica_n4:QUERY./select.requestTimes:1minRate} status=0 QTime=0
   [junit4]   2> 283386 INFO  (qtp1363186586-2793) [n:127.0.0.1:44731_solr    ] o.a.s.s.HttpSolrCall [admin] webapp=null path=/admin/metrics params={wt=javabin&version=2&key=solr.core.SearchRateTriggerTest-collection1.shard1.replica_n1:QUERY./select.requestTimes:1minRate} status=0 QTime=0
   [junit4]   2> 283387 INFO  (qtp1416107910-2792) [n:127.0.0.1:39667_solr    ] o.a.s.s.HttpSolrCall [admin] webapp=null path=/admin/metrics params={wt=javabin&version=2&key=solr.core.SearchRateTriggerTest-collection1.shard2.replica_n6:QUERY./select.requestTimes:1minRate} status=0 QTime=0
   [junit4]   2> 284389 INFO  (qtp969350272-2906) [n:127.0.0.1:45127_solr    ] o.a.s.s.HttpSolrCall [admin] webapp=null path=/admin/metrics params={wt=javabin&version=2&key=solr.core.SearchRateTriggerTest-collection1.shard1.replica_n2:QUERY./select.requestTimes:1minRate} status=0 QTime=0
   [junit4]   2> 284390 INFO  (qtp2126009066-2765) [n:127.0.0.1:35719_solr    ] o.a.s.s.HttpSolrCall [admin] webapp=null path=/admin/metrics params={wt=javabin&version=2&key=solr.core.SearchRateTriggerTest-collection1.shard2.replica_n4:QUERY./select.requestTimes:1minRate} status=0 QTime=0
   [junit4]   2> 284391 INFO  (qtp1363186586-2795) [n:127.0.0.1:44731_solr    ] o.a.s.s.HttpSolrCall [admin] webapp=null path=/admin/metrics params={wt=javabin&version=2&key=solr.core.SearchRateTriggerTest-collection1.shard1.replica_n1:QUERY./select.requestTimes:1minRate} status=0 QTime=0
   [junit4]   2> 284392 INFO  (qtp1416107910-2798) [n:127.0.0.1:39667_solr    ] o.a.s.s.HttpSolrCall [admin] webapp=null path=/admin/metrics params={wt=javabin&version=2&key=solr.core.SearchRateTriggerTest-collection1.shard2.replica_n6:QUERY./select.requestTimes:1minRate} status=0 QTime=0
   [junit4]   2> 285394 INFO  (qtp969350272-2783) [n:127.0.0.1:45127_solr    ] o.a.s.s.HttpSolrCall [admin] webapp=null path=/admin/metrics params={wt=javabin&version=2&key=solr.core.SearchRateTriggerTest-collection1.shard1.replica_n2:QUERY./select.requestTimes:1minRate} status=0 QTime=0
   [junit4]   2> 285396 INFO  (qtp2126009066-2788) [n:127.0.0.1:35719_solr    ] o.a.s.s.HttpSolrCall [admin] webapp=null path=/admin/metrics params={wt=javabin&version=2&key=solr.core.SearchRateTriggerTest-collection1.shard2.replica_n4:QUERY./select.requestTimes:1minRate} status=0 QTime=0
   [junit4]   2> 285397 INFO  (qtp1363186586-2793) [n:127.0.0.1:44731_solr    ] o.a.s.s.HttpSolrCall [admin] webapp=null path=/admin/metrics params={wt=javabin&version=2&key=solr.core.SearchRateTriggerTest-collection1.shard1.replica_n1:QUERY./select.requestTimes:1minRate} status=0 QTime=0
   [junit4]   2> 285398 INFO  (qtp1416107910-2792) [n:127.0.0.1:39667_solr    ] o.a.s.s.HttpSolrCall [admin] webapp=null path=/admin/metrics params={wt=javabin&version=2&key=solr.core.SearchRateTriggerTest-collection1.shard2.replica_n6:QUERY./select.requestTimes:1minRate} status=0 QTime=0
   [junit4]   2> 286400 INFO  (qtp969350272-2906) [n:127.0.0.1:45127_solr    ] o.a.s.s.HttpSolrCall [admin] webapp=null path=/admin/metrics params={wt=javabin&version=2&key=solr.core.SearchRateTriggerTest-collection1.shard1.replica_n2:QUERY./select.requestTimes:1minRate} status=0 QTime=0
   [junit4]   2> 286401 INFO  (qtp2126009066-2765) [n:127.0.0.1:35719_solr    ] o.a.s.s.HttpSolrCall [admin] webapp=null path=/admin/metrics params={wt=javabin&version=2&key=solr.core.SearchRateTriggerTest-collection1.shard2.replica_n4:QUERY./select.requestTimes:1minRate} status=0 QTime=0
   [junit4]   2> 286402 INFO  (qtp1363186586-2795) [n:127.0.0.1:44731_solr    ] o.a.s.s.HttpSolrCall [admin] webapp=null path=/admin/metrics params={wt=javabin&version=2&key=solr.core.SearchRateTriggerTest-collection1.shard1.replica_n1:QUERY./select.requestTimes:1minRate} status=0 QTime=0
   [junit4]   2> 286403 INFO  (qtp1416107910-2798) [n:127.0.0.1:39667_solr    ] o.a.s.s.HttpSolrCall [admin] webapp=null path=/admin/metrics params={wt=javabin&version=2&key=solr.core.SearchRateTriggerTest-collection1.shard2.replica_n6:QUERY./select.requestTimes:1minRate} status=0 QTime=0
   [junit4]   2> 287413 INFO  (qtp969350272-2783) [n:127.0.0.1:45127_solr    ] o.a.s.s.HttpSolrCall [admin] webapp=null path=/admin/metrics params={wt=javabin&version=2&key=solr.core.SearchRateTriggerTest-collection1.shard1.replica_n2:QUERY./select.requestTimes:1minRate} status=0 QTime=0
   [junit4]   2> 287414 INFO  (qtp2126009066-2788) [n:127.0.0.1:35719_solr    ] o.a.s.s.HttpSolrCall [admin] webapp=null path=/admin/metrics params={wt=javabin&version=2&key=solr.core.SearchRateTriggerTest-collection1.shard2.replica_n4:QUERY./select.requestTimes:1minRate} status=0 QTime=0
   [junit4]   2> 287415 INFO  (qtp1363186586-2793) [n:127.0.0.1:44731_solr    ] o.a.s.s.HttpSolrCall [admin] webapp=null path=/admin/metrics params={wt=javabin&version=2&key=solr.core.SearchRateTriggerTest-collection1.shard1.replica_n1:QUERY./select.requestTimes:1minRate} status=0 QTime=0
   [junit4]   2> 287416 INFO  (qtp1416107910-2792) [n:127.0.0.1:39667_solr    ] o.a.s.s.HttpSolrCall [admin] webapp=null path=/admin/metrics params={wt=javabin&version=2&key=solr.core.SearchRateTriggerTest-collection1.shard2.replica_n6:QUERY./select.requestTimes:1minRate} status=0 QTime=0
   [junit4]   2> 288422 INFO  (qtp969350272-2906) [n:127.0.0.1:45127_solr    ] o.a.s.s.HttpSolrCall [admin] webapp=null path=/admin/metrics params={wt=javabin&version=2&key=solr.core.SearchRateTriggerTest-collection1.shard1.replica_n2:QUERY./select.requestTimes:1minRate} status=0 QTime=0
   [junit4]   2> 288423 INFO  (qtp2126009066-2765) [n:127.0.0.1:35719_solr    ] o.a.s.s.HttpSolrCall [admin] webapp=null path=/admin/metrics params={wt=javabin&version=2&key=solr.core.SearchRateTriggerTest-collection1.shard2.replica_n4:QUERY./select.requestTimes:1minRate} status=0 QTime=0
   [junit4]   2> 288424 INFO  (qtp1363186586-2795) [n:127.0.0.1:44731_solr    ] o.a.s.s.HttpSolrCall [admin] webapp=null path=/admin/metrics params={wt=javabin&version=2&key=solr.core.SearchRateTriggerTest-collection1.shard1.replica_n1:QUERY./select.requestTimes:1minRate} status=0 QTime=0
   [junit4]   2> 288425 INFO  (qtp1416107910-2798) [n:127.0.0.1:39667_solr    ] o.a.s.s.HttpSolrCall [admin] webapp=null path=/admin/metrics params={wt=javabin&version=2&key=solr.core.SearchRateTriggerTest-collection1.shard2.replica_n6:QUERY./select.requestTimes:1minRate} status=0 QTime=0
   [junit4]   2> 288426 INFO  (qtp969350272-2783) [n:127.0.0.1:45127_solr    ] o.a.s.s.HttpSolrCall [admin] webapp=null path=/admin/metrics params={wt=javabin&version=2&key=solr.core.SearchRateTriggerTest-collection1.shard1.replica_n2:QUERY./select.requestTimes:1minRate} status=0 QTime=0
   [junit4]   2> 288427 INFO  (qtp2126009066-2788) [n:127.0.0.1:35719_solr    ] o.a.s.s.HttpSolrCall [admin] webapp=null path=/admin/metrics params={wt=javabin&version=2&key=solr.core.SearchRateTriggerTest-collection1.shard2.replica_n4:QUERY./select.requestTimes:1minRate} status=0 QTime=0
   [junit4]   2> 288428 INFO  (qtp1363186586-2793) [n:127.0.0.1:44731_solr    ] o.a.s.s.HttpSolrCall [admin] webapp=null path=/admin/metrics params={wt=javabin&version=2&key=solr.core.SearchRateTriggerTest-collection1.shard1.replica_n1:QUERY./select.requestTimes:1minRate} status=0 QTime=0
   [junit4]   2> 288430 INFO  (qtp1416107910-2792) [n:127.0.0.1:39667_solr    ] o.a.s.s.HttpSolrCall [admin] webapp=null path=/admin/metrics params={wt=javabin&version=2&key=solr.core.SearchRateTriggerTest-collection1.shard2.replica_n6:QUERY./select.requestTimes:1minRate} status=0 QTime=0
   [junit4]   2> 289431 INFO  (qtp969350272-2906) [n:127.0.0.1:45127_solr    ] o.a.s.s.HttpSolrCall [admin] webapp=null path=/admin/metrics params={wt=javabin&version=2&key=solr.core.SearchRateTriggerTest-collection1.shard1.replica_n2:QUERY./select.requestTimes:1minRate} status=0 QTime=0
   [junit4]   2> 289432 INFO  (qtp2126009066-2765) [n:127.0.0.1:35719_solr    ] o.a.s.s.HttpSolrCall [admin] webapp=null path=/admin/metrics params={wt=javabin&version=2&key=solr.core.SearchRateTriggerTest-collection1.shard2.replica_n4:QUERY./select.requestTimes:1minRate} status=0 QTime=0
   [junit4]   2> 289433 INFO  (qtp1363186586-2795) [n:127.0.0.1:44731_solr    ] o.a.s.s.HttpSolrCall [admin] webapp=null path=/admin/metrics params={wt=javabin&version=2&key=solr.core.SearchRateTriggerTest-collection1.shard1.replica_n1:QUERY./select.requestTimes:1minRate} status=0 QTime=0
   [junit4]   2> 289433 INFO  (qtp1416107910-2798) [n:127.0.0.1:39667_solr    ] o.a.s.s.HttpSolrCall [admin] webapp=null path=/admin/metrics params={wt=javabin&version=2&key=solr.core.SearchRateTriggerTest-collection1.shard2.replica_n6:QUERY./select.requestTimes:1minRate} status=0 QTime=0
   [junit4]   2> 290435 INFO  (qtp969350272-2783) [n:127.0.0.1:45127_solr    ] o.a.s.s.HttpSolrCall [admin] webapp=null path=/admin/metrics params={wt=javabin&version=2&key=solr.core.SearchRateTriggerTest-collection1.shard1.replica_n2:QUERY./select.requestTimes:1minRate} status=0 QTime=0
   [junit4]   2> 290436 INFO  (qtp2126009066-2788) [n:127.0.0.1:35719_solr    ] o.a.s.s.HttpSolrCall [admin] webapp=null path=/admin/metrics params={wt=javabin&version=2&key=solr.core.SearchRateTriggerTest-collection1.shard2.replica_n4:QUERY./select.requestTimes:1minRate} status=0 QTime=0
   [junit4]   2> 290436 INFO  (qtp1363186586-2793) [n:127.0.0.1:44731_solr    ] o.a.s.s.HttpSolrCall [admin] webapp=null path=/admin/metrics params={wt=javabin&version=2&key=solr.core.SearchRateTriggerTest-collection1.shard1.replica_n1:QUERY./select.requestTimes:1minRate} status=0 QTime=0
   [junit4]   2> 290437 INFO  (qtp1416107910-2792) [n:127.0.0.1:39667_solr    ] o.a.s.s.HttpSolrCall [admin] webapp=null path=/admin/metrics params={wt=javabin&version=2&key=solr.core.SearchRateTriggerTest-collection1.shard2.replica_n6:QUERY./select.requestTimes:1minRate} status=0 QTime=0
   [junit4]   2> 295440 INFO  (qtp969350272-2906) [n:127.0.0.1:45127_solr    ] o.a.s.s.HttpSolrCall [admin] webapp=null path=/admin/metrics params={wt=javabin&version=2&key=solr.core.SearchRateTriggerTest-collection1.shard1.replica_n2:QUERY./select.requestTimes:1minRate} status=0 QTime=0
   [junit4]   2> 295460 INFO  (qtp2126009066-2765) [n:127.0.0.1:35719_solr    ] o.a.s.s.HttpSolrCall [admin] webapp=null path=/admin/metrics params={wt=javabin&version=2&key=solr.core.SearchRateTriggerTest-collection1.shard2.replica_n4:QUERY./select.requestTimes:1minRate} status=0 QTime=0
   [junit4]   2> 295469 INFO  (qtp1363186586-2795) [n:127.0.0.1:44731_solr    ] o.a.s.s.HttpSolrCall [admin] webapp=null path=/admin/metrics params={wt=javabin&version=2&key=solr.core.SearchRateTriggerTest-collection1.shard1.replica_n1:QUERY./select.requestTimes:1minRate} status=0 QTime=0
   [junit4]   2> 295472 INFO  (qtp1416107910-2798) [n:127.0.0.1:39667_solr    ] o.a.s.s.HttpSolrCall [admin] webapp=null path=/admin/metrics params={wt=javabin&version=2&key=solr.core.SearchRateTriggerTest-collection1.shard2.replica_n6:QUERY./select.requestTimes:1minRate} status=0 QTime=0
   [junit4]   2> 295486 INFO  (TEST-SearchRateTriggerTest.testWaitForElapsed-seed#[BE518230236D5A63]) [    ] o.a.s.SolrTestCaseJ4 ###Ending testWaitForElapsed
   [junit4]   2> 295536 INFO  (TEST-SearchRateTriggerTest.testTrigger-seed#[BE518230236D5A63]) [    ] o.a.s.SolrTestCaseJ4 ###Starting testTrigger
   [junit4]   2> 295537 INFO  (TEST-SearchRateTriggerTest.testTrigger-seed#[BE518230236D5A63]) [    ] o.a.s.c.c.ZkStateReader Updated live nodes from ZooKeeper... (0) -> (4)
   [junit4]   2> 295538 INFO  (qtp969350272-2783) [n:127.0.0.1:45127_solr    ] o.a.s.h.a.CollectionsHandler Invoked Collection Action :delete with params name=SearchRateTriggerTest-collection1&action=DELETE&wt=javabin&version=2 and sendToOCPQueue=true
   [junit4]   2> 295551 INFO  (OverseerThreadFactory-1323-thread-2) [    ] o.a.s.c.a.c.OverseerCollectionMessageHandler Executing Collection Cmd=action=UNLOAD&deleteInstanceDir=true&deleteDataDir=true, asyncId=null
   [junit4]   2> 295565 INFO  (qtp1363186586-2776) [n:127.0.0.1:44731_solr    x:SearchRateTriggerTest-collection1_shard1_replica_n1] o.a.s.m.SolrMetricManager Closing metric reporters for registry=solr.core.SearchRateTriggerTest-collection1.shard1.replica_n1, tag=null
   [junit4]   2> 295565 INFO  (qtp1363186586-2776) [n:127.0.0.1:44731_solr    x:SearchRateTriggerTest-collection1_shard1_replica_n1] o.a.s.m.r.SolrJmxReporter Closing reporter [org.apache.solr.metrics.reporters.SolrJmxReporter@e7bc157: rootName = solr_44731, domain = solr.core.SearchRateTriggerTest-collection1.shard1.replica_n1, service url = null, agent id = null] for registry solr.core.SearchRateTriggerTest-collection1.shard1.replica_n1 / com.codahale.metrics.MetricRegistry@46676495
   [junit4]   2> 295581 INFO  (qtp1363186586-2776) [n:127.0.0.1:44731_solr    x:SearchRateTriggerTest-collection1_shard1_replica_n1] o.a.s.c.SolrCore [SearchRateTriggerTest-collection1_shard1_replica_n1]  CLOSING SolrCore org.apache.solr.core.SolrCore@405dcf43
   [junit4]   2> 295581 INFO  (qtp1363186586-2776) [n:127.0.0.1:44731_solr    x:SearchRateTriggerTest-collection1_shard1_replica_n1] o.a.s.m.SolrMetricManager Closing metric reporters for registry=solr.core.SearchRateTriggerTest-collection1.shard1.replica_n1, tag=405dcf43
   [junit4]   2> 295581 INFO  (qtp1363186586-2776) [n:127.0.0.1:44731_solr    x:SearchRateTriggerTest-collection1_shard1_replica_n1] o.a.s.m.SolrMetricManager Closing 

[...truncated too long message...]

9 INFO  (jetty-closer-625-thread-3) [    ] o.a.s.m.r.SolrJmxReporter Closing reporter [org.apache.solr.metrics.reporters.SolrJmxReporter@3008028c: rootName = solr_45127, domain = solr.jetty, service url = null, agent id = null] for registry solr.jetty / com.codahale.metrics.MetricRegistry@3ca96858
   [junit4]   2> 322449 INFO  (jetty-closer-625-thread-4) [    ] o.a.s.c.ZkController Remove node as live in ZooKeeper:/live_nodes/127.0.0.1:39667_solr
   [junit4]   2> 322449 INFO  (jetty-closer-625-thread-3) [    ] o.a.s.c.ZkController Remove node as live in ZooKeeper:/live_nodes/127.0.0.1:45127_solr
   [junit4]   2> 322450 INFO  (jetty-closer-625-thread-4) [    ] o.a.s.m.SolrMetricManager Closing metric reporters for registry=solr.cluster, tag=null
   [junit4]   2> 322450 INFO  (zkCallback-671-thread-1) [    ] o.a.s.c.c.ZkStateReader Updated live nodes from ZooKeeper... (2) -> (0)
   [junit4]   2> 322450 INFO  (jetty-closer-625-thread-3) [    ] o.a.s.m.SolrMetricManager Closing metric reporters for registry=solr.cluster, tag=null
   [junit4]   2> 322450 INFO  (zkCallback-658-thread-1) [    ] o.a.s.c.c.ZkStateReader Updated live nodes from ZooKeeper... (2) -> (0)
   [junit4]   2> 322450 INFO  (zkCallback-686-thread-1) [    ] o.a.s.c.c.ZkStateReader Updated live nodes from ZooKeeper... (2) -> (0)
   [junit4]   2> 322450 INFO  (zkCallback-654-thread-1) [    ] o.a.s.c.c.ZkStateReader Updated live nodes from ZooKeeper... (2) -> (0)
   [junit4]   2> 322450 INFO  (jetty-closer-625-thread-3) [    ] o.a.s.c.Overseer Overseer (id=72190452510949388-127.0.0.1:45127_solr-n_0000000000) closing
   [junit4]   2> 322451 INFO  (OverseerStateUpdate-72190452510949388-127.0.0.1:45127_solr-n_0000000000) [    ] o.a.s.c.Overseer Overseer Loop exiting : 127.0.0.1:45127_solr
   [junit4]   2> 322451 WARN  (OverseerAutoScalingTriggerThread-72190452510949388-127.0.0.1:45127_solr-n_0000000000) [    ] o.a.s.c.a.OverseerTriggerThread OverseerTriggerThread woken up but we are closed, exiting.
   [junit4]   2> 322452 INFO  (jetty-closer-625-thread-4) [    ] o.e.j.s.h.ContextHandler Stopped o.e.j.s.ServletContextHandler@78aaec48{/solr,null,UNAVAILABLE}
   [junit4]   2> 322452 INFO  (jetty-closer-625-thread-4) [    ] o.e.j.s.session node0 Stopped scavenging
   [junit4]   2> 322452 INFO  (jetty-closer-625-thread-3) [    ] o.e.j.s.h.ContextHandler Stopped o.e.j.s.ServletContextHandler@27c309e{/solr,null,UNAVAILABLE}
   [junit4]   2> 322453 INFO  (jetty-closer-625-thread-3) [    ] o.e.j.s.session node0 Stopped scavenging
   [junit4]   2> 323948 WARN  (zkCallback-650-thread-2) [    ] o.a.s.c.ZkController Unable to register nodeLost path for 127.0.0.1:44731_solr
   [junit4]   2> org.apache.zookeeper.KeeperException$SessionExpiredException: KeeperErrorCode = Session expired for /autoscaling/nodeLost/127.0.0.1:44731_solr
   [junit4]   2> 	at org.apache.zookeeper.KeeperException.create(KeeperException.java:130) ~[zookeeper-3.4.11.jar:3.4.11-37e277162d567b55a07d1755f0b31c32e93c01a0]
   [junit4]   2> 	at org.apache.zookeeper.KeeperException.create(KeeperException.java:54) ~[zookeeper-3.4.11.jar:3.4.11-37e277162d567b55a07d1755f0b31c32e93c01a0]
   [junit4]   2> 	at org.apache.zookeeper.ZooKeeper.create(ZooKeeper.java:786) ~[zookeeper-3.4.11.jar:3.4.11-37e277162d567b55a07d1755f0b31c32e93c01a0]
   [junit4]   2> 	at org.apache.solr.common.cloud.SolrZkClient.lambda$create$7(SolrZkClient.java:365) ~[java/:?]
   [junit4]   2> 	at org.apache.solr.common.cloud.ZkCmdExecutor.retryOperation(ZkCmdExecutor.java:60) ~[java/:?]
   [junit4]   2> 	at org.apache.solr.common.cloud.SolrZkClient.create(SolrZkClient.java:365) ~[java/:?]
   [junit4]   2> 	at org.apache.solr.cloud.ZkController.lambda$registerLiveNodesListener$2(ZkController.java:889) [java/:?]
   [junit4]   2> 	at org.apache.solr.common.cloud.ZkStateReader.lambda$refreshLiveNodes$3(ZkStateReader.java:792) [java/:?]
   [junit4]   2> 	at java.util.concurrent.ConcurrentHashMap$KeySetView.forEach(ConcurrentHashMap.java:4724) [?:?]
   [junit4]   2> 	at org.apache.solr.common.cloud.ZkStateReader.refreshLiveNodes(ZkStateReader.java:791) [java/:?]
   [junit4]   2> 	at org.apache.solr.common.cloud.ZkStateReader.access$1400(ZkStateReader.java:73) [java/:?]
   [junit4]   2> 	at org.apache.solr.common.cloud.ZkStateReader$LiveNodeWatcher.refreshAndWatch(ZkStateReader.java:1284) [java/:?]
   [junit4]   2> 	at org.apache.solr.common.cloud.ZkStateReader$LiveNodeWatcher.process(ZkStateReader.java:1279) [java/:?]
   [junit4]   2> 	at org.apache.solr.common.cloud.SolrZkClient$1.lambda$process$1(SolrZkClient.java:269) [java/:?]
   [junit4]   2> 	at java.util.concurrent.Executors$RunnableAdapter.call(Executors.java:514) [?:?]
   [junit4]   2> 	at java.util.concurrent.FutureTask.run(FutureTask.java:264) [?:?]
   [junit4]   2> 	at org.apache.solr.common.util.ExecutorUtil$MDCAwareThreadPoolExecutor.lambda$execute$0(ExecutorUtil.java:192) [java/:?]
   [junit4]   2> 	at java.util.concurrent.ThreadPoolExecutor.runWorker(ThreadPoolExecutor.java:1167) [?:?]
   [junit4]   2> 	at java.util.concurrent.ThreadPoolExecutor$Worker.run(ThreadPoolExecutor.java:641) [?:?]
   [junit4]   2> 	at java.lang.Thread.run(Thread.java:844) [?:?]
   [junit4]   2> 323949 INFO  (jetty-closer-625-thread-2) [    ] o.e.j.s.h.ContextHandler Stopped o.e.j.s.ServletContextHandler@783f24c4{/solr,null,UNAVAILABLE}
   [junit4]   2> 323949 INFO  (jetty-closer-625-thread-2) [    ] o.e.j.s.session node0 Stopped scavenging
   [junit4]   2> 323950 ERROR (SUITE-SearchRateTriggerTest-seed#[BE518230236D5A63]-worker) [    ] o.a.z.s.ZooKeeperServer ZKShutdownHandler is not registered, so ZooKeeper server won't take any action on ERROR or SHUTDOWN server state changes
   [junit4]   2> 323950 INFO  (SUITE-SearchRateTriggerTest-seed#[BE518230236D5A63]-worker) [    ] o.a.s.c.ZkTestServer connecting to 127.0.0.1:40729 40729
   [junit4]   2> 324422 INFO  (Thread-401) [    ] o.a.s.c.ZkTestServer connecting to 127.0.0.1:40729 40729
   [junit4]   2> 324423 WARN  (Thread-401) [    ] o.a.s.c.ZkTestServer Watch limit violations: 
   [junit4]   2> Maximum concurrent create/delete watches above limit:
   [junit4]   2> 
   [junit4]   2> 	15	/solr/collections/SearchRateTriggerTest-collection1/terms/shard1
   [junit4]   2> 	15	/solr/collections/SearchRateTriggerTest-collection1/terms/shard2
   [junit4]   2> 	12	/solr/clusterprops.json
   [junit4]   2> 	12	/solr/aliases.json
   [junit4]   2> 	8	/solr/configs/conf
   [junit4]   2> 	8	/solr/collections/SearchRateTriggerTest-collection2/terms/shard2
   [junit4]   2> 	8	/solr/collections/SearchRateTriggerTest-collection2/terms/shard1
   [junit4]   2> 	4	/solr/security.json
   [junit4]   2> 
   [junit4]   2> Maximum concurrent data watches above limit:
   [junit4]   2> 
   [junit4]   2> 	12	/solr/clusterstate.json
   [junit4]   2> 	8	/solr/collections/SearchRateTriggerTest-collection1/state.json
   [junit4]   2> 	4	/solr/collections/SearchRateTriggerTest-collection2/state.json
   [junit4]   2> 	3	/solr/overseer_elect/election/72190452510949388-127.0.0.1:45127_solr-n_0000000000
   [junit4]   2> 
   [junit4]   2> Maximum concurrent children watches above limit:
   [junit4]   2> 
   [junit4]   2> 	25	/solr/collections
   [junit4]   2> 	12	/solr/live_nodes
   [junit4]   2> 
   [junit4]   2> NOTE: leaving temporary files on disk at: /home/jenkins/workspace/Lucene-Solr-7.x-Linux/solr/build/solr-core/test/J2/temp/solr.cloud.autoscaling.SearchRateTriggerTest_BE518230236D5A63-001
   [junit4]   2> May 19, 2018 8:21:55 PM com.carrotsearch.randomizedtesting.ThreadLeakControl checkThreadLeaks
   [junit4]   2> WARNING: Will linger awaiting termination of 1 leaked thread(s).
   [junit4]   2> NOTE: test params are: codec=Asserting(Lucene70): {}, docValues:{}, maxPointsInLeafNode=465, maxMBSortInHeap=7.547788831103948, sim=RandomSimilarity(queryNorm=true): {}, locale=bez-TZ, timezone=Etc/GMT-11
   [junit4]   2> NOTE: Linux 4.13.0-39-generic amd64/Oracle Corporation 9.0.4 (64-bit)/cpus=8,threads=1,free=23511448,total=439353344
   [junit4]   2> NOTE: All tests run in this JVM: [TestTlogReplica, HdfsUnloadDistributedZkTest, CreateCollectionCleanupTest, LargeFieldTest, TestCoreDiscovery, OverseerRolesTest, AddSchemaFieldsUpdateProcessorFactoryTest, TestApiFramework, TestRequestForwarding, TestIntervalFaceting, TestExpandComponent, TestRawTransformer, TestPrepRecovery, CircularListTest, PingRequestHandlerTest, CdcrBidirectionalTest, DeleteShardTest, TestAtomicUpdateErrorCases, AsyncCallRequestStatusResponseTest, TestMaxScoreQueryParser, V2StandaloneTest, TestShortCircuitedRequests, MultiTermTest, CopyFieldTest, AssignTest, TestUseDocValuesAsStored, SearchRateTriggerTest]
   [junit4] Completed [122/805 (1!)] on J2 in 49.61s, 3 tests, 1 failure <<< FAILURES!

[...truncated 46174 lines...]
[repro] Jenkins log URL: https://jenkins.thetaphi.de/job/Lucene-Solr-7.x-Linux/1936/consoleText

[repro] Revision: 1e661ed97aed0cc77869b01134d80c761c6b5295

[repro] Ant options: "-Dargs=-XX:-UseCompressedOops -XX:+UseParallelGC"
[repro] Repro line:  ant test  -Dtestcase=SearchRateTriggerTest -Dtests.method=testTrigger -Dtests.seed=BE518230236D5A63 -Dtests.multiplier=3 -Dtests.slow=true -Dtests.locale=bez-TZ -Dtests.timezone=Etc/GMT-11 -Dtests.asserts=true -Dtests.file.encoding=ISO-8859-1

[repro] ant clean

[...truncated 6 lines...]
[repro] Test suites by module:
[repro]    solr/core
[repro]       SearchRateTriggerTest
[repro] ant compile-test

[...truncated 3321 lines...]
[repro] ant test-nocompile -Dtests.dups=5 -Dtests.maxfailures=5 -Dtests.class="*.SearchRateTriggerTest" -Dtests.showOutput=onerror "-Dargs=-XX:-UseCompressedOops -XX:+UseParallelGC" -Dtests.seed=BE518230236D5A63 -Dtests.multiplier=3 -Dtests.slow=true -Dtests.locale=bez-TZ -Dtests.timezone=Etc/GMT-11 -Dtests.asserts=true -Dtests.file.encoding=ISO-8859-1

[...truncated 88 lines...]
[repro] Failures:
[repro]   0/5 failed: org.apache.solr.cloud.autoscaling.SearchRateTriggerTest
[repro] Exiting with code 0

[...truncated 40 lines...]

Mime
View raw message