lucene-dev mailing list archives

Site index · List index
Message view « Date » · « Thread »
Top « Date » · « Thread »
From Policeman Jenkins Server <jenk...@thetaphi.de>
Subject [JENKINS] Lucene-Solr-master-Linux (64bit/jdk1.8.0_172) - Build # 22100 - Still Unstable!
Date Fri, 25 May 2018 10:47:13 GMT
Build: https://jenkins.thetaphi.de/job/Lucene-Solr-master-Linux/22100/
Java: 64bit/jdk1.8.0_172 -XX:+UseCompressedOops -XX:+UseConcMarkSweepGC

2 tests failed.
FAILED:  org.apache.solr.update.MaxSizeAutoCommitTest.deleteTest

Error Message:
Tlog size exceeds the max size bound. Tlog path: /home/jenkins/workspace/Lucene-Solr-master-Linux/solr/build/solr-core/test/J0/temp/solr.update.MaxSizeAutoCommitTest_9D7A060317C290F9-001/init-core-data-001/tlog/tlog.0000000000000000003, tlog size: 1276

Stack Trace:
java.lang.AssertionError: Tlog size exceeds the max size bound. Tlog path: /home/jenkins/workspace/Lucene-Solr-master-Linux/solr/build/solr-core/test/J0/temp/solr.update.MaxSizeAutoCommitTest_9D7A060317C290F9-001/init-core-data-001/tlog/tlog.0000000000000000003, tlog size: 1276
	at __randomizedtesting.SeedInfo.seed([9D7A060317C290F9:8D34E3FC6C6CA908]:0)
	at org.junit.Assert.fail(Assert.java:93)
	at org.junit.Assert.assertTrue(Assert.java:43)
	at org.apache.solr.update.MaxSizeAutoCommitTest.getTlogFileSizes(MaxSizeAutoCommitTest.java:379)
	at org.apache.solr.update.MaxSizeAutoCommitTest.deleteTest(MaxSizeAutoCommitTest.java:200)
	at sun.reflect.NativeMethodAccessorImpl.invoke0(Native Method)
	at sun.reflect.NativeMethodAccessorImpl.invoke(NativeMethodAccessorImpl.java:62)
	at sun.reflect.DelegatingMethodAccessorImpl.invoke(DelegatingMethodAccessorImpl.java:43)
	at java.lang.reflect.Method.invoke(Method.java:498)
	at com.carrotsearch.randomizedtesting.RandomizedRunner.invoke(RandomizedRunner.java:1737)
	at com.carrotsearch.randomizedtesting.RandomizedRunner$8.evaluate(RandomizedRunner.java:934)
	at com.carrotsearch.randomizedtesting.RandomizedRunner$9.evaluate(RandomizedRunner.java:970)
	at com.carrotsearch.randomizedtesting.RandomizedRunner$10.evaluate(RandomizedRunner.java:984)
	at com.carrotsearch.randomizedtesting.rules.SystemPropertiesRestoreRule$1.evaluate(SystemPropertiesRestoreRule.java:57)
	at org.apache.lucene.util.TestRuleSetupTeardownChained$1.evaluate(TestRuleSetupTeardownChained.java:49)
	at org.apache.lucene.util.AbstractBeforeAfterRule$1.evaluate(AbstractBeforeAfterRule.java:45)
	at org.apache.lucene.util.TestRuleThreadAndTestName$1.evaluate(TestRuleThreadAndTestName.java:48)
	at org.apache.lucene.util.TestRuleIgnoreAfterMaxFailures$1.evaluate(TestRuleIgnoreAfterMaxFailures.java:64)
	at org.apache.lucene.util.TestRuleMarkFailure$1.evaluate(TestRuleMarkFailure.java:47)
	at com.carrotsearch.randomizedtesting.rules.StatementAdapter.evaluate(StatementAdapter.java:36)
	at com.carrotsearch.randomizedtesting.ThreadLeakControl$StatementRunner.run(ThreadLeakControl.java:368)
	at com.carrotsearch.randomizedtesting.ThreadLeakControl.forkTimeoutingTask(ThreadLeakControl.java:817)
	at com.carrotsearch.randomizedtesting.ThreadLeakControl$3.evaluate(ThreadLeakControl.java:468)
	at com.carrotsearch.randomizedtesting.RandomizedRunner.runSingleTest(RandomizedRunner.java:943)
	at com.carrotsearch.randomizedtesting.RandomizedRunner$5.evaluate(RandomizedRunner.java:829)
	at com.carrotsearch.randomizedtesting.RandomizedRunner$6.evaluate(RandomizedRunner.java:879)
	at com.carrotsearch.randomizedtesting.RandomizedRunner$7.evaluate(RandomizedRunner.java:890)
	at com.carrotsearch.randomizedtesting.rules.StatementAdapter.evaluate(StatementAdapter.java:36)
	at com.carrotsearch.randomizedtesting.rules.SystemPropertiesRestoreRule$1.evaluate(SystemPropertiesRestoreRule.java:57)
	at org.apache.lucene.util.AbstractBeforeAfterRule$1.evaluate(AbstractBeforeAfterRule.java:45)
	at com.carrotsearch.randomizedtesting.rules.StatementAdapter.evaluate(StatementAdapter.java:36)
	at org.apache.lucene.util.TestRuleStoreClassName$1.evaluate(TestRuleStoreClassName.java:41)
	at com.carrotsearch.randomizedtesting.rules.NoShadowingOrOverridesOnMethodsRule$1.evaluate(NoShadowingOrOverridesOnMethodsRule.java:40)
	at com.carrotsearch.randomizedtesting.rules.NoShadowingOrOverridesOnMethodsRule$1.evaluate(NoShadowingOrOverridesOnMethodsRule.java:40)
	at com.carrotsearch.randomizedtesting.rules.StatementAdapter.evaluate(StatementAdapter.java:36)
	at com.carrotsearch.randomizedtesting.rules.StatementAdapter.evaluate(StatementAdapter.java:36)
	at com.carrotsearch.randomizedtesting.rules.StatementAdapter.evaluate(StatementAdapter.java:36)
	at org.apache.lucene.util.TestRuleAssertionsRequired$1.evaluate(TestRuleAssertionsRequired.java:53)
	at org.apache.lucene.util.TestRuleMarkFailure$1.evaluate(TestRuleMarkFailure.java:47)
	at org.apache.lucene.util.TestRuleIgnoreAfterMaxFailures$1.evaluate(TestRuleIgnoreAfterMaxFailures.java:64)
	at org.apache.lucene.util.TestRuleIgnoreTestSuites$1.evaluate(TestRuleIgnoreTestSuites.java:54)
	at com.carrotsearch.randomizedtesting.rules.StatementAdapter.evaluate(StatementAdapter.java:36)
	at com.carrotsearch.randomizedtesting.ThreadLeakControl$StatementRunner.run(ThreadLeakControl.java:368)
	at java.lang.Thread.run(Thread.java:748)


FAILED:  org.apache.solr.client.solrj.io.stream.StreamExpressionTest.testFeaturesSelectionStream

Error Message:
Error from server at http://127.0.0.1:38683/solr/destinationCollection: Expected mime type application/octet-stream but got text/html. <html> <head> <meta http-equiv="Content-Type" content="text/html;charset=utf-8"/> <title>Error 404 Can not find: /solr/destinationCollection/update</title> </head> <body><h2>HTTP ERROR 404</h2> <p>Problem accessing /solr/destinationCollection/update. Reason: <pre>    Can not find: /solr/destinationCollection/update</pre></p><hr><a href="http://eclipse.org/jetty">Powered by Jetty:// 9.4.10.v20180503</a><hr/>  </body> </html> 

Stack Trace:
org.apache.solr.client.solrj.impl.HttpSolrClient$RemoteSolrException: Error from server at http://127.0.0.1:38683/solr/destinationCollection: Expected mime type application/octet-stream but got text/html. <html>
<head>
<meta http-equiv="Content-Type" content="text/html;charset=utf-8"/>
<title>Error 404 Can not find: /solr/destinationCollection/update</title>
</head>
<body><h2>HTTP ERROR 404</h2>
<p>Problem accessing /solr/destinationCollection/update. Reason:
<pre>    Can not find: /solr/destinationCollection/update</pre></p><hr><a href="http://eclipse.org/jetty">Powered by Jetty:// 9.4.10.v20180503</a><hr/>

</body>
</html>

	at __randomizedtesting.SeedInfo.seed([20049DDEF0DC059F:4B8611C990BA75F9]:0)
	at org.apache.solr.client.solrj.impl.HttpSolrClient.executeMethod(HttpSolrClient.java:607)
	at org.apache.solr.client.solrj.impl.HttpSolrClient.request(HttpSolrClient.java:255)
	at org.apache.solr.client.solrj.impl.HttpSolrClient.request(HttpSolrClient.java:244)
	at org.apache.solr.client.solrj.impl.LBHttpSolrClient.doRequest(LBHttpSolrClient.java:483)
	at org.apache.solr.client.solrj.impl.LBHttpSolrClient.request(LBHttpSolrClient.java:413)
	at org.apache.solr.client.solrj.impl.CloudSolrClient.sendRequest(CloudSolrClient.java:1106)
	at org.apache.solr.client.solrj.impl.CloudSolrClient.requestWithRetryOnStaleState(CloudSolrClient.java:886)
	at org.apache.solr.client.solrj.impl.CloudSolrClient.request(CloudSolrClient.java:819)
	at org.apache.solr.client.solrj.SolrRequest.process(SolrRequest.java:194)
	at org.apache.solr.client.solrj.SolrClient.commit(SolrClient.java:484)
	at org.apache.solr.client.solrj.SolrClient.commit(SolrClient.java:448)
	at org.apache.solr.client.solrj.io.stream.StreamExpressionTest.testFeaturesSelectionStream(StreamExpressionTest.java:2241)
	at sun.reflect.NativeMethodAccessorImpl.invoke0(Native Method)
	at sun.reflect.NativeMethodAccessorImpl.invoke(NativeMethodAccessorImpl.java:62)
	at sun.reflect.DelegatingMethodAccessorImpl.invoke(DelegatingMethodAccessorImpl.java:43)
	at java.lang.reflect.Method.invoke(Method.java:498)
	at com.carrotsearch.randomizedtesting.RandomizedRunner.invoke(RandomizedRunner.java:1737)
	at com.carrotsearch.randomizedtesting.RandomizedRunner$8.evaluate(RandomizedRunner.java:934)
	at com.carrotsearch.randomizedtesting.RandomizedRunner$9.evaluate(RandomizedRunner.java:970)
	at com.carrotsearch.randomizedtesting.RandomizedRunner$10.evaluate(RandomizedRunner.java:984)
	at com.carrotsearch.randomizedtesting.rules.SystemPropertiesRestoreRule$1.evaluate(SystemPropertiesRestoreRule.java:57)
	at org.apache.lucene.util.TestRuleSetupTeardownChained$1.evaluate(TestRuleSetupTeardownChained.java:49)
	at org.apache.lucene.util.AbstractBeforeAfterRule$1.evaluate(AbstractBeforeAfterRule.java:45)
	at org.apache.lucene.util.TestRuleThreadAndTestName$1.evaluate(TestRuleThreadAndTestName.java:48)
	at org.apache.lucene.util.TestRuleIgnoreAfterMaxFailures$1.evaluate(TestRuleIgnoreAfterMaxFailures.java:64)
	at org.apache.lucene.util.TestRuleMarkFailure$1.evaluate(TestRuleMarkFailure.java:47)
	at com.carrotsearch.randomizedtesting.rules.StatementAdapter.evaluate(StatementAdapter.java:36)
	at com.carrotsearch.randomizedtesting.ThreadLeakControl$StatementRunner.run(ThreadLeakControl.java:368)
	at com.carrotsearch.randomizedtesting.ThreadLeakControl.forkTimeoutingTask(ThreadLeakControl.java:817)
	at com.carrotsearch.randomizedtesting.ThreadLeakControl$3.evaluate(ThreadLeakControl.java:468)
	at com.carrotsearch.randomizedtesting.RandomizedRunner.runSingleTest(RandomizedRunner.java:943)
	at com.carrotsearch.randomizedtesting.RandomizedRunner$5.evaluate(RandomizedRunner.java:829)
	at com.carrotsearch.randomizedtesting.RandomizedRunner$6.evaluate(RandomizedRunner.java:879)
	at com.carrotsearch.randomizedtesting.RandomizedRunner$7.evaluate(RandomizedRunner.java:890)
	at com.carrotsearch.randomizedtesting.rules.StatementAdapter.evaluate(StatementAdapter.java:36)
	at com.carrotsearch.randomizedtesting.rules.SystemPropertiesRestoreRule$1.evaluate(SystemPropertiesRestoreRule.java:57)
	at org.apache.lucene.util.AbstractBeforeAfterRule$1.evaluate(AbstractBeforeAfterRule.java:45)
	at com.carrotsearch.randomizedtesting.rules.StatementAdapter.evaluate(StatementAdapter.java:36)
	at org.apache.lucene.util.TestRuleStoreClassName$1.evaluate(TestRuleStoreClassName.java:41)
	at com.carrotsearch.randomizedtesting.rules.NoShadowingOrOverridesOnMethodsRule$1.evaluate(NoShadowingOrOverridesOnMethodsRule.java:40)
	at com.carrotsearch.randomizedtesting.rules.NoShadowingOrOverridesOnMethodsRule$1.evaluate(NoShadowingOrOverridesOnMethodsRule.java:40)
	at com.carrotsearch.randomizedtesting.rules.StatementAdapter.evaluate(StatementAdapter.java:36)
	at com.carrotsearch.randomizedtesting.rules.StatementAdapter.evaluate(StatementAdapter.java:36)
	at com.carrotsearch.randomizedtesting.rules.StatementAdapter.evaluate(StatementAdapter.java:36)
	at org.apache.lucene.util.TestRuleAssertionsRequired$1.evaluate(TestRuleAssertionsRequired.java:53)
	at org.apache.lucene.util.TestRuleMarkFailure$1.evaluate(TestRuleMarkFailure.java:47)
	at org.apache.lucene.util.TestRuleIgnoreAfterMaxFailures$1.evaluate(TestRuleIgnoreAfterMaxFailures.java:64)
	at org.apache.lucene.util.TestRuleIgnoreTestSuites$1.evaluate(TestRuleIgnoreTestSuites.java:54)
	at com.carrotsearch.randomizedtesting.rules.StatementAdapter.evaluate(StatementAdapter.java:36)
	at com.carrotsearch.randomizedtesting.ThreadLeakControl$StatementRunner.run(ThreadLeakControl.java:368)
	at java.lang.Thread.run(Thread.java:748)




Build Log:
[...truncated 12765 lines...]
   [junit4] Suite: org.apache.solr.update.MaxSizeAutoCommitTest
   [junit4]   2> Creating dataDir: /home/jenkins/workspace/Lucene-Solr-master-Linux/solr/build/solr-core/test/J0/temp/solr.update.MaxSizeAutoCommitTest_9D7A060317C290F9-001/init-core-data-001
   [junit4]   2> 230018 WARN  (SUITE-MaxSizeAutoCommitTest-seed#[9D7A060317C290F9]-worker) [    ] o.a.s.SolrTestCaseJ4 startTrackingSearchers: numOpens=1 numCloses=1
   [junit4]   2> 230018 INFO  (SUITE-MaxSizeAutoCommitTest-seed#[9D7A060317C290F9]-worker) [    ] o.a.s.SolrTestCaseJ4 Using PointFields (NUMERIC_POINTS_SYSPROP=true) w/NUMERIC_DOCVALUES_SYSPROP=false
   [junit4]   2> 230020 INFO  (SUITE-MaxSizeAutoCommitTest-seed#[9D7A060317C290F9]-worker) [    ] o.a.s.SolrTestCaseJ4 Randomized ssl (true) and clientAuth (false) via: @org.apache.solr.util.RandomizeSSL(reason=, ssl=NaN, value=NaN, clientAuth=NaN)
   [junit4]   2> 230020 INFO  (SUITE-MaxSizeAutoCommitTest-seed#[9D7A060317C290F9]-worker) [    ] o.a.s.SolrTestCaseJ4 SecureRandom sanity checks: test.solr.allowed.securerandom=null & java.security.egd=file:/dev/./urandom
   [junit4]   2> 230020 INFO  (TEST-MaxSizeAutoCommitTest.deleteTest-seed#[9D7A060317C290F9]) [    ] o.a.s.SolrTestCaseJ4 ###Starting deleteTest
   [junit4]   2> 230021 INFO  (TEST-MaxSizeAutoCommitTest.deleteTest-seed#[9D7A060317C290F9]) [    ] o.a.s.SolrTestCaseJ4 ####initCore
   [junit4]   2> 230021 INFO  (TEST-MaxSizeAutoCommitTest.deleteTest-seed#[9D7A060317C290F9]) [    ] o.a.s.c.SolrResourceLoader [null] Added 2 libs to classloader, from paths: [/home/jenkins/workspace/Lucene-Solr-master-Linux/solr/core/src/test-files/solr/collection1/lib, /home/jenkins/workspace/Lucene-Solr-master-Linux/solr/core/src/test-files/solr/collection1/lib/classes]
   [junit4]   2> 230030 INFO  (TEST-MaxSizeAutoCommitTest.deleteTest-seed#[9D7A060317C290F9]) [    ] o.a.s.c.SolrConfig Using Lucene MatchVersion: 8.0.0
   [junit4]   2> 230038 INFO  (TEST-MaxSizeAutoCommitTest.deleteTest-seed#[9D7A060317C290F9]) [    ] o.a.s.s.IndexSchema [null] Schema name=test
   [junit4]   2> 230085 INFO  (TEST-MaxSizeAutoCommitTest.deleteTest-seed#[9D7A060317C290F9]) [    ] o.a.s.s.IndexSchema Loaded schema test/1.0 with uniqueid field id
   [junit4]   2> 230110 INFO  (TEST-MaxSizeAutoCommitTest.deleteTest-seed#[9D7A060317C290F9]) [    ] o.a.s.m.r.SolrJmxReporter JMX monitoring for 'solr.node' (registry 'solr.node') enabled at server: com.sun.jmx.mbeanserver.JmxMBeanServer@3e4d86c1
   [junit4]   2> 230114 INFO  (TEST-MaxSizeAutoCommitTest.deleteTest-seed#[9D7A060317C290F9]) [    ] o.a.s.m.r.SolrJmxReporter JMX monitoring for 'solr.jvm' (registry 'solr.jvm') enabled at server: com.sun.jmx.mbeanserver.JmxMBeanServer@3e4d86c1
   [junit4]   2> 230114 INFO  (TEST-MaxSizeAutoCommitTest.deleteTest-seed#[9D7A060317C290F9]) [    ] o.a.s.m.r.SolrJmxReporter JMX monitoring for 'solr.jetty' (registry 'solr.jetty') enabled at server: com.sun.jmx.mbeanserver.JmxMBeanServer@3e4d86c1
   [junit4]   2> 230115 INFO  (coreLoadExecutor-1158-thread-1) [    ] o.a.s.c.TransientSolrCoreCacheDefault Allocating transient cache for 2147483647 transient cores
   [junit4]   2> 230115 INFO  (coreLoadExecutor-1158-thread-1) [    x:collection1] o.a.s.c.SolrResourceLoader [null] Added 2 libs to classloader, from paths: [/home/jenkins/workspace/Lucene-Solr-master-Linux/solr/core/src/test-files/solr/collection1/lib, /home/jenkins/workspace/Lucene-Solr-master-Linux/solr/core/src/test-files/solr/collection1/lib/classes]
   [junit4]   2> 230129 INFO  (coreLoadExecutor-1158-thread-1) [    x:collection1] o.a.s.c.SolrConfig Using Lucene MatchVersion: 8.0.0
   [junit4]   2> 230135 INFO  (coreLoadExecutor-1158-thread-1) [    x:collection1] o.a.s.s.IndexSchema [collection1] Schema name=test
   [junit4]   2> 230182 INFO  (coreLoadExecutor-1158-thread-1) [    x:collection1] o.a.s.s.IndexSchema Loaded schema test/1.0 with uniqueid field id
   [junit4]   2> 230186 INFO  (coreLoadExecutor-1158-thread-1) [    x:collection1] o.a.s.c.CoreContainer Creating SolrCore 'collection1' using configuration from instancedir /home/jenkins/workspace/Lucene-Solr-master-Linux/solr/core/src/test-files/solr/collection1, trusted=true
   [junit4]   2> 230187 INFO  (coreLoadExecutor-1158-thread-1) [    x:collection1] o.a.s.m.r.SolrJmxReporter JMX monitoring for 'solr.core.collection1' (registry 'solr.core.collection1') enabled at server: com.sun.jmx.mbeanserver.JmxMBeanServer@3e4d86c1
   [junit4]   2> 230187 INFO  (coreLoadExecutor-1158-thread-1) [    x:collection1] o.a.s.c.SolrCore solr.RecoveryStrategy.Builder
   [junit4]   2> 230187 INFO  (coreLoadExecutor-1158-thread-1) [    x:collection1] o.a.s.c.SolrCore [[collection1] ] Opening new SolrCore at [/home/jenkins/workspace/Lucene-Solr-master-Linux/solr/core/src/test-files/solr/collection1], dataDir=[/home/jenkins/workspace/Lucene-Solr-master-Linux/solr/build/solr-core/test/J0/temp/solr.update.MaxSizeAutoCommitTest_9D7A060317C290F9-001/init-core-data-001/]
   [junit4]   2> 230188 INFO  (coreLoadExecutor-1158-thread-1) [    x:collection1] o.a.s.u.RandomMergePolicy RandomMergePolicy wrapping class org.apache.lucene.index.AlcoholicMergePolicy: [AlcoholicMergePolicy: minMergeSize=0, mergeFactor=10, maxMergeSize=1818205695, maxMergeSizeForForcedMerge=9223372036854775807, calibrateSizeByDeletes=true, maxMergeDocs=2147483647, maxCFSSegmentSizeMB=8.796093022207999E12, noCFSRatio=0.1]
   [junit4]   2> 230189 WARN  (coreLoadExecutor-1158-thread-1) [    x:collection1] o.a.s.c.RequestHandlers INVALID paramSet a in requestHandler {type = requestHandler,name = /dump,class = DumpRequestHandler,attributes = {initParams=a, name=/dump, class=DumpRequestHandler},args = {defaults={a=A,b=B}}}
   [junit4]   2> 230210 INFO  (coreLoadExecutor-1158-thread-1) [    x:collection1] o.a.s.u.UpdateHandler Using UpdateLog implementation: org.apache.solr.update.UpdateLog
   [junit4]   2> 230210 INFO  (coreLoadExecutor-1158-thread-1) [    x:collection1] o.a.s.u.UpdateLog Initializing UpdateLog: dataDir= defaultSyncLevel=FLUSH numRecordsToKeep=100 maxNumLogsToKeep=10 numVersionBuckets=65536
   [junit4]   2> 230211 INFO  (coreLoadExecutor-1158-thread-1) [    x:collection1] o.a.s.u.CommitTracker Hard AutoCommit: disabled
   [junit4]   2> 230211 INFO  (coreLoadExecutor-1158-thread-1) [    x:collection1] o.a.s.u.CommitTracker Soft AutoCommit: disabled
   [junit4]   2> 230212 INFO  (coreLoadExecutor-1158-thread-1) [    x:collection1] o.a.s.u.RandomMergePolicy RandomMergePolicy wrapping class org.apache.lucene.index.LogDocMergePolicy: [LogDocMergePolicy: minMergeSize=1000, mergeFactor=13, maxMergeSize=9223372036854775807, maxMergeSizeForForcedMerge=9223372036854775807, calibrateSizeByDeletes=true, maxMergeDocs=2147483647, maxCFSSegmentSizeMB=8.796093022207999E12, noCFSRatio=0.18529454550596258]
   [junit4]   2> 230212 INFO  (coreLoadExecutor-1158-thread-1) [    x:collection1] o.a.s.s.SolrIndexSearcher Opening [Searcher@731c77de[collection1] main]
   [junit4]   2> 230212 WARN  (coreLoadExecutor-1158-thread-1) [    x:collection1] o.a.s.r.ManagedResourceStorage Cannot write to config directory /home/jenkins/workspace/Lucene-Solr-master-Linux/solr/core/src/test-files/solr/collection1/conf; switching to use InMemory storage instead.
   [junit4]   2> 230212 INFO  (coreLoadExecutor-1158-thread-1) [    x:collection1] o.a.s.h.ReplicationHandler Commits will be reserved for 10000ms.
   [junit4]   2> 230212 INFO  (coreLoadExecutor-1158-thread-1) [    x:collection1] o.a.s.u.UpdateLog Could not find max version in index or recent updates, using new clock 1601429501223370752
   [junit4]   2> 230213 INFO  (searcherExecutor-1159-thread-1-processing-x:collection1) [    x:collection1] o.a.s.c.SolrCore [collection1] Registered new searcher Searcher@731c77de[collection1] main{ExitableDirectoryReader(UninvertingDirectoryReader())}
   [junit4]   2> 230214 INFO  (TEST-MaxSizeAutoCommitTest.deleteTest-seed#[9D7A060317C290F9]) [    ] o.a.s.SolrTestCaseJ4 ####initCore end
   [junit4]   2> 230223 INFO  (commitScheduler-1162-thread-1) [    ] o.a.s.u.DirectUpdateHandler2 start commit{,optimize=false,openSearcher=false,waitSearcher=true,expungeDeletes=false,softCommit=false,prepareCommit=false}
   [junit4]   2> 230223 INFO  (commitScheduler-1162-thread-1) [    ] o.a.s.u.SolrIndexWriter Calling setCommitData with IW:org.apache.solr.update.SolrIndexWriter@63223cca commitCommandVersion:0
   [junit4]   2> 230230 INFO  (commitScheduler-1162-thread-1) [    ] o.a.s.s.SolrIndexSearcher Opening [Searcher@66c079fd[collection1] realtime]
   [junit4]   2> 230231 INFO  (commitScheduler-1162-thread-1) [    ] o.a.s.u.DirectUpdateHandler2 end_commit_flush
   [junit4]   2> 230231 INFO  (commitScheduler-1162-thread-1) [    ] o.a.s.u.DirectUpdateHandler2 start commit{,optimize=false,openSearcher=false,waitSearcher=true,expungeDeletes=false,softCommit=false,prepareCommit=false}
   [junit4]   2> 230231 INFO  (commitScheduler-1162-thread-1) [    ] o.a.s.u.SolrIndexWriter Calling setCommitData with IW:org.apache.solr.update.SolrIndexWriter@63223cca commitCommandVersion:0
   [junit4]   2> 230245 INFO  (commitScheduler-1162-thread-1) [    ] o.a.s.s.SolrIndexSearcher Opening [Searcher@25fd20f4[collection1] realtime]
   [junit4]   2> 230246 INFO  (commitScheduler-1162-thread-1) [    ] o.a.s.u.DirectUpdateHandler2 end_commit_flush
   [junit4]   2> 230246 INFO  (commitScheduler-1162-thread-1) [    ] o.a.s.u.DirectUpdateHandler2 start commit{,optimize=false,openSearcher=false,waitSearcher=true,expungeDeletes=false,softCommit=false,prepareCommit=false}
   [junit4]   2> 230246 INFO  (commitScheduler-1162-thread-1) [    ] o.a.s.u.SolrIndexWriter Calling setCommitData with IW:org.apache.solr.update.SolrIndexWriter@63223cca commitCommandVersion:0
   [junit4]   2> 230248 INFO  (TEST-MaxSizeAutoCommitTest.deleteTest-seed#[9D7A060317C290F9]) [    ] o.a.s.u.p.LogUpdateProcessorFactory [collection1] {add=[0 (1601429501227565056), 1 (1601429501229662208), 2 (1601429501229662209), 3 (1601429501230710784), 4 (1601429501230710785), 5 (1601429501230710786), 6 (1601429501230710787), 7 (1601429501230710788), 8 (1601429501230710789), 9 (1601429501230710790), ... (150 adds)]} 0 33
   [junit4]   2> 230252 INFO  (commitScheduler-1162-thread-1) [    ] o.a.s.s.SolrIndexSearcher Opening [Searcher@18de7c50[collection1] realtime]
   [junit4]   2> 230252 INFO  (commitScheduler-1162-thread-1) [    ] o.a.s.u.DirectUpdateHandler2 end_commit_flush
   [junit4]   2> 230450 INFO  (TEST-MaxSizeAutoCommitTest.deleteTest-seed#[9D7A060317C290F9]) [    ] o.a.s.u.p.LogUpdateProcessorFactory [collection1] {delete=[0 (-1601429501471883264), 1 (-1601429501471883265), 2 (-1601429501471883266), 3 (-1601429501472931840), 4 (-1601429501472931841), 5 (-1601429501472931842), 6 (-1601429501472931843), 7 (-1601429501472931844), 8 (-1601429501472931845), 9 (-1601429501472931846), ... (15 deletes)]} 0 1
   [junit4]   2> 230652 INFO  (TEST-MaxSizeAutoCommitTest.deleteTest-seed#[9D7A060317C290F9]) [    ] o.a.s.u.p.LogUpdateProcessorFactory [collection1] {delete=[15 (-1601429501683695616), 16 (-1601429501683695617), 17 (-1601429501683695618), 18 (-1601429501683695619), 19 (-1601429501683695620), 20 (-1601429501683695621), 21 (-1601429501683695622), 22 (-1601429501683695623), 23 (-1601429501683695624), 24 (-1601429501683695625), ... (15 deletes)]} 0 1
   [junit4]   2> 230853 INFO  (TEST-MaxSizeAutoCommitTest.deleteTest-seed#[9D7A060317C290F9]) [    ] o.a.s.u.p.LogUpdateProcessorFactory [collection1] {delete=[30 (-1601429501895507968), 31 (-1601429501895507969), 32 (-1601429501895507970), 33 (-1601429501895507971), 34 (-1601429501895507972), 35 (-1601429501895507973), 36 (-1601429501895507974), 37 (-1601429501895507975), 38 (-1601429501895507976), 39 (-1601429501895507977), ... (15 deletes)]} 0 1
   [junit4]   2> 230854 INFO  (commitScheduler-1162-thread-1) [    ] o.a.s.u.DirectUpdateHandler2 start commit{,optimize=false,openSearcher=false,waitSearcher=true,expungeDeletes=false,softCommit=false,prepareCommit=false}
   [junit4]   2> 230854 INFO  (commitScheduler-1162-thread-1) [    ] o.a.s.u.SolrIndexWriter Calling setCommitData with IW:org.apache.solr.update.SolrIndexWriter@63223cca commitCommandVersion:0
   [junit4]   2> 230856 INFO  (commitScheduler-1162-thread-1) [    ] o.a.s.s.SolrIndexSearcher Opening [Searcher@30447b99[collection1] realtime]
   [junit4]   2> 230856 INFO  (commitScheduler-1162-thread-1) [    ] o.a.s.u.DirectUpdateHandler2 end_commit_flush
   [junit4]   2> 230905 INFO  (TEST-MaxSizeAutoCommitTest.deleteTest-seed#[9D7A060317C290F9]) [    ] o.a.s.u.p.LogUpdateProcessorFactory [collection1] {delete=[45 (-1601429501948985344), 46 (-1601429501948985345), 47 (-1601429501948985346), 48 (-1601429501948985347), 49 (-1601429501950033920), 50 (-1601429501950033921), 51 (-1601429501950033922), 52 (-1601429501950033923), 53 (-1601429501950033924), 54 (-1601429501950033925), ... (15 deletes)]} 0 1
   [junit4]   2> 231107 INFO  (TEST-MaxSizeAutoCommitTest.deleteTest-seed#[9D7A060317C290F9]) [    ] o.a.s.u.p.LogUpdateProcessorFactory [collection1] {delete=[60 (-1601429502160797696), 61 (-1601429502160797697), 62 (-1601429502160797698), 63 (-1601429502160797699), 64 (-1601429502160797700), 65 (-1601429502160797701), 66 (-1601429502160797702), 67 (-1601429502160797703), 68 (-1601429502160797704), 69 (-1601429502160797705), ... (15 deletes)]} 0 1
   [junit4]   2> 231308 INFO  (TEST-MaxSizeAutoCommitTest.deleteTest-seed#[9D7A060317C290F9]) [    ] o.a.s.u.p.LogUpdateProcessorFactory [collection1] {delete=[75 (-1601429502371561472), 76 (-1601429502371561473), 77 (-1601429502371561474), 78 (-1601429502372610048), 79 (-1601429502372610049), 80 (-1601429502372610050), 81 (-1601429502372610051), 82 (-1601429502372610052), 83 (-1601429502372610053), 84 (-1601429502372610054), ... (15 deletes)]} 0 0
   [junit4]   2> 231509 INFO  (TEST-MaxSizeAutoCommitTest.deleteTest-seed#[9D7A060317C290F9]) [    ] o.a.s.u.p.LogUpdateProcessorFactory [collection1] {delete=[90 (-1601429502583373824), 91 (-1601429502583373825), 92 (-1601429502583373826), 93 (-1601429502583373827), 94 (-1601429502583373828), 95 (-1601429502583373829), 96 (-1601429502583373830), 97 (-1601429502583373831), 98 (-1601429502583373832), 99 (-1601429502583373833), ... (15 deletes)]} 0 0
   [junit4]   2> 231510 INFO  (commitScheduler-1162-thread-1) [    ] o.a.s.u.DirectUpdateHandler2 start commit{,optimize=false,openSearcher=false,waitSearcher=true,expungeDeletes=false,softCommit=false,prepareCommit=false}
   [junit4]   2> 231510 INFO  (commitScheduler-1162-thread-1) [    ] o.a.s.u.SolrIndexWriter Calling setCommitData with IW:org.apache.solr.update.SolrIndexWriter@63223cca commitCommandVersion:0
   [junit4]   2> 231511 INFO  (commitScheduler-1162-thread-1) [    ] o.a.s.s.SolrIndexSearcher Opening [Searcher@2b8aaea8[collection1] realtime]
   [junit4]   2> 231512 INFO  (commitScheduler-1162-thread-1) [    ] o.a.s.u.DirectUpdateHandler2 end_commit_flush
   [junit4]   2> 231561 INFO  (TEST-MaxSizeAutoCommitTest.deleteTest-seed#[9D7A060317C290F9]) [    ] o.a.s.u.p.LogUpdateProcessorFactory [collection1] {delete=[105 (-1601429502636851200), 106 (-1601429502636851201), 107 (-1601429502636851202), 108 (-1601429502636851203), 109 (-1601429502636851204), 110 (-1601429502637899776), 111 (-1601429502637899777), 112 (-1601429502637899778), 113 (-1601429502637899779), 114 (-1601429502637899780), ... (15 deletes)]} 0 1
   [junit4]   2> 231763 INFO  (TEST-MaxSizeAutoCommitTest.deleteTest-seed#[9D7A060317C290F9]) [    ] o.a.s.u.p.LogUpdateProcessorFactory [collection1] {delete=[120 (-1601429502848663552), 121 (-1601429502848663553), 122 (-1601429502848663554), 123 (-1601429502848663555), 124 (-1601429502848663556), 125 (-1601429502848663557), 126 (-1601429502848663558), 127 (-1601429502848663559), 128 (-1601429502849712128), 129 (-1601429502849712129), ... (15 deletes)]} 0 1
   [junit4]   2> 231964 INFO  (TEST-MaxSizeAutoCommitTest.deleteTest-seed#[9D7A060317C290F9]) [    ] o.a.s.u.p.LogUpdateProcessorFactory [collection1] {delete=[135 (-1601429503060475904), 136 (-1601429503060475905), 137 (-1601429503060475906), 138 (-1601429503060475907), 139 (-1601429503060475908), 140 (-1601429503060475909), 141 (-1601429503060475910), 142 (-1601429503060475911), 143 (-1601429503060475912), 144 (-1601429503060475913), ... (15 deletes)]} 0 0
   [junit4]   2> 232165 INFO  (TEST-MaxSizeAutoCommitTest.deleteTest-seed#[9D7A060317C290F9]) [    ] o.a.s.SolrTestCaseJ4 ###Ending deleteTest
   [junit4]   2> 232165 INFO  (TEST-MaxSizeAutoCommitTest.deleteTest-seed#[9D7A060317C290F9]) [    ] o.a.s.SolrTestCaseJ4 ###deleteCore
   [junit4]   2> 232165 INFO  (TEST-MaxSizeAutoCommitTest.deleteTest-seed#[9D7A060317C290F9]) [    ] o.a.s.c.CoreContainer Shutting down CoreContainer instance=1560972513
   [junit4]   2> 232165 INFO  (TEST-MaxSizeAutoCommitTest.deleteTest-seed#[9D7A060317C290F9]) [    ] o.a.s.m.SolrMetricManager Closing metric reporters for registry=solr.node, tag=null
   [junit4]   2> 232165 INFO  (TEST-MaxSizeAutoCommitTest.deleteTest-seed#[9D7A060317C290F9]) [    ] o.a.s.m.r.SolrJmxReporter Closing reporter [org.apache.solr.metrics.reporters.SolrJmxReporter@32c51ecd: rootName = null, domain = solr.node, service url = null, agent id = null] for registry solr.node / com.codahale.metrics.MetricRegistry@728690cf
   [junit4]   2> 232168 INFO  (TEST-MaxSizeAutoCommitTest.deleteTest-seed#[9D7A060317C290F9]) [    ] o.a.s.m.SolrMetricManager Closing metric reporters for registry=solr.jvm, tag=null
   [junit4]   2> 232168 INFO  (TEST-MaxSizeAutoCommitTest.deleteTest-seed#[9D7A060317C290F9]) [    ] o.a.s.m.r.SolrJmxReporter Closing reporter [org.apache.solr.metrics.reporters.SolrJmxReporter@66851004: rootName = null, domain = solr.jvm, service url = null, agent id = null] for registry solr.jvm / com.codahale.metrics.MetricRegistry@687f84c1
   [junit4]   2> 232170 INFO  (TEST-MaxSizeAutoCommitTest.deleteTest-seed#[9D7A060317C290F9]) [    ] o.a.s.m.SolrMetricManager Closing metric reporters for registry=solr.jetty, tag=null
   [junit4]   2> 232170 INFO  (TEST-MaxSizeAutoCommitTest.deleteTest-seed#[9D7A060317C290F9]) [    ] o.a.s.m.r.SolrJmxReporter Closing reporter [org.apache.solr.metrics.reporters.SolrJmxReporter@46ce4d0c: rootName = null, domain = solr.jetty, service url = null, agent id = null] for registry solr.jetty / com.codahale.metrics.MetricRegistry@15ea8716
   [junit4]   2> 232171 INFO  (coreCloseExecutor-1164-thread-1) [    x:collection1] o.a.s.c.SolrCore [collection1]  CLOSING SolrCore org.apache.solr.core.SolrCore@10d91488
   [junit4]   2> 232171 INFO  (coreCloseExecutor-1164-thread-1) [    x:collection1] o.a.s.m.SolrMetricManager Closing metric reporters for registry=solr.core.collection1, tag=10d91488
   [junit4]   2> 232171 INFO  (coreCloseExecutor-1164-thread-1) [    x:collection1] o.a.s.m.r.SolrJmxReporter Closing reporter [org.apache.solr.metrics.reporters.SolrJmxReporter@53219d4f: rootName = null, domain = solr.core.collection1, service url = null, agent id = null] for registry solr.core.collection1 / com.codahale.metrics.MetricRegistry@6716f396
   [junit4]   2> 232179 INFO  (coreCloseExecutor-1164-thread-1) [    x:collection1] o.a.s.u.DirectUpdateHandler2 Committing on IndexWriter close.
   [junit4]   2> 232179 INFO  (coreCloseExecutor-1164-thread-1) [    x:collection1] o.a.s.u.SolrIndexWriter Calling setCommitData with IW:org.apache.solr.update.SolrIndexWriter@63223cca commitCommandVersion:0
   [junit4]   2> NOTE: reproduce with: ant test  -Dtestcase=MaxSizeAutoCommitTest -Dtests.method=deleteTest -Dtests.seed=9D7A060317C290F9 -Dtests.multiplier=3 -Dtests.slow=true -Dtests.locale=sr -Dtests.timezone=Europe/Kirov -Dtests.asserts=true -Dtests.file.encoding=UTF-8
   [junit4] FAILURE 2.17s J0 | MaxSizeAutoCommitTest.deleteTest <<<
   [junit4]    > Throwable #1: java.lang.AssertionError: Tlog size exceeds the max size bound. Tlog path: /home/jenkins/workspace/Lucene-Solr-master-Linux/solr/build/solr-core/test/J0/temp/solr.update.MaxSizeAutoCommitTest_9D7A060317C290F9-001/init-core-data-001/tlog/tlog.0000000000000000003, tlog size: 1276
   [junit4]    > 	at __randomizedtesting.SeedInfo.seed([9D7A060317C290F9:8D34E3FC6C6CA908]:0)
   [junit4]    > 	at org.apache.solr.update.MaxSizeAutoCommitTest.getTlogFileSizes(MaxSizeAutoCommitTest.java:379)
   [junit4]    > 	at org.apache.solr.update.MaxSizeAutoCommitTest.deleteTest(MaxSizeAutoCommitTest.java:200)
   [junit4]    > 	at java.lang.Thread.run(Thread.java:748)
   [junit4]   2> 232186 INFO  (TEST-MaxSizeAutoCommitTest.testRedundantDeletes-seed#[9D7A060317C290F9]) [    ] o.a.s.SolrTestCaseJ4 ###Starting testRedundantDeletes
   [junit4]   2> 232186 INFO  (TEST-MaxSizeAutoCommitTest.testRedundantDeletes-seed#[9D7A060317C290F9]) [    ] o.a.s.SolrTestCaseJ4 ####initCore
   [junit4]   2> 232186 INFO  (TEST-MaxSizeAutoCommitTest.testRedundantDeletes-seed#[9D7A060317C290F9]) [    ] o.a.s.c.SolrResourceLoader [null] Added 2 libs to classloader, from paths: [/home/jenkins/workspace/Lucene-Solr-master-Linux/solr/core/src/test-files/solr/collection1/lib, /home/jenkins/workspace/Lucene-Solr-master-Linux/solr/core/src/test-files/solr/collection1/lib/classes]
   [junit4]   2> 232203 INFO  (TEST-MaxSizeAutoCommitTest.testRedundantDeletes-seed#[9D7A060317C290F9]) [    ] o.a.s.c.SolrConfig Using Lucene MatchVersion: 8.0.0
   [junit4]   2> 232210 INFO  (TEST-MaxSizeAutoCommitTest.testRedundantDeletes-seed#[9D7A060317C290F9]) [    ] o.a.s.s.IndexSchema [null] Schema name=test
   [junit4]   2> 232277 INFO  (TEST-MaxSizeAutoCommitTest.testRedundantDeletes-seed#[9D7A060317C290F9]) [    ] o.a.s.s.IndexSchema Loaded schema test/1.0 with uniqueid field id
   [junit4]   2> 232308 INFO  (TEST-MaxSizeAutoCommitTest.testRedundantDeletes-seed#[9D7A060317C290F9]) [    ] o.a.s.m.r.SolrJmxReporter JMX monitoring for 'solr.node' (registry 'solr.node') enabled at server: com.sun.jmx.mbeanserver.JmxMBeanServer@3e4d86c1
   [junit4]   2> 232312 INFO  (TEST-MaxSizeAutoCommitTest.testRedundantDeletes-seed#[9D7A060317C290F9]) [    ] o.a.s.m.r.SolrJmxReporter JMX monitoring for 'solr.jvm' (registry 'solr.jvm') enabled at server: com.sun.jmx.mbeanserver.JmxMBeanServer@3e4d86c1
   [junit4]   2> 232312 INFO  (TEST-MaxSizeAutoCommitTest.testRedundantDeletes-seed#[9D7A060317C290F9]) [    ] o.a.s.m.r.SolrJmxReporter JMX monitoring for 'solr.jetty' (registry 'solr.jetty') enabled at server: com.sun.jmx.mbeanserver.JmxMBeanServer@3e4d86c1
   [junit4]   2> 232313 INFO  (coreLoadExecutor-1171-thread-1) [    ] o.a.s.c.TransientSolrCoreCacheDefault Allocating transient cache for 2147483647 transient cores
   [junit4]   2> 232314 INFO  (coreLoadExecutor-1171-thread-1) [    x:collection1] o.a.s.c.SolrResourceLoader [null] Added 2 libs to classloader, from paths: [/home/jenkins/workspace/Lucene-Solr-master-Linux/solr/core/src/test-files/solr/collection1/lib, /home/jenkins/workspace/Lucene-Solr-master-Linux/solr/core/src/test-files/solr/collection1/lib/classes]
   [junit4]   2> 232328 INFO  (coreLoadExecutor-1171-thread-1) [    x:collection1] o.a.s.c.SolrConfig Using Lucene MatchVersion: 8.0.0
   [junit4]   2> 232334 INFO  (coreLoadExecutor-1171-thread-1) [    x:collection1] o.a.s.s.IndexSchema [collection1] Schema name=test
   [junit4]   2> 232382 INFO  (coreLoadExecutor-1171-thread-1) [    x:collection1] o.a.s.s.IndexSchema Loaded schema test/1.0 with uniqueid field id
   [junit4]   2> 232386 INFO  (coreLoadExecutor-1171-thread-1) [    x:collection1] o.a.s.c.CoreContainer Creating SolrCore 'collection1' using configuration from instancedir /home/jenkins/workspace/Lucene-Solr-master-Linux/solr/core/src/test-files/solr/collection1, trusted=true
   [junit4]   2> 232386 INFO  (coreLoadExecutor-1171-thread-1) [    x:collection1] o.a.s.m.r.SolrJmxReporter JMX monitoring for 'solr.core.collection1' (registry 'solr.core.collection1') enabled at server: com.sun.jmx.mbeanserver.JmxMBeanServer@3e4d86c1
   [junit4]   2> 232386 INFO  (coreLoadExecutor-1171-thread-1) [    x:collection1] o.a.s.c.SolrCore solr.RecoveryStrategy.Builder
   [junit4]   2> 232386 INFO  (coreLoadExecutor-1171-thread-1) [    x:collection1] o.a.s.c.SolrCore [[collection1] ] Opening new SolrCore at [/home/jenkins/workspace/Lucene-Solr-master-Linux/solr/core/src/test-files/solr/collection1], dataDir=[/home/jenkins/workspace/Lucene-Solr-master-Linux/solr/build/solr-core/test/J0/temp/solr.update.MaxSizeAutoCommitTest_9D7A060317C290F9-001/init-core-data-001/]
   [junit4]   2> 232387 INFO  (coreLoadExecutor-1171-thread-1) [    x:collection1] o.a.s.u.RandomMergePolicy RandomMergePolicy wrapping class org.apache.lucene.index.AlcoholicMergePolicy: [AlcoholicMergePolicy: minMergeSize=0, mergeFactor=10, maxMergeSize=1818205695, maxMergeSizeForForcedMerge=9223372036854775807, calibrateSizeByDeletes=true, maxMergeDocs=2147483647, maxCFSSegmentSizeMB=8.796093022207999E12, noCFSRatio=0.1]
   [junit4]   2> 232390 WARN  (coreLoadExecutor-1171-thread-1) [    x:collection1] o.a.s.c.RequestHandlers INVALID paramSet a in requestHandler {type = requestHandler,name = /dump,class = DumpRequestHandler,attributes = {initParams=a, name=/dump, class=DumpRequestHandler},args = {defaults={a=A,b=B}}}
   [junit4]   2> 232415 INFO  (coreLoadExecutor-1171-thread-1) [    x:collection1] o.a.s.u.UpdateHandler Using UpdateLog implementation: org.apache.solr.update.UpdateLog
   [junit4]   2> 232415 INFO  (coreLoadExecutor-1171-thread-1) [    x:collection1] o.a.s.u.UpdateLog Initializing UpdateLog: dataDir= defaultSyncLevel=FLUSH numRecordsToKeep=100 maxNumLogsToKeep=10 numVersionBuckets=65536
   [junit4]   2> 232416 INFO  (coreLoadExecutor-1171-thread-1) [    x:collection1] o.a.s.u.CommitTracker Hard AutoCommit: disabled
   [junit4]   2> 232416 INFO  (coreLoadExecutor-1171-thread-1) [    x:collection1] o.a.s.u.CommitTracker Soft AutoCommit: disabled
   [junit4]   2> 232416 INFO  (coreLoadExecutor-1171-thread-1) [    x:collection1] o.a.s.u.RandomMergePolicy RandomMergePolicy wrapping class org.apache.lucene.index.LogDocMergePolicy: [LogDocMergePolicy: minMergeSize=1000, mergeFactor=13, maxMergeSize=9223372036854775807, maxMergeSizeForForcedMerge=9223372036854775807, calibrateSizeByDeletes=true, maxMergeDocs=2147483647, maxCFSSegmentSizeMB=8.796093022207999E12, noCFSRatio=0.18529454550596258]
   [junit4]   2> 232417 INFO  (coreLoadExecutor-1171-thread-1) [    x:collection1] o.a.s.s.SolrIndexSearcher Opening [Searcher@29fc045f[collection1] main]
   [junit4]   2> 232417 WARN  (coreLoadExecutor-1171-thread-1) [    x:collection1] o.a.s.r.ManagedResourceStorage Cannot write to config directory /home/jenkins/workspace/Lucene-Solr-master-Linux/solr/core/src/test-files/solr/collection1/conf; switching to use InMemory storage instead.
   [junit4]   2> 232417 INFO  (coreLoadExecutor-1171-thread-1) [    x:collection1] o.a.s.h.ReplicationHandler Commits will be reserved for 10000ms.
   [junit4]   2> 232417 INFO  (coreLoadExecutor-1171-thread-1) [    x:collection1] o.a.s.u.UpdateLog Could not find max version in index or recent updates, using new clock 1601429503535480832
   [junit4]   2> 232418 INFO  (searcherExecutor-1172-thread-1-processing-x:collection1) [    x:collection1] o.a.s.c.SolrCore [collection1] Registered new searcher Searcher@29fc045f[collection1] main{ExitableDirectoryReader(UninvertingDirectoryReader())}
   [junit4]   2> 232419 INFO  (TEST-MaxSizeAutoCommitTest.testRedundantDeletes-seed#[9D7A060317C290F9]) [    ] o.a.s.SolrTestCaseJ4 ####initCore end
   [junit4]   2> 232425 INFO  (commitScheduler-1175-thread-1) [    ] o.a.s.u.DirectUpdateHandler2 start commit{,optimize=false,openSearcher=false,waitSearcher=true,expungeDeletes=false,softCommit=false,prepareCommit=false}
   [junit4]   2> 232425 INFO  (commitScheduler-1175-thread-1) [    ] o.a.s.u.SolrIndexWriter Calling setCommitData with IW:org.apache.solr.update.SolrIndexWriter@124db57 commitCommandVersion:0
   [junit4]   2> 232433 INFO  (commitScheduler-1175-thread-1) [    ] o.a.s.s.SolrIndexSearcher Opening [Searcher@6ac0af64[collection1] realtime]
   [junit4]   2> 232433 INFO  (commitScheduler-1175-thread-1) [    ] o.a.s.u.DirectUpdateHandler2 end_commit_flush
   [junit4]   2> 232433 INFO  (commitScheduler-1175-thread-1) [    ] o.a.s.u.DirectUpdateHandler2 start commit{,optimize=false,openSearcher=false,waitSearcher=true,expungeDeletes=false,softCommit=false,prepareCommit=false}
   [junit4]   2> 232433 INFO  (commitScheduler-1175-thread-1) [    ] o.a.s.u.SolrIndexWriter Calling setCommitData with IW:org.apache.solr.update.SolrIndexWriter@124db57 commitCommandVersion:0
   [junit4]   2> 232434 INFO  (TEST-MaxSizeAutoCommitTest.testRedundantDeletes-seed#[9D7A060317C290F9]) [    ] o.a.s.u.p.LogUpdateProcessorFactory [collection1] {add=[0 (1601429503538626560), 1 (1601429503539675136), 2 (1601429503540723712), 3 (1601429503540723713), 4 (1601429503540723714), 5 (1601429503540723715), 6 (1601429503540723716), 7 (1601429503540723717), 8 (1601429503540723718), 9 (1601429503540723719), ... (150 adds)]} 0 14
   [junit4]   2> 232439 INFO  (commitScheduler-1175-thread-1) [    ] o.a.s.s.SolrIndexSearcher Opening [Searcher@767bd532[collection1] realtime]
   [junit4]   2> 232439 INFO  (commitScheduler-1175-thread-1) [    ] o.a.s.u.DirectUpdateHandler2 end_commit_flush
   [junit4]   2> 232836 INFO  (TEST-MaxSizeAutoCommitTest.testRedundantDeletes-seed#[9D7A060317C290F9]) [    ] o.a.s.u.p.LogUpdateProcessorFactory [collection1] {delete=[100 (-1601429503973785600)]} 0 201
   [junit4]   2> 232836 INFO  (TEST-MaxSizeAutoCommitTest.testRedundantDeletes-seed#[9D7A060317C290F9]) [    ] o.a.s.u.p.LogUpdateProcessorFactory [collection1] {delete=[100 (-1601429503974834176)]} 0 201
   [junit4]   2> 232836 INFO  (TEST-MaxSizeAutoCommitTest.testRedundantDeletes-seed#[9D7A060317C290F9]) [    ] o.a.s.u.p.LogUpdateProcessorFactory [collection1] {delete=[100 (-1601429503974834177)]} 0 201
   [junit4]   2> 232836 INFO  (TEST-MaxSizeAutoCommitTest.testRedundantDeletes-seed#[9D7A060317C290F9]) [    ] o.a.s.u.p.LogUpdateProcessorFactory [collection1] {delete=[100 (-1601429503974834178)]} 0 201
   [junit4]   2> 232837 INFO  (TEST-MaxSizeAutoCommitTest.testRedundantDeletes-seed#[9D7A060317C290F9]) [    ] o.a.s.u.p.LogUpdateProcessorFactory [collection1] {delete=[100 (-1601429503974834179)]} 0 202
   [junit4]   2> 232837 INFO  (TEST-MaxSizeAutoCommitTest.testRedundantDeletes-seed#[9D7A060317C290F9]) [    ] o.a.s.u.p.LogUpdateProcessorFactory [collection1] {delete=[100 (-1601429503975882752)]} 0 202
   [junit4]   2> 232837 INFO  (TEST-MaxSizeAutoCommitTest.testRedundantDeletes-seed#[9D7A060317C290F9]) [    ] o.a.s.u.p.LogUpdateProcessorFactory [collection1] {delete=[100 (-1601429503975882753)]} 0 202
   [junit4]   2> 232837 INFO  (TEST-MaxSizeAutoCommitTest.testRedundantDeletes-seed#[9D7A060317C290F9]) [    ] o.a.s.u.p.LogUpdateProcessorFactory [collection1] {delete=[100 (-1601429503975882754)]} 0 202
   [junit4]   2> 232837 INFO  (TEST-MaxSizeAutoCommitTest.testRedundantDeletes-seed#[9D7A060317C290F9]) [    ] o.a.s.u.p.LogUpdateProcessorFactory [collection1] {delete=[100 (-1601429503975882755)]} 0 202
   [junit4]   2> 232837 INFO  (TEST-MaxSizeAutoCommitTest.testRedundantDeletes-seed#[9D7A060317C290F9]) [    ] o.a.s.u.p.LogUpdateProcessorFactory [collection1] {delete=[100 (-1601429503975882756)]} 0 202
   [junit4]   2> 232837 INFO  (TEST-MaxSizeAutoCommitTest.testRedundantDeletes-seed#[9D7A060317C290F9]) [    ] o.a.s.u.p.LogUpdateProcessorFactory [collection1] {delete=[100 (-1601429503975882757)]} 0 202
   [junit4]   2> 232837 INFO  (TEST-MaxSizeAutoCommitTest.testRedundantDeletes-seed#[9D7A060317C290F9]) [    ] o.a.s.u.p.LogUpdateProcessorFactory [collection1] {delete=[100 (-1601429503975882758)]} 0 202
   [junit4]   2> 232837 INFO  (TEST-MaxSizeAutoCommitTest.testRedundantDeletes-seed#[9D7A060317C290F9]) [    ] o.a.s.u.p.LogUpdateProcessorFactory [collection1] {delete=[100 (-1601429503975882759)]} 0 202
   [junit4]   2> 232837 INFO  (TEST-MaxSizeAutoCommitTest.testRedundantDeletes-seed#[9D7A060317C290F9]) [    ] o.a.s.u.p.LogUpdateProcessorFactory [collection1] {delete=[100 (-1601429503975882760)]} 0 202
   [junit4]   2> 232837 INFO  (TEST-MaxSizeAutoCommitTest.testRedundantDeletes-seed#[9D7A060317C290F9]) [    ] o.a.s.u.p.LogUpdateProcessorFactory [collection1] {delete=[100 (-1601429503975882761)]} 0 202
   [junit4]   2> 232837 INFO  (TEST-MaxSizeAutoCommitTest.testRedundantDeletes-seed#[9D7A060317C290F9]) [    ] o.a.s.u.p.LogUpdateProcessorFactory [collection1] {delete=[100 (-1601429503975882762)]} 0 203
   [junit4]   2> 232838 INFO  (TEST-MaxSizeAutoCommitTest.testRedundantDeletes-seed#[9D7A060317C290F9]) [    ] o.a.s.u.p.LogUpdateProcessorFactory [collection1] {delete=[100 (-1601429503976931328)]} 0 203
   [junit4]   2> 232838 INFO  (TEST-MaxSizeAutoCommitTest.testRedundantDeletes-seed#[9D7A060317C290F9]) [    ] o.a.s.u.p.LogUpdateProcessorFactory [collection1] {delete=[100 (-1601429503976931329)]} 0 203
   [junit4]   2> 232838 INFO  (TEST-MaxSizeAutoCommitTest.testRedundantDeletes-seed#[9D7A060317C290F9]) [    ] o.a.s.u.p.LogUpdateProcessorFactory [collection1] {delete=[100 (-1601429503976931330)]} 0 203
   [junit4]   2> 232838 INFO  (TEST-MaxSizeAutoCommitTest.testRedundantDeletes-seed#[9D7A060317C290F9]) [    ] o.a.s.u.p.LogUpdateProcessorFactory [collection1] {delete=[100 (-1601429503976931331)]} 0 203
   [junit4]   2> 232838 INFO  (TEST-MaxSizeAutoCommitTest.testRedundantDeletes-seed#[9D7A060317C290F9]) [    ] o.a.s.u.p.LogUpdateProcessorFactory [collection1] {delete=[100 (-1601429503976931332)]} 0 203
   [junit4]   2> 232838 INFO  (TEST-MaxSizeAutoCommitTest.testRedundantDeletes-seed#[9D7A060317C290F9]) [    ] o.a.s.u.p.LogUpdateProcessorFactory [collection1] {delete=[100 (-1601429503976931333)]} 0 203
   [junit4]   2> 232838 INFO  (TEST-MaxSizeAutoCommitTest.testRedundantDeletes-seed#[9D7A060317C290F9]) [    ] o.a.s.u.p.LogUpdateProcessorFactory [collection1] {delete=[100 (-1601429503976931334)]} 0 203
   [junit4]   2> 232838 INFO  (TEST-MaxSizeAutoCommitTest.testRedundantDeletes-seed#[9D7A060317C290F9]) [    ] o.a.s.u.p.LogUpdateProcessorFactory [collection1] {delete=[100 (-1601429503976931335)]} 0 203
   [junit4]   2> 232838 INFO  (TEST-MaxSizeAutoCommitTest.testRedundantDeletes-seed#[9D7A060317C290F9]) [    ] o.a.s.u.p.LogUpdateProcessorFactory [collection1] {delete=[100 (-1601429503976931336)]} 0 203
   [junit4]   2> 232838 INFO  (TEST-MaxSizeAutoCommitTest.testRedundantDeletes-seed#[9D7A060317C290F9]) [    ] o.a.s.u.p.LogUpdateProcessorFactory [collection1] {delete=[100 (-1601429503976931337)]} 0 204
   [junit4]   2> 232839 INFO  (TEST-MaxSizeAutoCommitTest.testRedundantDeletes-seed#[9D7A060317C290F9]) [    ] o.a.s.u.p.LogUpdateProcessorFactory [collection1] {delete=[100 (-1601429503977979904)]} 0 204
   [junit4]   2> 232839 INFO  (TEST-MaxSizeAutoCommitTest.testRedundantDeletes-seed#[9D7A060317C290F9]) [    ] o.a.s.u.p.LogUpdateProcessorFactory [collection1] {delete=[100 (-1601429503977979905)]} 0 204
   [junit4]   2> 232839 INFO  (TEST-MaxSizeAutoCommitTest.testRedundantDeletes-seed#[9D7A060317C290F9]) [    ] o.a.s.u.p.LogUpdateProcessorFactory [collection1] {delete=[100 (-1601429503977979906)]} 0 204
   [junit4]   2> 232839 INFO  (TEST-MaxSizeAutoCommitTest.testRedundantDeletes-seed#[9D7A060317C290F9]) [    ] o.a.s.u.p.LogUpdateProcessorFactory [collection1] {delete=[100 (-1601429503977979907)]} 0 204
   [junit4]   2> 232839 INFO  (TEST-MaxSizeAutoCommitTest.testRedundantDeletes-seed#[9D7A060317C290F9]) [    ] o.a.s.u.p.LogUpdateProcessorFactory [collection1] {delete=[100 (-1601429503977979908)]} 0 204
   [junit4]   2> 232839 INFO  (TEST-MaxSizeAutoCommitTest.testRedundantDeletes-seed#[9D7A060317C290F9]) [    ] o.a.s.u.p.LogUpdateProcessorFactory [collection1] {delete=[100 (-1601429503977979909)]} 0 204
   [junit4]   2> 232839 INFO  (TEST-MaxSizeAutoCommitTest.testRedundantDeletes-seed#[9D7A060317C290F9]) [    ] o.a.s.u.p.LogUpdateProcessorFactory [collection1] {delete=[100 (-1601429503977979910)]} 0 204
   [junit4]   2> 232839 INFO  (TEST-MaxSizeAutoCommitTest.testRedundantDeletes-seed#[9D7A060317C290F9]) [    ] o.a.s.u.p.LogUpdateProcessorFactory [collection1] {delete=[100 (-1601429503977979911)]} 0 204
   [junit4]   2> 232839 INFO  (TEST-MaxSizeAutoCommitTest.testRedundantDeletes-seed#[9D7A060317C290F9]) [    ] o.a.s.u.p.LogUpdateProcessorFactory [collection1] {delete=[100 (-1601429503977979912)]} 0 204
   [junit4]   2> 232840 INFO  (TEST-MaxSizeAutoCommitTest.testRedundantDeletes-seed#[9D7A060317C290F9]) [    ] o.a.s.u.p.LogUpdateProcessorFactory [collection1] {delete=[100 (-1601429503979028480)]} 0 205
   [junit4]   2> 232840 INFO  (TEST-MaxSizeAutoCommitTest.testRedundantDeletes-seed#[9D7A060317C290F9]) [    ] o.a.s.u.p.LogUpdateProcessorFactory [collection1] {delete=[100 (-1601429503979028481)]} 0 205
   [junit4]   2> 232840 INFO  (TEST-MaxSizeAutoCommitTest.testRedundantDeletes-seed#[9D7A060317C290F9]) [    ] o.a.s.u.p.LogUpdateProcessorFactory [collection1] {delete=[100 (-1601429503979028482)]} 0 205
   [junit4]   2> 232840 INFO  (TEST-MaxSizeAutoCommitTest.testRedundantDeletes-seed#[9D7A060317C290F9]) [    ] o.a.s.u.p.LogUpdateProcessorFactory [collection1] {delete=[100 (-1601429503979028483)]} 0 205
   [junit4]   2> 232840 INFO  (TEST-MaxSizeAutoCommitTest.testRedundantDeletes-seed#[9D7A060317C290F9]) [    ] o.a.s.u.p.LogUpdateProcessorFactory [collection1] {delete=[100 (-1601429503979028484)]} 0 205
   [junit4]   2> 232840 INFO  (TEST-MaxSizeAutoCommitTest.testRedundantDeletes-seed#[9D7A060317C290F9]) [    ] o.a.s.u.p.LogUpdateProcessorFactory [collection1] {delete=[100 (-1601429503979028485)]} 0 205
   [junit4]   2> 232840 INFO  (TEST-MaxSizeAutoCommitTest.testRedundantDeletes-seed#[9D7A060317C290F9]) [    ] o.a.s.u.p.LogUpdateProcessorFactory [collection1] {delete=[100 (-1601429503979028486)]} 0 205
   [junit4]   2> 232840 INFO  (TEST-MaxSizeAutoCommitTest.testRedundantDeletes-seed#[9D7A060317C290F9]) [    ] o.a.s.u.p.LogUpdateProcessorFactory [collection1] {delete=[100 (-1601429503979028487)]} 0 205
   [junit4]   2> 232840 INFO  (TEST-MaxSizeAutoCommitTest.testRedundantDeletes-seed#[9D7A060317C290F9]) [    ] o.a.s.u.p.LogUpdateProcessorFactory [collection1] {delete=[100 (-1601429503979028488)]} 0 205
   [junit4]   2> 232840 INFO  (TEST-MaxSizeAutoCommitTest.testRedundantDeletes-seed#[9D7A060317C290F9]) [    ] o.a.s.u.p.LogUpdateProcessorFactory [collection1] {delete=[100 (-1601429503979028489)]} 0 205
   [junit4]   2> 232840 INFO  (TEST-MaxSizeAutoCommitTest.testRedundantDeletes-seed#[9D7A060317C290F9]) [    ] o.a.s.u.p.LogUpdateProcessorFactory [collection1] {delete=[100 (-1601429503979028490)]} 0 205
   [junit4]   2> 232841 INFO  (TEST-MaxSizeAutoCommitTest.testRedundantDeletes-seed#[9D7A060317C290F9]) [    ] o.a.s.u.p.LogUpdateProcessorFactory [collection1] {delete=[100 (-1601429503980077056)]} 0 206
   [junit4]   2> 232841 INFO  (TEST-MaxSizeAutoCommitTest.testRedundantDeletes-seed#[9D7A060317C290F9]) [    ] o.a.s.u.p.LogUpdateProcessorFactory [collection1] {delete=[100 (-1601429503980077057)]} 0 206
   [junit4]   2> 232841 INFO  (TEST-MaxSizeAutoCommitTest.testRedundantDeletes-seed#[9D7A060317C290F9]) [    ] o.a.s.u.p.LogUpdateProcessorFactory [collection1] {delete=[100 (-1601429503980077058)]} 0 206
   [junit4]   2> 232841 INFO  (TEST-MaxSizeAutoCommitTest.testRedundantDeletes-seed#[9D7A060317C290F9]) [    ] o.a.s.u.p.LogUpdateProcessorFactory [collection1] {delete=[100 (-1601429503980077059)]} 0 206
   [junit4]   2> 232842 INFO  (commitScheduler-1175-thread-1) [    ] o.a.s.u.DirectUpdateHandler2 start commit{,optimize=false,openSearcher=false,waitSearcher=true,expungeDeletes=false,softCommit=false,prepareCommit=false}
   [junit4]   2> 232842 INFO  (commitScheduler-1175-thread-1) [    ] o.a.s.u.SolrIndexWriter Calling setCommitData with IW:org.apache.solr.update.SolrIndexWriter@124db57 commitCommandVersion:0
   [junit4]   2> 232843 INFO  (commitScheduler-1175-thread-1) [    ] o.a.s.s.SolrIndexSearcher Opening [Searcher@f3e1a49[collection1] realtime]
   [junit4]   2> 232844 INFO  (commitScheduler-1175-thread-1) [    ] o.a.s.u.DirectUpdateHandler2 end_commit_flush
   [junit4]   2> 232892 INFO  (TEST-MaxSizeAutoCommitTest.testRedundantDeletes-seed#[9D7A060317C290F9]) [    ] o.a.s.u.p.LogUpdateProcessorFactory [collection1] {delete=[100 (-1601429504032505856)]} 0 257
   [junit4]   2> 232892 INFO  (TEST-MaxSizeAutoCommitTest.testRedundantDeletes-seed#[9D7A060317C290F9]) [    ] o.a.s.u.p.LogUpdateProcessorFactory [collection1] {delete=[100 (-1601429504033554432)]} 0 257
   [junit4]   2> 232892 INFO  (TEST-MaxSizeAutoCommitTest.testRedundantDeletes-seed#[9D7A060317C290F9]) [    ] o.a.s.u.p.LogUpdateProcessorFactory [collection1] {delete=[100 (-1601429504033554433)]} 0 257
   [junit4]   2> 232892 INFO  (TEST-MaxSizeAutoCommitTest.testRedundantDeletes-seed#[9D7A060317C290F9]) [    ] o.a.s.u.p.LogUpdateProcessorFactory [collection1] {delete=[100 (-1601429504033554434)]} 0 257
   [junit4]   2> 232892 INFO  (TEST-MaxSizeAutoCommitTest.testRedundantDeletes-seed#[9D7A060317C290F9]) [    ] o.a.s.u.p.LogUpdateProcessorFactory [collection1] {delete=[100 (-1601429504033554435)]} 0 257
   [junit4]   2> 232892 INFO  (TEST-MaxSizeAutoCommitTest.testRedundantDeletes-seed#[9D7A060317C290F9]) [    ] o.a.s.u.p.LogUpdateProcessorFactory [collection1] {delete=[100 (-1601429504033554436)]} 0 257
   [junit4]   2> 232892 INFO  (TEST-MaxSizeAutoCommitTest.testRedundantDeletes-seed#[9D7A060317C290F9]) [    ] o.a.s.u.p.LogUpdateProcessorFactory [collection1] {delete=[100 (-1601429504033554437)]} 0 257
   [junit4]   2> 232892 INFO  (TEST-MaxSizeAutoCommitTest.testRedundantDeletes-seed#[9D7A060317C290F9]) [    ] o.a.s.u.p.LogUpdateProcessorFactory [collection1] {delete=[100 (-1601429504033554438)]} 0 257
   [junit4]   2> 232892 INFO  (TEST-MaxSizeAutoCommitTest.testRedundantDeletes-seed#[9D7A060317C290F9]) [    ] o.a.s.u.p.LogUpdateProcessorFactory [collection1] {delete=[100 (-1601429504033554439)]} 0 257
   [junit4]   2> 232892 INFO  (TEST-MaxSizeAutoCommitTest.testRedundantDeletes-seed#[9D7A060317C290F9]) [    ] o.a.s.u.p.LogUpdateProcessorFactory [collection1] {delete=[100 (-1601429504033554440)]} 0 257
   [junit4]   2> 232892 INFO  (TEST-MaxSizeAutoCommitTest.testRedundantDeletes-seed#[9D7A060317C290F9]) [    ] o.a.s.u.p.LogUpdateProcessorFactory [collection1] {delete=[100 (-1601429504033554441)]} 0 257
   [junit4]   2> 232892 INFO  (TEST-MaxSizeAutoCommitTest.testRedundantDeletes-seed#[9D7A060317C290F9]) [    ] o.a.s.u.p.LogUpdateProcessorFactory [collection1] {delete=[100 (-1601429504033554442)]} 0 257
   [junit4]   2> 232893 INFO  (TEST-MaxSizeAutoCommitTest.testRedundantDeletes-seed#[9D7A060317C290F9]) [    ] o.a.s.u.p.LogUpdateProcessorFactory [collection1] {delete=[100 (-1601429504033554443)]} 0 258
   [junit4]   2> 232893 INFO  (TEST-MaxSizeAutoCommitTest.testRedundantDeletes-seed#[9D7A060317C290F9]) [    ] o.a.s.u.p.LogUpdateProcessorFactory [collection1] {delete=[100 (-1601429504034603008)]} 0 258
   [junit4]   2> 232893 INFO  (TEST-MaxSizeAutoCommitTest.testRedundantDeletes-seed#[9D7A060317C290F9]) [    ] o.a.s.u.p.LogUpdateProcessorFactory [collection1] {delete=[100 (-1601429504034603009)]} 0 258
   [junit4]   2> 232893 INFO  (TEST-MaxSizeAutoCommitTest.testRedundantDeletes-seed#[9D7A060317C290F9]) [    ] o.a.s.u.p.LogUpdateProcessorFactory [collection1] {delete=[100 (-1601429504034603010)]} 0 258
   [junit4]   2> 232893 INFO  (TEST-MaxSizeAutoCommitTest.testRedundantDeletes-seed#[9D7A060317C290F9]) [    ] o.a.s.u.p.LogUpdateProcessorFactory [collection1] {delete=[100 (-1601429504034603011)]} 0 258
   [junit4]   2> 232893 INFO  (TEST-MaxSizeAutoCommitTest.testRedundantDeletes-seed#[9D7A060317C290F9]) [    ] o.a.s.u.p.LogUpdateProcessorFactory [collection1] {delete=[100 (-1601429504034603012)]} 0 258
   [junit4]   2> 232893 INFO  (TEST-MaxSizeAutoCommitTest.testRedundantDeletes-seed#[9D7A060317C290F9]) [    ] o.a.s.u.p.LogUpdateProcessorFactory [collection1] {delete=[100 (-1601429504034603013)]} 0 258
   [junit4]   2> 232893 INFO  (TEST-MaxSizeAutoCommitTest.testRedundantDeletes-seed#[9D7A060317C290F9]) [    ] o.a.s.u.p.LogUpdateProcessorFactory [collection1] {delete=[100 (-1601429504034603014)]} 0 258
   [junit4]   2> 232893 INFO  (TEST-MaxSizeAutoCommitTest.testRedundantDeletes-seed#[9D7A060317C290F9]) [    ] o.a.s.u.p.LogUpdateProcessorFactory [collection1] {delete=[100 (-1601429504034603015)]} 0 258
   [junit4]   2> 232894 INFO  (TEST-MaxSizeAutoCommitTest.testRedundantDeletes-seed#[9D7A060317C290F9]) [    ] o.a.s.u.p.LogUpdateProcessorFactory [collection1] {delete=[100 (-1601429504035651584)]} 0 259
   [junit4]   2> 232894 INFO  (TEST-MaxSizeAutoCommitTest.testRedundantDeletes-seed#[9D7A060317C290F9]) [    ] o.a.s.u.p.LogUpdateProcessorFactory [collection1] {delete=[100 (-1601429504035651585)]} 0 259
   [junit4]   2> 232894 INFO  (TEST-MaxSizeAutoCommitTest.testRedundantDeletes-seed#[9D7A060317C290F9]) [    ] o.a.s.u.p.LogUpdateProcessorFactory [collection1] {delete=[100 (-1601429504035651586)]} 0 259
   [junit4]   2> 232894 INFO  (TEST-MaxSizeAutoCommitTest.testRedundantDeletes-seed#[9D7A060317C290F9]) [    ] o.a.s.u.p.LogUpdateProcessorFactory [collection1] {delete=[100 (-1601429504035651587)]} 0 259
   [junit4]   2> 232894 INFO  (TEST-MaxSizeAutoCommitTest.testRedundantDeletes-seed#[9D7A060317C290F9]) [    ] o.a.s.u.p.LogUpdateProcessorFactory [collection1] {delete=[100 (-1601429504035651588)]} 0 259
   [junit4]   2> 232894 INFO  (TEST-MaxSizeAutoCommitTest.testRedundantDeletes-seed#[9D7A060317C290F9]) [    ] o.a.s.u.p.LogUpdateProcessorFactory [collection1] {delete=[100 (-1601429504035651589)]} 0 259
   [junit4]   2> 232894 INFO  (TEST-MaxSizeAutoCommitTest.testRedundantDeletes-seed#[9D7A060317C290F9]) [    ] o.a.s.u.p.LogUpdateProcessorFactory [collection1] {delete=[100 (-1601429504035651590)]} 0 259
   [junit4]   2> 232894 INFO  (TEST-MaxSizeAutoCommitTest.testRedundantDeletes-seed#[9D7A060317C290F9]) [    ] o.a.s.u.p.LogUpdateProcessorFactory [collection1] {delete=[100 (-1601429504035651591)]} 0 259
   [junit4]   2> 232894 INFO  (TEST-MaxSizeAutoCommitTest.testRedundantDeletes-seed#[9D7A060317C290F9]) [    ] o.a.s.u.p.LogUpdateProcessorFactory [collection1] {delete=[100 (-1601429504035651592)]} 0 259
   [junit4]   2> 232894 INFO  (TEST-MaxSizeAutoCommitTest.testRedundantDeletes-seed#[9D7A060317C290F9]) [    ] o.a.s.u.p.LogUpdateProcessorFactory [collection1] {delete=[100 (-1601429504035651593)]} 0 260
   [junit4]   2> 232895 INFO  (TEST-MaxSizeAutoCommitTest.testRedundantDeletes-seed#[9D7A060317C290F9]) [    ] o.a.s.u.p.LogUpdateProcessorFactory [collection1] {delete=[100 (-1601429504036700160)]} 0 260
   [junit4]   2> 232895 INFO  (TEST-MaxSizeAutoCommitTest.testRedundantDeletes-seed#[9D7A060317C290F9]) [    ] o.a.s.u.p.LogUpdateProcessorFactory [collection1] {delete=[100 (-1601429504036700161)]} 0 260
   [junit4]   2> 232895 INFO  (TEST-MaxSizeAutoCommitTest.testRedundantDeletes-seed#[9D7A060317C290F9]) [    ] o.a.s.u.p.LogUpdateProcessorFactory [collection1] {delete=[100 (-1601429504036700162)]} 0 260
   [junit4]   2> 232895 INFO  (TEST-MaxSizeAutoCommitTest.testRedundantDeletes-seed#[9D7A060317C290F9]) [    ] o.a.s.u.p.LogUpdateProcessorFactory [collection1] {delete=[100 (-1601429504036700163)]} 0 260
   [junit4]   2> 232895 INFO  (TEST-MaxSizeAutoCommitTest.testRedundantDeletes-seed#[9D7A060317C290F9]) [    ] o.a.s.u.p.LogUpdateProcessorFactory [collection1] {delete=[100 (-1601429504036700164)]} 0 260
   [junit4]   2> 232895 INFO  (TEST-MaxSizeAutoCommitTest.testRedundantDeletes-seed#[9D7A060317C290F9]) [    ] o.a.s.u.p.LogUpdateProcessorFactory [collection1] {delete=[100 (-1601429504036700165)]} 0 260
   [junit4]   2> 232895 INFO  (TEST-MaxSizeAutoCommitTest.testRedundantDeletes-seed#[9D7A060317C290F9]) [    ] o.a.s.u.p.LogUpdateProcessorFactory [collection1] {delete=[100 (-1601429504036700166)]} 0 260
   [junit4]   2> 232895 INFO  (TEST-MaxSizeAutoCommitTest.testRedundantDeletes-seed#[9D7A060317C290F9]) [    ] o.a.s.u.p.LogUpdateProcessorFactory [collection1] {delete=[100 (-1601429504036700167)]} 0 260
   [junit4]   2> 232895 INFO  (TEST-MaxSizeAutoCommitTest.testRedundantDeletes-seed#[9D7A060317C290F9]) [    ] o.a.s.u.p.LogUpdateProcessorFactory [collection1] {delete=[100 (-1601429504036700168)]} 0 260
   [junit4]   2> 232895 INFO  (TEST-MaxSizeAutoCommitTest.testRedundantDeletes-seed#[9D7A060317C290F9]) [    ] o.a.s.u.p.LogUpdateProcessorFactory [collection1] {delete=[100 (-1601429504036700169)]} 0 260
   [junit4]   2> 232895 INFO  (TEST-MaxSizeAutoCommitTest.testRedundantDeletes-seed#[9D7A060317C290F9]) [    ] o.a.s.u.p.LogUpdateProcessorFactory [collection1] {delete=[100 (-1601429504036700170)]} 0 260
   [junit4]   2> 232896 INFO  (TEST-MaxSizeAutoCommitTest.testRedundantDeletes-seed#[9D7A060317C290F9]) [    ] o.a.s.u.p.LogUpdateProcessorFactory [collection1] {delete=[100 (-1601429504036700171)]} 0 261
   [junit4]   2> 232896 INFO  (TEST-MaxSizeAutoCommitTest.testRedundantDeletes-seed#[9D7A060317C290F9]) [    ] o.a.s.u.p.LogUpdateProcessorFactory [collection1] {delete=[100 (-1601429504037748736)]} 0 261
   [junit4]   2> 232896 INFO  (TEST-MaxSizeAutoCommitTest.testRedundantDeletes-seed#[9D7A060317C290F9]) [    ] o.a.s.u.p.LogUpdateProcessorFactory [collection1] {delete=[100 (-1601429504037748737)]} 0 261
   [junit4]   2> 232896 INFO  (TEST-MaxSizeAutoCommitTest.testRedundantDeletes-seed#[9D7A060317C290F9]) [    ] o.a.s.u.p.LogUpdateProcessorFactory [collection1] {delete=[100 (-1601429504037748738)]} 0 261
   [junit4]   2> 232896 INFO  (TEST-MaxSizeAutoCommitTest.testRedundantDeletes-seed#[9D7A060317C290F9]) [    ] o.a.s.u.p.LogUpdateProcessorFactory [collection1] {delete=[100 (-1601429504037748739)]} 0 261
   [junit4]   2> 232896 INFO  (TEST-MaxSizeAutoCommitTest.testRedundantDeletes-seed#[9D7A060317C290F9]) [    ] o.a.s.u.p.LogUpdateProcessorFactory [collection1] {delete=[100 (-1601429504037748740)]} 0 261
   [junit4]   2> 232896 INFO  (TEST-MaxSizeAutoCommitTest.testRedundantDeletes-seed#[9D7A060317C290F9]) [    ] o.a.s.u.p.LogUpdateProcessorFactory [collection1] {delete=[100 (-1601429504037748741)]} 0 261
   [junit4]   2> 232896 INFO  (TEST-MaxSizeAutoCommitTest.testRedundantDeletes-seed#[9D7A060317C290F9]) [    ] o.a.s.u.p.LogUpdateProcessorFactory [collection1] {delete=[100 (-1601429504037748742)]} 0 261
   [junit4]   2> 232897 INFO  (commitScheduler-1175-thread-1) [    ] o.a.s.u.DirectUpdateHandler2 start commit{,optimize=false,openSearcher=false,waitSearcher=true,expungeDeletes=false,softCommit=false,prepareCommit=false}
   [junit4]   2> 232897 INFO  (commitScheduler-1175-thread-1) [    ] o.a.s.u.SolrIndexWriter Calling setCommitData with IW:org.apache.solr.update.SolrIndexWriter@124db57 commitCommandVersion:0
   [junit4]   2> 232898 INFO  (commitScheduler-1175-thread-1) [    ] o.a.s.s.SolrIndexSearcher Opening [Searcher@1a98ed92[collection1] realtime]
   [junit4]   2> 232899 INFO  (commitScheduler-1175-thread-1) [    ] o.a.s.u.DirectUpdateHandler2 end_commit_flush
   [junit4]   2> 232947 INFO  (TEST-MaxSizeAutoCommitTest.testRedundantDeletes-seed#[9D7A060317C290F9]) [    ] o.a.s.u.p.LogUpdateProcessorFactory [collection1] {delete=[100 (-1601429504090177536)]} 0 312
   [junit4]   2> 232947 INFO  (TEST-MaxSizeAutoCommitTest.testRedundantDeletes-seed#[9D7A060317C290F9]) [    ] o.a.s.u.p.LogUpdateProcessorFactory [collection1] {delete=[100 (-1601429504091226112)]} 0 312
   [junit4]   2> 232947 INFO  (TEST-MaxSizeAutoCommitTest.testRedundantDeletes-seed#[9D7A060317C290F9]) [    ] o.a.s.u.p.LogUpdateProcessorFactory [collection1] {delete=[100 (-1601429504091226113)]} 0 312
   [junit4]   2> 232947 INFO  (TEST-MaxSizeAutoCommitTest.testRedundantDeletes-seed#[9D7A060317C290F9]) [    ] o.a.s.u.p.LogUpdateProcessorFactory [collection1] {delete=[100 (-1601429504091226114)]} 0 312
   [junit4]   2> 232947 INFO  (TEST-MaxSizeAutoCommitTest.testRedundantDeletes-seed#[9D7A060317C290F9]) [    ] o.a.s.u.p.LogUpdateProcessorFactory [collection1] {delete=[100 (-1601429504091226115)]} 0 312
   [junit4]   2> 232947 INFO  (TEST-MaxSizeAutoCommitTest.testRedundantDeletes-seed#[9D7A060317C290F9]) [    ] o.a.s.u.p.LogUpdateProcessorFactory [collection1] {delete=[100 (-1601429504091226116)]} 0 312
   [junit4]   2> 232947 INFO  (TEST-MaxSizeAutoCommitTest.testRedundantDeletes-seed#[9D7A060317C290F9]) [    ] o.a.s.u.p.LogUpdateProcessorFactory [collection1] {delete=[100 (-1601429504091226117)]} 0 312
   [junit4]   2> 232947 INFO  (TEST-MaxSizeAutoCommitTest.testRedundantDeletes-seed#[9D7A060317C290F9]) [    ] o.a.s.u.p.LogUpdateProcessorFactory [collection1] {delete=[100 (-1601429504091226118)]} 0 312
   [junit4]   2> 232947 INFO  (TEST-MaxSizeAutoCommitTest.testRedundantDeletes-seed#[9D7A060317C290F9]) [    ] o.a.s.u.p.LogUpdateProcessorFactory [collection1] {delete=[100 (-1601429504091226119)]} 0 312
   [junit4]   2> 232947 INFO  (TEST-MaxSizeAutoCommitTest.testRedundantDeletes-seed#[9D7A060317C290F9]) [    ] o.a.s.u.p.LogUpdateProcessorFactory [collection1] {delete=[100 (-1601429504091226120)]} 0 312
   [junit4]   2> 232947 INFO  (TEST-MaxSizeAutoCommitTest.testRedundantDeletes-seed#[9D7A060317C290F9]) [    ] o.a.s.u.p.LogUpdateProcessorFactory [collection1] {delete=[100 (-1601429504091226121)]} 0 312
   [junit4]   2> 232948 INFO  (TEST-MaxSizeAutoCommitTest.testRedundantDeletes-seed#[9D7A060317C290F9]) [    ] o.a.s.u.p.LogUpdateProcessorFactory [collection1] {delete=[100 (-1601429504091226122)]} 0 313
   [junit4]   2> 232948 INFO  (TEST-MaxSizeAutoCommitTest.testRedundantDeletes-seed#[9D7A060317C290F9]) [    ] o.a.s.u.p.LogUpdateProcessorFactory [collection1] {delete=[100 (-1601429504092274688)]} 0 313
   [junit4]   2> 232948 INFO  (TEST-MaxSizeAutoCommitTest.testRedundantDeletes-seed#[9D7A060317C290F9]) [    ] o.a.s.u.p.LogUpdateProcessorFactory [collection1] {delete=[100 (-1601429504092274689)]} 0 313
   [junit4]   2> 232948 INFO  (TEST-MaxSizeAutoCommitTest.testRedundantDeletes-seed#[9D7A060317C290F9]) [    ] o.a.s.u.p.LogUpdateProcessorFactory [collection1] {delete=[100 (-1601429504092274690)]} 0 313
   [junit4]   2> 232948 INFO  (TEST-MaxSizeAutoCommitTest.testRedundantDeletes-seed#[9D7A060317C290F9]) [    ] o.a.s.u.p.LogUpdateProcessorFactory [collection1] {delete=[100 (-1601429504092274691)]} 0 313
   [junit4]   2> 232948 INFO  (TEST-MaxSizeAutoCommitTest.testRedundantDeletes-seed#[9D7A060317C290F9]) [    ] o.a.s.u.p.LogUpdateProcessorFactory [collection1] {delete=[100 (-1601429504092274692)]} 0 313
   [junit4]   2> 232948 INFO  (TEST-MaxSizeAutoCommitTest.testRedundantDeletes-seed#[9D7A060317C290F9]) [    ] o.a.s.u.p.LogUpdateProcessorFactory [collection1] {delete=[100 (-1601429504092274693)]} 0 313
   [junit4]   2> 232948 INFO  (TEST-MaxSizeAutoCommitTest.testRedundantDeletes-seed#[9D7A060317C290F9]) [    ] o.a.s.u.p.LogUpdateProcessorFactory [collection1] {delete=[100 (-1601429504092274694)]} 0 313
   [junit4]   2> 232948 INFO  (TEST-MaxSizeAutoCommitTest.testRedundantDeletes-seed#[9D7A060317C290F9]) [    ] o.a.s.u.p.LogUpdateProcessorFactory [collection1] {delete=[100 (-1601429504092274695)]} 0 313
   [junit4]   2> 232948 INFO  (TEST-MaxSizeAutoCommitTest.testRedundantDeletes-seed#[9D7A060317C290F9]) [    ] o.a.s.u.p.LogUpdateProcessorFactory [collection1] {delete=[100 (-1601429504092274696)]} 0 313
   [junit4]   2> 232948 INFO  (TEST-MaxSizeAutoCommitTest.testRedundantDeletes-seed#[9D7A060317C290F9]) [    ] o.a.s.u.p.LogUpdateProcessorFactory [collection1] {delete=[100 (-1601429504092274697)]} 0 313
   [junit4]   2> 232948 INFO  (TEST-MaxSizeAutoCommitTest.testRedundantDeletes-seed#[9D7A060317C290F9]) [    ] o.a.s.u.p.LogUpdateProcessorFactory [collection1] {delete=[100 (-1601429504092274698)]} 0 313
   [junit4]   2> 232948 INFO  (TEST-MaxSizeAutoCommitTest.testRedundantDeletes-seed#[9D7A060317C290F9]) [    ] o.a.s.u.p.LogUpdateProcessorFactory [collection1] {delete=[100 (-1601429504092274699)]} 0 313
   [junit4]   2> 232948 INFO  (TEST-MaxSizeAutoCommitTest.testRedundantDeletes-seed#[9D7A060317C290F9]) [    ] o.a.s.u.p.LogUpdateProcessorFactory [collection1] {delete=[100 (-1601429504092274700)]} 0 313
   [junit4]   2> 232948 INFO  (TEST-MaxSizeAutoCommitTest.testRedundantDeletes-seed#[9D7A060317C290F9]) [    ] o.a.s.u.p.LogUpdateProcessorFactory [collection1] {delete=[100 (-1601429504092274701)]} 0 313
   [junit4]   2> 232949 INFO  (TEST-MaxSizeAutoCommitTest.testRedundantDeletes-seed#[9D7A060317C290F9]) [    ] o.a.s.u.p.LogUpdateProcessorFactory [collection1] {delete=[100 (-1601429504092274702)]} 0 314
   [junit4]   2> 232949 INFO  (TEST-MaxSizeAutoCommitTest.testRedundantDeletes-seed#[9D7A060317C290F9]) [    ] o.a.s.u.p.LogUpdateProcessorFactory [collection1] {delete=[100 (-1601429504093323264)]} 0 314
   [junit4]   2> 232949 INFO  (TEST-MaxSizeAutoCommitTest.testRedundantDeletes-seed#[9D7A060317C290F9]) [    ] o.a.s.u.p.LogUpdateProcessorFactory [collection1] {delete=[100 (-1601429504093323265)]} 0 314
   [junit4]   2> 232949 INFO  (TEST-MaxSizeAutoCommitTest.testRedundantDeletes-seed#[9D7A060317C290F9]) [    ] o.a.s.u.p.LogUpdateProcessorFactory [collection1] {delete=[100 (-1601429504093323266)]} 0 314
   [junit4]   2> 232949 INFO  (TEST-MaxSizeAutoCommitTest.testRedundantDeletes-seed#[9D7A060317C290F9]) [    ] o.a.s.u.p.LogUpdateProcessorFactory [collection1] {delete=[100 (-1601429504093323267)]} 0 314
   [junit4]   2> 232949 INFO  (TEST-MaxSizeAutoCommitTest.testRedundantDeletes-seed#[9D7A060317C290F9]) [    ] o.a.s.u.p.LogUpdateProcessorFactory [collection1] {delete=[100 (-1601429504093323268)]} 0 314
   [junit4]   2> 232949 INFO  (TEST-MaxSizeAutoCommitTest.testRedundantDeletes-seed#[9D7A060317C290F9]) [    ] o.a.s.u.p.LogUpdateProcessorFactory [collection1] {delete=[100 (-1601429504093323269)]} 0 314
   [junit4]   2> 232949 INFO  (TEST-MaxSizeAutoCommitTest.testRedundantDeletes-seed#[9D7A060317C290F9]) [    ] o.a.s.u.p.LogUpdateProcessorFactory [collection1] {delete=[100 (-1601429504093323270)]} 0 314
   [junit4]   2> 232949 INFO  (TEST-MaxSizeAutoCommitTest.testRedundantDeletes-seed#[9D7A060317C290F9]) [    ] o.a.s.u.p.LogUpdateProcessorFactory [collection1] {delete=[100 (-1601429504093323271)]} 0 314
   [junit4]   2> 232949 INFO  (TEST-MaxSizeAutoCommitTest.testRedundantDeletes-seed#[9D7A060317C290F9]) [    ] o.a.s.u.p.LogUpdateProcessorFactory [collection1] {delete=[100 (-1601429504093323272)]} 0 314
   [junit4]   2> 232949 INFO  (TEST-MaxSizeAutoCommitTest.testRedundantDeletes-seed#[9D7A060317C290F9]) [    ] o.a.s.u.p.LogUpdateProcessorFactory [collection1] {delete=[100 (-1601429504093323273)]} 0 314
   [junit4]   2> 232949 INFO  (TEST-MaxSizeAutoCommitTest.testRedundantDeletes-seed#[9D7A060317C290F9]) [    ] o.a.s.u.p.LogUpdateProcessorFactory [collection1] {delete=[100 (-1601429504093323274)]} 0 314
   [junit4]   2> 232949 INFO  (TEST-MaxSizeAutoCommitTest.testRedundantDeletes-seed#[9D7A060317C290F9]) [    ] o.a.s.u.p.LogUpdateProcessorFactory [collection1] {delete=[100 (-1601429504093323275)]} 0 314
   [junit4]   2> 232949 INFO  (TEST-MaxSizeAutoCommitTest.testRedundantDeletes-seed#[9D7A060317C290F9]) [    ] o.a.s.u.p.LogUpdateProcessorFactory [collection1] {delete=[100 (-1601429504093323276)]} 0 314
   [junit4]   2> 232949 INFO  (TEST-MaxSizeAutoCommitTest.testRedundantDeletes-seed#[9D7A060317C290F9]) [    ] o.a.s.u.p.LogUpdateProcessorFactory [collection1] {delete=[100 (-1601429504093323277)]} 0 314
   [junit4]   2> 232949 INFO  (TEST-MaxSizeAutoCommitTest.testRedundantDeletes-seed#[9D7A060317C290F9]) [    ] o.a.s.u.p.LogUpdateProcessorFactory [collection1] {delete=[100 (-1601429504093323278)]} 0 315
   [junit4]   2> 232950 INFO  (TEST-MaxSizeAutoCommitTest.testRedundantDeletes-seed#[9D7A060317C290F9]) [    ] o.a.s.u.p.LogUpdateProcessorFactory [collection1] {delete=[100 (-1601429504094371840)]} 0 315
   [junit4]   2> 232950 INFO  (TEST-MaxSizeAutoCommitTest.testRedundantDeletes-seed#[9D7A060317C290F9]) [    ] o.a.s.u.p.LogUpdateProcessorFactory [collection1] {delete=[100 (-1601429504094371841)]} 0 315
   [junit4]   2> 232950 INFO  (TEST-MaxSizeAutoCommitTest.testRedundantDeletes-seed#[9D7A060317C290F9]) [    ] o.a.s.u.p.LogUpdateProcessorFactory [collection1] {delete=[100 (-1601429504094371842)]} 0 315
   [junit4]   2> 232950 INFO  (TEST-MaxSizeAutoCommitTest.testRedundantDeletes-seed#[9D7A060317C290F9]) [    ] o.a.s.u.p.LogUpdateProcessorFactory [collection1] {delete=[100 (-1601429504094371843)]} 0 315
   [junit4]   2> 232950 INFO  (TEST-MaxSizeAutoCommitTest.testRedundantDeletes-seed#[9D7A060317C290F9]) [    ] o.a.s.u.p.LogUpdateProcessorFactory [collection1] {delete=[100 (-1601429504094371844)]} 0 315
   [junit4]   2> 232950 INFO  (TEST-MaxSizeAutoCommitTest.testRedundantDeletes-seed#[9D7A060317C290F9]) [    ] o.a.s.u.p.LogUpdateProcessorFactory [collection1] {delete=[100 (-1601429504094371845)]} 0 315
   [junit4]   2> 232950 INFO  (TEST-MaxSizeAutoCommitTest.testRedundantDeletes-seed#[9D7A060317C290F9]) [    ] o.a.s.u.p.LogUpdateProcessorFactory [collection1] {delete=[100 (-1601429504094371846)]} 0 315
   [junit4]   2> 232950 INFO  (TEST-MaxSizeAutoCommitTest.testRedundantDeletes-seed#[9D7A060317C290F9]) [    ] o.a.s.u.p.LogUpdateProcessorFactory [collection1] {delete=[100 (-1601429504094371847)]} 0 315
   [junit4]   2> 232951 INFO  (commitScheduler-1175-thread-1) [    ] o.a.s.u.DirectUpdateHandler2 start commit{,optimize=false,openSearcher=false,waitSearcher=true,expungeDeletes=false,softCommit=false,prepareCommit=false}
   [junit4]   2> 232951 INFO  (commitScheduler-1175-thread-1) [    ] o.a.s.u.SolrIndexWriter Calling setCommitData with IW:org.apache.solr.update.SolrIndexWriter@124db57 commitCommandVersion:0
   [junit4]   2> 232952 INFO  (commitScheduler-1175-thread-1) [    ] o.a.s.s.SolrIndexSearcher Opening [Searcher@1a5ad7ac[collection1] realtime]
   [junit4]   2> 232953 INFO  (commitScheduler-1175-thread-1) [    ] o.a.s.u.DirectUpdateHandler2 end_commit_flush
   [junit4]   2> 233001 INFO  (TEST-MaxSizeAutoCommitTest.testRedundantDeletes-seed#[9D7A060317C290F9]) [    ] o.a.s.u.p.LogUpdateProcessorFactory [collection1] {delete=[100 (-1601429504146800640)]} 0 366
   [junit4]   2> 233001 INFO  (TEST-MaxSizeAutoCommitTest.testRedundantDeletes-seed#[9D7A060317C290F9]) [    ] o.a.s.u.p.LogUpdateProcessorFactory [collection1] {delete=[100 (-1601429504147849216)]} 0 366
   [junit4]   2> 233001 INFO  (TEST-MaxSizeAutoCommitTest.testRedundantDeletes-seed#[9D7A060317C290F9]) [    ] o.a.s.u.p.LogUpdateProcessorFactory [collection1] {delete=[100 (-1601429504147849217)]} 0 366
   [junit4]   2> 233001 INFO  (TEST-MaxSizeAutoCommitTest.testRedundantDeletes-seed#[9D7A060317C290F9]) [    ] o.a.s.u.p.LogUpdateProcessorFactory [collection1] {delete=[100 (-1601429504147849218)]} 0 366
   [junit4]   2> 233001 INFO  (TEST-MaxSizeAutoCommitTest.testRedundantDeletes-seed#[9D7A060317C290F9]) [    ] o.a.s.u.p.LogUpdateProcessorFactory [collection1] {delete=[100 (-1601429504147849219)]} 0 366
   [junit4]   2> 233001 INFO  (TEST-MaxSizeAutoCommitTest.testRedundantDeletes-seed#[9D7A060317C290F9]) [    ] o.a.s.u.p.LogUpdateProcessorFactory [collection1] {delete=[100 (-1601429504147849220)]} 0 366
   [junit4]   2> 233001 INFO  (TEST-MaxSizeAutoCommitTest.testRedundantDeletes-seed#[9D7A060317C290F9]) [    ] o.a.s.u.p.LogUpdateProcessorFactory [collection1] {delete=[100 (-1601429504147849221)]} 0 366
   [junit4]   2> 233001 INFO  (TEST-MaxSizeAutoCommitTest.testRedundantDeletes-seed#[9D7A060317C290F9]) [    ] o.a.s.u.p.LogUpdateProcessorFactory [collection1] {delete=[100 (-1601429504147849222)]} 0 366
   [junit4]   2> 233001 INFO  (TEST-MaxSizeAutoCommitTest.testRedundantDeletes-seed#[9D7A060317C290F9]) [    ] o.a.s.u.p.LogUpdateProcessorFactory [collection1] {delete=[100 (-1601429504147849223)]} 0 366
   [junit4]   2> 233001 INFO  (TEST-MaxSizeAutoCommitTest.testRedundantDeletes-seed#[9D7A060317C290F9]) [    ] o.a.s.u.p.LogUpdateProcessorFactory [collection1] {delete=[100 (-1601429504147849224)]} 0 366
   [junit4]   2> 233001 INFO  (TEST-MaxSizeAutoCommitTest.testRedundantDeletes-seed#[9D7A060317C290F9]) [    ] o.a.s.u.p.LogUpdateProcessorFactory [collection1] {delete=[100 (-1601429504147849225)]} 0 366
   [junit4]   2> 233001 INFO  (TEST-MaxSizeAutoCommitTest.testRedundantDeletes-seed#[9D7A060317C290F9]) [    ] o.a.s.u.p.LogUpdateProcessorFactory [collection1] {delete=[100 (-1601429504147849226)]} 0 366
   [junit4]   2> 233002 INFO  (TEST-MaxSizeAutoCommitTest.testRedundantDeletes-seed#[9D7A060317C290F9]) [    ] o.a.s.u.p.LogUpdateProcessorFactory [collection1] {delete=[100 (-1601429504147849227)]} 0 367
   [junit4]   2> 233002 INFO  (TEST-MaxSizeAutoCommitTest.testRedundantDeletes-seed#[9D7A060317C290F9]) [    ] o.a.s.u.p.LogUpdateProcessorFactory [collection1] {delete=[100 (-1601429504148897792)]} 0 367
   [junit4]   2> 233002 INFO  (TEST-MaxSizeAutoCommitTest.testRedundantDeletes-seed#[9D7A060317C290F9]) [    ] o.a.s.u.p.LogUpdateProcessorFactory [collection1] {delete=[100 (-1601429504148897793)]} 0 367
   [junit4]   2> 233002 INFO  (TEST-MaxSizeAutoCommitTest.testRedundantDeletes-seed#[9D7A060317C290F9]) [    ] o.a.s.u.p.LogUpdateProcessorFactory [collection1] {delete=[100 (-1601429504148897794)]} 0 367
   [junit4]   2> 233002 INFO  (TEST-MaxSizeAutoCommitTest.testRedundantDeletes-seed#[9D7A060317C290F9]) [    ] o.a.s.u.p.LogUpdateProcessorFactory [collection1] {delete=[100 (-1601429504148897795)]} 0 367
   [junit4]   2> 233002 INFO  (TEST-MaxSizeAutoCommitTest.testRedundantDeletes-seed#[9D7A060317C290F9]) [    ] o.a.s.u.p.LogUpdateProcessorFactory [collection1] {delete=[100 (-1601429504148897796)]} 0 367
   [junit4]   2> 233002 INFO  (TEST-MaxSizeAutoCommitTest.testRedundantDeletes-seed#[9D7A060317C290F9]) [    ] o.a.s.u.p.LogUpdateProcessorFactory [collection1] {delete=[100 (-1601429504148897797)]} 0 367
   [junit4]   2> 233002 INFO  (TEST-MaxSizeAutoCommitTest.testRedundantDeletes-seed#[9D7A060317C290F9]) [    ] o.a.s.u.p.LogUpdateProcessorFactory [collection1] {delete=[100 (-1601429504148897798)]} 0 367
   [junit4]   2> 233002 INFO  (TEST-MaxSizeAutoCommitTest.testRedundantDeletes-seed#[9D7A060317C290F9]) [    ] o.a.s.u.p.LogUpdateProcessorFactory [collection1] {delete=[100 (-1601429504148897799)]} 0 367
   [junit4]   2> 233002 INFO  (TEST-MaxSizeAutoCommitTest.testRedundantDeletes-seed#[9D7A060317C290F9]) [    ] o.a.s.u.p.LogUpdateProcessorFactory [collection1] {delete=[100 (-1601429504148897800)]} 0 367
   [junit4]   2> 233002 INFO  (TEST-MaxSizeAutoCommitTest.testRedundantDeletes-seed#[9D7A060317C290F9]) [    ] o.a.s.u.p.LogUpdateProcessorFactory [collection1] {delete=[100 (-1601429504148897801)]} 0 367
   [junit4]   2> 233002 INFO  (TEST-MaxSizeAutoCommitTest.testRedundantDeletes-seed#[9D7A060317C290F9]) [    ] o.a.s.u.p.LogUpdateProcessorFactory [collection1] {delete=[100 (-1601429504148897802)]} 0 367
   [junit4]   2> 233002 INFO  (TEST-MaxSizeAutoCommitTest.testRedundantDeletes-seed#[9D7A060317C290F9]) [    ] o.a.s.u.p.LogUpdateProcessorFactory [collection1] {delete=[100 (-1601429504148897803)]} 0 367
   [junit4]   2> 233002 INFO  (TEST-MaxSizeAutoCommitTest.testRedundantDeletes-seed#[9D7A060317C290F9]) [    ] o.a.s.u.p.LogUpdateProcessorFactory [collection1] {delete=[100 (-1601429504148897804)]} 0 367
   [junit4]   2> 233002 INFO  (TEST-MaxSizeAutoCommitTest.testRedundantDeletes-seed#[9D7A060317C290F9]) [    ] o.a.s.u.p.LogUpdateProcessorFactory [collection1] {delete=[100 (-1601429504148897805)]} 0 367
   [junit4]   2> 233002 INFO  (TEST-MaxSizeAutoCommitTest.testRedundantDeletes-seed#[9D7A060317C290F9]) [    ] o.a.s.u.p.LogUpdateProcessorFactory [collection1] {delete=[100 (-1601429504148897806)]} 0 367
   [junit4]   2> 233002 INFO  (TEST-MaxSizeAutoCommitTest.testRedundantDeletes-seed#[9D7A060317C290F9]) [    ] o.a.s.u.p.LogUpdateProcessorFactory [collection1] {delete=[100 (-1601429504148897807)]} 0 367
   [junit4]   2> 233002 INFO  (TEST-MaxSizeAutoCommitTest.testRedundantDeletes-seed#[9D7A060317C290F9]) [    ] o.a.s.u.p.LogUpdateProcessorFactory [collection1] {delete=[100 (-1601429504148897808)]} 0 368
   [junit4]   2> 233003 INFO  (TEST-MaxSizeAutoCommitTest.testRedundantDeletes-seed#[9D7A060317C290F9]) [    ] o.a.s.u.p.LogUpdateProcessorFactory [collection1] {delete=[100 (-1601429504149946368)]} 0 368
   [junit4]   2> 233003 INFO  (TEST-MaxSizeAutoCommitTest.testRedundantDeletes-seed#[9D7A060317C290F9]) [    ] o.a.s.u.p.LogUpdateProcessorFactory [collection1] {delete=[100 (-1601429504149946369)]} 0 368
   [junit4]   2> 233003 INFO  (TEST-MaxSizeAutoCommitTest.testRedundantDeletes-seed#[9D7A060317C290F9]) [    ] o.a.s.u.p.LogUpdateProcessorFactory [collection1] {delete=[100 (-1601429504149946370)]} 0 368
   [junit4]   2> 233003 INFO  (TEST-MaxSizeAutoCommitTest.testRedundantDeletes-seed#[9D7A060317C290F9]) [    ] o.a.s.u.p.LogUpdateProcessorFactory [collection1] {delete=[100 (-1601429504149946371)]} 0 368
   [junit4]   2> 233003 INFO  (TEST-MaxSizeAutoCommitTest.testRedundantDeletes-seed#[9D7A060317C290F9]) [    ] o.a.s.u.p.LogUpdateProcessorFactory [collection1] {delete=[100 (-1601429504149946372)]} 0 368
   [junit4]   2> 233003 INFO  (TEST-MaxSizeAutoCommitTest.testRedundantDeletes-seed#[9D7A060317C290F9]) [    ] o.a.s.u.p.LogUpdateProcessorFactory [collection1] {delete=[100 (-1601429504149946373)]} 0 368
   [junit4]   2> 233003 INFO  (TEST-MaxSizeAutoCommitTest.testRedundantDeletes-seed#[9D7A060317C290F9]) [    ] o.a.s.u.p.LogUpdateProcessorFactory [collection1] {delete=[100 (-1601429504149946374)]} 0 368
   [junit4]   2> 233003 INFO  (TEST-MaxSizeAutoCommitTest.testRedundantDeletes-seed#[9D7A060317C290F9]) [    ] o.a.s.u.p.LogUpdateProcessorFactory [collection1] {delete=[100 (-1601429504149946375)]} 0 368
   [junit4]   2> 233003 INFO  (TEST-MaxSizeAutoCommitTest.testRedundantDeletes-seed#[9D7A060317C290F9]) [    ] o.a.s.u.p.LogUpdateProcessorFactory [collection1] {delete=[100 (-1601429504149946376)]} 0 368
   [junit4]   2> 233003 INFO  (TEST-MaxSizeAutoCommitTest.testRedundantDeletes-seed#[9D7A060317C290F9]) [    ] o.a.s.u.p.LogUpdateProcessorFactory [collection1] {delete=[100 (-1601429504149946377)]} 0 368
   [junit4]   2> 233003 INFO  (TEST-MaxSizeAutoCommitTest.testRedundantDeletes-seed#[9D7A060317C290F9]) [    ] o.a.s.u.p.LogUpdateProcessorFactory [collection1] {delete=[100 (-1601429504149946378)]} 0 368
   [junit4]   2> 233003 INFO  (TEST-MaxSizeAutoCommitTest.testRedundantDeletes-seed#[9D7A060317C290F9]) [    ] o.a.s.u.p.LogUpdateProcessorFactory [collection1] {delete=[100 (-1601429504149946379)]} 0 368
   [junit4]   2> 233003 INFO  (TEST-MaxSizeAutoCommitTest.testRedundantDeletes-seed#[9D7A060317C290F9]) [    ] o.a.s.u.p.LogUpdateProcessorFactory [collection1] {delete=[100 (-1601429504149946380)]} 0 368
   [junit4]   2> 233003 INFO  (TEST-MaxSizeAutoCommitTest.testRedundantDeletes-seed#[9D7A060317C290F9]) [    ] o.a.s.u.p.LogUpdateProcessorFactory [collection1] {delete=[100 (-1601429504149946381)]} 0 368
   [junit4]   2> 233003 INFO  (TEST-MaxSizeAutoCommitTest.testRedundantDeletes-seed#[9D7A060317C290F9]) [    ] o.a.s.u.p.LogUpdateProcessorFactory [collection1] {delete=[100 (-1601429504149946382)]} 0 368
   [junit4]   2> 233003 INFO  (TEST-MaxSizeAutoCommitTest.testRedundantDeletes-seed#[9D7A060317C290F9]) [    ] o.a.s.u.p.LogUpdateProcessorFactory [collection1] {delete=[100 (-1601429504149946383)]} 0 368
   [junit4]   2> 233003 INFO  (TEST-MaxSizeAutoCommitTest.testRedundantDeletes-seed#[9D7A060317C290F9]) [    ] o.a.s.u.p.LogUpdateProcessorFactory [collection1] {delete=[100 (-1601429504149946384)]} 0 369
   [junit4]   2> 233004 INFO  (TEST-MaxSizeAutoCommitTest.testRedundantDeletes-seed#[9D7A060317C290F9]) [    ] o.a.s.u.p.LogUpdateProcessorFactory [collection1] {delete=[100 (-1601429504150994944)]} 0 369
   [junit4]   2> 233004 INFO  (TEST-MaxSizeAutoCommitTest.testRedundantDeletes-seed#[9D7A060317C290F9]) [    ] o.a.s.u.p.LogUpdateProcessorFactory [collection1] {delete=[100 (-1601429504150994945)]} 0 369
   [junit4]   2> 233004 INFO  (TEST-MaxSizeAutoCommitTest.testRedundantDeletes-seed#[9D7A060317C290F9]) [    ] o.a.s.u.p.LogUpdateProcessorFactory [collection1] {delete=[100 (-1601429504150994946)]} 0 369
   [junit4]   2> 233005 INFO  (commitScheduler-1175-thread-1) [    ] o.a.s.u.DirectUpdateHandler2 start commit{,optimize=false,openSearcher=false,waitSearcher=true,expungeDeletes=false,softCommit=false,prepareCommit=false}
   [junit4]   2> 233005 INFO  (commitScheduler-1175-thread-1) [    ] o.a.s.u.SolrIndexWriter Calling setCommitData with IW:org.apache.solr.update.SolrIndexWriter@124db57 commitCommandVersion:0
   [junit4]   2> 233006 INFO  (commitScheduler-1175-thread-1) [    ] o.a.s.s.SolrIndexSearcher Opening [Searcher@e3be826[collection1] realtime]
   [junit4]   2> 233007 INFO  (commitScheduler-1175-thread-1) [    ] o.a.s.u.DirectUpdateHandler2 end_commit_flush
   [junit4]   2> 233054 INFO  (TEST-MaxSizeAutoCommitTest.testRedundantDeletes-seed#[9D7A060317C290F9]) [    ] o.a.s.u.p.LogUpdateProcessorFactory [collection1] {delete=[100 (-1601429504203423744)]} 0 419
   [junit4]   2> 233055 INFO  (TEST-MaxSizeAutoCommitTest.testRedundantDeletes-seed#[9D7A060317C290F9]) [    ] o.a.s.u.p.LogUpdateProcessorFactory [collection1] {delete=[100 (-1601429504204472320)]} 0 420
   [junit4]   2> 233055 INFO  (TEST-MaxSizeAutoCommitTest.testRedundantDeletes-seed#[9D7A060317C290F9]) [    ] o.a.s.u.p.LogUpdateProcessorFactory [collection1] {delete=[100 (-1601429504204472321)]} 0 420
   [junit4]   2> 233055 INFO  (TEST-MaxSizeAutoCommitTest.testRedundantDeletes-seed#[9D7A060317C290F9]) [    ] o.a.s.u.p.LogUpdateProcessorFactory [collection1] {delete=[100 (-1601429504204472322)]} 0 420
   [junit4]   2> 233055 INFO  (TEST-MaxSizeAutoCommitTest.testRedundantDeletes-seed#[9D7A060317C290F9]) [    ] o.a.s.u.p.LogUpdateProcessorFactory [collection1] {delete=[100 (-1601429504204472323)]} 0 420
   [junit4]   2> 233055 INFO  (TEST-MaxSizeAutoCommitTest.testRedundantDeletes-seed#[9D7A060317C290F9]) [    ] o.a.s.u.p.LogUpdateProcessorFactory [collection1] {delete=[100 (-1601429504204472324)]} 0 420
   [junit4]   2> 233055 INFO  (TEST-MaxSizeAutoCommitTest.testRedundantDeletes-seed#[9D7A060317C290F9]) [    ] o.a.s.u.p.LogUpdateProcessorFactory [collection1] {delete=[100 (-1601429504204472325)]} 0 420
   [junit4]   2> 233055 INFO  (TEST-MaxSizeAutoCommitTest.testRedundantDeletes-seed#[9D7A060317C290F9]) [    ] o.a.s.u.p.LogUpdateProcessorFactory [collection1] {delete=[100 (-1601429504204472326)]} 0 420
   [junit4]   2> 233055 INFO  (TEST-MaxSizeAutoCommitTest.testRedundantDeletes-seed#[9D7A060317C290F9]) [    ] o.a.s.u.p.LogUpdateProcessorFactory [collection1] {delete=[100 (-1601429504204472327)]} 0 420
   [junit4]   2> 233055 INFO  (TEST-MaxSizeAutoCommitTest.testRedundantDeletes-seed#[9D7A060317C290F9]) [    ] o.a.s.u.p.LogUpdateProcessorFactory [collection1] {delete=[100 (-1601429504204472328)]} 0 420
   [junit4]   2> 233055 INFO  (TEST-MaxSizeAutoCommitTest.testRedundantDeletes-seed#[9D7A060317C290F9]) [    ] o.a.s.u.p.LogUpdateProcessorFactory [collection1] {delete=[100 (-1601429504204472329)]} 0 420
   [junit4]   2> 233055 INFO  (TEST-MaxSizeAutoCommitTest.testRedundantDeletes-seed#[9D7A060317C290F9]) [    ] o.a.s.u.p.LogUpdateProcessorFactory [collection1] {delete=[100 (-1601429504204472330)]} 0 420
   [junit4]   2> 233055 INFO  (TEST-MaxSizeAutoCommitTest.testRedundantDeletes-seed#[9D7A060317C290F9]) [    ] o.a.s.u.p.LogUpdateProcessorFactory [collection1] {delete=[100 (-1601429504204472331)]} 0 420
   [junit4]   2> 233055 INFO  (TEST-MaxSizeAutoCommitTest.testRedundantDeletes-seed#[9D7A060317C290F9]) [    ] o.a.s.u.p.LogUpdateProcessorFactory [collection1] {delete=[100 (-1601429504204472332)]} 0 420
   [junit4]   2> 233055 INFO  (TEST-MaxSizeAutoCommitTest.testRedundantDeletes-seed#[9D7A060317C290F9]) [    ] o.a.s.u.p.LogUpdateProcessorFactory [collection1] {delete=[100 (-1601429504204472333)]} 0 420
   [junit4]   2> 233055 INFO  (TEST-MaxSizeAutoCommitTest.testRedundantDeletes-seed#[9D7A060317C290F9]) [    ] o.a.s.u.p.LogUpdateProcessorFactory [collection1] {delete=[100 (-1601429504204472334)]} 0 420
   [junit4]   2> 233056 INFO  (TEST-MaxSizeAutoCommitTest.testRedundantDeletes-seed#[9D7A060317C290F9]) [    ] o.a.s.u.p.LogUpdateProcessorFactory [collection1] {delete=[100 (-1601429504204472335)]} 0 421
   [junit4]   2> 233056 INFO  (TEST-MaxSizeAutoCommitTest.testRedundantDeletes-seed#[9D7A060317C290F9]) [    ] o.a.s.u.p.LogUpdateProcessorFactory [collection1] {delete=[100 (-1601429504205520896)]} 0 421
   [junit4]   2> 233056 INFO  (TEST-MaxSizeAutoCommitTest.testRedundantDeletes-seed#[9D7A060317C290F9]) [    ] o.a.s.u.p.LogUpdateProcessorFactory [collection1] {delete=[100 (-1601429504205520897)]} 0 421
   [junit4]   2> 233056 INFO  (TEST-MaxSizeAutoCommitTest.testRedundantDeletes-seed#[9D7A060317C290F9]) [    ] o.a.s.u.p.LogUpdateProcessorFactory [collection1] {delete=[100 (-1601429504205520898)]} 0 421
   [junit4]   2> 233056 INFO  (TEST-MaxSizeAutoCommitTest.testRedundantDeletes-seed#[9D7A060317C290F9]) [    ] o.a.s.u.p.LogUpdateProcessorFactory [collection1] {delete=[100 (-1601429504205520899)]} 0 421
   [junit4]   2> 233056 INFO  (TEST-MaxSizeAutoCommitTest.testRedundantDeletes-seed#[9D7A060317C290F9]) [    ] o.a.s.u.p.LogUpdateProcessorFactory [collection1] {delete=[100 (-1601429504205520900)]} 0 421
   [junit4]   2> 233056 INFO  (TEST-MaxSizeAutoCommitTest.testRedundantDeletes-seed#[9D7A060317C290F9]) [    ] o.a.s.u.p.LogUpdateProcessorFactory [collection1] {delete=[100 (-1601429504205520901)]} 0 421
   [junit4]   2> 233056 INFO  (TEST-MaxSizeAutoCommitTest.testRedundantDeletes-seed#[9D7A060317C290F9]) [    ] o.a.s.u.p.LogUpdateProcessorFactory [collection1] {delete=[100 (-1601429504205520902)]} 0 421
   [junit4]   2> 233056 INFO  (TEST-MaxSizeAutoCommitTest.testRedundantDeletes-seed#[9D7A060317C290F9]) [    ] o.a.s.u.p.LogUpdateProcessorFactory [collection1] {delete=[100 (-1601429504205520903)]} 0 421
   [junit4]   2> 233056 INFO  (TEST-MaxSizeAutoCommitTest.testRedundantDeletes-seed#[9D7A060317C290F9]) [    ] o.a.s.u.p.LogUpdateProcessorFactory [collection1] {delete=[100 (-1601429504205520904)]} 0 421
   [junit4]   2> 233056 INFO  (TEST-MaxSizeAutoCommitTest.testRedundantDeletes-seed#[9D7A060317C290F9]) [    ] o.a.s.u.p.LogUpdateProcessorFactory [collection1] {delete=[100 (-1601429504205520905)]} 0 421
   [junit4]   2> 233056 INFO  (TEST-MaxSizeAutoCommitTest.testRedundantDeletes-seed#[9D7A060317C290F9]) [    ] o.a.s.u.p.LogUpdateProcessorFactory [collection1] {delete=[100 (-1601429504205520906)]} 0 421
   [junit4]   2> 233056 INFO  (TEST-MaxSizeAutoCommitTest.testRedundantD

[...truncated too long message...]

27s J2 | StreamExpressionTest.testSubFacetStream
   [junit4] OK      0.39s J2 | StreamExpressionTest.testRandomStream
   [junit4] OK      3.94s J2 | StreamExpressionTest.testFeaturesSelectionStream
   [junit4] OK      0.29s J2 | StreamExpressionTest.testKnnSearchStream
   [junit4] OK      3.14s J2 | StreamExpressionTest.testSqlStream
   [junit4] OK      1.32s J2 | StreamExpressionTest.testTopicStream
   [junit4] OK      0.21s J2 | StreamExpressionTest.testTimeSeriesStream
   [junit4] OK      0.15s J2 | StreamExpressionTest.testCloudSolrStreamWithZkHost
   [junit4] OK      0.12s J2 | StreamExpressionTest.testFacetStream
   [junit4] OK      0.10s J2 | StreamExpressionTest.testParameterSubstitution
   [junit4] Completed [2/5] on J2 in 34.55s, 19 tests
   [junit4] 
   [junit4] Duplicate suite name used with XML reports: org.apache.solr.client.solrj.io.stream.StreamExpressionTest. This may confuse tools that process XML reports. Set 'ignoreDuplicateSuites' to true to skip this message.
   [junit4] Suite: org.apache.solr.client.solrj.io.stream.StreamExpressionTest
   [junit4] OK      1.57s J1 | StreamExpressionTest.testParallelTopicStream
   [junit4] OK      8.45s J1 | StreamExpressionTest.testBasicTextLogitStream
   [junit4] OK      0.29s J1 | StreamExpressionTest.testNulls
   [junit4] OK      0.50s J1 | StreamExpressionTest.testStatsStream
   [junit4] OK      0.34s J1 | StreamExpressionTest.testCloudSolrStream
   [junit4] OK      1.80s J1 | StreamExpressionTest.testSignificantTermsStream
   [junit4] OK      0.29s J1 | StreamExpressionTest.testTupleStream
   [junit4] OK      0.15s J1 | StreamExpressionTest.testEchoStream
   [junit4] OK      0.15s J1 | StreamExpressionTest.testEvalStream
   [junit4] OK      0.28s J1 | StreamExpressionTest.testSubFacetStream
   [junit4] OK      0.41s J1 | StreamExpressionTest.testRandomStream
   [junit4] OK      4.14s J1 | StreamExpressionTest.testFeaturesSelectionStream
   [junit4] OK      0.31s J1 | StreamExpressionTest.testKnnSearchStream
   [junit4] OK      2.92s J1 | StreamExpressionTest.testSqlStream
   [junit4] OK      1.34s J1 | StreamExpressionTest.testTopicStream
   [junit4] OK      0.15s J1 | StreamExpressionTest.testTimeSeriesStream
   [junit4] OK      0.09s J1 | StreamExpressionTest.testCloudSolrStreamWithZkHost
   [junit4] OK      0.21s J1 | StreamExpressionTest.testFacetStream
   [junit4] OK      0.13s J1 | StreamExpressionTest.testParameterSubstitution
   [junit4] Completed [3/5] on J1 in 36.60s, 19 tests
   [junit4] 
   [junit4] Suite: org.apache.solr.client.solrj.io.stream.StreamExpressionTest
   [junit4] OK      0.43s J2 | StreamExpressionTest.testParallelTopicStream
   [junit4] OK      5.34s J2 | StreamExpressionTest.testBasicTextLogitStream
   [junit4] OK      0.25s J2 | StreamExpressionTest.testNulls
   [junit4] OK      0.19s J2 | StreamExpressionTest.testStatsStream
   [junit4] OK      0.11s J2 | StreamExpressionTest.testCloudSolrStream
   [junit4] OK      0.46s J2 | StreamExpressionTest.testSignificantTermsStream
   [junit4] OK      0.07s J2 | StreamExpressionTest.testTupleStream
   [junit4] OK      0.06s J2 | StreamExpressionTest.testEchoStream
   [junit4] OK      0.06s J2 | StreamExpressionTest.testEvalStream
   [junit4] OK      0.08s J2 | StreamExpressionTest.testSubFacetStream
   [junit4] OK      0.11s J2 | StreamExpressionTest.testRandomStream
   [junit4] OK      3.63s J2 | StreamExpressionTest.testFeaturesSelectionStream
   [junit4] OK      0.11s J2 | StreamExpressionTest.testKnnSearchStream
   [junit4] OK      0.25s J2 | StreamExpressionTest.testSqlStream
   [junit4] OK      1.24s J2 | StreamExpressionTest.testTopicStream
   [junit4] OK      0.10s J2 | StreamExpressionTest.testTimeSeriesStream
   [junit4] OK      0.08s J2 | StreamExpressionTest.testCloudSolrStreamWithZkHost
   [junit4] OK      0.10s J2 | StreamExpressionTest.testFacetStream
   [junit4] OK      0.08s J2 | StreamExpressionTest.testParameterSubstitution
   [junit4] Completed [4/5] on J2 in 17.16s, 19 tests
   [junit4] 
   [junit4] Suite: org.apache.solr.client.solrj.io.stream.StreamExpressionTest
   [junit4] OK      0.32s J0 | StreamExpressionTest.testParallelTopicStream
   [junit4] OK      5.18s J0 | StreamExpressionTest.testBasicTextLogitStream
   [junit4] OK      0.09s J0 | StreamExpressionTest.testNulls
   [junit4] OK      0.10s J0 | StreamExpressionTest.testStatsStream
   [junit4] OK      0.09s J0 | StreamExpressionTest.testCloudSolrStream
   [junit4] OK      0.45s J0 | StreamExpressionTest.testSignificantTermsStream
   [junit4] OK      0.08s J0 | StreamExpressionTest.testTupleStream
   [junit4] OK      0.07s J0 | StreamExpressionTest.testEchoStream
   [junit4] OK      0.07s J0 | StreamExpressionTest.testEvalStream
   [junit4] OK      0.14s J0 | StreamExpressionTest.testSubFacetStream
   [junit4] OK      0.20s J0 | StreamExpressionTest.testRandomStream
   [junit4] OK      2.85s J0 | StreamExpressionTest.testFeaturesSelectionStream
   [junit4] OK      0.10s J0 | StreamExpressionTest.testKnnSearchStream
   [junit4] OK      0.35s J0 | StreamExpressionTest.testSqlStream
   [junit4] OK      1.23s J0 | StreamExpressionTest.testTopicStream
   [junit4] OK      0.16s J0 | StreamExpressionTest.testTimeSeriesStream
   [junit4] OK      0.08s J0 | StreamExpressionTest.testCloudSolrStreamWithZkHost
   [junit4] OK      0.10s J0 | StreamExpressionTest.testFacetStream
   [junit4] OK      0.09s J0 | StreamExpressionTest.testParameterSubstitution
   [junit4] Completed [5/5] on J0 in 18.56s, 19 tests
   [junit4] 
   [junit4] JVM J0:     0.64 ..    54.73 =    54.09s
   [junit4] JVM J1:     0.64 ..    37.81 =    37.17s
   [junit4] JVM J2:     0.64 ..    53.25 =    52.61s
   [junit4] Execution time total: 54 seconds
   [junit4] Tests summary: 5 suites, 95 tests
   [junit4] Could not remove temporary path: /home/jenkins/workspace/Lucene-Solr-master-Linux/solr/build/solr-solrj/test/J2 (java.nio.file.DirectoryNotEmptyException: Remaining files: [/home/jenkins/workspace/Lucene-Solr-master-Linux/solr/build/solr-solrj/test/J2/temp])
   [junit4] Could not remove temporary path: /home/jenkins/workspace/Lucene-Solr-master-Linux/solr/build/solr-solrj/test/J0 (java.nio.file.DirectoryNotEmptyException: Remaining files: [/home/jenkins/workspace/Lucene-Solr-master-Linux/solr/build/solr-solrj/test/J0/temp])
   [junit4] Could not remove temporary path: /home/jenkins/workspace/Lucene-Solr-master-Linux/solr/build/solr-solrj/test/J1 (java.nio.file.DirectoryNotEmptyException: Remaining files: [/home/jenkins/workspace/Lucene-Solr-master-Linux/solr/build/solr-solrj/test/J1/temp])
     [echo] 5 slowest tests:
[junit4:tophints]  78.39s | org.apache.solr.client.solrj.io.stream.StreamDecoratorTest
[junit4:tophints]  41.36s | org.apache.solr.client.solrj.impl.CloudSolrClientTest
[junit4:tophints]  36.98s | org.apache.solr.common.cloud.TestCloudCollectionsListeners
[junit4:tophints]  35.99s | org.apache.solr.common.cloud.TestCollectionStateWatchers
[junit4:tophints]  26.47s | org.apache.solr.client.solrj.io.stream.StreamExpressionTest

-check-totals:

test-nocompile:

BUILD SUCCESSFUL
Total time: 56 seconds
[repro] Failures:
[repro]   0/5 failed: org.apache.solr.client.solrj.io.stream.StreamExpressionTest
[repro]   0/5 failed: org.apache.solr.update.MaxSizeAutoCommitTest
[repro] Exiting with code 0
+ mv lucene/build lucene/build.repro
+ mv solr/build solr/build.repro
+ mv lucene/build.orig lucene/build
+ mv solr/build.orig solr/build
Archiving artifacts
Setting ANT_1_8_2_HOME=/var/lib/jenkins/tools/hudson.tasks.Ant_AntInstallation/ANT_1.8.2
java.lang.InterruptedException: no matches found within 10000
	at hudson.FilePath$34.hasMatch(FilePath.java:2678)
	at hudson.FilePath$34.invoke(FilePath.java:2557)
	at hudson.FilePath$34.invoke(FilePath.java:2547)
	at hudson.FilePath.act(FilePath.java:1047)
	at hudson.FilePath.act(FilePath.java:1025)
	at hudson.FilePath.validateAntFileMask(FilePath.java:2547)
	at hudson.tasks.ArtifactArchiver.perform(ArtifactArchiver.java:243)
	at hudson.tasks.BuildStepCompatibilityLayer.perform(BuildStepCompatibilityLayer.java:81)
	at hudson.tasks.BuildStepMonitor$1.perform(BuildStepMonitor.java:20)
	at hudson.model.AbstractBuild$AbstractBuildExecution.perform(AbstractBuild.java:744)
	at hudson.model.AbstractBuild$AbstractBuildExecution.performAllBuildSteps(AbstractBuild.java:690)
	at hudson.model.Build$BuildExecution.post2(Build.java:186)
	at hudson.model.AbstractBuild$AbstractBuildExecution.post(AbstractBuild.java:635)
	at hudson.model.Run.execute(Run.java:1819)
	at hudson.model.FreeStyleBuild.run(FreeStyleBuild.java:43)
	at hudson.model.ResourceController.execute(ResourceController.java:97)
	at hudson.model.Executor.run(Executor.java:429)
No artifacts found that match the file pattern "**/*.events,heapdumps/**,**/*_pid*.log". Configuration error?
[WARNINGS] Parsing warnings in console log with parser Java Compiler (javac)
Setting ANT_1_8_2_HOME=/var/lib/jenkins/tools/hudson.tasks.Ant_AntInstallation/ANT_1.8.2
Setting ANT_1_8_2_HOME=/var/lib/jenkins/tools/hudson.tasks.Ant_AntInstallation/ANT_1.8.2
<Git Blamer> Using GitBlamer to create author and commit information for all warnings.
<Git Blamer> GIT_COMMIT=0a1de2c4a57d2f67ed7751c3d5cc7cb0250230b2, workspace=/var/lib/jenkins/workspace/Lucene-Solr-master-Linux
[WARNINGS] Computing warning deltas based on reference build #22099
Recording test results
Setting ANT_1_8_2_HOME=/var/lib/jenkins/tools/hudson.tasks.Ant_AntInstallation/ANT_1.8.2
Build step 'Publish JUnit test result report' changed build result to UNSTABLE
Email was triggered for: Unstable (Test Failures)
Sending email for trigger: Unstable (Test Failures)
Setting ANT_1_8_2_HOME=/var/lib/jenkins/tools/hudson.tasks.Ant_AntInstallation/ANT_1.8.2
Setting ANT_1_8_2_HOME=/var/lib/jenkins/tools/hudson.tasks.Ant_AntInstallation/ANT_1.8.2
Setting ANT_1_8_2_HOME=/var/lib/jenkins/tools/hudson.tasks.Ant_AntInstallation/ANT_1.8.2
Setting ANT_1_8_2_HOME=/var/lib/jenkins/tools/hudson.tasks.Ant_AntInstallation/ANT_1.8.2

Mime
View raw message