lucene-dev mailing list archives

Site index · List index
Message view « Date » · « Thread »
Top « Date » · « Thread »
From "Uwe Schindler" <...@thetaphi.de>
Subject RE: [JENKINS] Lucene-Solr-7.x-Solaris (64bit/jdk1.8.0) - Build # 626 - Still Failing!
Date Wed, 16 May 2018 06:41:40 GMT
Sorry was my fault, for some reason I did not catch the demo failure.

Will fix.

Uwe

-----
Uwe Schindler
Achterdiek 19, D-28357 Bremen
http://www.thetaphi.de
eMail: uwe@thetaphi.de

> -----Original Message-----
> From: Policeman Jenkins Server <jenkins@thetaphi.de>
> Sent: Wednesday, May 16, 2018 8:09 AM
> To: dev@lucene.apache.org
> Subject: [JENKINS] Lucene-Solr-7.x-Solaris (64bit/jdk1.8.0) - Build # 626 - Still
> Failing!
> 
> Build: https://jenkins.thetaphi.de/job/Lucene-Solr-7.x-Solaris/626/
> Java: 64bit/jdk1.8.0 -XX:-UseCompressedOops -XX:+UseG1GC
> 
> All tests passed
> 
> Build Log:
> [...truncated 7226 lines...]
>     [javac] Compiling 13 source files to
> /export/home/jenkins/workspace/Lucene-Solr-7.x-
> Solaris/lucene/build/demo/classes/java
>     [javac] /export/home/jenkins/workspace/Lucene-Solr-7.x-
> Solaris/lucene/demo/src/java/org/apache/lucene/demo/xmlparser/FormBa
> sedXmlQueryDemo.java:46: error: cannot find symbol
>     [javac] import
> org.apache.lucene.queryparser.xml.QueryTemplateManager;
>     [javac]                                         ^
>     [javac]   symbol:   class QueryTemplateManager
>     [javac]   location: package org.apache.lucene.queryparser.xml
>     [javac] /export/home/jenkins/workspace/Lucene-Solr-7.x-
> Solaris/lucene/demo/src/java/org/apache/lucene/demo/xmlparser/FormBa
> sedXmlQueryDemo.java:61: error: cannot find symbol
>     [javac]   private QueryTemplateManager queryTemplateManager;
>     [javac]           ^
>     [javac]   symbol:   class QueryTemplateManager
>     [javac]   location: class FormBasedXmlQueryDemo
>     [javac] /export/home/jenkins/workspace/Lucene-Solr-7.x-
> Solaris/lucene/demo/src/java/org/apache/lucene/demo/xmlparser/FormBa
> sedXmlQueryDemo.java:81: error: cannot find symbol
>     [javac]       queryTemplateManager = new QueryTemplateManager(
>     [javac]                                  ^
>     [javac]   symbol:   class QueryTemplateManager
>     [javac]   location: class FormBasedXmlQueryDemo
>     [javac] 3 errors
> 
> BUILD FAILED
> /export/home/jenkins/workspace/Lucene-Solr-7.x-Solaris/build.xml:633: The
> following error occurred while executing this line:
> /export/home/jenkins/workspace/Lucene-Solr-7.x-Solaris/build.xml:577: The
> following error occurred while executing this line:
> /export/home/jenkins/workspace/Lucene-Solr-7.x-Solaris/build.xml:59: The
> following error occurred while executing this line:
> /export/home/jenkins/workspace/Lucene-Solr-7.x-
> Solaris/lucene/build.xml:493: The following error occurred while executing
> this line:
> /export/home/jenkins/workspace/Lucene-Solr-7.x-Solaris/lucene/common-
> build.xml:2264: The following error occurred while executing this line:
> /export/home/jenkins/workspace/Lucene-Solr-7.x-Solaris/lucene/module-
> build.xml:67: The following error occurred while executing this line:
> /export/home/jenkins/workspace/Lucene-Solr-7.x-Solaris/lucene/module-
> build.xml:64: The following error occurred while executing this line:
> /export/home/jenkins/workspace/Lucene-Solr-7.x-Solaris/lucene/common-
> build.xml:551: The following error occurred while executing this line:
> /export/home/jenkins/workspace/Lucene-Solr-7.x-Solaris/lucene/common-
> build.xml:2052: Compile failed; see the compiler error output for details.
> 
> Total time: 10 minutes 43 seconds
> Build step 'Invoke Ant' marked build as failure
> Archiving artifacts
> Setting
> ANT_1_8_2_HOME=/export/home/jenkins/tools/hudson.tasks.Ant_AntInstal
> lation/ANT_1.8.2
> [WARNINGS] Skipping publisher since build result is FAILURE
> Recording test results
> Setting
> ANT_1_8_2_HOME=/export/home/jenkins/tools/hudson.tasks.Ant_AntInstal
> lation/ANT_1.8.2
> Email was triggered for: Failure - Any
> Sending email for trigger: Failure - Any
> Setting
> ANT_1_8_2_HOME=/export/home/jenkins/tools/hudson.tasks.Ant_AntInstal
> lation/ANT_1.8.2
> Setting
> ANT_1_8_2_HOME=/export/home/jenkins/tools/hudson.tasks.Ant_AntInstal
> lation/ANT_1.8.2
> Setting
> ANT_1_8_2_HOME=/export/home/jenkins/tools/hudson.tasks.Ant_AntInstal
> lation/ANT_1.8.2
> Setting
> ANT_1_8_2_HOME=/export/home/jenkins/tools/hudson.tasks.Ant_AntInstal
> lation/ANT_1.8.2


---------------------------------------------------------------------
To unsubscribe, e-mail: dev-unsubscribe@lucene.apache.org
For additional commands, e-mail: dev-help@lucene.apache.org


Mime
View raw message