lucene-dev mailing list archives

Site index · List index
Message view « Date » · « Thread »
Top « Date » · « Thread »
From Policeman Jenkins Server <jenk...@thetaphi.de>
Subject [JENKINS-EA] Lucene-Solr-7.x-Linux (64bit/jdk-11-ea+5) - Build # 1733 - Still Unstable!
Date Mon, 16 Apr 2018 23:35:41 GMT
Build: https://jenkins.thetaphi.de/job/Lucene-Solr-7.x-Linux/1733/
Java: 64bit/jdk-11-ea+5 -XX:+UseCompressedOops -XX:+UseParallelGC

10 tests failed.
FAILED:  org.apache.solr.handler.admin.SegmentsInfoRequestHandlerTest.testSegmentInfos

Error Message:


Stack Trace:
java.lang.AssertionError
	at __randomizedtesting.SeedInfo.seed([D83D5ACC5839E8EE:946ACD73923530BE]:0)
	at org.apache.lucene.index.IndexWriter$ReaderPool.noDups(IndexWriter.java:867)
	at org.apache.lucene.index.IndexWriter$ReaderPool.get(IndexWriter.java:857)
	at org.apache.lucene.index.IndexWriter.numDeletesToMerge(IndexWriter.java:5235)
	at org.apache.lucene.index.LogMergePolicy.sizeDocs(LogMergePolicy.java:153)
	at org.apache.lucene.index.LogDocMergePolicy.size(LogDocMergePolicy.java:44)
	at org.apache.lucene.index.LogMergePolicy.findMerges(LogMergePolicy.java:469)
	at org.apache.solr.handler.admin.SegmentsInfoRequestHandler.getMergeCandidatesNames(SegmentsInfoRequestHandler.java:100)
	at org.apache.solr.handler.admin.SegmentsInfoRequestHandler.getSegmentsInfo(SegmentsInfoRequestHandler.java:59)
	at org.apache.solr.handler.admin.SegmentsInfoRequestHandler.handleRequestBody(SegmentsInfoRequestHandler.java:48)
	at org.apache.solr.handler.RequestHandlerBase.handleRequest(RequestHandlerBase.java:199)
	at org.apache.solr.core.SolrCore.execute(SolrCore.java:2508)
	at org.apache.solr.util.TestHarness.query(TestHarness.java:337)
	at org.apache.solr.util.TestHarness.query(TestHarness.java:319)
	at org.apache.solr.SolrTestCaseJ4.assertQ(SolrTestCaseJ4.java:890)
	at org.apache.solr.handler.admin.SegmentsInfoRequestHandlerTest.testSegmentInfos(SegmentsInfoRequestHandlerTest.java:61)
	at java.base/jdk.internal.reflect.NativeMethodAccessorImpl.invoke0(Native Method)
	at java.base/jdk.internal.reflect.NativeMethodAccessorImpl.invoke(NativeMethodAccessorImpl.java:62)
	at java.base/jdk.internal.reflect.DelegatingMethodAccessorImpl.invoke(DelegatingMethodAccessorImpl.java:43)
	at java.base/java.lang.reflect.Method.invoke(Method.java:564)
	at com.carrotsearch.randomizedtesting.RandomizedRunner.invoke(RandomizedRunner.java:1737)
	at com.carrotsearch.randomizedtesting.RandomizedRunner$8.evaluate(RandomizedRunner.java:934)
	at com.carrotsearch.randomizedtesting.RandomizedRunner$9.evaluate(RandomizedRunner.java:970)
	at com.carrotsearch.randomizedtesting.RandomizedRunner$10.evaluate(RandomizedRunner.java:984)
	at com.carrotsearch.randomizedtesting.rules.SystemPropertiesRestoreRule$1.evaluate(SystemPropertiesRestoreRule.java:57)
	at org.apache.lucene.util.TestRuleSetupTeardownChained$1.evaluate(TestRuleSetupTeardownChained.java:49)
	at org.apache.lucene.util.AbstractBeforeAfterRule$1.evaluate(AbstractBeforeAfterRule.java:45)
	at org.apache.lucene.util.TestRuleThreadAndTestName$1.evaluate(TestRuleThreadAndTestName.java:48)
	at org.apache.lucene.util.TestRuleIgnoreAfterMaxFailures$1.evaluate(TestRuleIgnoreAfterMaxFailures.java:64)
	at org.apache.lucene.util.TestRuleMarkFailure$1.evaluate(TestRuleMarkFailure.java:47)
	at com.carrotsearch.randomizedtesting.rules.StatementAdapter.evaluate(StatementAdapter.java:36)
	at com.carrotsearch.randomizedtesting.ThreadLeakControl$StatementRunner.run(ThreadLeakControl.java:368)
	at com.carrotsearch.randomizedtesting.ThreadLeakControl.forkTimeoutingTask(ThreadLeakControl.java:817)
	at com.carrotsearch.randomizedtesting.ThreadLeakControl$3.evaluate(ThreadLeakControl.java:468)
	at com.carrotsearch.randomizedtesting.RandomizedRunner.runSingleTest(RandomizedRunner.java:943)
	at com.carrotsearch.randomizedtesting.RandomizedRunner$5.evaluate(RandomizedRunner.java:829)
	at com.carrotsearch.randomizedtesting.RandomizedRunner$6.evaluate(RandomizedRunner.java:879)
	at com.carrotsearch.randomizedtesting.RandomizedRunner$7.evaluate(RandomizedRunner.java:890)
	at com.carrotsearch.randomizedtesting.rules.StatementAdapter.evaluate(StatementAdapter.java:36)
	at com.carrotsearch.randomizedtesting.rules.SystemPropertiesRestoreRule$1.evaluate(SystemPropertiesRestoreRule.java:57)
	at org.apache.lucene.util.AbstractBeforeAfterRule$1.evaluate(AbstractBeforeAfterRule.java:45)
	at com.carrotsearch.randomizedtesting.rules.StatementAdapter.evaluate(StatementAdapter.java:36)
	at org.apache.lucene.util.TestRuleStoreClassName$1.evaluate(TestRuleStoreClassName.java:41)
	at com.carrotsearch.randomizedtesting.rules.NoShadowingOrOverridesOnMethodsRule$1.evaluate(NoShadowingOrOverridesOnMethodsRule.java:40)
	at com.carrotsearch.randomizedtesting.rules.NoShadowingOrOverridesOnMethodsRule$1.evaluate(NoShadowingOrOverridesOnMethodsRule.java:40)
	at com.carrotsearch.randomizedtesting.rules.StatementAdapter.evaluate(StatementAdapter.java:36)
	at com.carrotsearch.randomizedtesting.rules.StatementAdapter.evaluate(StatementAdapter.java:36)
	at org.apache.lucene.util.TestRuleAssertionsRequired$1.evaluate(TestRuleAssertionsRequired.java:53)
	at org.apache.lucene.util.TestRuleMarkFailure$1.evaluate(TestRuleMarkFailure.java:47)
	at org.apache.lucene.util.TestRuleIgnoreAfterMaxFailures$1.evaluate(TestRuleIgnoreAfterMaxFailures.java:64)
	at org.apache.lucene.util.TestRuleIgnoreTestSuites$1.evaluate(TestRuleIgnoreTestSuites.java:54)
	at com.carrotsearch.randomizedtesting.rules.StatementAdapter.evaluate(StatementAdapter.java:36)
	at com.carrotsearch.randomizedtesting.ThreadLeakControl$StatementRunner.run(ThreadLeakControl.java:368)
	at java.base/java.lang.Thread.run(Thread.java:841)


FAILED:  org.apache.solr.handler.admin.SegmentsInfoRequestHandlerTest.testSegmentInfosVersion

Error Message:


Stack Trace:
java.lang.AssertionError
	at __randomizedtesting.SeedInfo.seed([D83D5ACC5839E8EE:20E3CF24205539BD]:0)
	at org.apache.lucene.index.IndexWriter$ReaderPool.noDups(IndexWriter.java:867)
	at org.apache.lucene.index.IndexWriter$ReaderPool.get(IndexWriter.java:857)
	at org.apache.lucene.index.IndexWriter.numDeletesToMerge(IndexWriter.java:5235)
	at org.apache.lucene.index.LogMergePolicy.sizeDocs(LogMergePolicy.java:153)
	at org.apache.lucene.index.LogDocMergePolicy.size(LogDocMergePolicy.java:44)
	at org.apache.lucene.index.LogMergePolicy.findMerges(LogMergePolicy.java:469)
	at org.apache.solr.handler.admin.SegmentsInfoRequestHandler.getMergeCandidatesNames(SegmentsInfoRequestHandler.java:100)
	at org.apache.solr.handler.admin.SegmentsInfoRequestHandler.getSegmentsInfo(SegmentsInfoRequestHandler.java:59)
	at org.apache.solr.handler.admin.SegmentsInfoRequestHandler.handleRequestBody(SegmentsInfoRequestHandler.java:48)
	at org.apache.solr.handler.RequestHandlerBase.handleRequest(RequestHandlerBase.java:199)
	at org.apache.solr.core.SolrCore.execute(SolrCore.java:2508)
	at org.apache.solr.util.TestHarness.query(TestHarness.java:337)
	at org.apache.solr.util.TestHarness.query(TestHarness.java:319)
	at org.apache.solr.SolrTestCaseJ4.assertQ(SolrTestCaseJ4.java:890)
	at org.apache.solr.handler.admin.SegmentsInfoRequestHandlerTest.testSegmentInfosVersion(SegmentsInfoRequestHandlerTest.java:68)
	at java.base/jdk.internal.reflect.NativeMethodAccessorImpl.invoke0(Native Method)
	at java.base/jdk.internal.reflect.NativeMethodAccessorImpl.invoke(NativeMethodAccessorImpl.java:62)
	at java.base/jdk.internal.reflect.DelegatingMethodAccessorImpl.invoke(DelegatingMethodAccessorImpl.java:43)
	at java.base/java.lang.reflect.Method.invoke(Method.java:564)
	at com.carrotsearch.randomizedtesting.RandomizedRunner.invoke(RandomizedRunner.java:1737)
	at com.carrotsearch.randomizedtesting.RandomizedRunner$8.evaluate(RandomizedRunner.java:934)
	at com.carrotsearch.randomizedtesting.RandomizedRunner$9.evaluate(RandomizedRunner.java:970)
	at com.carrotsearch.randomizedtesting.RandomizedRunner$10.evaluate(RandomizedRunner.java:984)
	at com.carrotsearch.randomizedtesting.rules.SystemPropertiesRestoreRule$1.evaluate(SystemPropertiesRestoreRule.java:57)
	at org.apache.lucene.util.TestRuleSetupTeardownChained$1.evaluate(TestRuleSetupTeardownChained.java:49)
	at org.apache.lucene.util.AbstractBeforeAfterRule$1.evaluate(AbstractBeforeAfterRule.java:45)
	at org.apache.lucene.util.TestRuleThreadAndTestName$1.evaluate(TestRuleThreadAndTestName.java:48)
	at org.apache.lucene.util.TestRuleIgnoreAfterMaxFailures$1.evaluate(TestRuleIgnoreAfterMaxFailures.java:64)
	at org.apache.lucene.util.TestRuleMarkFailure$1.evaluate(TestRuleMarkFailure.java:47)
	at com.carrotsearch.randomizedtesting.rules.StatementAdapter.evaluate(StatementAdapter.java:36)
	at com.carrotsearch.randomizedtesting.ThreadLeakControl$StatementRunner.run(ThreadLeakControl.java:368)
	at com.carrotsearch.randomizedtesting.ThreadLeakControl.forkTimeoutingTask(ThreadLeakControl.java:817)
	at com.carrotsearch.randomizedtesting.ThreadLeakControl$3.evaluate(ThreadLeakControl.java:468)
	at com.carrotsearch.randomizedtesting.RandomizedRunner.runSingleTest(RandomizedRunner.java:943)
	at com.carrotsearch.randomizedtesting.RandomizedRunner$5.evaluate(RandomizedRunner.java:829)
	at com.carrotsearch.randomizedtesting.RandomizedRunner$6.evaluate(RandomizedRunner.java:879)
	at com.carrotsearch.randomizedtesting.RandomizedRunner$7.evaluate(RandomizedRunner.java:890)
	at com.carrotsearch.randomizedtesting.rules.StatementAdapter.evaluate(StatementAdapter.java:36)
	at com.carrotsearch.randomizedtesting.rules.SystemPropertiesRestoreRule$1.evaluate(SystemPropertiesRestoreRule.java:57)
	at org.apache.lucene.util.AbstractBeforeAfterRule$1.evaluate(AbstractBeforeAfterRule.java:45)
	at com.carrotsearch.randomizedtesting.rules.StatementAdapter.evaluate(StatementAdapter.java:36)
	at org.apache.lucene.util.TestRuleStoreClassName$1.evaluate(TestRuleStoreClassName.java:41)
	at com.carrotsearch.randomizedtesting.rules.NoShadowingOrOverridesOnMethodsRule$1.evaluate(NoShadowingOrOverridesOnMethodsRule.java:40)
	at com.carrotsearch.randomizedtesting.rules.NoShadowingOrOverridesOnMethodsRule$1.evaluate(NoShadowingOrOverridesOnMethodsRule.java:40)
	at com.carrotsearch.randomizedtesting.rules.StatementAdapter.evaluate(StatementAdapter.java:36)
	at com.carrotsearch.randomizedtesting.rules.StatementAdapter.evaluate(StatementAdapter.java:36)
	at org.apache.lucene.util.TestRuleAssertionsRequired$1.evaluate(TestRuleAssertionsRequired.java:53)
	at org.apache.lucene.util.TestRuleMarkFailure$1.evaluate(TestRuleMarkFailure.java:47)
	at org.apache.lucene.util.TestRuleIgnoreAfterMaxFailures$1.evaluate(TestRuleIgnoreAfterMaxFailures.java:64)
	at org.apache.lucene.util.TestRuleIgnoreTestSuites$1.evaluate(TestRuleIgnoreTestSuites.java:54)
	at com.carrotsearch.randomizedtesting.rules.StatementAdapter.evaluate(StatementAdapter.java:36)
	at com.carrotsearch.randomizedtesting.ThreadLeakControl$StatementRunner.run(ThreadLeakControl.java:368)
	at java.base/java.lang.Thread.run(Thread.java:841)


FAILED:  org.apache.solr.handler.admin.SegmentsInfoRequestHandlerTest.testSegmentInfosData

Error Message:


Stack Trace:
java.lang.AssertionError
	at __randomizedtesting.SeedInfo.seed([D83D5ACC5839E8EE:A4947897EED15F71]:0)
	at org.apache.lucene.index.IndexWriter$ReaderPool.noDups(IndexWriter.java:867)
	at org.apache.lucene.index.IndexWriter$ReaderPool.get(IndexWriter.java:857)
	at org.apache.lucene.index.IndexWriter.numDeletesToMerge(IndexWriter.java:5235)
	at org.apache.lucene.index.LogMergePolicy.sizeDocs(LogMergePolicy.java:153)
	at org.apache.lucene.index.LogDocMergePolicy.size(LogDocMergePolicy.java:44)
	at org.apache.lucene.index.LogMergePolicy.findMerges(LogMergePolicy.java:469)
	at org.apache.solr.handler.admin.SegmentsInfoRequestHandler.getMergeCandidatesNames(SegmentsInfoRequestHandler.java:100)
	at org.apache.solr.handler.admin.SegmentsInfoRequestHandler.getSegmentsInfo(SegmentsInfoRequestHandler.java:59)
	at org.apache.solr.handler.admin.SegmentsInfoRequestHandler.handleRequestBody(SegmentsInfoRequestHandler.java:48)
	at org.apache.solr.handler.RequestHandlerBase.handleRequest(RequestHandlerBase.java:199)
	at org.apache.solr.core.SolrCore.execute(SolrCore.java:2508)
	at org.apache.solr.util.TestHarness.query(TestHarness.java:337)
	at org.apache.solr.util.TestHarness.query(TestHarness.java:319)
	at org.apache.solr.SolrTestCaseJ4.assertQ(SolrTestCaseJ4.java:890)
	at org.apache.solr.handler.admin.SegmentsInfoRequestHandlerTest.testSegmentInfosData(SegmentsInfoRequestHandlerTest.java:75)
	at java.base/jdk.internal.reflect.NativeMethodAccessorImpl.invoke0(Native Method)
	at java.base/jdk.internal.reflect.NativeMethodAccessorImpl.invoke(NativeMethodAccessorImpl.java:62)
	at java.base/jdk.internal.reflect.DelegatingMethodAccessorImpl.invoke(DelegatingMethodAccessorImpl.java:43)
	at java.base/java.lang.reflect.Method.invoke(Method.java:564)
	at com.carrotsearch.randomizedtesting.RandomizedRunner.invoke(RandomizedRunner.java:1737)
	at com.carrotsearch.randomizedtesting.RandomizedRunner$8.evaluate(RandomizedRunner.java:934)
	at com.carrotsearch.randomizedtesting.RandomizedRunner$9.evaluate(RandomizedRunner.java:970)
	at com.carrotsearch.randomizedtesting.RandomizedRunner$10.evaluate(RandomizedRunner.java:984)
	at com.carrotsearch.randomizedtesting.rules.SystemPropertiesRestoreRule$1.evaluate(SystemPropertiesRestoreRule.java:57)
	at org.apache.lucene.util.TestRuleSetupTeardownChained$1.evaluate(TestRuleSetupTeardownChained.java:49)
	at org.apache.lucene.util.AbstractBeforeAfterRule$1.evaluate(AbstractBeforeAfterRule.java:45)
	at org.apache.lucene.util.TestRuleThreadAndTestName$1.evaluate(TestRuleThreadAndTestName.java:48)
	at org.apache.lucene.util.TestRuleIgnoreAfterMaxFailures$1.evaluate(TestRuleIgnoreAfterMaxFailures.java:64)
	at org.apache.lucene.util.TestRuleMarkFailure$1.evaluate(TestRuleMarkFailure.java:47)
	at com.carrotsearch.randomizedtesting.rules.StatementAdapter.evaluate(StatementAdapter.java:36)
	at com.carrotsearch.randomizedtesting.ThreadLeakControl$StatementRunner.run(ThreadLeakControl.java:368)
	at com.carrotsearch.randomizedtesting.ThreadLeakControl.forkTimeoutingTask(ThreadLeakControl.java:817)
	at com.carrotsearch.randomizedtesting.ThreadLeakControl$3.evaluate(ThreadLeakControl.java:468)
	at com.carrotsearch.randomizedtesting.RandomizedRunner.runSingleTest(RandomizedRunner.java:943)
	at com.carrotsearch.randomizedtesting.RandomizedRunner$5.evaluate(RandomizedRunner.java:829)
	at com.carrotsearch.randomizedtesting.RandomizedRunner$6.evaluate(RandomizedRunner.java:879)
	at com.carrotsearch.randomizedtesting.RandomizedRunner$7.evaluate(RandomizedRunner.java:890)
	at com.carrotsearch.randomizedtesting.rules.StatementAdapter.evaluate(StatementAdapter.java:36)
	at com.carrotsearch.randomizedtesting.rules.SystemPropertiesRestoreRule$1.evaluate(SystemPropertiesRestoreRule.java:57)
	at org.apache.lucene.util.AbstractBeforeAfterRule$1.evaluate(AbstractBeforeAfterRule.java:45)
	at com.carrotsearch.randomizedtesting.rules.StatementAdapter.evaluate(StatementAdapter.java:36)
	at org.apache.lucene.util.TestRuleStoreClassName$1.evaluate(TestRuleStoreClassName.java:41)
	at com.carrotsearch.randomizedtesting.rules.NoShadowingOrOverridesOnMethodsRule$1.evaluate(NoShadowingOrOverridesOnMethodsRule.java:40)
	at com.carrotsearch.randomizedtesting.rules.NoShadowingOrOverridesOnMethodsRule$1.evaluate(NoShadowingOrOverridesOnMethodsRule.java:40)
	at com.carrotsearch.randomizedtesting.rules.StatementAdapter.evaluate(StatementAdapter.java:36)
	at com.carrotsearch.randomizedtesting.rules.StatementAdapter.evaluate(StatementAdapter.java:36)
	at org.apache.lucene.util.TestRuleAssertionsRequired$1.evaluate(TestRuleAssertionsRequired.java:53)
	at org.apache.lucene.util.TestRuleMarkFailure$1.evaluate(TestRuleMarkFailure.java:47)
	at org.apache.lucene.util.TestRuleIgnoreAfterMaxFailures$1.evaluate(TestRuleIgnoreAfterMaxFailures.java:64)
	at org.apache.lucene.util.TestRuleIgnoreTestSuites$1.evaluate(TestRuleIgnoreTestSuites.java:54)
	at com.carrotsearch.randomizedtesting.rules.StatementAdapter.evaluate(StatementAdapter.java:36)
	at com.carrotsearch.randomizedtesting.ThreadLeakControl$StatementRunner.run(ThreadLeakControl.java:368)
	at java.base/java.lang.Thread.run(Thread.java:841)


FAILED:  org.apache.solr.handler.admin.SegmentsInfoRequestHandlerTest.testSegmentInfos

Error Message:


Stack Trace:
java.lang.AssertionError
	at __randomizedtesting.SeedInfo.seed([D83D5ACC5839E8EE:946ACD73923530BE]:0)
	at org.apache.lucene.index.IndexWriter$ReaderPool.noDups(IndexWriter.java:867)
	at org.apache.lucene.index.IndexWriter$ReaderPool.get(IndexWriter.java:857)
	at org.apache.lucene.index.IndexWriter.numDeletesToMerge(IndexWriter.java:5235)
	at org.apache.lucene.index.LogMergePolicy.sizeDocs(LogMergePolicy.java:153)
	at org.apache.lucene.index.LogDocMergePolicy.size(LogDocMergePolicy.java:44)
	at org.apache.lucene.index.LogMergePolicy.findMerges(LogMergePolicy.java:469)
	at org.apache.solr.handler.admin.SegmentsInfoRequestHandler.getMergeCandidatesNames(SegmentsInfoRequestHandler.java:100)
	at org.apache.solr.handler.admin.SegmentsInfoRequestHandler.getSegmentsInfo(SegmentsInfoRequestHandler.java:59)
	at org.apache.solr.handler.admin.SegmentsInfoRequestHandler.handleRequestBody(SegmentsInfoRequestHandler.java:48)
	at org.apache.solr.handler.RequestHandlerBase.handleRequest(RequestHandlerBase.java:199)
	at org.apache.solr.core.SolrCore.execute(SolrCore.java:2508)
	at org.apache.solr.util.TestHarness.query(TestHarness.java:337)
	at org.apache.solr.util.TestHarness.query(TestHarness.java:319)
	at org.apache.solr.SolrTestCaseJ4.assertQ(SolrTestCaseJ4.java:890)
	at org.apache.solr.handler.admin.SegmentsInfoRequestHandlerTest.testSegmentInfos(SegmentsInfoRequestHandlerTest.java:61)
	at java.base/jdk.internal.reflect.NativeMethodAccessorImpl.invoke0(Native Method)
	at java.base/jdk.internal.reflect.NativeMethodAccessorImpl.invoke(NativeMethodAccessorImpl.java:62)
	at java.base/jdk.internal.reflect.DelegatingMethodAccessorImpl.invoke(DelegatingMethodAccessorImpl.java:43)
	at java.base/java.lang.reflect.Method.invoke(Method.java:564)
	at com.carrotsearch.randomizedtesting.RandomizedRunner.invoke(RandomizedRunner.java:1737)
	at com.carrotsearch.randomizedtesting.RandomizedRunner$8.evaluate(RandomizedRunner.java:934)
	at com.carrotsearch.randomizedtesting.RandomizedRunner$9.evaluate(RandomizedRunner.java:970)
	at com.carrotsearch.randomizedtesting.RandomizedRunner$10.evaluate(RandomizedRunner.java:984)
	at com.carrotsearch.randomizedtesting.rules.SystemPropertiesRestoreRule$1.evaluate(SystemPropertiesRestoreRule.java:57)
	at org.apache.lucene.util.TestRuleSetupTeardownChained$1.evaluate(TestRuleSetupTeardownChained.java:49)
	at org.apache.lucene.util.AbstractBeforeAfterRule$1.evaluate(AbstractBeforeAfterRule.java:45)
	at org.apache.lucene.util.TestRuleThreadAndTestName$1.evaluate(TestRuleThreadAndTestName.java:48)
	at org.apache.lucene.util.TestRuleIgnoreAfterMaxFailures$1.evaluate(TestRuleIgnoreAfterMaxFailures.java:64)
	at org.apache.lucene.util.TestRuleMarkFailure$1.evaluate(TestRuleMarkFailure.java:47)
	at com.carrotsearch.randomizedtesting.rules.StatementAdapter.evaluate(StatementAdapter.java:36)
	at com.carrotsearch.randomizedtesting.ThreadLeakControl$StatementRunner.run(ThreadLeakControl.java:368)
	at com.carrotsearch.randomizedtesting.ThreadLeakControl.forkTimeoutingTask(ThreadLeakControl.java:817)
	at com.carrotsearch.randomizedtesting.ThreadLeakControl$3.evaluate(ThreadLeakControl.java:468)
	at com.carrotsearch.randomizedtesting.RandomizedRunner.runSingleTest(RandomizedRunner.java:943)
	at com.carrotsearch.randomizedtesting.RandomizedRunner$5.evaluate(RandomizedRunner.java:829)
	at com.carrotsearch.randomizedtesting.RandomizedRunner$6.evaluate(RandomizedRunner.java:879)
	at com.carrotsearch.randomizedtesting.RandomizedRunner$7.evaluate(RandomizedRunner.java:890)
	at com.carrotsearch.randomizedtesting.rules.StatementAdapter.evaluate(StatementAdapter.java:36)
	at com.carrotsearch.randomizedtesting.rules.SystemPropertiesRestoreRule$1.evaluate(SystemPropertiesRestoreRule.java:57)
	at org.apache.lucene.util.AbstractBeforeAfterRule$1.evaluate(AbstractBeforeAfterRule.java:45)
	at com.carrotsearch.randomizedtesting.rules.StatementAdapter.evaluate(StatementAdapter.java:36)
	at org.apache.lucene.util.TestRuleStoreClassName$1.evaluate(TestRuleStoreClassName.java:41)
	at com.carrotsearch.randomizedtesting.rules.NoShadowingOrOverridesOnMethodsRule$1.evaluate(NoShadowingOrOverridesOnMethodsRule.java:40)
	at com.carrotsearch.randomizedtesting.rules.NoShadowingOrOverridesOnMethodsRule$1.evaluate(NoShadowingOrOverridesOnMethodsRule.java:40)
	at com.carrotsearch.randomizedtesting.rules.StatementAdapter.evaluate(StatementAdapter.java:36)
	at com.carrotsearch.randomizedtesting.rules.StatementAdapter.evaluate(StatementAdapter.java:36)
	at org.apache.lucene.util.TestRuleAssertionsRequired$1.evaluate(TestRuleAssertionsRequired.java:53)
	at org.apache.lucene.util.TestRuleMarkFailure$1.evaluate(TestRuleMarkFailure.java:47)
	at org.apache.lucene.util.TestRuleIgnoreAfterMaxFailures$1.evaluate(TestRuleIgnoreAfterMaxFailures.java:64)
	at org.apache.lucene.util.TestRuleIgnoreTestSuites$1.evaluate(TestRuleIgnoreTestSuites.java:54)
	at com.carrotsearch.randomizedtesting.rules.StatementAdapter.evaluate(StatementAdapter.java:36)
	at com.carrotsearch.randomizedtesting.ThreadLeakControl$StatementRunner.run(ThreadLeakControl.java:368)
	at java.base/java.lang.Thread.run(Thread.java:841)


FAILED:  org.apache.solr.handler.admin.SegmentsInfoRequestHandlerTest.testSegmentInfosVersion

Error Message:


Stack Trace:
java.lang.AssertionError
	at __randomizedtesting.SeedInfo.seed([D83D5ACC5839E8EE:20E3CF24205539BD]:0)
	at org.apache.lucene.index.IndexWriter$ReaderPool.noDups(IndexWriter.java:867)
	at org.apache.lucene.index.IndexWriter$ReaderPool.get(IndexWriter.java:857)
	at org.apache.lucene.index.IndexWriter.numDeletesToMerge(IndexWriter.java:5235)
	at org.apache.lucene.index.LogMergePolicy.sizeDocs(LogMergePolicy.java:153)
	at org.apache.lucene.index.LogDocMergePolicy.size(LogDocMergePolicy.java:44)
	at org.apache.lucene.index.LogMergePolicy.findMerges(LogMergePolicy.java:469)
	at org.apache.solr.handler.admin.SegmentsInfoRequestHandler.getMergeCandidatesNames(SegmentsInfoRequestHandler.java:100)
	at org.apache.solr.handler.admin.SegmentsInfoRequestHandler.getSegmentsInfo(SegmentsInfoRequestHandler.java:59)
	at org.apache.solr.handler.admin.SegmentsInfoRequestHandler.handleRequestBody(SegmentsInfoRequestHandler.java:48)
	at org.apache.solr.handler.RequestHandlerBase.handleRequest(RequestHandlerBase.java:199)
	at org.apache.solr.core.SolrCore.execute(SolrCore.java:2508)
	at org.apache.solr.util.TestHarness.query(TestHarness.java:337)
	at org.apache.solr.util.TestHarness.query(TestHarness.java:319)
	at org.apache.solr.SolrTestCaseJ4.assertQ(SolrTestCaseJ4.java:890)
	at org.apache.solr.handler.admin.SegmentsInfoRequestHandlerTest.testSegmentInfosVersion(SegmentsInfoRequestHandlerTest.java:68)
	at java.base/jdk.internal.reflect.NativeMethodAccessorImpl.invoke0(Native Method)
	at java.base/jdk.internal.reflect.NativeMethodAccessorImpl.invoke(NativeMethodAccessorImpl.java:62)
	at java.base/jdk.internal.reflect.DelegatingMethodAccessorImpl.invoke(DelegatingMethodAccessorImpl.java:43)
	at java.base/java.lang.reflect.Method.invoke(Method.java:564)
	at com.carrotsearch.randomizedtesting.RandomizedRunner.invoke(RandomizedRunner.java:1737)
	at com.carrotsearch.randomizedtesting.RandomizedRunner$8.evaluate(RandomizedRunner.java:934)
	at com.carrotsearch.randomizedtesting.RandomizedRunner$9.evaluate(RandomizedRunner.java:970)
	at com.carrotsearch.randomizedtesting.RandomizedRunner$10.evaluate(RandomizedRunner.java:984)
	at com.carrotsearch.randomizedtesting.rules.SystemPropertiesRestoreRule$1.evaluate(SystemPropertiesRestoreRule.java:57)
	at org.apache.lucene.util.TestRuleSetupTeardownChained$1.evaluate(TestRuleSetupTeardownChained.java:49)
	at org.apache.lucene.util.AbstractBeforeAfterRule$1.evaluate(AbstractBeforeAfterRule.java:45)
	at org.apache.lucene.util.TestRuleThreadAndTestName$1.evaluate(TestRuleThreadAndTestName.java:48)
	at org.apache.lucene.util.TestRuleIgnoreAfterMaxFailures$1.evaluate(TestRuleIgnoreAfterMaxFailures.java:64)
	at org.apache.lucene.util.TestRuleMarkFailure$1.evaluate(TestRuleMarkFailure.java:47)
	at com.carrotsearch.randomizedtesting.rules.StatementAdapter.evaluate(StatementAdapter.java:36)
	at com.carrotsearch.randomizedtesting.ThreadLeakControl$StatementRunner.run(ThreadLeakControl.java:368)
	at com.carrotsearch.randomizedtesting.ThreadLeakControl.forkTimeoutingTask(ThreadLeakControl.java:817)
	at com.carrotsearch.randomizedtesting.ThreadLeakControl$3.evaluate(ThreadLeakControl.java:468)
	at com.carrotsearch.randomizedtesting.RandomizedRunner.runSingleTest(RandomizedRunner.java:943)
	at com.carrotsearch.randomizedtesting.RandomizedRunner$5.evaluate(RandomizedRunner.java:829)
	at com.carrotsearch.randomizedtesting.RandomizedRunner$6.evaluate(RandomizedRunner.java:879)
	at com.carrotsearch.randomizedtesting.RandomizedRunner$7.evaluate(RandomizedRunner.java:890)
	at com.carrotsearch.randomizedtesting.rules.StatementAdapter.evaluate(StatementAdapter.java:36)
	at com.carrotsearch.randomizedtesting.rules.SystemPropertiesRestoreRule$1.evaluate(SystemPropertiesRestoreRule.java:57)
	at org.apache.lucene.util.AbstractBeforeAfterRule$1.evaluate(AbstractBeforeAfterRule.java:45)
	at com.carrotsearch.randomizedtesting.rules.StatementAdapter.evaluate(StatementAdapter.java:36)
	at org.apache.lucene.util.TestRuleStoreClassName$1.evaluate(TestRuleStoreClassName.java:41)
	at com.carrotsearch.randomizedtesting.rules.NoShadowingOrOverridesOnMethodsRule$1.evaluate(NoShadowingOrOverridesOnMethodsRule.java:40)
	at com.carrotsearch.randomizedtesting.rules.NoShadowingOrOverridesOnMethodsRule$1.evaluate(NoShadowingOrOverridesOnMethodsRule.java:40)
	at com.carrotsearch.randomizedtesting.rules.StatementAdapter.evaluate(StatementAdapter.java:36)
	at com.carrotsearch.randomizedtesting.rules.StatementAdapter.evaluate(StatementAdapter.java:36)
	at org.apache.lucene.util.TestRuleAssertionsRequired$1.evaluate(TestRuleAssertionsRequired.java:53)
	at org.apache.lucene.util.TestRuleMarkFailure$1.evaluate(TestRuleMarkFailure.java:47)
	at org.apache.lucene.util.TestRuleIgnoreAfterMaxFailures$1.evaluate(TestRuleIgnoreAfterMaxFailures.java:64)
	at org.apache.lucene.util.TestRuleIgnoreTestSuites$1.evaluate(TestRuleIgnoreTestSuites.java:54)
	at com.carrotsearch.randomizedtesting.rules.StatementAdapter.evaluate(StatementAdapter.java:36)
	at com.carrotsearch.randomizedtesting.ThreadLeakControl$StatementRunner.run(ThreadLeakControl.java:368)
	at java.base/java.lang.Thread.run(Thread.java:841)


FAILED:  org.apache.solr.handler.admin.SegmentsInfoRequestHandlerTest.testSegmentInfos

Error Message:


Stack Trace:
java.lang.AssertionError
	at __randomizedtesting.SeedInfo.seed([D83D5ACC5839E8EE:946ACD73923530BE]:0)
	at org.apache.lucene.index.IndexWriter$ReaderPool.noDups(IndexWriter.java:867)
	at org.apache.lucene.index.IndexWriter$ReaderPool.get(IndexWriter.java:857)
	at org.apache.lucene.index.IndexWriter.numDeletesToMerge(IndexWriter.java:5235)
	at org.apache.lucene.index.LogMergePolicy.sizeDocs(LogMergePolicy.java:153)
	at org.apache.lucene.index.LogDocMergePolicy.size(LogDocMergePolicy.java:44)
	at org.apache.lucene.index.LogMergePolicy.findMerges(LogMergePolicy.java:469)
	at org.apache.solr.handler.admin.SegmentsInfoRequestHandler.getMergeCandidatesNames(SegmentsInfoRequestHandler.java:100)
	at org.apache.solr.handler.admin.SegmentsInfoRequestHandler.getSegmentsInfo(SegmentsInfoRequestHandler.java:59)
	at org.apache.solr.handler.admin.SegmentsInfoRequestHandler.handleRequestBody(SegmentsInfoRequestHandler.java:48)
	at org.apache.solr.handler.RequestHandlerBase.handleRequest(RequestHandlerBase.java:199)
	at org.apache.solr.core.SolrCore.execute(SolrCore.java:2508)
	at org.apache.solr.util.TestHarness.query(TestHarness.java:337)
	at org.apache.solr.util.TestHarness.query(TestHarness.java:319)
	at org.apache.solr.SolrTestCaseJ4.assertQ(SolrTestCaseJ4.java:890)
	at org.apache.solr.handler.admin.SegmentsInfoRequestHandlerTest.testSegmentInfos(SegmentsInfoRequestHandlerTest.java:61)
	at java.base/jdk.internal.reflect.NativeMethodAccessorImpl.invoke0(Native Method)
	at java.base/jdk.internal.reflect.NativeMethodAccessorImpl.invoke(NativeMethodAccessorImpl.java:62)
	at java.base/jdk.internal.reflect.DelegatingMethodAccessorImpl.invoke(DelegatingMethodAccessorImpl.java:43)
	at java.base/java.lang.reflect.Method.invoke(Method.java:564)
	at com.carrotsearch.randomizedtesting.RandomizedRunner.invoke(RandomizedRunner.java:1737)
	at com.carrotsearch.randomizedtesting.RandomizedRunner$8.evaluate(RandomizedRunner.java:934)
	at com.carrotsearch.randomizedtesting.RandomizedRunner$9.evaluate(RandomizedRunner.java:970)
	at com.carrotsearch.randomizedtesting.RandomizedRunner$10.evaluate(RandomizedRunner.java:984)
	at com.carrotsearch.randomizedtesting.rules.SystemPropertiesRestoreRule$1.evaluate(SystemPropertiesRestoreRule.java:57)
	at org.apache.lucene.util.TestRuleSetupTeardownChained$1.evaluate(TestRuleSetupTeardownChained.java:49)
	at org.apache.lucene.util.AbstractBeforeAfterRule$1.evaluate(AbstractBeforeAfterRule.java:45)
	at org.apache.lucene.util.TestRuleThreadAndTestName$1.evaluate(TestRuleThreadAndTestName.java:48)
	at org.apache.lucene.util.TestRuleIgnoreAfterMaxFailures$1.evaluate(TestRuleIgnoreAfterMaxFailures.java:64)
	at org.apache.lucene.util.TestRuleMarkFailure$1.evaluate(TestRuleMarkFailure.java:47)
	at com.carrotsearch.randomizedtesting.rules.StatementAdapter.evaluate(StatementAdapter.java:36)
	at com.carrotsearch.randomizedtesting.ThreadLeakControl$StatementRunner.run(ThreadLeakControl.java:368)
	at com.carrotsearch.randomizedtesting.ThreadLeakControl.forkTimeoutingTask(ThreadLeakControl.java:817)
	at com.carrotsearch.randomizedtesting.ThreadLeakControl$3.evaluate(ThreadLeakControl.java:468)
	at com.carrotsearch.randomizedtesting.RandomizedRunner.runSingleTest(RandomizedRunner.java:943)
	at com.carrotsearch.randomizedtesting.RandomizedRunner$5.evaluate(RandomizedRunner.java:829)
	at com.carrotsearch.randomizedtesting.RandomizedRunner$6.evaluate(RandomizedRunner.java:879)
	at com.carrotsearch.randomizedtesting.RandomizedRunner$7.evaluate(RandomizedRunner.java:890)
	at com.carrotsearch.randomizedtesting.rules.StatementAdapter.evaluate(StatementAdapter.java:36)
	at com.carrotsearch.randomizedtesting.rules.SystemPropertiesRestoreRule$1.evaluate(SystemPropertiesRestoreRule.java:57)
	at org.apache.lucene.util.AbstractBeforeAfterRule$1.evaluate(AbstractBeforeAfterRule.java:45)
	at com.carrotsearch.randomizedtesting.rules.StatementAdapter.evaluate(StatementAdapter.java:36)
	at org.apache.lucene.util.TestRuleStoreClassName$1.evaluate(TestRuleStoreClassName.java:41)
	at com.carrotsearch.randomizedtesting.rules.NoShadowingOrOverridesOnMethodsRule$1.evaluate(NoShadowingOrOverridesOnMethodsRule.java:40)
	at com.carrotsearch.randomizedtesting.rules.NoShadowingOrOverridesOnMethodsRule$1.evaluate(NoShadowingOrOverridesOnMethodsRule.java:40)
	at com.carrotsearch.randomizedtesting.rules.StatementAdapter.evaluate(StatementAdapter.java:36)
	at com.carrotsearch.randomizedtesting.rules.StatementAdapter.evaluate(StatementAdapter.java:36)
	at org.apache.lucene.util.TestRuleAssertionsRequired$1.evaluate(TestRuleAssertionsRequired.java:53)
	at org.apache.lucene.util.TestRuleMarkFailure$1.evaluate(TestRuleMarkFailure.java:47)
	at org.apache.lucene.util.TestRuleIgnoreAfterMaxFailures$1.evaluate(TestRuleIgnoreAfterMaxFailures.java:64)
	at org.apache.lucene.util.TestRuleIgnoreTestSuites$1.evaluate(TestRuleIgnoreTestSuites.java:54)
	at com.carrotsearch.randomizedtesting.rules.StatementAdapter.evaluate(StatementAdapter.java:36)
	at com.carrotsearch.randomizedtesting.ThreadLeakControl$StatementRunner.run(ThreadLeakControl.java:368)
	at java.base/java.lang.Thread.run(Thread.java:841)


FAILED:  org.apache.solr.handler.admin.SegmentsInfoRequestHandlerTest.testSegmentInfosVersion

Error Message:


Stack Trace:
java.lang.AssertionError
	at __randomizedtesting.SeedInfo.seed([D83D5ACC5839E8EE:20E3CF24205539BD]:0)
	at org.apache.lucene.index.IndexWriter$ReaderPool.noDups(IndexWriter.java:867)
	at org.apache.lucene.index.IndexWriter$ReaderPool.get(IndexWriter.java:857)
	at org.apache.lucene.index.IndexWriter.numDeletesToMerge(IndexWriter.java:5235)
	at org.apache.lucene.index.LogMergePolicy.sizeDocs(LogMergePolicy.java:153)
	at org.apache.lucene.index.LogDocMergePolicy.size(LogDocMergePolicy.java:44)
	at org.apache.lucene.index.LogMergePolicy.findMerges(LogMergePolicy.java:469)
	at org.apache.solr.handler.admin.SegmentsInfoRequestHandler.getMergeCandidatesNames(SegmentsInfoRequestHandler.java:100)
	at org.apache.solr.handler.admin.SegmentsInfoRequestHandler.getSegmentsInfo(SegmentsInfoRequestHandler.java:59)
	at org.apache.solr.handler.admin.SegmentsInfoRequestHandler.handleRequestBody(SegmentsInfoRequestHandler.java:48)
	at org.apache.solr.handler.RequestHandlerBase.handleRequest(RequestHandlerBase.java:199)
	at org.apache.solr.core.SolrCore.execute(SolrCore.java:2508)
	at org.apache.solr.util.TestHarness.query(TestHarness.java:337)
	at org.apache.solr.util.TestHarness.query(TestHarness.java:319)
	at org.apache.solr.SolrTestCaseJ4.assertQ(SolrTestCaseJ4.java:890)
	at org.apache.solr.handler.admin.SegmentsInfoRequestHandlerTest.testSegmentInfosVersion(SegmentsInfoRequestHandlerTest.java:68)
	at java.base/jdk.internal.reflect.NativeMethodAccessorImpl.invoke0(Native Method)
	at java.base/jdk.internal.reflect.NativeMethodAccessorImpl.invoke(NativeMethodAccessorImpl.java:62)
	at java.base/jdk.internal.reflect.DelegatingMethodAccessorImpl.invoke(DelegatingMethodAccessorImpl.java:43)
	at java.base/java.lang.reflect.Method.invoke(Method.java:564)
	at com.carrotsearch.randomizedtesting.RandomizedRunner.invoke(RandomizedRunner.java:1737)
	at com.carrotsearch.randomizedtesting.RandomizedRunner$8.evaluate(RandomizedRunner.java:934)
	at com.carrotsearch.randomizedtesting.RandomizedRunner$9.evaluate(RandomizedRunner.java:970)
	at com.carrotsearch.randomizedtesting.RandomizedRunner$10.evaluate(RandomizedRunner.java:984)
	at com.carrotsearch.randomizedtesting.rules.SystemPropertiesRestoreRule$1.evaluate(SystemPropertiesRestoreRule.java:57)
	at org.apache.lucene.util.TestRuleSetupTeardownChained$1.evaluate(TestRuleSetupTeardownChained.java:49)
	at org.apache.lucene.util.AbstractBeforeAfterRule$1.evaluate(AbstractBeforeAfterRule.java:45)
	at org.apache.lucene.util.TestRuleThreadAndTestName$1.evaluate(TestRuleThreadAndTestName.java:48)
	at org.apache.lucene.util.TestRuleIgnoreAfterMaxFailures$1.evaluate(TestRuleIgnoreAfterMaxFailures.java:64)
	at org.apache.lucene.util.TestRuleMarkFailure$1.evaluate(TestRuleMarkFailure.java:47)
	at com.carrotsearch.randomizedtesting.rules.StatementAdapter.evaluate(StatementAdapter.java:36)
	at com.carrotsearch.randomizedtesting.ThreadLeakControl$StatementRunner.run(ThreadLeakControl.java:368)
	at com.carrotsearch.randomizedtesting.ThreadLeakControl.forkTimeoutingTask(ThreadLeakControl.java:817)
	at com.carrotsearch.randomizedtesting.ThreadLeakControl$3.evaluate(ThreadLeakControl.java:468)
	at com.carrotsearch.randomizedtesting.RandomizedRunner.runSingleTest(RandomizedRunner.java:943)
	at com.carrotsearch.randomizedtesting.RandomizedRunner$5.evaluate(RandomizedRunner.java:829)
	at com.carrotsearch.randomizedtesting.RandomizedRunner$6.evaluate(RandomizedRunner.java:879)
	at com.carrotsearch.randomizedtesting.RandomizedRunner$7.evaluate(RandomizedRunner.java:890)
	at com.carrotsearch.randomizedtesting.rules.StatementAdapter.evaluate(StatementAdapter.java:36)
	at com.carrotsearch.randomizedtesting.rules.SystemPropertiesRestoreRule$1.evaluate(SystemPropertiesRestoreRule.java:57)
	at org.apache.lucene.util.AbstractBeforeAfterRule$1.evaluate(AbstractBeforeAfterRule.java:45)
	at com.carrotsearch.randomizedtesting.rules.StatementAdapter.evaluate(StatementAdapter.java:36)
	at org.apache.lucene.util.TestRuleStoreClassName$1.evaluate(TestRuleStoreClassName.java:41)
	at com.carrotsearch.randomizedtesting.rules.NoShadowingOrOverridesOnMethodsRule$1.evaluate(NoShadowingOrOverridesOnMethodsRule.java:40)
	at com.carrotsearch.randomizedtesting.rules.NoShadowingOrOverridesOnMethodsRule$1.evaluate(NoShadowingOrOverridesOnMethodsRule.java:40)
	at com.carrotsearch.randomizedtesting.rules.StatementAdapter.evaluate(StatementAdapter.java:36)
	at com.carrotsearch.randomizedtesting.rules.StatementAdapter.evaluate(StatementAdapter.java:36)
	at org.apache.lucene.util.TestRuleAssertionsRequired$1.evaluate(TestRuleAssertionsRequired.java:53)
	at org.apache.lucene.util.TestRuleMarkFailure$1.evaluate(TestRuleMarkFailure.java:47)
	at org.apache.lucene.util.TestRuleIgnoreAfterMaxFailures$1.evaluate(TestRuleIgnoreAfterMaxFailures.java:64)
	at org.apache.lucene.util.TestRuleIgnoreTestSuites$1.evaluate(TestRuleIgnoreTestSuites.java:54)
	at com.carrotsearch.randomizedtesting.rules.StatementAdapter.evaluate(StatementAdapter.java:36)
	at com.carrotsearch.randomizedtesting.ThreadLeakControl$StatementRunner.run(ThreadLeakControl.java:368)
	at java.base/java.lang.Thread.run(Thread.java:841)


FAILED:  org.apache.solr.handler.admin.SegmentsInfoRequestHandlerTest.testSegmentInfos

Error Message:


Stack Trace:
java.lang.AssertionError
	at __randomizedtesting.SeedInfo.seed([D83D5ACC5839E8EE:946ACD73923530BE]:0)
	at org.apache.lucene.index.IndexWriter$ReaderPool.noDups(IndexWriter.java:867)
	at org.apache.lucene.index.IndexWriter$ReaderPool.get(IndexWriter.java:857)
	at org.apache.lucene.index.IndexWriter.numDeletesToMerge(IndexWriter.java:5235)
	at org.apache.lucene.index.LogMergePolicy.sizeDocs(LogMergePolicy.java:153)
	at org.apache.lucene.index.LogDocMergePolicy.size(LogDocMergePolicy.java:44)
	at org.apache.lucene.index.LogMergePolicy.findMerges(LogMergePolicy.java:469)
	at org.apache.solr.handler.admin.SegmentsInfoRequestHandler.getMergeCandidatesNames(SegmentsInfoRequestHandler.java:100)
	at org.apache.solr.handler.admin.SegmentsInfoRequestHandler.getSegmentsInfo(SegmentsInfoRequestHandler.java:59)
	at org.apache.solr.handler.admin.SegmentsInfoRequestHandler.handleRequestBody(SegmentsInfoRequestHandler.java:48)
	at org.apache.solr.handler.RequestHandlerBase.handleRequest(RequestHandlerBase.java:199)
	at org.apache.solr.core.SolrCore.execute(SolrCore.java:2508)
	at org.apache.solr.util.TestHarness.query(TestHarness.java:337)
	at org.apache.solr.util.TestHarness.query(TestHarness.java:319)
	at org.apache.solr.SolrTestCaseJ4.assertQ(SolrTestCaseJ4.java:890)
	at org.apache.solr.handler.admin.SegmentsInfoRequestHandlerTest.testSegmentInfos(SegmentsInfoRequestHandlerTest.java:61)
	at java.base/jdk.internal.reflect.NativeMethodAccessorImpl.invoke0(Native Method)
	at java.base/jdk.internal.reflect.NativeMethodAccessorImpl.invoke(NativeMethodAccessorImpl.java:62)
	at java.base/jdk.internal.reflect.DelegatingMethodAccessorImpl.invoke(DelegatingMethodAccessorImpl.java:43)
	at java.base/java.lang.reflect.Method.invoke(Method.java:564)
	at com.carrotsearch.randomizedtesting.RandomizedRunner.invoke(RandomizedRunner.java:1737)
	at com.carrotsearch.randomizedtesting.RandomizedRunner$8.evaluate(RandomizedRunner.java:934)
	at com.carrotsearch.randomizedtesting.RandomizedRunner$9.evaluate(RandomizedRunner.java:970)
	at com.carrotsearch.randomizedtesting.RandomizedRunner$10.evaluate(RandomizedRunner.java:984)
	at com.carrotsearch.randomizedtesting.rules.SystemPropertiesRestoreRule$1.evaluate(SystemPropertiesRestoreRule.java:57)
	at org.apache.lucene.util.TestRuleSetupTeardownChained$1.evaluate(TestRuleSetupTeardownChained.java:49)
	at org.apache.lucene.util.AbstractBeforeAfterRule$1.evaluate(AbstractBeforeAfterRule.java:45)
	at org.apache.lucene.util.TestRuleThreadAndTestName$1.evaluate(TestRuleThreadAndTestName.java:48)
	at org.apache.lucene.util.TestRuleIgnoreAfterMaxFailures$1.evaluate(TestRuleIgnoreAfterMaxFailures.java:64)
	at org.apache.lucene.util.TestRuleMarkFailure$1.evaluate(TestRuleMarkFailure.java:47)
	at com.carrotsearch.randomizedtesting.rules.StatementAdapter.evaluate(StatementAdapter.java:36)
	at com.carrotsearch.randomizedtesting.ThreadLeakControl$StatementRunner.run(ThreadLeakControl.java:368)
	at com.carrotsearch.randomizedtesting.ThreadLeakControl.forkTimeoutingTask(ThreadLeakControl.java:817)
	at com.carrotsearch.randomizedtesting.ThreadLeakControl$3.evaluate(ThreadLeakControl.java:468)
	at com.carrotsearch.randomizedtesting.RandomizedRunner.runSingleTest(RandomizedRunner.java:943)
	at com.carrotsearch.randomizedtesting.RandomizedRunner$5.evaluate(RandomizedRunner.java:829)
	at com.carrotsearch.randomizedtesting.RandomizedRunner$6.evaluate(RandomizedRunner.java:879)
	at com.carrotsearch.randomizedtesting.RandomizedRunner$7.evaluate(RandomizedRunner.java:890)
	at com.carrotsearch.randomizedtesting.rules.StatementAdapter.evaluate(StatementAdapter.java:36)
	at com.carrotsearch.randomizedtesting.rules.SystemPropertiesRestoreRule$1.evaluate(SystemPropertiesRestoreRule.java:57)
	at org.apache.lucene.util.AbstractBeforeAfterRule$1.evaluate(AbstractBeforeAfterRule.java:45)
	at com.carrotsearch.randomizedtesting.rules.StatementAdapter.evaluate(StatementAdapter.java:36)
	at org.apache.lucene.util.TestRuleStoreClassName$1.evaluate(TestRuleStoreClassName.java:41)
	at com.carrotsearch.randomizedtesting.rules.NoShadowingOrOverridesOnMethodsRule$1.evaluate(NoShadowingOrOverridesOnMethodsRule.java:40)
	at com.carrotsearch.randomizedtesting.rules.NoShadowingOrOverridesOnMethodsRule$1.evaluate(NoShadowingOrOverridesOnMethodsRule.java:40)
	at com.carrotsearch.randomizedtesting.rules.StatementAdapter.evaluate(StatementAdapter.java:36)
	at com.carrotsearch.randomizedtesting.rules.StatementAdapter.evaluate(StatementAdapter.java:36)
	at org.apache.lucene.util.TestRuleAssertionsRequired$1.evaluate(TestRuleAssertionsRequired.java:53)
	at org.apache.lucene.util.TestRuleMarkFailure$1.evaluate(TestRuleMarkFailure.java:47)
	at org.apache.lucene.util.TestRuleIgnoreAfterMaxFailures$1.evaluate(TestRuleIgnoreAfterMaxFailures.java:64)
	at org.apache.lucene.util.TestRuleIgnoreTestSuites$1.evaluate(TestRuleIgnoreTestSuites.java:54)
	at com.carrotsearch.randomizedtesting.rules.StatementAdapter.evaluate(StatementAdapter.java:36)
	at com.carrotsearch.randomizedtesting.ThreadLeakControl$StatementRunner.run(ThreadLeakControl.java:368)
	at java.base/java.lang.Thread.run(Thread.java:841)


FAILED:  org.apache.solr.handler.admin.SegmentsInfoRequestHandlerTest.testSegmentInfosVersion

Error Message:


Stack Trace:
java.lang.AssertionError
	at __randomizedtesting.SeedInfo.seed([D83D5ACC5839E8EE:20E3CF24205539BD]:0)
	at org.apache.lucene.index.IndexWriter$ReaderPool.noDups(IndexWriter.java:867)
	at org.apache.lucene.index.IndexWriter$ReaderPool.get(IndexWriter.java:857)
	at org.apache.lucene.index.IndexWriter.numDeletesToMerge(IndexWriter.java:5235)
	at org.apache.lucene.index.LogMergePolicy.sizeDocs(LogMergePolicy.java:153)
	at org.apache.lucene.index.LogDocMergePolicy.size(LogDocMergePolicy.java:44)
	at org.apache.lucene.index.LogMergePolicy.findMerges(LogMergePolicy.java:469)
	at org.apache.solr.handler.admin.SegmentsInfoRequestHandler.getMergeCandidatesNames(SegmentsInfoRequestHandler.java:100)
	at org.apache.solr.handler.admin.SegmentsInfoRequestHandler.getSegmentsInfo(SegmentsInfoRequestHandler.java:59)
	at org.apache.solr.handler.admin.SegmentsInfoRequestHandler.handleRequestBody(SegmentsInfoRequestHandler.java:48)
	at org.apache.solr.handler.RequestHandlerBase.handleRequest(RequestHandlerBase.java:199)
	at org.apache.solr.core.SolrCore.execute(SolrCore.java:2508)
	at org.apache.solr.util.TestHarness.query(TestHarness.java:337)
	at org.apache.solr.util.TestHarness.query(TestHarness.java:319)
	at org.apache.solr.SolrTestCaseJ4.assertQ(SolrTestCaseJ4.java:890)
	at org.apache.solr.handler.admin.SegmentsInfoRequestHandlerTest.testSegmentInfosVersion(SegmentsInfoRequestHandlerTest.java:68)
	at java.base/jdk.internal.reflect.NativeMethodAccessorImpl.invoke0(Native Method)
	at java.base/jdk.internal.reflect.NativeMethodAccessorImpl.invoke(NativeMethodAccessorImpl.java:62)
	at java.base/jdk.internal.reflect.DelegatingMethodAccessorImpl.invoke(DelegatingMethodAccessorImpl.java:43)
	at java.base/java.lang.reflect.Method.invoke(Method.java:564)
	at com.carrotsearch.randomizedtesting.RandomizedRunner.invoke(RandomizedRunner.java:1737)
	at com.carrotsearch.randomizedtesting.RandomizedRunner$8.evaluate(RandomizedRunner.java:934)
	at com.carrotsearch.randomizedtesting.RandomizedRunner$9.evaluate(RandomizedRunner.java:970)
	at com.carrotsearch.randomizedtesting.RandomizedRunner$10.evaluate(RandomizedRunner.java:984)
	at com.carrotsearch.randomizedtesting.rules.SystemPropertiesRestoreRule$1.evaluate(SystemPropertiesRestoreRule.java:57)
	at org.apache.lucene.util.TestRuleSetupTeardownChained$1.evaluate(TestRuleSetupTeardownChained.java:49)
	at org.apache.lucene.util.AbstractBeforeAfterRule$1.evaluate(AbstractBeforeAfterRule.java:45)
	at org.apache.lucene.util.TestRuleThreadAndTestName$1.evaluate(TestRuleThreadAndTestName.java:48)
	at org.apache.lucene.util.TestRuleIgnoreAfterMaxFailures$1.evaluate(TestRuleIgnoreAfterMaxFailures.java:64)
	at org.apache.lucene.util.TestRuleMarkFailure$1.evaluate(TestRuleMarkFailure.java:47)
	at com.carrotsearch.randomizedtesting.rules.StatementAdapter.evaluate(StatementAdapter.java:36)
	at com.carrotsearch.randomizedtesting.ThreadLeakControl$StatementRunner.run(ThreadLeakControl.java:368)
	at com.carrotsearch.randomizedtesting.ThreadLeakControl.forkTimeoutingTask(ThreadLeakControl.java:817)
	at com.carrotsearch.randomizedtesting.ThreadLeakControl$3.evaluate(ThreadLeakControl.java:468)
	at com.carrotsearch.randomizedtesting.RandomizedRunner.runSingleTest(RandomizedRunner.java:943)
	at com.carrotsearch.randomizedtesting.RandomizedRunner$5.evaluate(RandomizedRunner.java:829)
	at com.carrotsearch.randomizedtesting.RandomizedRunner$6.evaluate(RandomizedRunner.java:879)
	at com.carrotsearch.randomizedtesting.RandomizedRunner$7.evaluate(RandomizedRunner.java:890)
	at com.carrotsearch.randomizedtesting.rules.StatementAdapter.evaluate(StatementAdapter.java:36)
	at com.carrotsearch.randomizedtesting.rules.SystemPropertiesRestoreRule$1.evaluate(SystemPropertiesRestoreRule.java:57)
	at org.apache.lucene.util.AbstractBeforeAfterRule$1.evaluate(AbstractBeforeAfterRule.java:45)
	at com.carrotsearch.randomizedtesting.rules.StatementAdapter.evaluate(StatementAdapter.java:36)
	at org.apache.lucene.util.TestRuleStoreClassName$1.evaluate(TestRuleStoreClassName.java:41)
	at com.carrotsearch.randomizedtesting.rules.NoShadowingOrOverridesOnMethodsRule$1.evaluate(NoShadowingOrOverridesOnMethodsRule.java:40)
	at com.carrotsearch.randomizedtesting.rules.NoShadowingOrOverridesOnMethodsRule$1.evaluate(NoShadowingOrOverridesOnMethodsRule.java:40)
	at com.carrotsearch.randomizedtesting.rules.StatementAdapter.evaluate(StatementAdapter.java:36)
	at com.carrotsearch.randomizedtesting.rules.StatementAdapter.evaluate(StatementAdapter.java:36)
	at org.apache.lucene.util.TestRuleAssertionsRequired$1.evaluate(TestRuleAssertionsRequired.java:53)
	at org.apache.lucene.util.TestRuleMarkFailure$1.evaluate(TestRuleMarkFailure.java:47)
	at org.apache.lucene.util.TestRuleIgnoreAfterMaxFailures$1.evaluate(TestRuleIgnoreAfterMaxFailures.java:64)
	at org.apache.lucene.util.TestRuleIgnoreTestSuites$1.evaluate(TestRuleIgnoreTestSuites.java:54)
	at com.carrotsearch.randomizedtesting.rules.StatementAdapter.evaluate(StatementAdapter.java:36)
	at com.carrotsearch.randomizedtesting.ThreadLeakControl$StatementRunner.run(ThreadLeakControl.java:368)
	at java.base/java.lang.Thread.run(Thread.java:841)


FAILED:  org.apache.solr.handler.admin.SegmentsInfoRequestHandlerTest.testSegmentInfosData

Error Message:


Stack Trace:
java.lang.AssertionError
	at __randomizedtesting.SeedInfo.seed([D83D5ACC5839E8EE:A4947897EED15F71]:0)
	at org.apache.lucene.index.IndexWriter$ReaderPool.noDups(IndexWriter.java:867)
	at org.apache.lucene.index.IndexWriter$ReaderPool.get(IndexWriter.java:857)
	at org.apache.lucene.index.IndexWriter.numDeletesToMerge(IndexWriter.java:5235)
	at org.apache.lucene.index.LogMergePolicy.sizeDocs(LogMergePolicy.java:153)
	at org.apache.lucene.index.LogDocMergePolicy.size(LogDocMergePolicy.java:44)
	at org.apache.lucene.index.LogMergePolicy.findMerges(LogMergePolicy.java:469)
	at org.apache.solr.handler.admin.SegmentsInfoRequestHandler.getMergeCandidatesNames(SegmentsInfoRequestHandler.java:100)
	at org.apache.solr.handler.admin.SegmentsInfoRequestHandler.getSegmentsInfo(SegmentsInfoRequestHandler.java:59)
	at org.apache.solr.handler.admin.SegmentsInfoRequestHandler.handleRequestBody(SegmentsInfoRequestHandler.java:48)
	at org.apache.solr.handler.RequestHandlerBase.handleRequest(RequestHandlerBase.java:199)
	at org.apache.solr.core.SolrCore.execute(SolrCore.java:2508)
	at org.apache.solr.util.TestHarness.query(TestHarness.java:337)
	at org.apache.solr.util.TestHarness.query(TestHarness.java:319)
	at org.apache.solr.SolrTestCaseJ4.assertQ(SolrTestCaseJ4.java:890)
	at org.apache.solr.handler.admin.SegmentsInfoRequestHandlerTest.testSegmentInfosData(SegmentsInfoRequestHandlerTest.java:75)
	at java.base/jdk.internal.reflect.NativeMethodAccessorImpl.invoke0(Native Method)
	at java.base/jdk.internal.reflect.NativeMethodAccessorImpl.invoke(NativeMethodAccessorImpl.java:62)
	at java.base/jdk.internal.reflect.DelegatingMethodAccessorImpl.invoke(DelegatingMethodAccessorImpl.java:43)
	at java.base/java.lang.reflect.Method.invoke(Method.java:564)
	at com.carrotsearch.randomizedtesting.RandomizedRunner.invoke(RandomizedRunner.java:1737)
	at com.carrotsearch.randomizedtesting.RandomizedRunner$8.evaluate(RandomizedRunner.java:934)
	at com.carrotsearch.randomizedtesting.RandomizedRunner$9.evaluate(RandomizedRunner.java:970)
	at com.carrotsearch.randomizedtesting.RandomizedRunner$10.evaluate(RandomizedRunner.java:984)
	at com.carrotsearch.randomizedtesting.rules.SystemPropertiesRestoreRule$1.evaluate(SystemPropertiesRestoreRule.java:57)
	at org.apache.lucene.util.TestRuleSetupTeardownChained$1.evaluate(TestRuleSetupTeardownChained.java:49)
	at org.apache.lucene.util.AbstractBeforeAfterRule$1.evaluate(AbstractBeforeAfterRule.java:45)
	at org.apache.lucene.util.TestRuleThreadAndTestName$1.evaluate(TestRuleThreadAndTestName.java:48)
	at org.apache.lucene.util.TestRuleIgnoreAfterMaxFailures$1.evaluate(TestRuleIgnoreAfterMaxFailures.java:64)
	at org.apache.lucene.util.TestRuleMarkFailure$1.evaluate(TestRuleMarkFailure.java:47)
	at com.carrotsearch.randomizedtesting.rules.StatementAdapter.evaluate(StatementAdapter.java:36)
	at com.carrotsearch.randomizedtesting.ThreadLeakControl$StatementRunner.run(ThreadLeakControl.java:368)
	at com.carrotsearch.randomizedtesting.ThreadLeakControl.forkTimeoutingTask(ThreadLeakControl.java:817)
	at com.carrotsearch.randomizedtesting.ThreadLeakControl$3.evaluate(ThreadLeakControl.java:468)
	at com.carrotsearch.randomizedtesting.RandomizedRunner.runSingleTest(RandomizedRunner.java:943)
	at com.carrotsearch.randomizedtesting.RandomizedRunner$5.evaluate(RandomizedRunner.java:829)
	at com.carrotsearch.randomizedtesting.RandomizedRunner$6.evaluate(RandomizedRunner.java:879)
	at com.carrotsearch.randomizedtesting.RandomizedRunner$7.evaluate(RandomizedRunner.java:890)
	at com.carrotsearch.randomizedtesting.rules.StatementAdapter.evaluate(StatementAdapter.java:36)
	at com.carrotsearch.randomizedtesting.rules.SystemPropertiesRestoreRule$1.evaluate(SystemPropertiesRestoreRule.java:57)
	at org.apache.lucene.util.AbstractBeforeAfterRule$1.evaluate(AbstractBeforeAfterRule.java:45)
	at com.carrotsearch.randomizedtesting.rules.StatementAdapter.evaluate(StatementAdapter.java:36)
	at org.apache.lucene.util.TestRuleStoreClassName$1.evaluate(TestRuleStoreClassName.java:41)
	at com.carrotsearch.randomizedtesting.rules.NoShadowingOrOverridesOnMethodsRule$1.evaluate(NoShadowingOrOverridesOnMethodsRule.java:40)
	at com.carrotsearch.randomizedtesting.rules.NoShadowingOrOverridesOnMethodsRule$1.evaluate(NoShadowingOrOverridesOnMethodsRule.java:40)
	at com.carrotsearch.randomizedtesting.rules.StatementAdapter.evaluate(StatementAdapter.java:36)
	at com.carrotsearch.randomizedtesting.rules.StatementAdapter.evaluate(StatementAdapter.java:36)
	at org.apache.lucene.util.TestRuleAssertionsRequired$1.evaluate(TestRuleAssertionsRequired.java:53)
	at org.apache.lucene.util.TestRuleMarkFailure$1.evaluate(TestRuleMarkFailure.java:47)
	at org.apache.lucene.util.TestRuleIgnoreAfterMaxFailures$1.evaluate(TestRuleIgnoreAfterMaxFailures.java:64)
	at org.apache.lucene.util.TestRuleIgnoreTestSuites$1.evaluate(TestRuleIgnoreTestSuites.java:54)
	at com.carrotsearch.randomizedtesting.rules.StatementAdapter.evaluate(StatementAdapter.java:36)
	at com.carrotsearch.randomizedtesting.ThreadLeakControl$StatementRunner.run(ThreadLeakControl.java:368)
	at java.base/java.lang.Thread.run(Thread.java:841)




Build Log:
[...truncated 12694 lines...]
   [junit4] Suite: org.apache.solr.handler.admin.SegmentsInfoRequestHandlerTest
   [junit4]   2> 288480 INFO  (SUITE-SegmentsInfoRequestHandlerTest-seed#[D83D5ACC5839E8EE]-worker) [    ] o.a.s.SolrTestCaseJ4 SecureRandom sanity checks: test.solr.allowed.securerandom=null & java.security.egd=file:/dev/./urandom
   [junit4]   2> Creating dataDir: /home/jenkins/workspace/Lucene-Solr-7.x-Linux/solr/build/solr-core/test/J0/temp/solr.handler.admin.SegmentsInfoRequestHandlerTest_D83D5ACC5839E8EE-001/init-core-data-001
   [junit4]   2> 288481 WARN  (SUITE-SegmentsInfoRequestHandlerTest-seed#[D83D5ACC5839E8EE]-worker) [    ] o.a.s.SolrTestCaseJ4 startTrackingSearchers: numOpens=14 numCloses=14
   [junit4]   2> 288481 INFO  (SUITE-SegmentsInfoRequestHandlerTest-seed#[D83D5ACC5839E8EE]-worker) [    ] o.a.s.SolrTestCaseJ4 Using PointFields (NUMERIC_POINTS_SYSPROP=true) w/NUMERIC_DOCVALUES_SYSPROP=false
   [junit4]   2> 288482 INFO  (SUITE-SegmentsInfoRequestHandlerTest-seed#[D83D5ACC5839E8EE]-worker) [    ] o.a.s.SolrTestCaseJ4 Randomized ssl (false) and clientAuth (true) via: @org.apache.solr.util.RandomizeSSL(reason="", ssl=0.0/0.0, value=0.0/0.0, clientAuth=0.0/0.0)
   [junit4]   2> 288482 INFO  (SUITE-SegmentsInfoRequestHandlerTest-seed#[D83D5ACC5839E8EE]-worker) [    ] o.a.s.SolrTestCaseJ4 ####initCore
   [junit4]   2> 288483 INFO  (SUITE-SegmentsInfoRequestHandlerTest-seed#[D83D5ACC5839E8EE]-worker) [    ] o.a.s.c.SolrResourceLoader [null] Added 2 libs to classloader, from paths: [/home/jenkins/workspace/Lucene-Solr-7.x-Linux/solr/core/src/test-files/solr/collection1/lib, /home/jenkins/workspace/Lucene-Solr-7.x-Linux/solr/core/src/test-files/solr/collection1/lib/classes]
   [junit4]   2> 288504 INFO  (SUITE-SegmentsInfoRequestHandlerTest-seed#[D83D5ACC5839E8EE]-worker) [    ] o.a.s.c.SolrConfig Using Lucene MatchVersion: 7.4.0
   [junit4]   2> 288524 INFO  (SUITE-SegmentsInfoRequestHandlerTest-seed#[D83D5ACC5839E8EE]-worker) [    ] o.a.s.s.IndexSchema [null] Schema name=test
   [junit4]   2> 288606 WARN  (SUITE-SegmentsInfoRequestHandlerTest-seed#[D83D5ACC5839E8EE]-worker) [    ] o.a.s.s.IndexSchema Field text is not multivalued and destination for multiple copyFields (2)
   [junit4]   2> 288606 INFO  (SUITE-SegmentsInfoRequestHandlerTest-seed#[D83D5ACC5839E8EE]-worker) [    ] o.a.s.s.IndexSchema Loaded schema test/1.4 with uniqueid field id
   [junit4]   2> 288642 INFO  (SUITE-SegmentsInfoRequestHandlerTest-seed#[D83D5ACC5839E8EE]-worker) [    ] o.a.s.m.r.SolrJmxReporter JMX monitoring for 'solr.node' (registry 'solr.node') enabled at server: com.sun.jmx.mbeanserver.JmxMBeanServer@71315f73
   [junit4]   2> 288648 INFO  (SUITE-SegmentsInfoRequestHandlerTest-seed#[D83D5ACC5839E8EE]-worker) [    ] o.a.s.m.r.SolrJmxReporter JMX monitoring for 'solr.jvm' (registry 'solr.jvm') enabled at server: com.sun.jmx.mbeanserver.JmxMBeanServer@71315f73
   [junit4]   2> 288648 INFO  (SUITE-SegmentsInfoRequestHandlerTest-seed#[D83D5ACC5839E8EE]-worker) [    ] o.a.s.m.r.SolrJmxReporter JMX monitoring for 'solr.jetty' (registry 'solr.jetty') enabled at server: com.sun.jmx.mbeanserver.JmxMBeanServer@71315f73
   [junit4]   2> 288650 INFO  (coreLoadExecutor-998-thread-1) [    ] o.a.s.c.TransientSolrCoreCacheDefault Allocating transient cache for 2147483647 transient cores
   [junit4]   2> 288651 INFO  (coreLoadExecutor-998-thread-1) [    x:collection1] o.a.s.c.SolrResourceLoader [null] Added 2 libs to classloader, from paths: [/home/jenkins/workspace/Lucene-Solr-7.x-Linux/solr/core/src/test-files/solr/collection1/lib, /home/jenkins/workspace/Lucene-Solr-7.x-Linux/solr/core/src/test-files/solr/collection1/lib/classes]
   [junit4]   2> 288673 INFO  (coreLoadExecutor-998-thread-1) [    x:collection1] o.a.s.c.SolrConfig Using Lucene MatchVersion: 7.4.0
   [junit4]   2> 288690 INFO  (coreLoadExecutor-998-thread-1) [    x:collection1] o.a.s.s.IndexSchema [collection1] Schema name=test
   [junit4]   2> 288739 WARN  (coreLoadExecutor-998-thread-1) [    x:collection1] o.a.s.s.IndexSchema Field text is not multivalued and destination for multiple copyFields (2)
   [junit4]   2> 288739 INFO  (coreLoadExecutor-998-thread-1) [    x:collection1] o.a.s.s.IndexSchema Loaded schema test/1.4 with uniqueid field id
   [junit4]   2> 288748 INFO  (coreLoadExecutor-998-thread-1) [    x:collection1] o.a.s.c.CoreContainer Creating SolrCore 'collection1' using configuration from instancedir /home/jenkins/workspace/Lucene-Solr-7.x-Linux/solr/core/src/test-files/solr/collection1, trusted=true
   [junit4]   2> 288748 INFO  (coreLoadExecutor-998-thread-1) [    x:collection1] o.a.s.m.r.SolrJmxReporter JMX monitoring for 'solr.core.collection1' (registry 'solr.core.collection1') enabled at server: com.sun.jmx.mbeanserver.JmxMBeanServer@71315f73
   [junit4]   2> 288748 INFO  (coreLoadExecutor-998-thread-1) [    x:collection1] o.a.s.c.SolrCore solr.RecoveryStrategy.Builder
   [junit4]   2> 288748 INFO  (coreLoadExecutor-998-thread-1) [    x:collection1] o.a.s.c.SolrCore [[collection1] ] Opening new SolrCore at [/home/jenkins/workspace/Lucene-Solr-7.x-Linux/solr/core/src/test-files/solr/collection1], dataDir=[/home/jenkins/workspace/Lucene-Solr-7.x-Linux/solr/build/solr-core/test/J0/temp/solr.handler.admin.SegmentsInfoRequestHandlerTest_D83D5ACC5839E8EE-001/init-core-data-001/]
   [junit4]   2> 288790 INFO  (coreLoadExecutor-998-thread-1) [    x:collection1] o.a.s.u.CommitTracker Hard AutoCommit: disabled
   [junit4]   2> 288790 INFO  (coreLoadExecutor-998-thread-1) [    x:collection1] o.a.s.u.CommitTracker Soft AutoCommit: disabled
   [junit4]   2> 288791 INFO  (coreLoadExecutor-998-thread-1) [    x:collection1] o.a.s.s.SolrIndexSearcher Opening [Searcher@2aafa2dd[collection1] main]
   [junit4]   2> 288792 INFO  (coreLoadExecutor-998-thread-1) [    x:collection1] o.a.s.h.c.SpellCheckComponent Initializing spell checkers
   [junit4]   2> 288814 INFO  (coreLoadExecutor-998-thread-1) [    x:collection1] o.a.s.s.DirectSolrSpellChecker init: {name=direct,classname=DirectSolrSpellChecker,field=lowerfilt,minQueryLength=3}
   [junit4]   2> 288915 INFO  (coreLoadExecutor-998-thread-1) [    x:collection1] o.a.s.h.ReplicationHandler Commits will be reserved for 10000ms.
   [junit4]   2> 288915 INFO  (searcherExecutor-999-thread-1-processing-x:collection1) [    x:collection1] o.a.s.h.c.SpellCheckComponent Loading spell index for spellchecker: default
   [junit4]   2> 288916 INFO  (searcherExecutor-999-thread-1-processing-x:collection1) [    x:collection1] o.a.s.h.c.SpellCheckComponent Loading spell index for spellchecker: direct
   [junit4]   2> 288916 INFO  (searcherExecutor-999-thread-1-processing-x:collection1) [    x:collection1] o.a.s.h.c.SpellCheckComponent Loading spell index for spellchecker: wordbreak
   [junit4]   2> 288916 INFO  (searcherExecutor-999-thread-1-processing-x:collection1) [    x:collection1] o.a.s.h.c.SpellCheckComponent Loading spell index for spellchecker: multipleFields
   [junit4]   2> 288916 INFO  (searcherExecutor-999-thread-1-processing-x:collection1) [    x:collection1] o.a.s.h.c.SpellCheckComponent Loading spell index for spellchecker: jarowinkler
   [junit4]   2> 288916 INFO  (searcherExecutor-999-thread-1-processing-x:collection1) [    x:collection1] o.a.s.h.c.SpellCheckComponent Loading spell index for spellchecker: external
   [junit4]   2> 288916 INFO  (SUITE-SegmentsInfoRequestHandlerTest-seed#[D83D5ACC5839E8EE]-worker) [    ] o.a.s.SolrTestCaseJ4 ####initCore end
   [junit4]   2> 288917 INFO  (searcherExecutor-999-thread-1-processing-x:collection1) [    x:collection1] o.a.s.h.c.SpellCheckComponent Loading spell index for spellchecker: freq
   [junit4]   2> 288917 INFO  (searcherExecutor-999-thread-1-processing-x:collection1) [    x:collection1] o.a.s.h.c.SpellCheckComponent Loading spell index for spellchecker: fqcn
   [junit4]   2> 288918 INFO  (searcherExecutor-999-thread-1-processing-x:collection1) [    x:collection1] o.a.s.h.c.SpellCheckComponent Loading spell index for spellchecker: perDict
   [junit4]   2> 288918 INFO  (SUITE-SegmentsInfoRequestHandlerTest-seed#[D83D5ACC5839E8EE]-worker) [    ] o.a.s.u.p.LogUpdateProcessorFactory [collection1]  webapp=null path=null params={}{add=[SOLR1000]} 0 1
   [junit4]   2> 288918 INFO  (searcherExecutor-999-thread-1-processing-x:collection1) [    x:collection1] o.a.s.c.SolrCore [collection1] Registered new searcher Searcher@2aafa2dd[collection1] main{ExitableDirectoryReader(UninvertingDirectoryReader())}
   [junit4]   2> 288919 INFO  (SUITE-SegmentsInfoRequestHandlerTest-seed#[D83D5ACC5839E8EE]-worker) [    ] o.a.s.u.p.LogUpdateProcessorFactory [collection1]  webapp=null path=null params={}{add=[SOLR1001]} 0 0
   [junit4]   2> 288919 INFO  (SUITE-SegmentsInfoRequestHandlerTest-seed#[D83D5ACC5839E8EE]-worker) [    ] o.a.s.u.p.LogUpdateProcessorFactory [collection1]  webapp=null path=null params={}{add=[SOLR1002]} 0 0
   [junit4]   2> 288919 INFO  (SUITE-SegmentsInfoRequestHandlerTest-seed#[D83D5ACC5839E8EE]-worker) [    ] o.a.s.u.p.LogUpdateProcessorFactory [collection1]  webapp=null path=null params={}{add=[SOLR1003]} 0 0
   [junit4]   2> 288919 INFO  (SUITE-SegmentsInfoRequestHandlerTest-seed#[D83D5ACC5839E8EE]-worker) [    ] o.a.s.u.p.LogUpdateProcessorFactory [collection1]  webapp=null path=null params={}{add=[SOLR1004]} 0 0
   [junit4]   2> 288920 INFO  (SUITE-SegmentsInfoRequestHandlerTest-seed#[D83D5ACC5839E8EE]-worker) [    ] o.a.s.u.p.LogUpdateProcessorFactory [collection1]  webapp=null path=null params={}{delete=[SOLR1000]} 0 0
   [junit4]   2> 288920 INFO  (SUITE-SegmentsInfoRequestHandlerTest-seed#[D83D5ACC5839E8EE]-worker) [    ] o.a.s.u.DirectUpdateHandler2 start commit{,optimize=false,openSearcher=true,waitSearcher=true,expungeDeletes=false,softCommit=false,prepareCommit=false}
   [junit4]   2> 288920 INFO  (SUITE-SegmentsInfoRequestHandlerTest-seed#[D83D5ACC5839E8EE]-worker) [    ] o.a.s.u.SolrIndexWriter Calling setCommitData with IW:org.apache.solr.update.SolrIndexWriter@11294e62 commitCommandVersion:0
   [junit4]   2> 288923 INFO  (SUITE-SegmentsInfoRequestHandlerTest-seed#[D83D5ACC5839E8EE]-worker) [    ] o.a.s.s.SolrIndexSearcher Opening [Searcher@33ae9545[collection1] main]
   [junit4]   2> 288923 INFO  (SUITE-SegmentsInfoRequestHandlerTest-seed#[D83D5ACC5839E8EE]-worker) [    ] o.a.s.u.DirectUpdateHandler2 end_commit_flush
   [junit4]   2> 288924 INFO  (searcherExecutor-999-thread-1) [    ] o.a.s.c.SolrCore [collection1] Registered new searcher Searcher@33ae9545[collection1] main{ExitableDirectoryReader(UninvertingDirectoryReader(Uninverting(_0(7.4.0):c5/1:delGen=1)))}
   [junit4]   2> 288924 INFO  (SUITE-SegmentsInfoRequestHandlerTest-seed#[D83D5ACC5839E8EE]-worker) [    ] o.a.s.u.p.LogUpdateProcessorFactory [collection1]  webapp=null path=null params={}{commit=} 0 4
   [junit4]   2> 288926 INFO  (SUITE-SegmentsInfoRequestHandlerTest-seed#[D83D5ACC5839E8EE]-worker) [    ] o.a.s.u.p.LogUpdateProcessorFactory [collection1]  webapp=null path=null params={}{add=[SOLR2000]} 0 0
   [junit4]   2> 288926 INFO  (SUITE-SegmentsInfoRequestHandlerTest-seed#[D83D5ACC5839E8EE]-worker) [    ] o.a.s.u.p.LogUpdateProcessorFactory [collection1]  webapp=null path=null params={}{add=[SOLR2001]} 0 0
   [junit4]   2> 288926 INFO  (SUITE-SegmentsInfoRequestHandlerTest-seed#[D83D5ACC5839E8EE]-worker) [    ] o.a.s.u.p.LogUpdateProcessorFactory [collection1]  webapp=null path=null params={}{add=[SOLR2002]} 0 0
   [junit4]   2> 288927 INFO  (SUITE-SegmentsInfoRequestHandlerTest-seed#[D83D5ACC5839E8EE]-worker) [    ] o.a.s.u.p.LogUpdateProcessorFactory [collection1]  webapp=null path=null params={}{add=[SOLR2003]} 0 0
   [junit4]   2> 288927 INFO  (SUITE-SegmentsInfoRequestHandlerTest-seed#[D83D5ACC5839E8EE]-worker) [    ] o.a.s.u.p.LogUpdateProcessorFactory [collection1]  webapp=null path=null params={}{add=[SOLR2004]} 0 0
   [junit4]   2> 288927 INFO  (SUITE-SegmentsInfoRequestHandlerTest-seed#[D83D5ACC5839E8EE]-worker) [    ] o.a.s.u.DirectUpdateHandler2 start commit{,optimize=false,openSearcher=true,waitSearcher=true,expungeDeletes=false,softCommit=false,prepareCommit=false}
   [junit4]   2> 288927 INFO  (SUITE-SegmentsInfoRequestHandlerTest-seed#[D83D5ACC5839E8EE]-worker) [    ] o.a.s.u.SolrIndexWriter Calling setCommitData with IW:org.apache.solr.update.SolrIndexWriter@11294e62 commitCommandVersion:0
   [junit4]   2> 288930 INFO  (SUITE-SegmentsInfoRequestHandlerTest-seed#[D83D5ACC5839E8EE]-worker) [    ] o.a.s.s.SolrIndexSearcher Opening [Searcher@62e3d51d[collection1] main]
   [junit4]   2> 288931 INFO  (searcherExecutor-999-thread-1) [    ] o.a.s.c.SolrCore [collection1] Registered new searcher Searcher@62e3d51d[collection1] main{ExitableDirectoryReader(UninvertingDirectoryReader(Uninverting(_0(7.4.0):c5/1:delGen=1) Uninverting(_1(7.4.0):c5)))}
   [junit4]   2> 288931 INFO  (SUITE-SegmentsInfoRequestHandlerTest-seed#[D83D5ACC5839E8EE]-worker) [    ] o.a.s.u.DirectUpdateHandler2 end_commit_flush
   [junit4]   2> 288931 INFO  (SUITE-SegmentsInfoRequestHandlerTest-seed#[D83D5ACC5839E8EE]-worker) [    ] o.a.s.u.p.LogUpdateProcessorFactory [collection1]  webapp=null path=null params={}{commit=} 0 4
   [junit4]   2> 288933 INFO  (TEST-SegmentsInfoRequestHandlerTest.testSegmentInfos-seed#[D83D5ACC5839E8EE]) [    ] o.a.s.SolrTestCaseJ4 ###Starting testSegmentInfos
   [junit4]   2> 288933 INFO  (TEST-SegmentsInfoRequestHandlerTest.testSegmentInfos-seed#[D83D5ACC5839E8EE]) [    ] o.a.s.SolrTestCaseJ4 ###Ending testSegmentInfos
   [junit4]   2> NOTE: reproduce with: ant test  -Dtestcase=SegmentsInfoRequestHandlerTest -Dtests.method=testSegmentInfos -Dtests.seed=D83D5ACC5839E8EE -Dtests.multiplier=3 -Dtests.slow=true -Dtests.locale=ro-MD -Dtests.timezone=Etc/UTC -Dtests.asserts=true -Dtests.file.encoding=UTF-8
   [junit4] FAILURE 0.00s J0 | SegmentsInfoRequestHandlerTest.testSegmentInfos <<<
   [junit4]    > Throwable #1: java.lang.AssertionError
   [junit4]    > 	at __randomizedtesting.SeedInfo.seed([D83D5ACC5839E8EE:946ACD73923530BE]:0)
   [junit4]    > 	at org.apache.lucene.index.IndexWriter$ReaderPool.noDups(IndexWriter.java:867)
   [junit4]    > 	at org.apache.lucene.index.IndexWriter$ReaderPool.get(IndexWriter.java:857)
   [junit4]    > 	at org.apache.lucene.index.IndexWriter.numDeletesToMerge(IndexWriter.java:5235)
   [junit4]    > 	at org.apache.lucene.index.LogMergePolicy.sizeDocs(LogMergePolicy.java:153)
   [junit4]    > 	at org.apache.lucene.index.LogDocMergePolicy.size(LogDocMergePolicy.java:44)
   [junit4]    > 	at org.apache.lucene.index.LogMergePolicy.findMerges(LogMergePolicy.java:469)
   [junit4]    > 	at org.apache.solr.handler.admin.SegmentsInfoRequestHandler.getMergeCandidatesNames(SegmentsInfoRequestHandler.java:100)
   [junit4]    > 	at org.apache.solr.handler.admin.SegmentsInfoRequestHandler.getSegmentsInfo(SegmentsInfoRequestHandler.java:59)
   [junit4]    > 	at org.apache.solr.handler.admin.SegmentsInfoRequestHandler.handleRequestBody(SegmentsInfoRequestHandler.java:48)
   [junit4]    > 	at org.apache.solr.handler.RequestHandlerBase.handleRequest(RequestHandlerBase.java:199)
   [junit4]    > 	at org.apache.solr.core.SolrCore.execute(SolrCore.java:2508)
   [junit4]    > 	at org.apache.solr.util.TestHarness.query(TestHarness.java:337)
   [junit4]    > 	at org.apache.solr.util.TestHarness.query(TestHarness.java:319)
   [junit4]    > 	at org.apache.solr.SolrTestCaseJ4.assertQ(SolrTestCaseJ4.java:890)
   [junit4]    > 	at org.apache.solr.handler.admin.SegmentsInfoRequestHandlerTest.testSegmentInfos(SegmentsInfoRequestHandlerTest.java:61)
   [junit4]    > 	at java.base/jdk.internal.reflect.NativeMethodAccessorImpl.invoke0(Native Method)
   [junit4]    > 	at java.base/jdk.internal.reflect.NativeMethodAccessorImpl.invoke(NativeMethodAccessorImpl.java:62)
   [junit4]    > 	at java.base/jdk.internal.reflect.DelegatingMethodAccessorImpl.invoke(DelegatingMethodAccessorImpl.java:43)
   [junit4]    > 	at java.base/java.lang.reflect.Method.invoke(Method.java:564)
   [junit4]    > 	at java.base/java.lang.Thread.run(Thread.java:841)
   [junit4]   2> 288935 INFO  (TEST-SegmentsInfoRequestHandlerTest.testSegmentInfosVersion-seed#[D83D5ACC5839E8EE]) [    ] o.a.s.SolrTestCaseJ4 ###Starting testSegmentInfosVersion
   [junit4]   2> 288936 INFO  (TEST-SegmentsInfoRequestHandlerTest.testSegmentInfosVersion-seed#[D83D5ACC5839E8EE]) [    ] o.a.s.SolrTestCaseJ4 ###Ending testSegmentInfosVersion
   [junit4]   2> NOTE: reproduce with: ant test  -Dtestcase=SegmentsInfoRequestHandlerTest -Dtests.method=testSegmentInfosVersion -Dtests.seed=D83D5ACC5839E8EE -Dtests.multiplier=3 -Dtests.slow=true -Dtests.locale=ro-MD -Dtests.timezone=Etc/UTC -Dtests.asserts=true -Dtests.file.encoding=UTF-8
   [junit4] FAILURE 0.00s J0 | SegmentsInfoRequestHandlerTest.testSegmentInfosVersion <<<
   [junit4]    > Throwable #1: java.lang.AssertionError
   [junit4]    > 	at __randomizedtesting.SeedInfo.seed([D83D5ACC5839E8EE:20E3CF24205539BD]:0)
   [junit4]    > 	at org.apache.lucene.index.IndexWriter$ReaderPool.noDups(IndexWriter.java:867)
   [junit4]    > 	at org.apache.lucene.index.IndexWriter$ReaderPool.get(IndexWriter.java:857)
   [junit4]    > 	at org.apache.lucene.index.IndexWriter.numDeletesToMerge(IndexWriter.java:5235)
   [junit4]    > 	at org.apache.lucene.index.LogMergePolicy.sizeDocs(LogMergePolicy.java:153)
   [junit4]    > 	at org.apache.lucene.index.LogDocMergePolicy.size(LogDocMergePolicy.java:44)
   [junit4]    > 	at org.apache.lucene.index.LogMergePolicy.findMerges(LogMergePolicy.java:469)
   [junit4]    > 	at org.apache.solr.handler.admin.SegmentsInfoRequestHandler.getMergeCandidatesNames(SegmentsInfoRequestHandler.java:100)
   [junit4]    > 	at org.apache.solr.handler.admin.SegmentsInfoRequestHandler.getSegmentsInfo(SegmentsInfoRequestHandler.java:59)
   [junit4]    > 	at org.apache.solr.handler.admin.SegmentsInfoRequestHandler.handleRequestBody(SegmentsInfoRequestHandler.java:48)
   [junit4]    > 	at org.apache.solr.handler.RequestHandlerBase.handleRequest(RequestHandlerBase.java:199)
   [junit4]    > 	at org.apache.solr.core.SolrCore.execute(SolrCore.java:2508)
   [junit4]    > 	at org.apache.solr.util.TestHarness.query(TestHarness.java:337)
   [junit4]    > 	at org.apache.solr.util.TestHarness.query(TestHarness.java:319)
   [junit4]    > 	at org.apache.solr.SolrTestCaseJ4.assertQ(SolrTestCaseJ4.java:890)
   [junit4]    > 	at org.apache.solr.handler.admin.SegmentsInfoRequestHandlerTest.testSegmentInfosVersion(SegmentsInfoRequestHandlerTest.java:68)
   [junit4]    > 	at java.base/jdk.internal.reflect.NativeMethodAccessorImpl.invoke0(Native Method)
   [junit4]    > 	at java.base/jdk.internal.reflect.NativeMethodAccessorImpl.invoke(NativeMethodAccessorImpl.java:62)
   [junit4]    > 	at java.base/jdk.internal.reflect.DelegatingMethodAccessorImpl.invoke(DelegatingMethodAccessorImpl.java:43)
   [junit4]    > 	at java.base/java.lang.reflect.Method.invoke(Method.java:564)
   [junit4]    > 	at java.base/java.lang.Thread.run(Thread.java:841)
   [junit4]   2> 288937 INFO  (TEST-SegmentsInfoRequestHandlerTest.testSegmentInfosData-seed#[D83D5ACC5839E8EE]) [    ] o.a.s.SolrTestCaseJ4 ###Starting testSegmentInfosData
   [junit4]   2> 288938 INFO  (TEST-SegmentsInfoRequestHandlerTest.testSegmentInfosData-seed#[D83D5ACC5839E8EE]) [    ] o.a.s.SolrTestCaseJ4 ###Ending testSegmentInfosData
   [junit4]   2> NOTE: reproduce with: ant test  -Dtestcase=SegmentsInfoRequestHandlerTest -Dtests.method=testSegmentInfosData -Dtests.seed=D83D5ACC5839E8EE -Dtests.multiplier=3 -Dtests.slow=true -Dtests.locale=ro-MD -Dtests.timezone=Etc/UTC -Dtests.asserts=true -Dtests.file.encoding=UTF-8
   [junit4] FAILURE 0.00s J0 | SegmentsInfoRequestHandlerTest.testSegmentInfosData <<<
   [junit4]    > Throwable #1: java.lang.AssertionError
   [junit4]    > 	at __randomizedtesting.SeedInfo.seed([D83D5ACC5839E8EE:A4947897EED15F71]:0)
   [junit4]    > 	at org.apache.lucene.index.IndexWriter$ReaderPool.noDups(IndexWriter.java:867)
   [junit4]    > 	at org.apache.lucene.index.IndexWriter$ReaderPool.get(IndexWriter.java:857)
   [junit4]    > 	at org.apache.lucene.index.IndexWriter.numDeletesToMerge(IndexWriter.java:5235)
   [junit4]    > 	at org.apache.lucene.index.LogMergePolicy.sizeDocs(LogMergePolicy.java:153)
   [junit4]    > 	at org.apache.lucene.index.LogDocMergePolicy.size(LogDocMergePolicy.java:44)
   [junit4]    > 	at org.apache.lucene.index.LogMergePolicy.findMerges(LogMergePolicy.java:469)
   [junit4]    > 	at org.apache.solr.handler.admin.SegmentsInfoRequestHandler.getMergeCandidatesNames(SegmentsInfoRequestHandler.java:100)
   [junit4]    > 	at org.apache.solr.handler.admin.SegmentsInfoRequestHandler.getSegmentsInfo(SegmentsInfoRequestHandler.java:59)
   [junit4]    > 	at org.apache.solr.handler.admin.SegmentsInfoRequestHandler.handleRequestBody(SegmentsInfoRequestHandler.java:48)
   [junit4]    > 	at org.apache.solr.handler.RequestHandlerBase.handleRequest(RequestHandlerBase.java:199)
   [junit4]    > 	at org.apache.solr.core.SolrCore.execute(SolrCore.java:2508)
   [junit4]    > 	at org.apache.solr.util.TestHarness.query(TestHarness.java:337)
   [junit4]    > 	at org.apache.solr.util.TestHarness.query(TestHarness.java:319)
   [junit4]    > 	at org.apache.solr.SolrTestCaseJ4.assertQ(SolrTestCaseJ4.java:890)
   [junit4]    > 	at org.apache.solr.handler.admin.SegmentsInfoRequestHandlerTest.testSegmentInfosData(SegmentsInfoRequestHandlerTest.java:75)
   [junit4]    > 	at java.base/jdk.internal.reflect.NativeMethodAccessorImpl.invoke0(Native Method)
   [junit4]    > 	at java.base/jdk.internal.reflect.NativeMethodAccessorImpl.invoke(NativeMethodAccessorImpl.java:62)
   [junit4]    > 	at java.base/jdk.internal.reflect.DelegatingMethodAccessorImpl.invoke(DelegatingMethodAccessorImpl.java:43)
   [junit4]    > 	at java.base/java.lang.reflect.Method.invoke(Method.java:564)
   [junit4]    > 	at java.base/java.lang.Thread.run(Thread.java:841)
   [junit4]   2> 288940 INFO  (SUITE-SegmentsInfoRequestHandlerTest-seed#[D83D5ACC5839E8EE]-worker) [    ] o.a.s.SolrTestCaseJ4 ###deleteCore
   [junit4]   2> 288940 INFO  (SUITE-SegmentsInfoRequestHandlerTest-seed#[D83D5ACC5839E8EE]-worker) [    ] o.a.s.c.CoreContainer Shutting down CoreContainer instance=1899981782
   [junit4]   2> 288940 INFO  (SUITE-SegmentsInfoRequestHandlerTest-seed#[D83D5ACC5839E8EE]-worker) [    ] o.a.s.m.SolrMetricManager Closing metric reporters for registry=solr.node, tag=null
   [junit4]   2> 288940 INFO  (SUITE-SegmentsInfoRequestHandlerTest-seed#[D83D5ACC5839E8EE]-worker) [    ] o.a.s.m.r.SolrJmxReporter Closing reporter [org.apache.solr.metrics.reporters.SolrJmxReporter@3b0ec013: rootName = null, domain = solr.node, service url = null, agent id = null] for registry solr.node / com.codahale.metrics.MetricRegistry@3a703e33
   [junit4]   2> 288944 INFO  (SUITE-SegmentsInfoRequestHandlerTest-seed#[D83D5ACC5839E8EE]-worker) [    ] o.a.s.m.SolrMetricManager Closing metric reporters for registry=solr.jvm, tag=null
   [junit4]   2> 288945 INFO  (SUITE-SegmentsInfoRequestHandlerTest-seed#[D83D5ACC5839E8EE]-worker) [    ] o.a.s.m.r.SolrJmxReporter Closing reporter [org.apache.solr.metrics.reporters.SolrJmxReporter@214c5abf: rootName = null, domain = solr.jvm, service url = null, agent id = null] for registry solr.jvm / com.codahale.metrics.MetricRegistry@618db7de
   [junit4]   2> 288946 INFO  (SUITE-SegmentsInfoRequestHandlerTest-seed#[D83D5ACC5839E8EE]-worker) [    ] o.a.s.m.SolrMetricManager Closing metric reporters for registry=solr.jetty, tag=null
   [junit4]   2> 288946 INFO  (SUITE-SegmentsInfoRequestHandlerTest-seed#[D83D5ACC5839E8EE]-worker) [    ] o.a.s.m.r.SolrJmxReporter Closing reporter [org.apache.solr.metrics.reporters.SolrJmxReporter@123f19bd: rootName = null, domain = solr.jetty, service url = null, agent id = null] for registry solr.jetty / com.codahale.metrics.MetricRegistry@6c7e172b
   [junit4]   2> 288957 INFO  (coreCloseExecutor-1003-thread-1) [    x:collection1] o.a.s.c.SolrCore [collection1]  CLOSING SolrCore org.apache.solr.core.SolrCore@5a7baa23
   [junit4]   2> 288957 INFO  (coreCloseExecutor-1003-thread-1) [    x:collection1] o.a.s.m.SolrMetricManager Closing metric reporters for registry=solr.core.collection1, tag=5a7baa23
   [junit4]   2> 288957 INFO  (coreCloseExecutor-1003-thread-1) [    x:collection1] o.a.s.m.r.SolrJmxReporter Closing reporter [org.apache.solr.metrics.reporters.SolrJmxReporter@23ce9118: rootName = null, domain = solr.core.collection1, service url = null, agent id = null] for registry solr.core.collection1 / com.codahale.metrics.MetricRegistry@50512b74
   [junit4]   2> NOTE: leaving temporary files on disk at: /home/jenkins/workspace/Lucene-Solr-7.x-Linux/solr/build/solr-core/test/J0/temp/solr.handler.admin.SegmentsInfoRequestHandlerTest_D83D5ACC5839E8EE-001
   [junit4]   2> NOTE: test params are: codec=Asserting(Lucene70): {name=FST50, id=FST50}, docValues:{}, maxPointsInLeafNode=398, maxMBSortInHeap=7.769480488917711, sim=RandomSimilarity(queryNorm=false): {}, locale=ro-MD, timezone=Etc/UTC
   [junit4]   2> NOTE: Linux 4.13.0-37-generic amd64/Oracle Corporation 11-ea (64-bit)/cpus=8,threads=1,free=190928856,total=498073600
   [junit4]   2> NOTE: All tests run in this JVM: [TestJsonFacetRefinement, PluginInfoTest, ZkFailoverTest, TestClassicSimilarityFactory, StatsComponentTest, TestManagedResource, ClassificationUpdateProcessorFactoryTest, TestMiniSolrCloudClusterSSL, ZkSolrClientTest, CleanupOldIndexTest, TestDynamicFieldResource, SuggesterWFSTTest, CurrencyRangeFacetCloudTest, EchoParamsTest, TestEmbeddedSolrServerConstructors, AutoscalingHistoryHandlerTest, RollingRestartTest, TestManagedSynonymFilterFactory, TestCloudManagedSchema, NodeLostTriggerIntegrationTest, OpenCloseCoreStressTest, DistribJoinFromCollectionTest, SegmentsInfoRequestHandlerTest]
   [junit4] Completed [96/802 (1!)] on J0 in 0.50s, 3 tests, 3 failures <<< FAILURES!

[...truncated 46258 lines...]
[repro] Jenkins log URL: https://jenkins.thetaphi.de/job/Lucene-Solr-7.x-Linux/1733/consoleText

[repro] Revision: d9ef3a3d02870af55d7ee7447852fbdf374bf238

[repro] Ant options: "-Dargs=-XX:+UseCompressedOops -XX:+UseParallelGC"
[repro] Repro line:  ant test  -Dtestcase=SegmentsInfoRequestHandlerTest -Dtests.method=testSegmentInfos -Dtests.seed=D83D5ACC5839E8EE -Dtests.multiplier=3 -Dtests.slow=true -Dtests.locale=ro-MD -Dtests.timezone=Etc/UTC -Dtests.asserts=true -Dtests.file.encoding=UTF-8

[repro] Repro line:  ant test  -Dtestcase=SegmentsInfoRequestHandlerTest -Dtests.method=testSegmentInfosVersion -Dtests.seed=D83D5ACC5839E8EE -Dtests.multiplier=3 -Dtests.slow=true -Dtests.locale=ro-MD -Dtests.timezone=Etc/UTC -Dtests.asserts=true -Dtests.file.encoding=UTF-8

[repro] Repro line:  ant test  -Dtestcase=SegmentsInfoRequestHandlerTest -Dtests.method=testSegmentInfosData -Dtests.seed=D83D5ACC5839E8EE -Dtests.multiplier=3 -Dtests.slow=true -Dtests.locale=ro-MD -Dtests.timezone=Etc/UTC -Dtests.asserts=true -Dtests.file.encoding=UTF-8

[repro] ant clean

[...truncated 6 lines...]
[repro] Test suites by module:
[repro]    solr/core
[repro]       SegmentsInfoRequestHandlerTest
[repro] ant compile-test

[...truncated 3321 lines...]
[repro] ant test-nocompile -Dtests.dups=5 -Dtests.maxfailures=5 -Dtests.class="*.SegmentsInfoRequestHandlerTest" -Dtests.showOutput=onerror "-Dargs=-XX:+UseCompressedOops -XX:+UseParallelGC" -Dtests.seed=D83D5ACC5839E8EE -Dtests.multiplier=3 -Dtests.slow=true -Dtests.locale=ro-MD -Dtests.timezone=Etc/UTC -Dtests.asserts=true -Dtests.file.encoding=UTF-8

[...truncated 32 lines...]
   [junit4] Suite: org.apache.solr.handler.admin.SegmentsInfoRequestHandlerTest
   [junit4]   2> 2409 INFO  (SUITE-SegmentsInfoRequestHandlerTest-seed#[D83D5ACC5839E8EE]-worker) [    ] o.a.s.SolrTestCaseJ4 SecureRandom sanity checks: test.solr.allowed.securerandom=null & java.security.egd=file:/dev/./urandom
   [junit4]   2> Creating dataDir: /home/jenkins/workspace/Lucene-Solr-7.x-Linux/solr/build/solr-core/test/J2/temp/solr.handler.admin.SegmentsInfoRequestHandlerTest_D83D5ACC5839E8EE-001/init-core-data-001
   [junit4]   2> 2479 INFO  (SUITE-SegmentsInfoRequestHandlerTest-seed#[D83D5ACC5839E8EE]-worker) [    ] o.a.s.SolrTestCaseJ4 Using PointFields (NUMERIC_POINTS_SYSPROP=true) w/NUMERIC_DOCVALUES_SYSPROP=false
   [junit4]   2> 2527 INFO  (SUITE-SegmentsInfoRequestHandlerTest-seed#[D83D5ACC5839E8EE]-worker) [    ] o.e.j.u.log Logging initialized @2553ms to org.eclipse.jetty.util.log.Slf4jLog
   [junit4]   2> 2536 INFO  (SUITE-SegmentsInfoRequestHandlerTest-seed#[D83D5ACC5839E8EE]-worker) [    ] o.a.s.SolrTestCaseJ4 Randomized ssl (false) and clientAuth (true) via: @org.apache.solr.util.RandomizeSSL(reason="", ssl=0.0/0.0, value=0.0/0.0, clientAuth=0.0/0.0)
   [junit4]   2> 2543 INFO  (SUITE-SegmentsInfoRequestHandlerTest-seed#[D83D5ACC5839E8EE]-worker) [    ] o.a.s.SolrTestCaseJ4 ####initCore
   [junit4]   2> 2650 INFO  (SUITE-SegmentsInfoRequestHandlerTest-seed#[D83D5ACC5839E8EE]-worker) [    ] o.a.s.c.SolrResourceLoader Using system property solr.solr.home: /home/jenkins/workspace/Lucene-Solr-7.x-Linux/solr/core/src/test-files/solr
   [junit4]   2> 2653 INFO  (SUITE-SegmentsInfoRequestHandlerTest-seed#[D83D5ACC5839E8EE]-worker) [    ] o.a.s.c.SolrResourceLoader [null] Added 2 libs to classloader, from paths: [/home/jenkins/workspace/Lucene-Solr-7.x-Linux/solr/core/src/test-files/solr/collection1/lib, /home/jenkins/workspace/Lucene-Solr-7.x-Linux/solr/core/src/test-files/solr/collection1/lib/classes]
   [junit4]   2> 2969 INFO  (SUITE-SegmentsInfoRequestHandlerTest-seed#[D83D5ACC5839E8EE]-worker) [    ] o.a.s.c.SolrConfig Using Lucene MatchVersion: 7.4.0
   [junit4]   2> 3133 INFO  (SUITE-SegmentsInfoRequestHandlerTest-seed#[D83D5ACC5839E8EE]-worker) [    ] o.a.s.s.IndexSchema [null] Schema name=test
   [junit4]   2> 3351 WARN  (SUITE-SegmentsInfoRequestHandlerTest-seed#[D83D5ACC5839E8EE]-worker) [    ] o.a.s.c.SolrResourceLoader Solr loaded a deprecated plugin/analysis class [solr.GeoHashField]. Please consult documentation how to replace it accordingly.
   [junit4]   2> 3356 WARN  (SUITE-SegmentsInfoRequestHandlerTest-seed#[D83D5ACC5839E8EE]-worker) [    ] o.a.s.c.SolrResourceLoader Solr loaded a deprecated plugin/analysis class [solr.LatLonType]. Please consult documentation how to replace it accordingly.
   [junit4]   2> 3461 WARN  (SUITE-SegmentsInfoRequestHandlerTest-seed#[D83D5ACC5839E8EE]-worker) [    ] o.a.s.c.SolrResourceLoader Solr loaded a deprecated plugin/analysis class [solr.CurrencyField]. Please consult documentation how to replace it accordingly.
   [junit4]   2> 3527 WARN  (SUITE-SegmentsInfoRequestHandlerTest-seed#[D83D5ACC5839E8EE]-worker) [    ] o.a.s.s.IndexSchema Field text is not multivalued and destination for multiple copyFields (2)
   [junit4]   2> 3529 INFO  (SUITE-SegmentsInfoRequestHandlerTest-seed#[D83D5ACC5839E8EE]-worker) [    ] o.a.s.s.IndexSchema Loaded schema test/1.4 with uniqueid field id
   [junit4]   2> 4132 INFO  (SUITE-SegmentsInfoRequestHandlerTest-seed#[D83D5ACC5839E8EE]-worker) [    ] o.a.s.m.r.SolrJmxReporter JMX monitoring for 'solr.node' (registry 'solr.node') enabled at server: com.sun.jmx.mbeanserver.JmxMBeanServer@67bda047
   [junit4]   2> 4133 INFO  (SUITE-SegmentsInfoRequestHandlerTest-seed#[D83D5ACC5839E8EE]-worker) [    ] o.a.s.m.r.SolrJmxReporter JMX monitoring for 'solr.jvm' (registry 'solr.jvm') enabled at server: com.sun.jmx.mbeanserver.JmxMBeanServer@67bda047
   [junit4]   2> 4133 INFO  (SUITE-SegmentsInfoRequestHandlerTest-seed#[D83D5ACC5839E8EE]-worker) [    ] o.a.s.m.r.SolrJmxReporter JMX monitoring for 'solr.jetty' (registry 'solr.jetty') enabled at server: com.sun.jmx.mbeanserver.JmxMBeanServer@67bda047
   [junit4]   2> 4179 INFO  (coreLoadExecutor-6-thread-1) [    ] o.a.s.c.TransientSolrCoreCacheDefault Allocating transient cache for 2147483647 transient cores
   [junit4]   2> 4184 INFO  (coreLoadExecutor-6-thread-1) [    x:collection1] o.a.s.c.SolrResourceLoader [null] Added 2 libs to classloader, from paths: [/home/jenkins/workspace/Lucene-Solr-7.x-Linux/solr/core/src/test-files/solr/collection1/lib, /home/jenkins/workspace/Lucene-Solr-7.x-Linux/solr/core/src/test-files/solr/collection1/lib/classes]
   [junit4]   2> 4314 INFO  (coreLoadExecutor-6-thread-1) [    x:collection1] o.a.s.c.SolrConfig Using Lucene MatchVersion: 7.4.0
   [junit4]   2> 4364 INFO  (coreLoadExecutor-6-thread-1) [    x:collection1] o.a.s.s.IndexSchema [collection1] Schema name=test
   [junit4]   2> 4508 WARN  (coreLoadExecutor-6-thread-1) [    x:collection1] o.a.s.s.IndexSchema Field text is not multivalued and destination for multiple copyFields (2)
   [junit4]   2> 4509 INFO  (coreLoadExecutor-6-thread-1) [    x:collection1] o.a.s.s.IndexSchema Loaded schema test/1.4 with uniqueid field id
   [junit4]   2> 4574 INFO  (coreLoadExecutor-6-thread-1) [    x:collection1] o.a.s.c.CoreContainer Creating SolrCore 'collection1' using configuration from instancedir /home/jenkins/workspace/Lucene-Solr-7.x-Linux/solr/core/src/test-files/solr/collection1, trusted=true
   [junit4]   2> 4679 INFO  (coreLoadExecutor-6-thread-1) [    x:collection1] o.a.s.m.r.SolrJmxReporter JMX monitoring for 'solr.core.collection1' (registry 'solr.core.collection1') enabled at server: com.sun.jmx.mbeanserver.JmxMBeanServer@67bda047
   [junit4]   2> 4684 INFO  (coreLoadExecutor-6-thread-1) [    x:collection1] o.a.s.c.SolrCore solr.RecoveryStrategy.Builder
   [junit4]   2> 4692 INFO  (coreLoadExecutor-6-thread-1) [    x:collection1] o.a.s.c.SolrCore [[collection1] ] Opening new SolrCore at [/home/jenkins/workspace/Lucene-Solr-7.x-Linux/solr/core/src/test-files/solr/collection1], dataDir=[/home/jenkins/workspace/Lucene-Solr-7.x-Linux/solr/build/solr-core/test/J2/temp/solr.handler.admin.SegmentsInfoRequestHandlerTest_D83D5ACC5839E8EE-001/init-core-data-001/]
   [junit4]   2> 4779 WARN  (coreLoadExecutor-6-thread-1) [    x:collection1] o.a.s.c.SolrResourceLoader Solr loaded a deprecated plugin/analysis class [solr.OldLuceneQParserPlugin]. Please consult documentation how to replace it accordingly.
   [junit4]   2> 5124 INFO  (coreLoadExecutor-6-thread-1) [    x:collection1] o.a.s.u.CommitTracker Hard AutoCommit: disabled
   [junit4]   2> 5125 INFO  (coreLoadExecutor-6-thread-1) [    x:collection1] o.a.s.u.CommitTracker Soft AutoCommit: disabled
   [junit4]   2> 5136 INFO  (coreLoadExecutor-6-thread-1) [    x:collection1] o.a.s.s.SolrIndexSearcher Opening [Searcher@306455d5[collection1] main]
   [junit4]   2> 5160 INFO  (coreLoadExecutor-6-thread-1) [    x:collection1] o.a.s.h.c.SpellCheckComponent Initializing spell checkers
   [junit4]   2> 5217 INFO  (coreLoadExecutor-6-thread-1) [    x:collection1] o.a.s.s.DirectSolrSpellChecker init: {name=direct,classname=DirectSolrSpellChecker,field=lowerfilt,minQueryLength=3}
   [junit4]   2> 5368 INFO  (coreLoadExecutor-6-thread-1) [    x:collection1] o.a.s.h.ReplicationHandler Commits will be reserved for 10000ms.
   [junit4]   2> 5369 INFO  (searcherExecutor-7-thread-1-processing-x:collection1) [    x:collection1] o.a.s.h.c.SpellCheckComponent Loading spell index for spellchecker: default
   [junit4]   2> 5374 INFO  (searcherExecutor-7-thread-1-processing-x:collection1) [    x:collection1] o.a.s.h.c.SpellCheckComponent Loading spell index for spellchecker: direct
   [junit4]   2> 5374 INFO  (searcherExecutor-7-thread-1-processing-x:collection1) [    x:collection1] o.a.s.h.c.SpellCheckComponent Loading spell index for spellchecker: wordbreak
   [junit4]   2> 5374 INFO  (searcherExecutor-7-thread-1-processing-x:collection1) [    x:collection1] o.a.s.h.c.SpellCheckComponent Loading spell index for spellchecker: multipleFields
   [junit4]   2> 5375 INFO  (searcherExecutor-7-thread-1-processing-x:collection1) [    x:collection1] o.a.s.h.c.SpellCheckComponent Loading spell index for spellchecker: jarowinkler
   [junit4]   2> 5376 INFO  (searcherExecutor-7-thread-1-processing-x:collection1) [    x:collection1] o.a.s.h.c.SpellCheckComponent Loading spell index for spellchecker: external
   [junit4]   2> 5376 INFO  (searcherExecutor-7-thread-1-processing-x:collection1) [    x:collection1] o.a.s.h.c.SpellCheckComponent Loading spell index for spellchecker: freq
   [junit4]   2> 5377 INFO  (SUITE-SegmentsInfoRequestHandlerTest-seed#[D83D5ACC5839E8EE]-worker) [    ] o.a.s.SolrTestCaseJ4 ####initCore end
   [junit4]   2> 5377 INFO  (searcherExecutor-7-thread-1-processing-x:collection1) [    x:collection1] o.a.s.h.c.SpellCheckComponent Loading spell index for spellchecker: fqcn
   [junit4]   2> 5378 INFO  (searcherExecutor-7-thread-1-processing-x:collection1) [    x:collection1] o.a.s.h.c.SpellCheckComponent Loading spell index for spellchecker: perDict
   [junit4]   2> 5382 INFO  (searcherExecutor-7-thread-1-processing-x:collection1) [    x:collection1] o.a.s.c.SolrCore [collection1] Registered new searcher Searcher@306455d5[collection1] main{ExitableDirectoryReader(UninvertingDirectoryReader())}
   [junit4]   2> 5455 INFO  (SUITE-SegmentsInfoRequestHandlerTest-seed#[D83D5ACC5839E8EE]-worker) [    ] o.a.s.u.p.LogUpdateProcessorF

[...truncated too long message...]

 [junit4]    > 	at org.apache.solr.handler.admin.SegmentsInfoRequestHandler.getMergeCandidatesNames(SegmentsInfoRequestHandler.java:100)
   [junit4]    > 	at org.apache.solr.handler.admin.SegmentsInfoRequestHandler.getSegmentsInfo(SegmentsInfoRequestHandler.java:59)
   [junit4]    > 	at org.apache.solr.handler.admin.SegmentsInfoRequestHandler.handleRequestBody(SegmentsInfoRequestHandler.java:48)
   [junit4]    > 	at org.apache.solr.handler.RequestHandlerBase.handleRequest(RequestHandlerBase.java:199)
   [junit4]    > 	at org.apache.solr.core.SolrCore.execute(SolrCore.java:2508)
   [junit4]    > 	at org.apache.solr.util.TestHarness.query(TestHarness.java:337)
   [junit4]    > 	at org.apache.solr.util.TestHarness.query(TestHarness.java:319)
   [junit4]    > 	at org.apache.solr.SolrTestCaseJ4.assertQ(SolrTestCaseJ4.java:890)
   [junit4]    > 	at org.apache.solr.handler.admin.SegmentsInfoRequestHandlerTest.testSegmentInfos(SegmentsInfoRequestHandlerTest.java:61)
   [junit4]    > 	at java.base/jdk.internal.reflect.NativeMethodAccessorImpl.invoke0(Native Method)
   [junit4]    > 	at java.base/jdk.internal.reflect.NativeMethodAccessorImpl.invoke(NativeMethodAccessorImpl.java:62)
   [junit4]    > 	at java.base/jdk.internal.reflect.DelegatingMethodAccessorImpl.invoke(DelegatingMethodAccessorImpl.java:43)
   [junit4]    > 	at java.base/java.lang.reflect.Method.invoke(Method.java:564)
   [junit4]    > 	at java.base/java.lang.Thread.run(Thread.java:841)
   [junit4]   2> 7207 INFO  (TEST-SegmentsInfoRequestHandlerTest.testSegmentInfosVersion-seed#[D83D5ACC5839E8EE]) [    ] o.a.s.SolrTestCaseJ4 ###Starting testSegmentInfosVersion
   [junit4]   2> 7208 INFO  (TEST-SegmentsInfoRequestHandlerTest.testSegmentInfosVersion-seed#[D83D5ACC5839E8EE]) [    ] o.a.s.SolrTestCaseJ4 ###Ending testSegmentInfosVersion
   [junit4]   2> NOTE: reproduce with: ant test  -Dtestcase=SegmentsInfoRequestHandlerTest -Dtests.method=testSegmentInfosVersion -Dtests.seed=D83D5ACC5839E8EE -Dtests.multiplier=3 -Dtests.slow=true -Dtests.badapples=true -Dtests.locale=ro-MD -Dtests.timezone=Etc/UTC -Dtests.asserts=true -Dtests.file.encoding=UTF-8
   [junit4] FAILURE 0.01s J2 | SegmentsInfoRequestHandlerTest.testSegmentInfosVersion <<<
   [junit4]    > Throwable #1: java.lang.AssertionError
   [junit4]    > 	at __randomizedtesting.SeedInfo.seed([D83D5ACC5839E8EE:20E3CF24205539BD]:0)
   [junit4]    > 	at org.apache.lucene.index.IndexWriter$ReaderPool.noDups(IndexWriter.java:867)
   [junit4]    > 	at org.apache.lucene.index.IndexWriter$ReaderPool.get(IndexWriter.java:857)
   [junit4]    > 	at org.apache.lucene.index.IndexWriter.numDeletesToMerge(IndexWriter.java:5235)
   [junit4]    > 	at org.apache.lucene.index.LogMergePolicy.sizeDocs(LogMergePolicy.java:153)
   [junit4]    > 	at org.apache.lucene.index.LogDocMergePolicy.size(LogDocMergePolicy.java:44)
   [junit4]    > 	at org.apache.lucene.index.LogMergePolicy.findMerges(LogMergePolicy.java:469)
   [junit4]    > 	at org.apache.solr.handler.admin.SegmentsInfoRequestHandler.getMergeCandidatesNames(SegmentsInfoRequestHandler.java:100)
   [junit4]    > 	at org.apache.solr.handler.admin.SegmentsInfoRequestHandler.getSegmentsInfo(SegmentsInfoRequestHandler.java:59)
   [junit4]    > 	at org.apache.solr.handler.admin.SegmentsInfoRequestHandler.handleRequestBody(SegmentsInfoRequestHandler.java:48)
   [junit4]    > 	at org.apache.solr.handler.RequestHandlerBase.handleRequest(RequestHandlerBase.java:199)
   [junit4]    > 	at org.apache.solr.core.SolrCore.execute(SolrCore.java:2508)
   [junit4]    > 	at org.apache.solr.util.TestHarness.query(TestHarness.java:337)
   [junit4]    > 	at org.apache.solr.util.TestHarness.query(TestHarness.java:319)
   [junit4]    > 	at org.apache.solr.SolrTestCaseJ4.assertQ(SolrTestCaseJ4.java:890)
   [junit4]    > 	at org.apache.solr.handler.admin.SegmentsInfoRequestHandlerTest.testSegmentInfosVersion(SegmentsInfoRequestHandlerTest.java:68)
   [junit4]    > 	at java.base/jdk.internal.reflect.NativeMethodAccessorImpl.invoke0(Native Method)
   [junit4]    > 	at java.base/jdk.internal.reflect.NativeMethodAccessorImpl.invoke(NativeMethodAccessorImpl.java:62)
   [junit4]    > 	at java.base/jdk.internal.reflect.DelegatingMethodAccessorImpl.invoke(DelegatingMethodAccessorImpl.java:43)
   [junit4]    > 	at java.base/java.lang.reflect.Method.invoke(Method.java:564)
   [junit4]    > 	at java.base/java.lang.Thread.run(Thread.java:841)
   [junit4] IGNOR/A 0.00s J2 | SegmentsInfoRequestHandlerTest.testSegmentInfosData
   [junit4]    > Assumption #1: Ignored, failures limit reached (5 >= 5).
   [junit4]   2> 7220 INFO  (SUITE-SegmentsInfoRequestHandlerTest-seed#[D83D5ACC5839E8EE]-worker) [    ] o.a.s.SolrTestCaseJ4 ###deleteCore
   [junit4]   2> 7220 INFO  (SUITE-SegmentsInfoRequestHandlerTest-seed#[D83D5ACC5839E8EE]-worker) [    ] o.a.s.c.CoreContainer Shutting down CoreContainer instance=107202188
   [junit4]   2> 7220 INFO  (SUITE-SegmentsInfoRequestHandlerTest-seed#[D83D5ACC5839E8EE]-worker) [    ] o.a.s.m.SolrMetricManager Closing metric reporters for registry=solr.node, tag=null
   [junit4]   2> 7220 INFO  (SUITE-SegmentsInfoRequestHandlerTest-seed#[D83D5ACC5839E8EE]-worker) [    ] o.a.s.m.r.SolrJmxReporter Closing reporter [org.apache.solr.metrics.reporters.SolrJmxReporter@7bc56881: rootName = null, domain = solr.node, service url = null, agent id = null] for registry solr.node / com.codahale.metrics.MetricRegistry@5f468dbe
   [junit4]   2> 7226 INFO  (SUITE-SegmentsInfoRequestHandlerTest-seed#[D83D5ACC5839E8EE]-worker) [    ] o.a.s.m.SolrMetricManager Closing metric reporters for registry=solr.jvm, tag=null
   [junit4]   2> 7226 INFO  (SUITE-SegmentsInfoRequestHandlerTest-seed#[D83D5ACC5839E8EE]-worker) [    ] o.a.s.m.r.SolrJmxReporter Closing reporter [org.apache.solr.metrics.reporters.SolrJmxReporter@376ac33: rootName = null, domain = solr.jvm, service url = null, agent id = null] for registry solr.jvm / com.codahale.metrics.MetricRegistry@78b0b938
   [junit4]   2> 7226 INFO  (SUITE-SegmentsInfoRequestHandlerTest-seed#[D83D5ACC5839E8EE]-worker) [    ] o.a.s.m.SolrMetricManager Closing metric reporters for registry=solr.jetty, tag=null
   [junit4]   2> 7226 INFO  (SUITE-SegmentsInfoRequestHandlerTest-seed#[D83D5ACC5839E8EE]-worker) [    ] o.a.s.m.r.SolrJmxReporter Closing reporter [org.apache.solr.metrics.reporters.SolrJmxReporter@477d76c9: rootName = null, domain = solr.jetty, service url = null, agent id = null] for registry solr.jetty / com.codahale.metrics.MetricRegistry@54066da9
   [junit4]   2> 7227 INFO  (coreCloseExecutor-23-thread-1) [    x:collection1] o.a.s.c.SolrCore [collection1]  CLOSING SolrCore org.apache.solr.core.SolrCore@7f60903d
   [junit4]   2> 7227 INFO  (coreCloseExecutor-23-thread-1) [    x:collection1] o.a.s.m.SolrMetricManager Closing metric reporters for registry=solr.core.collection1, tag=7f60903d
   [junit4]   2> 7228 INFO  (coreCloseExecutor-23-thread-1) [    x:collection1] o.a.s.m.r.SolrJmxReporter Closing reporter [org.apache.solr.metrics.reporters.SolrJmxReporter@6f6aa14c: rootName = null, domain = solr.core.collection1, service url = null, agent id = null] for registry solr.core.collection1 / com.codahale.metrics.MetricRegistry@6bd61793
   [junit4]   2> NOTE: leaving temporary files on disk at: /home/jenkins/workspace/Lucene-Solr-7.x-Linux/solr/build/solr-core/test/J2/temp/solr.handler.admin.SegmentsInfoRequestHandlerTest_D83D5ACC5839E8EE-002
   [junit4]   2> NOTE: test params are: codec=Asserting(Lucene70): {name=FST50, id=FST50}, docValues:{}, maxPointsInLeafNode=398, maxMBSortInHeap=7.769480488917711, sim=RandomSimilarity(queryNorm=false): {}, locale=ro-MD, timezone=Etc/UTC
   [junit4]   2> NOTE: Linux 4.13.0-37-generic amd64/Oracle Corporation 11-ea (64-bit)/cpus=8,threads=1,free=419959904,total=520093696
   [junit4]   2> NOTE: All tests run in this JVM: [SegmentsInfoRequestHandlerTest, SegmentsInfoRequestHandlerTest]
   [junit4] Completed [5/5 (5!)] on J2 in 1.26s, 3 tests, 2 failures, 1 skipped <<< FAILURES!

[...truncated 20 lines...]
BUILD FAILED
/home/jenkins/workspace/Lucene-Solr-7.x-Linux/lucene/common-build.xml:1568: The following error occurred while executing this line:
/home/jenkins/workspace/Lucene-Solr-7.x-Linux/lucene/common-build.xml:1092: There were test failures: 5 suites, 15 tests, 13 failures, 2 ignored (2 assumptions) [seed: D83D5ACC5839E8EE]

Total time: 9 seconds

[repro] Setting last failure code to 256

[repro] Failures:
[repro]   5/5 failed: org.apache.solr.handler.admin.SegmentsInfoRequestHandlerTest
[repro] Exiting with code 256
+ mv lucene/build lucene/build.repro
+ mv solr/build solr/build.repro
+ mv lucene/build.orig lucene/build
+ mv solr/build.orig solr/build
Archiving artifacts
Setting ANT_1_8_2_HOME=/var/lib/jenkins/tools/hudson.tasks.Ant_AntInstallation/ANT_1.8.2
[WARNINGS] Parsing warnings in console log with parser Java Compiler (javac)
Setting ANT_1_8_2_HOME=/var/lib/jenkins/tools/hudson.tasks.Ant_AntInstallation/ANT_1.8.2
Setting ANT_1_8_2_HOME=/var/lib/jenkins/tools/hudson.tasks.Ant_AntInstallation/ANT_1.8.2
<Git Blamer> Using GitBlamer to create author and commit information for all warnings.
<Git Blamer> GIT_COMMIT=d9ef3a3d02870af55d7ee7447852fbdf374bf238, workspace=/var/lib/jenkins/workspace/Lucene-Solr-7.x-Linux
[WARNINGS] Computing warning deltas based on reference build #1732
Recording test results
Setting ANT_1_8_2_HOME=/var/lib/jenkins/tools/hudson.tasks.Ant_AntInstallation/ANT_1.8.2
Build step 'Publish JUnit test result report' changed build result to UNSTABLE
Email was triggered for: Unstable (Test Failures)
Sending email for trigger: Unstable (Test Failures)
Setting ANT_1_8_2_HOME=/var/lib/jenkins/tools/hudson.tasks.Ant_AntInstallation/ANT_1.8.2
Setting ANT_1_8_2_HOME=/var/lib/jenkins/tools/hudson.tasks.Ant_AntInstallation/ANT_1.8.2
Setting ANT_1_8_2_HOME=/var/lib/jenkins/tools/hudson.tasks.Ant_AntInstallation/ANT_1.8.2
Setting ANT_1_8_2_HOME=/var/lib/jenkins/tools/hudson.tasks.Ant_AntInstallation/ANT_1.8.2

Mime
View raw message