lucene-dev mailing list archives

Site index · List index
Message view « Date » · « Thread »
Top « Date » · « Thread »
From Policeman Jenkins Server <jenk...@thetaphi.de>
Subject [JENKINS] Lucene-Solr-master-Linux (32bit/jdk1.8.0_162) - Build # 21845 - Still Unstable!
Date Tue, 17 Apr 2018 10:44:31 GMT
Build: https://jenkins.thetaphi.de/job/Lucene-Solr-master-Linux/21845/
Java: 32bit/jdk1.8.0_162 -server -XX:+UseConcMarkSweepGC

10 tests failed.
FAILED:  org.apache.solr.handler.admin.SegmentsInfoRequestHandlerTest.testSegmentInfosVersion

Error Message:


Stack Trace:
java.lang.AssertionError
	at __randomizedtesting.SeedInfo.seed([777D8BC1C7354EB9:8FA31E29BF599FEA]:0)
	at org.apache.lucene.index.IndexWriter$ReaderPool.noDups(IndexWriter.java:867)
	at org.apache.lucene.index.IndexWriter$ReaderPool.get(IndexWriter.java:857)
	at org.apache.lucene.index.IndexWriter.numDeletesToMerge(IndexWriter.java:5233)
	at org.apache.lucene.index.LogMergePolicy.sizeDocs(LogMergePolicy.java:153)
	at org.apache.lucene.index.LogDocMergePolicy.size(LogDocMergePolicy.java:44)
	at org.apache.lucene.index.LogMergePolicy.findMerges(LogMergePolicy.java:469)
	at org.apache.solr.handler.admin.SegmentsInfoRequestHandler.getMergeCandidatesNames(SegmentsInfoRequestHandler.java:100)
	at org.apache.solr.handler.admin.SegmentsInfoRequestHandler.getSegmentsInfo(SegmentsInfoRequestHandler.java:59)
	at org.apache.solr.handler.admin.SegmentsInfoRequestHandler.handleRequestBody(SegmentsInfoRequestHandler.java:48)
	at org.apache.solr.handler.RequestHandlerBase.handleRequest(RequestHandlerBase.java:199)
	at org.apache.solr.core.SolrCore.execute(SolrCore.java:2508)
	at org.apache.solr.util.TestHarness.query(TestHarness.java:337)
	at org.apache.solr.util.TestHarness.query(TestHarness.java:319)
	at org.apache.solr.SolrTestCaseJ4.assertQ(SolrTestCaseJ4.java:890)
	at org.apache.solr.handler.admin.SegmentsInfoRequestHandlerTest.testSegmentInfosVersion(SegmentsInfoRequestHandlerTest.java:68)
	at sun.reflect.NativeMethodAccessorImpl.invoke0(Native Method)
	at sun.reflect.NativeMethodAccessorImpl.invoke(NativeMethodAccessorImpl.java:62)
	at sun.reflect.DelegatingMethodAccessorImpl.invoke(DelegatingMethodAccessorImpl.java:43)
	at java.lang.reflect.Method.invoke(Method.java:498)
	at com.carrotsearch.randomizedtesting.RandomizedRunner.invoke(RandomizedRunner.java:1737)
	at com.carrotsearch.randomizedtesting.RandomizedRunner$8.evaluate(RandomizedRunner.java:934)
	at com.carrotsearch.randomizedtesting.RandomizedRunner$9.evaluate(RandomizedRunner.java:970)
	at com.carrotsearch.randomizedtesting.RandomizedRunner$10.evaluate(RandomizedRunner.java:984)
	at com.carrotsearch.randomizedtesting.rules.SystemPropertiesRestoreRule$1.evaluate(SystemPropertiesRestoreRule.java:57)
	at org.apache.lucene.util.TestRuleSetupTeardownChained$1.evaluate(TestRuleSetupTeardownChained.java:49)
	at org.apache.lucene.util.AbstractBeforeAfterRule$1.evaluate(AbstractBeforeAfterRule.java:45)
	at org.apache.lucene.util.TestRuleThreadAndTestName$1.evaluate(TestRuleThreadAndTestName.java:48)
	at org.apache.lucene.util.TestRuleIgnoreAfterMaxFailures$1.evaluate(TestRuleIgnoreAfterMaxFailures.java:64)
	at org.apache.lucene.util.TestRuleMarkFailure$1.evaluate(TestRuleMarkFailure.java:47)
	at com.carrotsearch.randomizedtesting.rules.StatementAdapter.evaluate(StatementAdapter.java:36)
	at com.carrotsearch.randomizedtesting.ThreadLeakControl$StatementRunner.run(ThreadLeakControl.java:368)
	at com.carrotsearch.randomizedtesting.ThreadLeakControl.forkTimeoutingTask(ThreadLeakControl.java:817)
	at com.carrotsearch.randomizedtesting.ThreadLeakControl$3.evaluate(ThreadLeakControl.java:468)
	at com.carrotsearch.randomizedtesting.RandomizedRunner.runSingleTest(RandomizedRunner.java:943)
	at com.carrotsearch.randomizedtesting.RandomizedRunner$5.evaluate(RandomizedRunner.java:829)
	at com.carrotsearch.randomizedtesting.RandomizedRunner$6.evaluate(RandomizedRunner.java:879)
	at com.carrotsearch.randomizedtesting.RandomizedRunner$7.evaluate(RandomizedRunner.java:890)
	at com.carrotsearch.randomizedtesting.rules.StatementAdapter.evaluate(StatementAdapter.java:36)
	at com.carrotsearch.randomizedtesting.rules.SystemPropertiesRestoreRule$1.evaluate(SystemPropertiesRestoreRule.java:57)
	at org.apache.lucene.util.AbstractBeforeAfterRule$1.evaluate(AbstractBeforeAfterRule.java:45)
	at com.carrotsearch.randomizedtesting.rules.StatementAdapter.evaluate(StatementAdapter.java:36)
	at org.apache.lucene.util.TestRuleStoreClassName$1.evaluate(TestRuleStoreClassName.java:41)
	at com.carrotsearch.randomizedtesting.rules.NoShadowingOrOverridesOnMethodsRule$1.evaluate(NoShadowingOrOverridesOnMethodsRule.java:40)
	at com.carrotsearch.randomizedtesting.rules.NoShadowingOrOverridesOnMethodsRule$1.evaluate(NoShadowingOrOverridesOnMethodsRule.java:40)
	at com.carrotsearch.randomizedtesting.rules.StatementAdapter.evaluate(StatementAdapter.java:36)
	at com.carrotsearch.randomizedtesting.rules.StatementAdapter.evaluate(StatementAdapter.java:36)
	at com.carrotsearch.randomizedtesting.rules.StatementAdapter.evaluate(StatementAdapter.java:36)
	at org.apache.lucene.util.TestRuleAssertionsRequired$1.evaluate(TestRuleAssertionsRequired.java:53)
	at org.apache.lucene.util.TestRuleMarkFailure$1.evaluate(TestRuleMarkFailure.java:47)
	at org.apache.lucene.util.TestRuleIgnoreAfterMaxFailures$1.evaluate(TestRuleIgnoreAfterMaxFailures.java:64)
	at org.apache.lucene.util.TestRuleIgnoreTestSuites$1.evaluate(TestRuleIgnoreTestSuites.java:54)
	at com.carrotsearch.randomizedtesting.rules.StatementAdapter.evaluate(StatementAdapter.java:36)
	at com.carrotsearch.randomizedtesting.ThreadLeakControl$StatementRunner.run(ThreadLeakControl.java:368)
	at java.lang.Thread.run(Thread.java:748)


FAILED:  org.apache.solr.handler.admin.SegmentsInfoRequestHandlerTest.testSegmentInfosData

Error Message:


Stack Trace:
java.lang.AssertionError
	at __randomizedtesting.SeedInfo.seed([777D8BC1C7354EB9:BD4A99A71DDF926]:0)
	at org.apache.lucene.index.IndexWriter$ReaderPool.noDups(IndexWriter.java:867)
	at org.apache.lucene.index.IndexWriter$ReaderPool.get(IndexWriter.java:857)
	at org.apache.lucene.index.IndexWriter.numDeletesToMerge(IndexWriter.java:5233)
	at org.apache.lucene.index.LogMergePolicy.sizeDocs(LogMergePolicy.java:153)
	at org.apache.lucene.index.LogDocMergePolicy.size(LogDocMergePolicy.java:44)
	at org.apache.lucene.index.LogMergePolicy.findMerges(LogMergePolicy.java:469)
	at org.apache.solr.handler.admin.SegmentsInfoRequestHandler.getMergeCandidatesNames(SegmentsInfoRequestHandler.java:100)
	at org.apache.solr.handler.admin.SegmentsInfoRequestHandler.getSegmentsInfo(SegmentsInfoRequestHandler.java:59)
	at org.apache.solr.handler.admin.SegmentsInfoRequestHandler.handleRequestBody(SegmentsInfoRequestHandler.java:48)
	at org.apache.solr.handler.RequestHandlerBase.handleRequest(RequestHandlerBase.java:199)
	at org.apache.solr.core.SolrCore.execute(SolrCore.java:2508)
	at org.apache.solr.util.TestHarness.query(TestHarness.java:337)
	at org.apache.solr.util.TestHarness.query(TestHarness.java:319)
	at org.apache.solr.SolrTestCaseJ4.assertQ(SolrTestCaseJ4.java:890)
	at org.apache.solr.handler.admin.SegmentsInfoRequestHandlerTest.testSegmentInfosData(SegmentsInfoRequestHandlerTest.java:75)
	at sun.reflect.NativeMethodAccessorImpl.invoke0(Native Method)
	at sun.reflect.NativeMethodAccessorImpl.invoke(NativeMethodAccessorImpl.java:62)
	at sun.reflect.DelegatingMethodAccessorImpl.invoke(DelegatingMethodAccessorImpl.java:43)
	at java.lang.reflect.Method.invoke(Method.java:498)
	at com.carrotsearch.randomizedtesting.RandomizedRunner.invoke(RandomizedRunner.java:1737)
	at com.carrotsearch.randomizedtesting.RandomizedRunner$8.evaluate(RandomizedRunner.java:934)
	at com.carrotsearch.randomizedtesting.RandomizedRunner$9.evaluate(RandomizedRunner.java:970)
	at com.carrotsearch.randomizedtesting.RandomizedRunner$10.evaluate(RandomizedRunner.java:984)
	at com.carrotsearch.randomizedtesting.rules.SystemPropertiesRestoreRule$1.evaluate(SystemPropertiesRestoreRule.java:57)
	at org.apache.lucene.util.TestRuleSetupTeardownChained$1.evaluate(TestRuleSetupTeardownChained.java:49)
	at org.apache.lucene.util.AbstractBeforeAfterRule$1.evaluate(AbstractBeforeAfterRule.java:45)
	at org.apache.lucene.util.TestRuleThreadAndTestName$1.evaluate(TestRuleThreadAndTestName.java:48)
	at org.apache.lucene.util.TestRuleIgnoreAfterMaxFailures$1.evaluate(TestRuleIgnoreAfterMaxFailures.java:64)
	at org.apache.lucene.util.TestRuleMarkFailure$1.evaluate(TestRuleMarkFailure.java:47)
	at com.carrotsearch.randomizedtesting.rules.StatementAdapter.evaluate(StatementAdapter.java:36)
	at com.carrotsearch.randomizedtesting.ThreadLeakControl$StatementRunner.run(ThreadLeakControl.java:368)
	at com.carrotsearch.randomizedtesting.ThreadLeakControl.forkTimeoutingTask(ThreadLeakControl.java:817)
	at com.carrotsearch.randomizedtesting.ThreadLeakControl$3.evaluate(ThreadLeakControl.java:468)
	at com.carrotsearch.randomizedtesting.RandomizedRunner.runSingleTest(RandomizedRunner.java:943)
	at com.carrotsearch.randomizedtesting.RandomizedRunner$5.evaluate(RandomizedRunner.java:829)
	at com.carrotsearch.randomizedtesting.RandomizedRunner$6.evaluate(RandomizedRunner.java:879)
	at com.carrotsearch.randomizedtesting.RandomizedRunner$7.evaluate(RandomizedRunner.java:890)
	at com.carrotsearch.randomizedtesting.rules.StatementAdapter.evaluate(StatementAdapter.java:36)
	at com.carrotsearch.randomizedtesting.rules.SystemPropertiesRestoreRule$1.evaluate(SystemPropertiesRestoreRule.java:57)
	at org.apache.lucene.util.AbstractBeforeAfterRule$1.evaluate(AbstractBeforeAfterRule.java:45)
	at com.carrotsearch.randomizedtesting.rules.StatementAdapter.evaluate(StatementAdapter.java:36)
	at org.apache.lucene.util.TestRuleStoreClassName$1.evaluate(TestRuleStoreClassName.java:41)
	at com.carrotsearch.randomizedtesting.rules.NoShadowingOrOverridesOnMethodsRule$1.evaluate(NoShadowingOrOverridesOnMethodsRule.java:40)
	at com.carrotsearch.randomizedtesting.rules.NoShadowingOrOverridesOnMethodsRule$1.evaluate(NoShadowingOrOverridesOnMethodsRule.java:40)
	at com.carrotsearch.randomizedtesting.rules.StatementAdapter.evaluate(StatementAdapter.java:36)
	at com.carrotsearch.randomizedtesting.rules.StatementAdapter.evaluate(StatementAdapter.java:36)
	at com.carrotsearch.randomizedtesting.rules.StatementAdapter.evaluate(StatementAdapter.java:36)
	at org.apache.lucene.util.TestRuleAssertionsRequired$1.evaluate(TestRuleAssertionsRequired.java:53)
	at org.apache.lucene.util.TestRuleMarkFailure$1.evaluate(TestRuleMarkFailure.java:47)
	at org.apache.lucene.util.TestRuleIgnoreAfterMaxFailures$1.evaluate(TestRuleIgnoreAfterMaxFailures.java:64)
	at org.apache.lucene.util.TestRuleIgnoreTestSuites$1.evaluate(TestRuleIgnoreTestSuites.java:54)
	at com.carrotsearch.randomizedtesting.rules.StatementAdapter.evaluate(StatementAdapter.java:36)
	at com.carrotsearch.randomizedtesting.ThreadLeakControl$StatementRunner.run(ThreadLeakControl.java:368)
	at java.lang.Thread.run(Thread.java:748)


FAILED:  org.apache.solr.handler.admin.SegmentsInfoRequestHandlerTest.testSegmentInfos

Error Message:


Stack Trace:
java.lang.AssertionError
	at __randomizedtesting.SeedInfo.seed([777D8BC1C7354EB9:3B2A1C7E0D3996E9]:0)
	at org.apache.lucene.index.IndexWriter$ReaderPool.noDups(IndexWriter.java:867)
	at org.apache.lucene.index.IndexWriter$ReaderPool.get(IndexWriter.java:857)
	at org.apache.lucene.index.IndexWriter.numDeletesToMerge(IndexWriter.java:5233)
	at org.apache.lucene.index.LogMergePolicy.sizeDocs(LogMergePolicy.java:153)
	at org.apache.lucene.index.LogDocMergePolicy.size(LogDocMergePolicy.java:44)
	at org.apache.lucene.index.LogMergePolicy.findMerges(LogMergePolicy.java:469)
	at org.apache.solr.handler.admin.SegmentsInfoRequestHandler.getMergeCandidatesNames(SegmentsInfoRequestHandler.java:100)
	at org.apache.solr.handler.admin.SegmentsInfoRequestHandler.getSegmentsInfo(SegmentsInfoRequestHandler.java:59)
	at org.apache.solr.handler.admin.SegmentsInfoRequestHandler.handleRequestBody(SegmentsInfoRequestHandler.java:48)
	at org.apache.solr.handler.RequestHandlerBase.handleRequest(RequestHandlerBase.java:199)
	at org.apache.solr.core.SolrCore.execute(SolrCore.java:2508)
	at org.apache.solr.util.TestHarness.query(TestHarness.java:337)
	at org.apache.solr.util.TestHarness.query(TestHarness.java:319)
	at org.apache.solr.SolrTestCaseJ4.assertQ(SolrTestCaseJ4.java:890)
	at org.apache.solr.handler.admin.SegmentsInfoRequestHandlerTest.testSegmentInfos(SegmentsInfoRequestHandlerTest.java:61)
	at sun.reflect.NativeMethodAccessorImpl.invoke0(Native Method)
	at sun.reflect.NativeMethodAccessorImpl.invoke(NativeMethodAccessorImpl.java:62)
	at sun.reflect.DelegatingMethodAccessorImpl.invoke(DelegatingMethodAccessorImpl.java:43)
	at java.lang.reflect.Method.invoke(Method.java:498)
	at com.carrotsearch.randomizedtesting.RandomizedRunner.invoke(RandomizedRunner.java:1737)
	at com.carrotsearch.randomizedtesting.RandomizedRunner$8.evaluate(RandomizedRunner.java:934)
	at com.carrotsearch.randomizedtesting.RandomizedRunner$9.evaluate(RandomizedRunner.java:970)
	at com.carrotsearch.randomizedtesting.RandomizedRunner$10.evaluate(RandomizedRunner.java:984)
	at com.carrotsearch.randomizedtesting.rules.SystemPropertiesRestoreRule$1.evaluate(SystemPropertiesRestoreRule.java:57)
	at org.apache.lucene.util.TestRuleSetupTeardownChained$1.evaluate(TestRuleSetupTeardownChained.java:49)
	at org.apache.lucene.util.AbstractBeforeAfterRule$1.evaluate(AbstractBeforeAfterRule.java:45)
	at org.apache.lucene.util.TestRuleThreadAndTestName$1.evaluate(TestRuleThreadAndTestName.java:48)
	at org.apache.lucene.util.TestRuleIgnoreAfterMaxFailures$1.evaluate(TestRuleIgnoreAfterMaxFailures.java:64)
	at org.apache.lucene.util.TestRuleMarkFailure$1.evaluate(TestRuleMarkFailure.java:47)
	at com.carrotsearch.randomizedtesting.rules.StatementAdapter.evaluate(StatementAdapter.java:36)
	at com.carrotsearch.randomizedtesting.ThreadLeakControl$StatementRunner.run(ThreadLeakControl.java:368)
	at com.carrotsearch.randomizedtesting.ThreadLeakControl.forkTimeoutingTask(ThreadLeakControl.java:817)
	at com.carrotsearch.randomizedtesting.ThreadLeakControl$3.evaluate(ThreadLeakControl.java:468)
	at com.carrotsearch.randomizedtesting.RandomizedRunner.runSingleTest(RandomizedRunner.java:943)
	at com.carrotsearch.randomizedtesting.RandomizedRunner$5.evaluate(RandomizedRunner.java:829)
	at com.carrotsearch.randomizedtesting.RandomizedRunner$6.evaluate(RandomizedRunner.java:879)
	at com.carrotsearch.randomizedtesting.RandomizedRunner$7.evaluate(RandomizedRunner.java:890)
	at com.carrotsearch.randomizedtesting.rules.StatementAdapter.evaluate(StatementAdapter.java:36)
	at com.carrotsearch.randomizedtesting.rules.SystemPropertiesRestoreRule$1.evaluate(SystemPropertiesRestoreRule.java:57)
	at org.apache.lucene.util.AbstractBeforeAfterRule$1.evaluate(AbstractBeforeAfterRule.java:45)
	at com.carrotsearch.randomizedtesting.rules.StatementAdapter.evaluate(StatementAdapter.java:36)
	at org.apache.lucene.util.TestRuleStoreClassName$1.evaluate(TestRuleStoreClassName.java:41)
	at com.carrotsearch.randomizedtesting.rules.NoShadowingOrOverridesOnMethodsRule$1.evaluate(NoShadowingOrOverridesOnMethodsRule.java:40)
	at com.carrotsearch.randomizedtesting.rules.NoShadowingOrOverridesOnMethodsRule$1.evaluate(NoShadowingOrOverridesOnMethodsRule.java:40)
	at com.carrotsearch.randomizedtesting.rules.StatementAdapter.evaluate(StatementAdapter.java:36)
	at com.carrotsearch.randomizedtesting.rules.StatementAdapter.evaluate(StatementAdapter.java:36)
	at com.carrotsearch.randomizedtesting.rules.StatementAdapter.evaluate(StatementAdapter.java:36)
	at org.apache.lucene.util.TestRuleAssertionsRequired$1.evaluate(TestRuleAssertionsRequired.java:53)
	at org.apache.lucene.util.TestRuleMarkFailure$1.evaluate(TestRuleMarkFailure.java:47)
	at org.apache.lucene.util.TestRuleIgnoreAfterMaxFailures$1.evaluate(TestRuleIgnoreAfterMaxFailures.java:64)
	at org.apache.lucene.util.TestRuleIgnoreTestSuites$1.evaluate(TestRuleIgnoreTestSuites.java:54)
	at com.carrotsearch.randomizedtesting.rules.StatementAdapter.evaluate(StatementAdapter.java:36)
	at com.carrotsearch.randomizedtesting.ThreadLeakControl$StatementRunner.run(ThreadLeakControl.java:368)
	at java.lang.Thread.run(Thread.java:748)


FAILED:  org.apache.solr.handler.admin.SegmentsInfoRequestHandlerTest.testSegmentInfosVersion

Error Message:


Stack Trace:
java.lang.AssertionError
	at __randomizedtesting.SeedInfo.seed([777D8BC1C7354EB9:8FA31E29BF599FEA]:0)
	at org.apache.lucene.index.IndexWriter$ReaderPool.noDups(IndexWriter.java:867)
	at org.apache.lucene.index.IndexWriter$ReaderPool.get(IndexWriter.java:857)
	at org.apache.lucene.index.IndexWriter.numDeletesToMerge(IndexWriter.java:5233)
	at org.apache.lucene.index.LogMergePolicy.sizeDocs(LogMergePolicy.java:153)
	at org.apache.lucene.index.LogDocMergePolicy.size(LogDocMergePolicy.java:44)
	at org.apache.lucene.index.LogMergePolicy.findMerges(LogMergePolicy.java:469)
	at org.apache.solr.handler.admin.SegmentsInfoRequestHandler.getMergeCandidatesNames(SegmentsInfoRequestHandler.java:100)
	at org.apache.solr.handler.admin.SegmentsInfoRequestHandler.getSegmentsInfo(SegmentsInfoRequestHandler.java:59)
	at org.apache.solr.handler.admin.SegmentsInfoRequestHandler.handleRequestBody(SegmentsInfoRequestHandler.java:48)
	at org.apache.solr.handler.RequestHandlerBase.handleRequest(RequestHandlerBase.java:199)
	at org.apache.solr.core.SolrCore.execute(SolrCore.java:2508)
	at org.apache.solr.util.TestHarness.query(TestHarness.java:337)
	at org.apache.solr.util.TestHarness.query(TestHarness.java:319)
	at org.apache.solr.SolrTestCaseJ4.assertQ(SolrTestCaseJ4.java:890)
	at org.apache.solr.handler.admin.SegmentsInfoRequestHandlerTest.testSegmentInfosVersion(SegmentsInfoRequestHandlerTest.java:68)
	at sun.reflect.NativeMethodAccessorImpl.invoke0(Native Method)
	at sun.reflect.NativeMethodAccessorImpl.invoke(NativeMethodAccessorImpl.java:62)
	at sun.reflect.DelegatingMethodAccessorImpl.invoke(DelegatingMethodAccessorImpl.java:43)
	at java.lang.reflect.Method.invoke(Method.java:498)
	at com.carrotsearch.randomizedtesting.RandomizedRunner.invoke(RandomizedRunner.java:1737)
	at com.carrotsearch.randomizedtesting.RandomizedRunner$8.evaluate(RandomizedRunner.java:934)
	at com.carrotsearch.randomizedtesting.RandomizedRunner$9.evaluate(RandomizedRunner.java:970)
	at com.carrotsearch.randomizedtesting.RandomizedRunner$10.evaluate(RandomizedRunner.java:984)
	at com.carrotsearch.randomizedtesting.rules.SystemPropertiesRestoreRule$1.evaluate(SystemPropertiesRestoreRule.java:57)
	at org.apache.lucene.util.TestRuleSetupTeardownChained$1.evaluate(TestRuleSetupTeardownChained.java:49)
	at org.apache.lucene.util.AbstractBeforeAfterRule$1.evaluate(AbstractBeforeAfterRule.java:45)
	at org.apache.lucene.util.TestRuleThreadAndTestName$1.evaluate(TestRuleThreadAndTestName.java:48)
	at org.apache.lucene.util.TestRuleIgnoreAfterMaxFailures$1.evaluate(TestRuleIgnoreAfterMaxFailures.java:64)
	at org.apache.lucene.util.TestRuleMarkFailure$1.evaluate(TestRuleMarkFailure.java:47)
	at com.carrotsearch.randomizedtesting.rules.StatementAdapter.evaluate(StatementAdapter.java:36)
	at com.carrotsearch.randomizedtesting.ThreadLeakControl$StatementRunner.run(ThreadLeakControl.java:368)
	at com.carrotsearch.randomizedtesting.ThreadLeakControl.forkTimeoutingTask(ThreadLeakControl.java:817)
	at com.carrotsearch.randomizedtesting.ThreadLeakControl$3.evaluate(ThreadLeakControl.java:468)
	at com.carrotsearch.randomizedtesting.RandomizedRunner.runSingleTest(RandomizedRunner.java:943)
	at com.carrotsearch.randomizedtesting.RandomizedRunner$5.evaluate(RandomizedRunner.java:829)
	at com.carrotsearch.randomizedtesting.RandomizedRunner$6.evaluate(RandomizedRunner.java:879)
	at com.carrotsearch.randomizedtesting.RandomizedRunner$7.evaluate(RandomizedRunner.java:890)
	at com.carrotsearch.randomizedtesting.rules.StatementAdapter.evaluate(StatementAdapter.java:36)
	at com.carrotsearch.randomizedtesting.rules.SystemPropertiesRestoreRule$1.evaluate(SystemPropertiesRestoreRule.java:57)
	at org.apache.lucene.util.AbstractBeforeAfterRule$1.evaluate(AbstractBeforeAfterRule.java:45)
	at com.carrotsearch.randomizedtesting.rules.StatementAdapter.evaluate(StatementAdapter.java:36)
	at org.apache.lucene.util.TestRuleStoreClassName$1.evaluate(TestRuleStoreClassName.java:41)
	at com.carrotsearch.randomizedtesting.rules.NoShadowingOrOverridesOnMethodsRule$1.evaluate(NoShadowingOrOverridesOnMethodsRule.java:40)
	at com.carrotsearch.randomizedtesting.rules.NoShadowingOrOverridesOnMethodsRule$1.evaluate(NoShadowingOrOverridesOnMethodsRule.java:40)
	at com.carrotsearch.randomizedtesting.rules.StatementAdapter.evaluate(StatementAdapter.java:36)
	at com.carrotsearch.randomizedtesting.rules.StatementAdapter.evaluate(StatementAdapter.java:36)
	at com.carrotsearch.randomizedtesting.rules.StatementAdapter.evaluate(StatementAdapter.java:36)
	at org.apache.lucene.util.TestRuleAssertionsRequired$1.evaluate(TestRuleAssertionsRequired.java:53)
	at org.apache.lucene.util.TestRuleMarkFailure$1.evaluate(TestRuleMarkFailure.java:47)
	at org.apache.lucene.util.TestRuleIgnoreAfterMaxFailures$1.evaluate(TestRuleIgnoreAfterMaxFailures.java:64)
	at org.apache.lucene.util.TestRuleIgnoreTestSuites$1.evaluate(TestRuleIgnoreTestSuites.java:54)
	at com.carrotsearch.randomizedtesting.rules.StatementAdapter.evaluate(StatementAdapter.java:36)
	at com.carrotsearch.randomizedtesting.ThreadLeakControl$StatementRunner.run(ThreadLeakControl.java:368)
	at java.lang.Thread.run(Thread.java:748)


FAILED:  org.apache.solr.handler.admin.SegmentsInfoRequestHandlerTest.testSegmentInfosData

Error Message:


Stack Trace:
java.lang.AssertionError
	at __randomizedtesting.SeedInfo.seed([777D8BC1C7354EB9:BD4A99A71DDF926]:0)
	at org.apache.lucene.index.IndexWriter$ReaderPool.noDups(IndexWriter.java:867)
	at org.apache.lucene.index.IndexWriter$ReaderPool.get(IndexWriter.java:857)
	at org.apache.lucene.index.IndexWriter.numDeletesToMerge(IndexWriter.java:5233)
	at org.apache.lucene.index.LogMergePolicy.sizeDocs(LogMergePolicy.java:153)
	at org.apache.lucene.index.LogDocMergePolicy.size(LogDocMergePolicy.java:44)
	at org.apache.lucene.index.LogMergePolicy.findMerges(LogMergePolicy.java:469)
	at org.apache.solr.handler.admin.SegmentsInfoRequestHandler.getMergeCandidatesNames(SegmentsInfoRequestHandler.java:100)
	at org.apache.solr.handler.admin.SegmentsInfoRequestHandler.getSegmentsInfo(SegmentsInfoRequestHandler.java:59)
	at org.apache.solr.handler.admin.SegmentsInfoRequestHandler.handleRequestBody(SegmentsInfoRequestHandler.java:48)
	at org.apache.solr.handler.RequestHandlerBase.handleRequest(RequestHandlerBase.java:199)
	at org.apache.solr.core.SolrCore.execute(SolrCore.java:2508)
	at org.apache.solr.util.TestHarness.query(TestHarness.java:337)
	at org.apache.solr.util.TestHarness.query(TestHarness.java:319)
	at org.apache.solr.SolrTestCaseJ4.assertQ(SolrTestCaseJ4.java:890)
	at org.apache.solr.handler.admin.SegmentsInfoRequestHandlerTest.testSegmentInfosData(SegmentsInfoRequestHandlerTest.java:75)
	at sun.reflect.NativeMethodAccessorImpl.invoke0(Native Method)
	at sun.reflect.NativeMethodAccessorImpl.invoke(NativeMethodAccessorImpl.java:62)
	at sun.reflect.DelegatingMethodAccessorImpl.invoke(DelegatingMethodAccessorImpl.java:43)
	at java.lang.reflect.Method.invoke(Method.java:498)
	at com.carrotsearch.randomizedtesting.RandomizedRunner.invoke(RandomizedRunner.java:1737)
	at com.carrotsearch.randomizedtesting.RandomizedRunner$8.evaluate(RandomizedRunner.java:934)
	at com.carrotsearch.randomizedtesting.RandomizedRunner$9.evaluate(RandomizedRunner.java:970)
	at com.carrotsearch.randomizedtesting.RandomizedRunner$10.evaluate(RandomizedRunner.java:984)
	at com.carrotsearch.randomizedtesting.rules.SystemPropertiesRestoreRule$1.evaluate(SystemPropertiesRestoreRule.java:57)
	at org.apache.lucene.util.TestRuleSetupTeardownChained$1.evaluate(TestRuleSetupTeardownChained.java:49)
	at org.apache.lucene.util.AbstractBeforeAfterRule$1.evaluate(AbstractBeforeAfterRule.java:45)
	at org.apache.lucene.util.TestRuleThreadAndTestName$1.evaluate(TestRuleThreadAndTestName.java:48)
	at org.apache.lucene.util.TestRuleIgnoreAfterMaxFailures$1.evaluate(TestRuleIgnoreAfterMaxFailures.java:64)
	at org.apache.lucene.util.TestRuleMarkFailure$1.evaluate(TestRuleMarkFailure.java:47)
	at com.carrotsearch.randomizedtesting.rules.StatementAdapter.evaluate(StatementAdapter.java:36)
	at com.carrotsearch.randomizedtesting.ThreadLeakControl$StatementRunner.run(ThreadLeakControl.java:368)
	at com.carrotsearch.randomizedtesting.ThreadLeakControl.forkTimeoutingTask(ThreadLeakControl.java:817)
	at com.carrotsearch.randomizedtesting.ThreadLeakControl$3.evaluate(ThreadLeakControl.java:468)
	at com.carrotsearch.randomizedtesting.RandomizedRunner.runSingleTest(RandomizedRunner.java:943)
	at com.carrotsearch.randomizedtesting.RandomizedRunner$5.evaluate(RandomizedRunner.java:829)
	at com.carrotsearch.randomizedtesting.RandomizedRunner$6.evaluate(RandomizedRunner.java:879)
	at com.carrotsearch.randomizedtesting.RandomizedRunner$7.evaluate(RandomizedRunner.java:890)
	at com.carrotsearch.randomizedtesting.rules.StatementAdapter.evaluate(StatementAdapter.java:36)
	at com.carrotsearch.randomizedtesting.rules.SystemPropertiesRestoreRule$1.evaluate(SystemPropertiesRestoreRule.java:57)
	at org.apache.lucene.util.AbstractBeforeAfterRule$1.evaluate(AbstractBeforeAfterRule.java:45)
	at com.carrotsearch.randomizedtesting.rules.StatementAdapter.evaluate(StatementAdapter.java:36)
	at org.apache.lucene.util.TestRuleStoreClassName$1.evaluate(TestRuleStoreClassName.java:41)
	at com.carrotsearch.randomizedtesting.rules.NoShadowingOrOverridesOnMethodsRule$1.evaluate(NoShadowingOrOverridesOnMethodsRule.java:40)
	at com.carrotsearch.randomizedtesting.rules.NoShadowingOrOverridesOnMethodsRule$1.evaluate(NoShadowingOrOverridesOnMethodsRule.java:40)
	at com.carrotsearch.randomizedtesting.rules.StatementAdapter.evaluate(StatementAdapter.java:36)
	at com.carrotsearch.randomizedtesting.rules.StatementAdapter.evaluate(StatementAdapter.java:36)
	at com.carrotsearch.randomizedtesting.rules.StatementAdapter.evaluate(StatementAdapter.java:36)
	at org.apache.lucene.util.TestRuleAssertionsRequired$1.evaluate(TestRuleAssertionsRequired.java:53)
	at org.apache.lucene.util.TestRuleMarkFailure$1.evaluate(TestRuleMarkFailure.java:47)
	at org.apache.lucene.util.TestRuleIgnoreAfterMaxFailures$1.evaluate(TestRuleIgnoreAfterMaxFailures.java:64)
	at org.apache.lucene.util.TestRuleIgnoreTestSuites$1.evaluate(TestRuleIgnoreTestSuites.java:54)
	at com.carrotsearch.randomizedtesting.rules.StatementAdapter.evaluate(StatementAdapter.java:36)
	at com.carrotsearch.randomizedtesting.ThreadLeakControl$StatementRunner.run(ThreadLeakControl.java:368)
	at java.lang.Thread.run(Thread.java:748)


FAILED:  org.apache.solr.handler.admin.SegmentsInfoRequestHandlerTest.testSegmentInfosVersion

Error Message:


Stack Trace:
java.lang.AssertionError
	at __randomizedtesting.SeedInfo.seed([777D8BC1C7354EB9:8FA31E29BF599FEA]:0)
	at org.apache.lucene.index.IndexWriter$ReaderPool.noDups(IndexWriter.java:867)
	at org.apache.lucene.index.IndexWriter$ReaderPool.get(IndexWriter.java:857)
	at org.apache.lucene.index.IndexWriter.numDeletesToMerge(IndexWriter.java:5233)
	at org.apache.lucene.index.LogMergePolicy.sizeDocs(LogMergePolicy.java:153)
	at org.apache.lucene.index.LogDocMergePolicy.size(LogDocMergePolicy.java:44)
	at org.apache.lucene.index.LogMergePolicy.findMerges(LogMergePolicy.java:469)
	at org.apache.solr.handler.admin.SegmentsInfoRequestHandler.getMergeCandidatesNames(SegmentsInfoRequestHandler.java:100)
	at org.apache.solr.handler.admin.SegmentsInfoRequestHandler.getSegmentsInfo(SegmentsInfoRequestHandler.java:59)
	at org.apache.solr.handler.admin.SegmentsInfoRequestHandler.handleRequestBody(SegmentsInfoRequestHandler.java:48)
	at org.apache.solr.handler.RequestHandlerBase.handleRequest(RequestHandlerBase.java:199)
	at org.apache.solr.core.SolrCore.execute(SolrCore.java:2508)
	at org.apache.solr.util.TestHarness.query(TestHarness.java:337)
	at org.apache.solr.util.TestHarness.query(TestHarness.java:319)
	at org.apache.solr.SolrTestCaseJ4.assertQ(SolrTestCaseJ4.java:890)
	at org.apache.solr.handler.admin.SegmentsInfoRequestHandlerTest.testSegmentInfosVersion(SegmentsInfoRequestHandlerTest.java:68)
	at sun.reflect.NativeMethodAccessorImpl.invoke0(Native Method)
	at sun.reflect.NativeMethodAccessorImpl.invoke(NativeMethodAccessorImpl.java:62)
	at sun.reflect.DelegatingMethodAccessorImpl.invoke(DelegatingMethodAccessorImpl.java:43)
	at java.lang.reflect.Method.invoke(Method.java:498)
	at com.carrotsearch.randomizedtesting.RandomizedRunner.invoke(RandomizedRunner.java:1737)
	at com.carrotsearch.randomizedtesting.RandomizedRunner$8.evaluate(RandomizedRunner.java:934)
	at com.carrotsearch.randomizedtesting.RandomizedRunner$9.evaluate(RandomizedRunner.java:970)
	at com.carrotsearch.randomizedtesting.RandomizedRunner$10.evaluate(RandomizedRunner.java:984)
	at com.carrotsearch.randomizedtesting.rules.SystemPropertiesRestoreRule$1.evaluate(SystemPropertiesRestoreRule.java:57)
	at org.apache.lucene.util.TestRuleSetupTeardownChained$1.evaluate(TestRuleSetupTeardownChained.java:49)
	at org.apache.lucene.util.AbstractBeforeAfterRule$1.evaluate(AbstractBeforeAfterRule.java:45)
	at org.apache.lucene.util.TestRuleThreadAndTestName$1.evaluate(TestRuleThreadAndTestName.java:48)
	at org.apache.lucene.util.TestRuleIgnoreAfterMaxFailures$1.evaluate(TestRuleIgnoreAfterMaxFailures.java:64)
	at org.apache.lucene.util.TestRuleMarkFailure$1.evaluate(TestRuleMarkFailure.java:47)
	at com.carrotsearch.randomizedtesting.rules.StatementAdapter.evaluate(StatementAdapter.java:36)
	at com.carrotsearch.randomizedtesting.ThreadLeakControl$StatementRunner.run(ThreadLeakControl.java:368)
	at com.carrotsearch.randomizedtesting.ThreadLeakControl.forkTimeoutingTask(ThreadLeakControl.java:817)
	at com.carrotsearch.randomizedtesting.ThreadLeakControl$3.evaluate(ThreadLeakControl.java:468)
	at com.carrotsearch.randomizedtesting.RandomizedRunner.runSingleTest(RandomizedRunner.java:943)
	at com.carrotsearch.randomizedtesting.RandomizedRunner$5.evaluate(RandomizedRunner.java:829)
	at com.carrotsearch.randomizedtesting.RandomizedRunner$6.evaluate(RandomizedRunner.java:879)
	at com.carrotsearch.randomizedtesting.RandomizedRunner$7.evaluate(RandomizedRunner.java:890)
	at com.carrotsearch.randomizedtesting.rules.StatementAdapter.evaluate(StatementAdapter.java:36)
	at com.carrotsearch.randomizedtesting.rules.SystemPropertiesRestoreRule$1.evaluate(SystemPropertiesRestoreRule.java:57)
	at org.apache.lucene.util.AbstractBeforeAfterRule$1.evaluate(AbstractBeforeAfterRule.java:45)
	at com.carrotsearch.randomizedtesting.rules.StatementAdapter.evaluate(StatementAdapter.java:36)
	at org.apache.lucene.util.TestRuleStoreClassName$1.evaluate(TestRuleStoreClassName.java:41)
	at com.carrotsearch.randomizedtesting.rules.NoShadowingOrOverridesOnMethodsRule$1.evaluate(NoShadowingOrOverridesOnMethodsRule.java:40)
	at com.carrotsearch.randomizedtesting.rules.NoShadowingOrOverridesOnMethodsRule$1.evaluate(NoShadowingOrOverridesOnMethodsRule.java:40)
	at com.carrotsearch.randomizedtesting.rules.StatementAdapter.evaluate(StatementAdapter.java:36)
	at com.carrotsearch.randomizedtesting.rules.StatementAdapter.evaluate(StatementAdapter.java:36)
	at com.carrotsearch.randomizedtesting.rules.StatementAdapter.evaluate(StatementAdapter.java:36)
	at org.apache.lucene.util.TestRuleAssertionsRequired$1.evaluate(TestRuleAssertionsRequired.java:53)
	at org.apache.lucene.util.TestRuleMarkFailure$1.evaluate(TestRuleMarkFailure.java:47)
	at org.apache.lucene.util.TestRuleIgnoreAfterMaxFailures$1.evaluate(TestRuleIgnoreAfterMaxFailures.java:64)
	at org.apache.lucene.util.TestRuleIgnoreTestSuites$1.evaluate(TestRuleIgnoreTestSuites.java:54)
	at com.carrotsearch.randomizedtesting.rules.StatementAdapter.evaluate(StatementAdapter.java:36)
	at com.carrotsearch.randomizedtesting.ThreadLeakControl$StatementRunner.run(ThreadLeakControl.java:368)
	at java.lang.Thread.run(Thread.java:748)


FAILED:  org.apache.solr.handler.admin.SegmentsInfoRequestHandlerTest.testSegmentInfosData

Error Message:


Stack Trace:
java.lang.AssertionError
	at __randomizedtesting.SeedInfo.seed([777D8BC1C7354EB9:BD4A99A71DDF926]:0)
	at org.apache.lucene.index.IndexWriter$ReaderPool.noDups(IndexWriter.java:867)
	at org.apache.lucene.index.IndexWriter$ReaderPool.get(IndexWriter.java:857)
	at org.apache.lucene.index.IndexWriter.numDeletesToMerge(IndexWriter.java:5233)
	at org.apache.lucene.index.LogMergePolicy.sizeDocs(LogMergePolicy.java:153)
	at org.apache.lucene.index.LogDocMergePolicy.size(LogDocMergePolicy.java:44)
	at org.apache.lucene.index.LogMergePolicy.findMerges(LogMergePolicy.java:469)
	at org.apache.solr.handler.admin.SegmentsInfoRequestHandler.getMergeCandidatesNames(SegmentsInfoRequestHandler.java:100)
	at org.apache.solr.handler.admin.SegmentsInfoRequestHandler.getSegmentsInfo(SegmentsInfoRequestHandler.java:59)
	at org.apache.solr.handler.admin.SegmentsInfoRequestHandler.handleRequestBody(SegmentsInfoRequestHandler.java:48)
	at org.apache.solr.handler.RequestHandlerBase.handleRequest(RequestHandlerBase.java:199)
	at org.apache.solr.core.SolrCore.execute(SolrCore.java:2508)
	at org.apache.solr.util.TestHarness.query(TestHarness.java:337)
	at org.apache.solr.util.TestHarness.query(TestHarness.java:319)
	at org.apache.solr.SolrTestCaseJ4.assertQ(SolrTestCaseJ4.java:890)
	at org.apache.solr.handler.admin.SegmentsInfoRequestHandlerTest.testSegmentInfosData(SegmentsInfoRequestHandlerTest.java:75)
	at sun.reflect.NativeMethodAccessorImpl.invoke0(Native Method)
	at sun.reflect.NativeMethodAccessorImpl.invoke(NativeMethodAccessorImpl.java:62)
	at sun.reflect.DelegatingMethodAccessorImpl.invoke(DelegatingMethodAccessorImpl.java:43)
	at java.lang.reflect.Method.invoke(Method.java:498)
	at com.carrotsearch.randomizedtesting.RandomizedRunner.invoke(RandomizedRunner.java:1737)
	at com.carrotsearch.randomizedtesting.RandomizedRunner$8.evaluate(RandomizedRunner.java:934)
	at com.carrotsearch.randomizedtesting.RandomizedRunner$9.evaluate(RandomizedRunner.java:970)
	at com.carrotsearch.randomizedtesting.RandomizedRunner$10.evaluate(RandomizedRunner.java:984)
	at com.carrotsearch.randomizedtesting.rules.SystemPropertiesRestoreRule$1.evaluate(SystemPropertiesRestoreRule.java:57)
	at org.apache.lucene.util.TestRuleSetupTeardownChained$1.evaluate(TestRuleSetupTeardownChained.java:49)
	at org.apache.lucene.util.AbstractBeforeAfterRule$1.evaluate(AbstractBeforeAfterRule.java:45)
	at org.apache.lucene.util.TestRuleThreadAndTestName$1.evaluate(TestRuleThreadAndTestName.java:48)
	at org.apache.lucene.util.TestRuleIgnoreAfterMaxFailures$1.evaluate(TestRuleIgnoreAfterMaxFailures.java:64)
	at org.apache.lucene.util.TestRuleMarkFailure$1.evaluate(TestRuleMarkFailure.java:47)
	at com.carrotsearch.randomizedtesting.rules.StatementAdapter.evaluate(StatementAdapter.java:36)
	at com.carrotsearch.randomizedtesting.ThreadLeakControl$StatementRunner.run(ThreadLeakControl.java:368)
	at com.carrotsearch.randomizedtesting.ThreadLeakControl.forkTimeoutingTask(ThreadLeakControl.java:817)
	at com.carrotsearch.randomizedtesting.ThreadLeakControl$3.evaluate(ThreadLeakControl.java:468)
	at com.carrotsearch.randomizedtesting.RandomizedRunner.runSingleTest(RandomizedRunner.java:943)
	at com.carrotsearch.randomizedtesting.RandomizedRunner$5.evaluate(RandomizedRunner.java:829)
	at com.carrotsearch.randomizedtesting.RandomizedRunner$6.evaluate(RandomizedRunner.java:879)
	at com.carrotsearch.randomizedtesting.RandomizedRunner$7.evaluate(RandomizedRunner.java:890)
	at com.carrotsearch.randomizedtesting.rules.StatementAdapter.evaluate(StatementAdapter.java:36)
	at com.carrotsearch.randomizedtesting.rules.SystemPropertiesRestoreRule$1.evaluate(SystemPropertiesRestoreRule.java:57)
	at org.apache.lucene.util.AbstractBeforeAfterRule$1.evaluate(AbstractBeforeAfterRule.java:45)
	at com.carrotsearch.randomizedtesting.rules.StatementAdapter.evaluate(StatementAdapter.java:36)
	at org.apache.lucene.util.TestRuleStoreClassName$1.evaluate(TestRuleStoreClassName.java:41)
	at com.carrotsearch.randomizedtesting.rules.NoShadowingOrOverridesOnMethodsRule$1.evaluate(NoShadowingOrOverridesOnMethodsRule.java:40)
	at com.carrotsearch.randomizedtesting.rules.NoShadowingOrOverridesOnMethodsRule$1.evaluate(NoShadowingOrOverridesOnMethodsRule.java:40)
	at com.carrotsearch.randomizedtesting.rules.StatementAdapter.evaluate(StatementAdapter.java:36)
	at com.carrotsearch.randomizedtesting.rules.StatementAdapter.evaluate(StatementAdapter.java:36)
	at com.carrotsearch.randomizedtesting.rules.StatementAdapter.evaluate(StatementAdapter.java:36)
	at org.apache.lucene.util.TestRuleAssertionsRequired$1.evaluate(TestRuleAssertionsRequired.java:53)
	at org.apache.lucene.util.TestRuleMarkFailure$1.evaluate(TestRuleMarkFailure.java:47)
	at org.apache.lucene.util.TestRuleIgnoreAfterMaxFailures$1.evaluate(TestRuleIgnoreAfterMaxFailures.java:64)
	at org.apache.lucene.util.TestRuleIgnoreTestSuites$1.evaluate(TestRuleIgnoreTestSuites.java:54)
	at com.carrotsearch.randomizedtesting.rules.StatementAdapter.evaluate(StatementAdapter.java:36)
	at com.carrotsearch.randomizedtesting.ThreadLeakControl$StatementRunner.run(ThreadLeakControl.java:368)
	at java.lang.Thread.run(Thread.java:748)


FAILED:  org.apache.solr.handler.admin.SegmentsInfoRequestHandlerTest.testSegmentInfosVersion

Error Message:


Stack Trace:
java.lang.AssertionError
	at __randomizedtesting.SeedInfo.seed([777D8BC1C7354EB9:8FA31E29BF599FEA]:0)
	at org.apache.lucene.index.IndexWriter$ReaderPool.noDups(IndexWriter.java:867)
	at org.apache.lucene.index.IndexWriter$ReaderPool.get(IndexWriter.java:857)
	at org.apache.lucene.index.IndexWriter.numDeletesToMerge(IndexWriter.java:5233)
	at org.apache.lucene.index.LogMergePolicy.sizeDocs(LogMergePolicy.java:153)
	at org.apache.lucene.index.LogDocMergePolicy.size(LogDocMergePolicy.java:44)
	at org.apache.lucene.index.LogMergePolicy.findMerges(LogMergePolicy.java:469)
	at org.apache.solr.handler.admin.SegmentsInfoRequestHandler.getMergeCandidatesNames(SegmentsInfoRequestHandler.java:100)
	at org.apache.solr.handler.admin.SegmentsInfoRequestHandler.getSegmentsInfo(SegmentsInfoRequestHandler.java:59)
	at org.apache.solr.handler.admin.SegmentsInfoRequestHandler.handleRequestBody(SegmentsInfoRequestHandler.java:48)
	at org.apache.solr.handler.RequestHandlerBase.handleRequest(RequestHandlerBase.java:199)
	at org.apache.solr.core.SolrCore.execute(SolrCore.java:2508)
	at org.apache.solr.util.TestHarness.query(TestHarness.java:337)
	at org.apache.solr.util.TestHarness.query(TestHarness.java:319)
	at org.apache.solr.SolrTestCaseJ4.assertQ(SolrTestCaseJ4.java:890)
	at org.apache.solr.handler.admin.SegmentsInfoRequestHandlerTest.testSegmentInfosVersion(SegmentsInfoRequestHandlerTest.java:68)
	at sun.reflect.NativeMethodAccessorImpl.invoke0(Native Method)
	at sun.reflect.NativeMethodAccessorImpl.invoke(NativeMethodAccessorImpl.java:62)
	at sun.reflect.DelegatingMethodAccessorImpl.invoke(DelegatingMethodAccessorImpl.java:43)
	at java.lang.reflect.Method.invoke(Method.java:498)
	at com.carrotsearch.randomizedtesting.RandomizedRunner.invoke(RandomizedRunner.java:1737)
	at com.carrotsearch.randomizedtesting.RandomizedRunner$8.evaluate(RandomizedRunner.java:934)
	at com.carrotsearch.randomizedtesting.RandomizedRunner$9.evaluate(RandomizedRunner.java:970)
	at com.carrotsearch.randomizedtesting.RandomizedRunner$10.evaluate(RandomizedRunner.java:984)
	at com.carrotsearch.randomizedtesting.rules.SystemPropertiesRestoreRule$1.evaluate(SystemPropertiesRestoreRule.java:57)
	at org.apache.lucene.util.TestRuleSetupTeardownChained$1.evaluate(TestRuleSetupTeardownChained.java:49)
	at org.apache.lucene.util.AbstractBeforeAfterRule$1.evaluate(AbstractBeforeAfterRule.java:45)
	at org.apache.lucene.util.TestRuleThreadAndTestName$1.evaluate(TestRuleThreadAndTestName.java:48)
	at org.apache.lucene.util.TestRuleIgnoreAfterMaxFailures$1.evaluate(TestRuleIgnoreAfterMaxFailures.java:64)
	at org.apache.lucene.util.TestRuleMarkFailure$1.evaluate(TestRuleMarkFailure.java:47)
	at com.carrotsearch.randomizedtesting.rules.StatementAdapter.evaluate(StatementAdapter.java:36)
	at com.carrotsearch.randomizedtesting.ThreadLeakControl$StatementRunner.run(ThreadLeakControl.java:368)
	at com.carrotsearch.randomizedtesting.ThreadLeakControl.forkTimeoutingTask(ThreadLeakControl.java:817)
	at com.carrotsearch.randomizedtesting.ThreadLeakControl$3.evaluate(ThreadLeakControl.java:468)
	at com.carrotsearch.randomizedtesting.RandomizedRunner.runSingleTest(RandomizedRunner.java:943)
	at com.carrotsearch.randomizedtesting.RandomizedRunner$5.evaluate(RandomizedRunner.java:829)
	at com.carrotsearch.randomizedtesting.RandomizedRunner$6.evaluate(RandomizedRunner.java:879)
	at com.carrotsearch.randomizedtesting.RandomizedRunner$7.evaluate(RandomizedRunner.java:890)
	at com.carrotsearch.randomizedtesting.rules.StatementAdapter.evaluate(StatementAdapter.java:36)
	at com.carrotsearch.randomizedtesting.rules.SystemPropertiesRestoreRule$1.evaluate(SystemPropertiesRestoreRule.java:57)
	at org.apache.lucene.util.AbstractBeforeAfterRule$1.evaluate(AbstractBeforeAfterRule.java:45)
	at com.carrotsearch.randomizedtesting.rules.StatementAdapter.evaluate(StatementAdapter.java:36)
	at org.apache.lucene.util.TestRuleStoreClassName$1.evaluate(TestRuleStoreClassName.java:41)
	at com.carrotsearch.randomizedtesting.rules.NoShadowingOrOverridesOnMethodsRule$1.evaluate(NoShadowingOrOverridesOnMethodsRule.java:40)
	at com.carrotsearch.randomizedtesting.rules.NoShadowingOrOverridesOnMethodsRule$1.evaluate(NoShadowingOrOverridesOnMethodsRule.java:40)
	at com.carrotsearch.randomizedtesting.rules.StatementAdapter.evaluate(StatementAdapter.java:36)
	at com.carrotsearch.randomizedtesting.rules.StatementAdapter.evaluate(StatementAdapter.java:36)
	at com.carrotsearch.randomizedtesting.rules.StatementAdapter.evaluate(StatementAdapter.java:36)
	at org.apache.lucene.util.TestRuleAssertionsRequired$1.evaluate(TestRuleAssertionsRequired.java:53)
	at org.apache.lucene.util.TestRuleMarkFailure$1.evaluate(TestRuleMarkFailure.java:47)
	at org.apache.lucene.util.TestRuleIgnoreAfterMaxFailures$1.evaluate(TestRuleIgnoreAfterMaxFailures.java:64)
	at org.apache.lucene.util.TestRuleIgnoreTestSuites$1.evaluate(TestRuleIgnoreTestSuites.java:54)
	at com.carrotsearch.randomizedtesting.rules.StatementAdapter.evaluate(StatementAdapter.java:36)
	at com.carrotsearch.randomizedtesting.ThreadLeakControl$StatementRunner.run(ThreadLeakControl.java:368)
	at java.lang.Thread.run(Thread.java:748)


FAILED:  org.apache.solr.handler.admin.SegmentsInfoRequestHandlerTest.testSegmentInfosData

Error Message:


Stack Trace:
java.lang.AssertionError
	at __randomizedtesting.SeedInfo.seed([777D8BC1C7354EB9:BD4A99A71DDF926]:0)
	at org.apache.lucene.index.IndexWriter$ReaderPool.noDups(IndexWriter.java:867)
	at org.apache.lucene.index.IndexWriter$ReaderPool.get(IndexWriter.java:857)
	at org.apache.lucene.index.IndexWriter.numDeletesToMerge(IndexWriter.java:5233)
	at org.apache.lucene.index.LogMergePolicy.sizeDocs(LogMergePolicy.java:153)
	at org.apache.lucene.index.LogDocMergePolicy.size(LogDocMergePolicy.java:44)
	at org.apache.lucene.index.LogMergePolicy.findMerges(LogMergePolicy.java:469)
	at org.apache.solr.handler.admin.SegmentsInfoRequestHandler.getMergeCandidatesNames(SegmentsInfoRequestHandler.java:100)
	at org.apache.solr.handler.admin.SegmentsInfoRequestHandler.getSegmentsInfo(SegmentsInfoRequestHandler.java:59)
	at org.apache.solr.handler.admin.SegmentsInfoRequestHandler.handleRequestBody(SegmentsInfoRequestHandler.java:48)
	at org.apache.solr.handler.RequestHandlerBase.handleRequest(RequestHandlerBase.java:199)
	at org.apache.solr.core.SolrCore.execute(SolrCore.java:2508)
	at org.apache.solr.util.TestHarness.query(TestHarness.java:337)
	at org.apache.solr.util.TestHarness.query(TestHarness.java:319)
	at org.apache.solr.SolrTestCaseJ4.assertQ(SolrTestCaseJ4.java:890)
	at org.apache.solr.handler.admin.SegmentsInfoRequestHandlerTest.testSegmentInfosData(SegmentsInfoRequestHandlerTest.java:75)
	at sun.reflect.NativeMethodAccessorImpl.invoke0(Native Method)
	at sun.reflect.NativeMethodAccessorImpl.invoke(NativeMethodAccessorImpl.java:62)
	at sun.reflect.DelegatingMethodAccessorImpl.invoke(DelegatingMethodAccessorImpl.java:43)
	at java.lang.reflect.Method.invoke(Method.java:498)
	at com.carrotsearch.randomizedtesting.RandomizedRunner.invoke(RandomizedRunner.java:1737)
	at com.carrotsearch.randomizedtesting.RandomizedRunner$8.evaluate(RandomizedRunner.java:934)
	at com.carrotsearch.randomizedtesting.RandomizedRunner$9.evaluate(RandomizedRunner.java:970)
	at com.carrotsearch.randomizedtesting.RandomizedRunner$10.evaluate(RandomizedRunner.java:984)
	at com.carrotsearch.randomizedtesting.rules.SystemPropertiesRestoreRule$1.evaluate(SystemPropertiesRestoreRule.java:57)
	at org.apache.lucene.util.TestRuleSetupTeardownChained$1.evaluate(TestRuleSetupTeardownChained.java:49)
	at org.apache.lucene.util.AbstractBeforeAfterRule$1.evaluate(AbstractBeforeAfterRule.java:45)
	at org.apache.lucene.util.TestRuleThreadAndTestName$1.evaluate(TestRuleThreadAndTestName.java:48)
	at org.apache.lucene.util.TestRuleIgnoreAfterMaxFailures$1.evaluate(TestRuleIgnoreAfterMaxFailures.java:64)
	at org.apache.lucene.util.TestRuleMarkFailure$1.evaluate(TestRuleMarkFailure.java:47)
	at com.carrotsearch.randomizedtesting.rules.StatementAdapter.evaluate(StatementAdapter.java:36)
	at com.carrotsearch.randomizedtesting.ThreadLeakControl$StatementRunner.run(ThreadLeakControl.java:368)
	at com.carrotsearch.randomizedtesting.ThreadLeakControl.forkTimeoutingTask(ThreadLeakControl.java:817)
	at com.carrotsearch.randomizedtesting.ThreadLeakControl$3.evaluate(ThreadLeakControl.java:468)
	at com.carrotsearch.randomizedtesting.RandomizedRunner.runSingleTest(RandomizedRunner.java:943)
	at com.carrotsearch.randomizedtesting.RandomizedRunner$5.evaluate(RandomizedRunner.java:829)
	at com.carrotsearch.randomizedtesting.RandomizedRunner$6.evaluate(RandomizedRunner.java:879)
	at com.carrotsearch.randomizedtesting.RandomizedRunner$7.evaluate(RandomizedRunner.java:890)
	at com.carrotsearch.randomizedtesting.rules.StatementAdapter.evaluate(StatementAdapter.java:36)
	at com.carrotsearch.randomizedtesting.rules.SystemPropertiesRestoreRule$1.evaluate(SystemPropertiesRestoreRule.java:57)
	at org.apache.lucene.util.AbstractBeforeAfterRule$1.evaluate(AbstractBeforeAfterRule.java:45)
	at com.carrotsearch.randomizedtesting.rules.StatementAdapter.evaluate(StatementAdapter.java:36)
	at org.apache.lucene.util.TestRuleStoreClassName$1.evaluate(TestRuleStoreClassName.java:41)
	at com.carrotsearch.randomizedtesting.rules.NoShadowingOrOverridesOnMethodsRule$1.evaluate(NoShadowingOrOverridesOnMethodsRule.java:40)
	at com.carrotsearch.randomizedtesting.rules.NoShadowingOrOverridesOnMethodsRule$1.evaluate(NoShadowingOrOverridesOnMethodsRule.java:40)
	at com.carrotsearch.randomizedtesting.rules.StatementAdapter.evaluate(StatementAdapter.java:36)
	at com.carrotsearch.randomizedtesting.rules.StatementAdapter.evaluate(StatementAdapter.java:36)
	at com.carrotsearch.randomizedtesting.rules.StatementAdapter.evaluate(StatementAdapter.java:36)
	at org.apache.lucene.util.TestRuleAssertionsRequired$1.evaluate(TestRuleAssertionsRequired.java:53)
	at org.apache.lucene.util.TestRuleMarkFailure$1.evaluate(TestRuleMarkFailure.java:47)
	at org.apache.lucene.util.TestRuleIgnoreAfterMaxFailures$1.evaluate(TestRuleIgnoreAfterMaxFailures.java:64)
	at org.apache.lucene.util.TestRuleIgnoreTestSuites$1.evaluate(TestRuleIgnoreTestSuites.java:54)
	at com.carrotsearch.randomizedtesting.rules.StatementAdapter.evaluate(StatementAdapter.java:36)
	at com.carrotsearch.randomizedtesting.ThreadLeakControl$StatementRunner.run(ThreadLeakControl.java:368)
	at java.lang.Thread.run(Thread.java:748)


FAILED:  org.apache.solr.handler.admin.SegmentsInfoRequestHandlerTest.testSegmentInfos

Error Message:


Stack Trace:
java.lang.AssertionError
	at __randomizedtesting.SeedInfo.seed([777D8BC1C7354EB9:3B2A1C7E0D3996E9]:0)
	at org.apache.lucene.index.IndexWriter$ReaderPool.noDups(IndexWriter.java:867)
	at org.apache.lucene.index.IndexWriter$ReaderPool.get(IndexWriter.java:857)
	at org.apache.lucene.index.IndexWriter.numDeletesToMerge(IndexWriter.java:5233)
	at org.apache.lucene.index.LogMergePolicy.sizeDocs(LogMergePolicy.java:153)
	at org.apache.lucene.index.LogDocMergePolicy.size(LogDocMergePolicy.java:44)
	at org.apache.lucene.index.LogMergePolicy.findMerges(LogMergePolicy.java:469)
	at org.apache.solr.handler.admin.SegmentsInfoRequestHandler.getMergeCandidatesNames(SegmentsInfoRequestHandler.java:100)
	at org.apache.solr.handler.admin.SegmentsInfoRequestHandler.getSegmentsInfo(SegmentsInfoRequestHandler.java:59)
	at org.apache.solr.handler.admin.SegmentsInfoRequestHandler.handleRequestBody(SegmentsInfoRequestHandler.java:48)
	at org.apache.solr.handler.RequestHandlerBase.handleRequest(RequestHandlerBase.java:199)
	at org.apache.solr.core.SolrCore.execute(SolrCore.java:2508)
	at org.apache.solr.util.TestHarness.query(TestHarness.java:337)
	at org.apache.solr.util.TestHarness.query(TestHarness.java:319)
	at org.apache.solr.SolrTestCaseJ4.assertQ(SolrTestCaseJ4.java:890)
	at org.apache.solr.handler.admin.SegmentsInfoRequestHandlerTest.testSegmentInfos(SegmentsInfoRequestHandlerTest.java:61)
	at sun.reflect.NativeMethodAccessorImpl.invoke0(Native Method)
	at sun.reflect.NativeMethodAccessorImpl.invoke(NativeMethodAccessorImpl.java:62)
	at sun.reflect.DelegatingMethodAccessorImpl.invoke(DelegatingMethodAccessorImpl.java:43)
	at java.lang.reflect.Method.invoke(Method.java:498)
	at com.carrotsearch.randomizedtesting.RandomizedRunner.invoke(RandomizedRunner.java:1737)
	at com.carrotsearch.randomizedtesting.RandomizedRunner$8.evaluate(RandomizedRunner.java:934)
	at com.carrotsearch.randomizedtesting.RandomizedRunner$9.evaluate(RandomizedRunner.java:970)
	at com.carrotsearch.randomizedtesting.RandomizedRunner$10.evaluate(RandomizedRunner.java:984)
	at com.carrotsearch.randomizedtesting.rules.SystemPropertiesRestoreRule$1.evaluate(SystemPropertiesRestoreRule.java:57)
	at org.apache.lucene.util.TestRuleSetupTeardownChained$1.evaluate(TestRuleSetupTeardownChained.java:49)
	at org.apache.lucene.util.AbstractBeforeAfterRule$1.evaluate(AbstractBeforeAfterRule.java:45)
	at org.apache.lucene.util.TestRuleThreadAndTestName$1.evaluate(TestRuleThreadAndTestName.java:48)
	at org.apache.lucene.util.TestRuleIgnoreAfterMaxFailures$1.evaluate(TestRuleIgnoreAfterMaxFailures.java:64)
	at org.apache.lucene.util.TestRuleMarkFailure$1.evaluate(TestRuleMarkFailure.java:47)
	at com.carrotsearch.randomizedtesting.rules.StatementAdapter.evaluate(StatementAdapter.java:36)
	at com.carrotsearch.randomizedtesting.ThreadLeakControl$StatementRunner.run(ThreadLeakControl.java:368)
	at com.carrotsearch.randomizedtesting.ThreadLeakControl.forkTimeoutingTask(ThreadLeakControl.java:817)
	at com.carrotsearch.randomizedtesting.ThreadLeakControl$3.evaluate(ThreadLeakControl.java:468)
	at com.carrotsearch.randomizedtesting.RandomizedRunner.runSingleTest(RandomizedRunner.java:943)
	at com.carrotsearch.randomizedtesting.RandomizedRunner$5.evaluate(RandomizedRunner.java:829)
	at com.carrotsearch.randomizedtesting.RandomizedRunner$6.evaluate(RandomizedRunner.java:879)
	at com.carrotsearch.randomizedtesting.RandomizedRunner$7.evaluate(RandomizedRunner.java:890)
	at com.carrotsearch.randomizedtesting.rules.StatementAdapter.evaluate(StatementAdapter.java:36)
	at com.carrotsearch.randomizedtesting.rules.SystemPropertiesRestoreRule$1.evaluate(SystemPropertiesRestoreRule.java:57)
	at org.apache.lucene.util.AbstractBeforeAfterRule$1.evaluate(AbstractBeforeAfterRule.java:45)
	at com.carrotsearch.randomizedtesting.rules.StatementAdapter.evaluate(StatementAdapter.java:36)
	at org.apache.lucene.util.TestRuleStoreClassName$1.evaluate(TestRuleStoreClassName.java:41)
	at com.carrotsearch.randomizedtesting.rules.NoShadowingOrOverridesOnMethodsRule$1.evaluate(NoShadowingOrOverridesOnMethodsRule.java:40)
	at com.carrotsearch.randomizedtesting.rules.NoShadowingOrOverridesOnMethodsRule$1.evaluate(NoShadowingOrOverridesOnMethodsRule.java:40)
	at com.carrotsearch.randomizedtesting.rules.StatementAdapter.evaluate(StatementAdapter.java:36)
	at com.carrotsearch.randomizedtesting.rules.StatementAdapter.evaluate(StatementAdapter.java:36)
	at com.carrotsearch.randomizedtesting.rules.StatementAdapter.evaluate(StatementAdapter.java:36)
	at org.apache.lucene.util.TestRuleAssertionsRequired$1.evaluate(TestRuleAssertionsRequired.java:53)
	at org.apache.lucene.util.TestRuleMarkFailure$1.evaluate(TestRuleMarkFailure.java:47)
	at org.apache.lucene.util.TestRuleIgnoreAfterMaxFailures$1.evaluate(TestRuleIgnoreAfterMaxFailures.java:64)
	at org.apache.lucene.util.TestRuleIgnoreTestSuites$1.evaluate(TestRuleIgnoreTestSuites.java:54)
	at com.carrotsearch.randomizedtesting.rules.StatementAdapter.evaluate(StatementAdapter.java:36)
	at com.carrotsearch.randomizedtesting.ThreadLeakControl$StatementRunner.run(ThreadLeakControl.java:368)
	at java.lang.Thread.run(Thread.java:748)




Build Log:
[...truncated 14621 lines...]
   [junit4] Suite: org.apache.solr.handler.admin.SegmentsInfoRequestHandlerTest
   [junit4]   2> Creating dataDir: /home/jenkins/workspace/Lucene-Solr-master-Linux/solr/build/solr-core/test/J0/temp/solr.handler.admin.SegmentsInfoRequestHandlerTest_777D8BC1C7354EB9-001/init-core-data-001
   [junit4]   2> 1825332 INFO  (SUITE-SegmentsInfoRequestHandlerTest-seed#[777D8BC1C7354EB9]-worker) [    ] o.a.s.c.SolrResourceLoader [null] Added 2 libs to classloader, from paths: [/home/jenkins/workspace/Lucene-Solr-master-Linux/solr/core/src/test-files/solr/collection1/lib, /home/jenkins/workspace/Lucene-Solr-master-Linux/solr/core/src/test-files/solr/collection1/lib/classes]
   [junit4]   2> 1825350 INFO  (SUITE-SegmentsInfoRequestHandlerTest-seed#[777D8BC1C7354EB9]-worker) [    ] o.a.s.c.SolrConfig Using Lucene MatchVersion: 8.0.0
   [junit4]   2> 1825365 INFO  (SUITE-SegmentsInfoRequestHandlerTest-seed#[777D8BC1C7354EB9]-worker) [    ] o.a.s.s.IndexSchema [null] Schema name=test
   [junit4]   2> 1825430 WARN  (SUITE-SegmentsInfoRequestHandlerTest-seed#[777D8BC1C7354EB9]-worker) [    ] o.a.s.s.IndexSchema Field text is not multivalued and destination for multiple copyFields (2)
   [junit4]   2> 1825430 INFO  (SUITE-SegmentsInfoRequestHandlerTest-seed#[777D8BC1C7354EB9]-worker) [    ] o.a.s.s.IndexSchema Loaded schema test/1.4 with uniqueid field id
   [junit4]   2> 1825460 INFO  (SUITE-SegmentsInfoRequestHandlerTest-seed#[777D8BC1C7354EB9]-worker) [    ] o.a.s.m.r.SolrJmxReporter JMX monitoring for 'solr.node' (registry 'solr.node') enabled at server: com.sun.jmx.mbeanserver.JmxMBeanServer@11c6aad
   [junit4]   2> 1825466 INFO  (SUITE-SegmentsInfoRequestHandlerTest-seed#[777D8BC1C7354EB9]-worker) [    ] o.a.s.m.r.SolrJmxReporter JMX monitoring for 'solr.jvm' (registry 'solr.jvm') enabled at server: com.sun.jmx.mbeanserver.JmxMBeanServer@11c6aad
   [junit4]   2> 1825467 INFO  (SUITE-SegmentsInfoRequestHandlerTest-seed#[777D8BC1C7354EB9]-worker) [    ] o.a.s.m.r.SolrJmxReporter JMX monitoring for 'solr.jetty' (registry 'solr.jetty') enabled at server: com.sun.jmx.mbeanserver.JmxMBeanServer@11c6aad
   [junit4]   2> 1825468 INFO  (coreLoadExecutor-7887-thread-1) [    ] o.a.s.c.TransientSolrCoreCacheDefault Allocating transient cache for 2147483647 transient cores
   [junit4]   2> 1825468 INFO  (coreLoadExecutor-7887-thread-1) [    x:collection1] o.a.s.c.SolrResourceLoader [null] Added 2 libs to classloader, from paths: [/home/jenkins/workspace/Lucene-Solr-master-Linux/solr/core/src/test-files/solr/collection1/lib, /home/jenkins/workspace/Lucene-Solr-master-Linux/solr/core/src/test-files/solr/collection1/lib/classes]
   [junit4]   2> 1825491 INFO  (coreLoadExecutor-7887-thread-1) [    x:collection1] o.a.s.c.SolrConfig Using Lucene MatchVersion: 8.0.0
   [junit4]   2> 1825504 INFO  (coreLoadExecutor-7887-thread-1) [    x:collection1] o.a.s.s.IndexSchema [collection1] Schema name=test
   [junit4]   2> 1825565 WARN  (coreLoadExecutor-7887-thread-1) [    x:collection1] o.a.s.s.IndexSchema Field text is not multivalued and destination for multiple copyFields (2)
   [junit4]   2> 1825565 INFO  (coreLoadExecutor-7887-thread-1) [    x:collection1] o.a.s.s.IndexSchema Loaded schema test/1.4 with uniqueid field id
   [junit4]   2> 1825570 INFO  (coreLoadExecutor-7887-thread-1) [    x:collection1] o.a.s.c.CoreContainer Creating SolrCore 'collection1' using configuration from instancedir /home/jenkins/workspace/Lucene-Solr-master-Linux/solr/core/src/test-files/solr/collection1, trusted=true
   [junit4]   2> 1825570 INFO  (coreLoadExecutor-7887-thread-1) [    x:collection1] o.a.s.m.r.SolrJmxReporter JMX monitoring for 'solr.core.collection1' (registry 'solr.core.collection1') enabled at server: com.sun.jmx.mbeanserver.JmxMBeanServer@11c6aad
   [junit4]   2> 1825570 INFO  (coreLoadExecutor-7887-thread-1) [    x:collection1] o.a.s.c.SolrCore solr.RecoveryStrategy.Builder
   [junit4]   2> 1825570 INFO  (coreLoadExecutor-7887-thread-1) [    x:collection1] o.a.s.c.SolrCore [[collection1] ] Opening new SolrCore at [/home/jenkins/workspace/Lucene-Solr-master-Linux/solr/core/src/test-files/solr/collection1], dataDir=[/home/jenkins/workspace/Lucene-Solr-master-Linux/solr/build/solr-core/test/J0/temp/solr.handler.admin.SegmentsInfoRequestHandlerTest_777D8BC1C7354EB9-001/init-core-data-001/]
   [junit4]   2> 1825604 INFO  (coreLoadExecutor-7887-thread-1) [    x:collection1] o.a.s.u.CommitTracker Hard AutoCommit: disabled
   [junit4]   2> 1825604 INFO  (coreLoadExecutor-7887-thread-1) [    x:collection1] o.a.s.u.CommitTracker Soft AutoCommit: disabled
   [junit4]   2> 1825605 INFO  (coreLoadExecutor-7887-thread-1) [    x:collection1] o.a.s.s.SolrIndexSearcher Opening [Searcher@831875[collection1] main]
   [junit4]   2> 1825605 INFO  (coreLoadExecutor-7887-thread-1) [    x:collection1] o.a.s.h.c.SpellCheckComponent Initializing spell checkers
   [junit4]   2> 1825622 INFO  (coreLoadExecutor-7887-thread-1) [    x:collection1] o.a.s.s.DirectSolrSpellChecker init: {name=direct,classname=DirectSolrSpellChecker,field=lowerfilt,minQueryLength=3}
   [junit4]   2> 1825698 INFO  (coreLoadExecutor-7887-thread-1) [    x:collection1] o.a.s.h.ReplicationHandler Commits will be reserved for 10000ms.
   [junit4]   2> 1825698 INFO  (searcherExecutor-7888-thread-1-processing-x:collection1) [    x:collection1] o.a.s.h.c.SpellCheckComponent Loading spell index for spellchecker: default
   [junit4]   2> 1825698 INFO  (searcherExecutor-7888-thread-1-processing-x:collection1) [    x:collection1] o.a.s.h.c.SpellCheckComponent Loading spell index for spellchecker: direct
   [junit4]   2> 1825698 INFO  (searcherExecutor-7888-thread-1-processing-x:collection1) [    x:collection1] o.a.s.h.c.SpellCheckComponent Loading spell index for spellchecker: wordbreak
   [junit4]   2> 1825698 INFO  (searcherExecutor-7888-thread-1-processing-x:collection1) [    x:collection1] o.a.s.h.c.SpellCheckComponent Loading spell index for spellchecker: multipleFields
   [junit4]   2> 1825698 INFO  (searcherExecutor-7888-thread-1-processing-x:collection1) [    x:collection1] o.a.s.h.c.SpellCheckComponent Loading spell index for spellchecker: jarowinkler
   [junit4]   2> 1825698 INFO  (searcherExecutor-7888-thread-1-processing-x:collection1) [    x:collection1] o.a.s.h.c.SpellCheckComponent Loading spell index for spellchecker: external
   [junit4]   2> 1825698 INFO  (searcherExecutor-7888-thread-1-processing-x:collection1) [    x:collection1] o.a.s.h.c.SpellCheckComponent Loading spell index for spellchecker: freq
   [junit4]   2> 1825698 INFO  (searcherExecutor-7888-thread-1-processing-x:collection1) [    x:collection1] o.a.s.h.c.SpellCheckComponent Loading spell index for spellchecker: fqcn
   [junit4]   2> 1825699 INFO  (searcherExecutor-7888-thread-1-processing-x:collection1) [    x:collection1] o.a.s.h.c.SpellCheckComponent Loading spell index for spellchecker: perDict
   [junit4]   2> 1825699 INFO  (searcherExecutor-7888-thread-1-processing-x:collection1) [    x:collection1] o.a.s.c.SolrCore [collection1] Registered new searcher Searcher@831875[collection1] main{ExitableDirectoryReader(UninvertingDirectoryReader())}
   [junit4]   2> 1825700 INFO  (SUITE-SegmentsInfoRequestHandlerTest-seed#[777D8BC1C7354EB9]-worker) [    ] o.a.s.u.p.LogUpdateProcessorFactory [collection1]  webapp=null path=null params={}{add=[SOLR1000]} 0 0
   [junit4]   2> 1825701 INFO  (SUITE-SegmentsInfoRequestHandlerTest-seed#[777D8BC1C7354EB9]-worker) [    ] o.a.s.u.p.LogUpdateProcessorFactory [collection1]  webapp=null path=null params={}{add=[SOLR1001]} 0 0
   [junit4]   2> 1825701 INFO  (SUITE-SegmentsInfoRequestHandlerTest-seed#[777D8BC1C7354EB9]-worker) [    ] o.a.s.u.p.LogUpdateProcessorFactory [collection1]  webapp=null path=null params={}{add=[SOLR1002]} 0 0
   [junit4]   2> 1825702 INFO  (SUITE-SegmentsInfoRequestHandlerTest-seed#[777D8BC1C7354EB9]-worker) [    ] o.a.s.u.p.LogUpdateProcessorFactory [collection1]  webapp=null path=null params={}{add=[SOLR1003]} 0 0
   [junit4]   2> 1825702 INFO  (SUITE-SegmentsInfoRequestHandlerTest-seed#[777D8BC1C7354EB9]-worker) [    ] o.a.s.u.p.LogUpdateProcessorFactory [collection1]  webapp=null path=null params={}{add=[SOLR1004]} 0 0
   [junit4]   2> 1825702 INFO  (SUITE-SegmentsInfoRequestHandlerTest-seed#[777D8BC1C7354EB9]-worker) [    ] o.a.s.u.p.LogUpdateProcessorFactory [collection1]  webapp=null path=null params={}{delete=[SOLR1000]} 0 0
   [junit4]   2> 1825702 INFO  (SUITE-SegmentsInfoRequestHandlerTest-seed#[777D8BC1C7354EB9]-worker) [    ] o.a.s.u.DirectUpdateHandler2 start commit{,optimize=false,openSearcher=true,waitSearcher=true,expungeDeletes=false,softCommit=false,prepareCommit=false}
   [junit4]   2> 1825702 INFO  (SUITE-SegmentsInfoRequestHandlerTest-seed#[777D8BC1C7354EB9]-worker) [    ] o.a.s.u.SolrIndexWriter Calling setCommitData with IW:org.apache.solr.update.SolrIndexWriter@11dd83b commitCommandVersion:0
   [junit4]   2> 1825704 INFO  (SUITE-SegmentsInfoRequestHandlerTest-seed#[777D8BC1C7354EB9]-worker) [    ] o.a.s.s.SolrIndexSearcher Opening [Searcher@df1890[collection1] main]
   [junit4]   2> 1825704 INFO  (SUITE-SegmentsInfoRequestHandlerTest-seed#[777D8BC1C7354EB9]-worker) [    ] o.a.s.u.DirectUpdateHandler2 end_commit_flush
   [junit4]   2> 1825705 INFO  (searcherExecutor-7888-thread-1) [    ] o.a.s.c.SolrCore [collection1] Registered new searcher Searcher@df1890[collection1] main{ExitableDirectoryReader(UninvertingDirectoryReader(Uninverting(_0(8.0.0):C5/1:delGen=1)))}
   [junit4]   2> 1825706 INFO  (SUITE-SegmentsInfoRequestHandlerTest-seed#[777D8BC1C7354EB9]-worker) [    ] o.a.s.u.p.LogUpdateProcessorFactory [collection1]  webapp=null path=null params={}{commit=} 0 3
   [junit4]   2> 1825706 INFO  (SUITE-SegmentsInfoRequestHandlerTest-seed#[777D8BC1C7354EB9]-worker) [    ] o.a.s.u.p.LogUpdateProcessorFactory [collection1]  webapp=null path=null params={}{add=[SOLR2000]} 0 0
   [junit4]   2> 1825706 INFO  (SUITE-SegmentsInfoRequestHandlerTest-seed#[777D8BC1C7354EB9]-worker) [    ] o.a.s.u.p.LogUpdateProcessorFactory [collection1]  webapp=null path=null params={}{add=[SOLR2001]} 0 0
   [junit4]   2> 1825706 INFO  (SUITE-SegmentsInfoRequestHandlerTest-seed#[777D8BC1C7354EB9]-worker) [    ] o.a.s.u.p.LogUpdateProcessorFactory [collection1]  webapp=null path=null params={}{add=[SOLR2002]} 0 0
   [junit4]   2> 1825706 INFO  (SUITE-SegmentsInfoRequestHandlerTest-seed#[777D8BC1C7354EB9]-worker) [    ] o.a.s.u.p.LogUpdateProcessorFactory [collection1]  webapp=null path=null params={}{add=[SOLR2003]} 0 0
   [junit4]   2> 1825706 INFO  (SUITE-SegmentsInfoRequestHandlerTest-seed#[777D8BC1C7354EB9]-worker) [    ] o.a.s.u.p.LogUpdateProcessorFactory [collection1]  webapp=null path=null params={}{add=[SOLR2004]} 0 0
   [junit4]   2> 1825706 INFO  (SUITE-SegmentsInfoRequestHandlerTest-seed#[777D8BC1C7354EB9]-worker) [    ] o.a.s.u.DirectUpdateHandler2 start commit{,optimize=false,openSearcher=true,waitSearcher=true,expungeDeletes=false,softCommit=false,prepareCommit=false}
   [junit4]   2> 1825706 INFO  (SUITE-SegmentsInfoRequestHandlerTest-seed#[777D8BC1C7354EB9]-worker) [    ] o.a.s.u.SolrIndexWriter Calling setCommitData with IW:org.apache.solr.update.SolrIndexWriter@11dd83b commitCommandVersion:0
   [junit4]   2> 1825708 INFO  (SUITE-SegmentsInfoRequestHandlerTest-seed#[777D8BC1C7354EB9]-worker) [    ] o.a.s.s.SolrIndexSearcher Opening [Searcher@83e60e[collection1] main]
   [junit4]   2> 1825708 INFO  (SUITE-SegmentsInfoRequestHandlerTest-seed#[777D8BC1C7354EB9]-worker) [    ] o.a.s.u.DirectUpdateHandler2 end_commit_flush
   [junit4]   2> 1825709 INFO  (searcherExecutor-7888-thread-1) [    ] o.a.s.c.SolrCore [collection1] Registered new searcher Searcher@83e60e[collection1] main{ExitableDirectoryReader(UninvertingDirectoryReader(Uninverting(_0(8.0.0):C5/1:delGen=1) Uninverting(_1(8.0.0):C5)))}
   [junit4]   2> 1825709 INFO  (SUITE-SegmentsInfoRequestHandlerTest-seed#[777D8BC1C7354EB9]-worker) [    ] o.a.s.u.p.LogUpdateProcessorFactory [collection1]  webapp=null path=null params={}{commit=} 0 2
   [junit4]   2> NOTE: reproduce with: ant test  -Dtestcase=SegmentsInfoRequestHandlerTest -Dtests.method=testSegmentInfosVersion -Dtests.seed=777D8BC1C7354EB9 -Dtests.multiplier=3 -Dtests.slow=true -Dtests.locale=ar-MA -Dtests.timezone=America/Lima -Dtests.asserts=true -Dtests.file.encoding=ISO-8859-1
   [junit4] FAILURE 0.01s J0 | SegmentsInfoRequestHandlerTest.testSegmentInfosVersion <<<
   [junit4]    > Throwable #1: java.lang.AssertionError
   [junit4]    > 	at __randomizedtesting.SeedInfo.seed([777D8BC1C7354EB9:8FA31E29BF599FEA]:0)
   [junit4]    > 	at org.apache.lucene.index.IndexWriter$ReaderPool.noDups(IndexWriter.java:867)
   [junit4]    > 	at org.apache.lucene.index.IndexWriter$ReaderPool.get(IndexWriter.java:857)
   [junit4]    > 	at org.apache.lucene.index.IndexWriter.numDeletesToMerge(IndexWriter.java:5233)
   [junit4]    > 	at org.apache.lucene.index.LogMergePolicy.sizeDocs(LogMergePolicy.java:153)
   [junit4]    > 	at org.apache.lucene.index.LogDocMergePolicy.size(LogDocMergePolicy.java:44)
   [junit4]    > 	at org.apache.lucene.index.LogMergePolicy.findMerges(LogMergePolicy.java:469)
   [junit4]    > 	at org.apache.solr.handler.admin.SegmentsInfoRequestHandler.getMergeCandidatesNames(SegmentsInfoRequestHandler.java:100)
   [junit4]    > 	at org.apache.solr.handler.admin.SegmentsInfoRequestHandler.getSegmentsInfo(SegmentsInfoRequestHandler.java:59)
   [junit4]    > 	at org.apache.solr.handler.admin.SegmentsInfoRequestHandler.handleRequestBody(SegmentsInfoRequestHandler.java:48)
   [junit4]    > 	at org.apache.solr.handler.RequestHandlerBase.handleRequest(RequestHandlerBase.java:199)
   [junit4]    > 	at org.apache.solr.core.SolrCore.execute(SolrCore.java:2508)
   [junit4]    > 	at org.apache.solr.util.TestHarness.query(TestHarness.java:337)
   [junit4]    > 	at org.apache.solr.util.TestHarness.query(TestHarness.java:319)
   [junit4]    > 	at org.apache.solr.SolrTestCaseJ4.assertQ(SolrTestCaseJ4.java:890)
   [junit4]    > 	at org.apache.solr.handler.admin.SegmentsInfoRequestHandlerTest.testSegmentInfosVersion(SegmentsInfoRequestHandlerTest.java:68)
   [junit4]    > 	at java.lang.Thread.run(Thread.java:748)
   [junit4]   2> NOTE: reproduce with: ant test  -Dtestcase=SegmentsInfoRequestHandlerTest -Dtests.method=testSegmentInfosData -Dtests.seed=777D8BC1C7354EB9 -Dtests.multiplier=3 -Dtests.slow=true -Dtests.locale=ar-MA -Dtests.timezone=America/Lima -Dtests.asserts=true -Dtests.file.encoding=ISO-8859-1
   [junit4] FAILURE 0.01s J0 | SegmentsInfoRequestHandlerTest.testSegmentInfosData <<<
   [junit4]    > Throwable #1: java.lang.AssertionError
   [junit4]    > 	at __randomizedtesting.SeedInfo.seed([777D8BC1C7354EB9:BD4A99A71DDF926]:0)
   [junit4]    > 	at org.apache.lucene.index.IndexWriter$ReaderPool.noDups(IndexWriter.java:867)
   [junit4]    > 	at org.apache.lucene.index.IndexWriter$ReaderPool.get(IndexWriter.java:857)
   [junit4]    > 	at org.apache.lucene.index.IndexWriter.numDeletesToMerge(IndexWriter.java:5233)
   [junit4]    > 	at org.apache.lucene.index.LogMergePolicy.sizeDocs(LogMergePolicy.java:153)
   [junit4]    > 	at org.apache.lucene.index.LogDocMergePolicy.size(LogDocMergePolicy.java:44)
   [junit4]    > 	at org.apache.lucene.index.LogMergePolicy.findMerges(LogMergePolicy.java:469)
   [junit4]    > 	at org.apache.solr.handler.admin.SegmentsInfoRequestHandler.getMergeCandidatesNames(SegmentsInfoRequestHandler.java:100)
   [junit4]    > 	at org.apache.solr.handler.admin.SegmentsInfoRequestHandler.getSegmentsInfo(SegmentsInfoRequestHandler.java:59)
   [junit4]    > 	at org.apache.solr.handler.admin.SegmentsInfoRequestHandler.handleRequestBody(SegmentsInfoRequestHandler.java:48)
   [junit4]    > 	at org.apache.solr.handler.RequestHandlerBase.handleRequest(RequestHandlerBase.java:199)
   [junit4]    > 	at org.apache.solr.core.SolrCore.execute(SolrCore.java:2508)
   [junit4]    > 	at org.apache.solr.util.TestHarness.query(TestHarness.java:337)
   [junit4]    > 	at org.apache.solr.util.TestHarness.query(TestHarness.java:319)
   [junit4]    > 	at org.apache.solr.SolrTestCaseJ4.assertQ(SolrTestCaseJ4.java:890)
   [junit4]    > 	at org.apache.solr.handler.admin.SegmentsInfoRequestHandlerTest.testSegmentInfosData(SegmentsInfoRequestHandlerTest.java:75)
   [junit4]    > 	at java.lang.Thread.run(Thread.java:748)
   [junit4]   2> NOTE: reproduce with: ant test  -Dtestcase=SegmentsInfoRequestHandlerTest -Dtests.method=testSegmentInfos -Dtests.seed=777D8BC1C7354EB9 -Dtests.multiplier=3 -Dtests.slow=true -Dtests.locale=ar-MA -Dtests.timezone=America/Lima -Dtests.asserts=true -Dtests.file.encoding=ISO-8859-1
   [junit4] FAILURE 0.00s J0 | SegmentsInfoRequestHandlerTest.testSegmentInfos <<<
   [junit4]    > Throwable #1: java.lang.AssertionError
   [junit4]    > 	at __randomizedtesting.SeedInfo.seed([777D8BC1C7354EB9:3B2A1C7E0D3996E9]:0)
   [junit4]    > 	at org.apache.lucene.index.IndexWriter$ReaderPool.noDups(IndexWriter.java:867)
   [junit4]    > 	at org.apache.lucene.index.IndexWriter$ReaderPool.get(IndexWriter.java:857)
   [junit4]    > 	at org.apache.lucene.index.IndexWriter.numDeletesToMerge(IndexWriter.java:5233)
   [junit4]    > 	at org.apache.lucene.index.LogMergePolicy.sizeDocs(LogMergePolicy.java:153)
   [junit4]    > 	at org.apache.lucene.index.LogDocMergePolicy.size(LogDocMergePolicy.java:44)
   [junit4]    > 	at org.apache.lucene.index.LogMergePolicy.findMerges(LogMergePolicy.java:469)
   [junit4]    > 	at org.apache.solr.handler.admin.SegmentsInfoRequestHandler.getMergeCandidatesNames(SegmentsInfoRequestHandler.java:100)
   [junit4]    > 	at org.apache.solr.handler.admin.SegmentsInfoRequestHandler.getSegmentsInfo(SegmentsInfoRequestHandler.java:59)
   [junit4]    > 	at org.apache.solr.handler.admin.SegmentsInfoRequestHandler.handleRequestBody(SegmentsInfoRequestHandler.java:48)
   [junit4]    > 	at org.apache.solr.handler.RequestHandlerBase.handleRequest(RequestHandlerBase.java:199)
   [junit4]    > 	at org.apache.solr.core.SolrCore.execute(SolrCore.java:2508)
   [junit4]    > 	at org.apache.solr.util.TestHarness.query(TestHarness.java:337)
   [junit4]    > 	at org.apache.solr.util.TestHarness.query(TestHarness.java:319)
   [junit4]    > 	at org.apache.solr.SolrTestCaseJ4.assertQ(SolrTestCaseJ4.java:890)
   [junit4]    > 	at org.apache.solr.handler.admin.SegmentsInfoRequestHandlerTest.testSegmentInfos(SegmentsInfoRequestHandlerTest.java:61)
   [junit4]    > 	at java.lang.Thread.run(Thread.java:748)
   [junit4]   2> 1825726 INFO  (SUITE-SegmentsInfoRequestHandlerTest-seed#[777D8BC1C7354EB9]-worker) [    ] o.a.s.c.CoreContainer Shutting down CoreContainer instance=19664388
   [junit4]   2> 1825727 INFO  (SUITE-SegmentsInfoRequestHandlerTest-seed#[777D8BC1C7354EB9]-worker) [    ] o.a.s.m.SolrMetricManager Closing metric reporters for registry=solr.node, tag=null
   [junit4]   2> 1825727 INFO  (SUITE-SegmentsInfoRequestHandlerTest-seed#[777D8BC1C7354EB9]-worker) [    ] o.a.s.m.r.SolrJmxReporter Closing reporter [org.apache.solr.metrics.reporters.SolrJmxReporter@19887d9: rootName = null, domain = solr.node, service url = null, agent id = null] for registry solr.node / com.codahale.metrics.MetricRegistry@4962b4
   [junit4]   2> 1825730 INFO  (SUITE-SegmentsInfoRequestHandlerTest-seed#[777D8BC1C7354EB9]-worker) [    ] o.a.s.m.SolrMetricManager Closing metric reporters for registry=solr.jvm, tag=null
   [junit4]   2> 1825730 INFO  (SUITE-SegmentsInfoRequestHandlerTest-seed#[777D8BC1C7354EB9]-worker) [    ] o.a.s.m.r.SolrJmxReporter Closing reporter [org.apache.solr.metrics.reporters.SolrJmxReporter@11f6366: rootName = null, domain = solr.jvm, service url = null, agent id = null] for registry solr.jvm / com.codahale.metrics.MetricRegistry@1f4f9d
   [junit4]   2> 1825732 INFO  (SUITE-SegmentsInfoRequestHandlerTest-seed#[777D8BC1C7354EB9]-worker) [    ] o.a.s.m.SolrMetricManager Closing metric reporters for registry=solr.jetty, tag=null
   [junit4]   2> 1825732 INFO  (SUITE-SegmentsInfoRequestHandlerTest-seed#[777D8BC1C7354EB9]-worker) [    ] o.a.s.m.r.SolrJmxReporter Closing reporter [org.apache.solr.metrics.reporters.SolrJmxReporter@18a70d9: rootName = null, domain = solr.jetty, service url = null, agent id = null] for registry solr.jetty / com.codahale.metrics.MetricRegistry@4fae12
   [junit4]   2> 1825732 INFO  (coreCloseExecutor-7892-thread-1) [    x:collection1] o.a.s.c.SolrCore [collection1]  CLOSING SolrCore org.apache.solr.core.SolrCore@3e843b
   [junit4]   2> 1825732 INFO  (coreCloseExecutor-7892-thread-1) [    x:collection1] o.a.s.m.SolrMetricManager Closing metric reporters for registry=solr.core.collection1, tag=3e843b
   [junit4]   2> 1825732 INFO  (coreCloseExecutor-7892-thread-1) [    x:collection1] o.a.s.m.r.SolrJmxReporter Closing reporter [org.apache.solr.metrics.reporters.SolrJmxReporter@17d9c31: rootName = null, domain = solr.core.collection1, service url = null, agent id = null] for registry solr.core.collection1 / com.codahale.metrics.MetricRegistry@15891bb
   [junit4]   2> NOTE: leaving temporary files on disk at: /home/jenkins/workspace/Lucene-Solr-master-Linux/solr/build/solr-core/test/J0/temp/solr.handler.admin.SegmentsInfoRequestHandlerTest_777D8BC1C7354EB9-001
   [junit4]   2> NOTE: test params are: codec=Asserting(Lucene70): {name=TestBloomFilteredLucenePostings(BloomFilteringPostingsFormat(Lucene50(blocksize=128))), id=TestBloomFilteredLucenePostings(BloomFilteringPostingsFormat(Lucene50(blocksize=128)))}, docValues:{}, maxPointsInLeafNode=1855, maxMBSortInHeap=5.217803678418882, sim=Asserting(org.apache.lucene.search.similarities.AssertingSimilarity@358000), locale=ar-MA, timezone=America/Lima
   [junit4]   2> NOTE: Linux 4.13.0-37-generic i386/Oracle Corporation 1.8.0_162 (32-bit)/cpus=8,threads=1,free=127579696,total=437690368
   [junit4]   2> NOTE: All tests run in this JVM: [TestNRTOpen, MultiThreadedOCPTest, DistribJoinFromCollectionTest, DefaultValueUpdateProcessorTest, TokenizerChainTest, TestManagedStopFilterFactory, DirectUpdateHandlerTest, DocValuesNotIndexedTest, TestApiFramework, TestNoOpRegenerator, TestHashPartitioner, TestSchemaManager, TestSimpleTextCodec, TestDefaultStatsCache, EnumFieldTest, TestLeaderElectionWithEmptyReplica, ZkCLITest, TestExecutePlanAction, IgnoreCommitOptimizeUpdateProcessorFactoryTest, OverriddenZkACLAndCredentialsProvidersTest, CdcrReplicationHandlerTest, AnalyticsQueryTest, HdfsAutoAddReplicasIntegrationTest, DistributedTermsComponentTest, BadIndexSchemaTest, AtomicUpdatesTest, TestSolrCloudWithDelegationTokens, TestCSVLoader, MetricsConfigTest, SortSpecParsingTest, TestMultiValuedNumericRangeQuery, DataDrivenBlockJoinTest, TestFieldResource, TestConfigSetProperties, DistributedFacetPivotLongTailTest, MBeansHandlerTest, TestZkAclsWithHadoopAuth, TestSmileRequest, TestExportWriter, TestHighFrequencyDictionaryFactory, TestJsonFacetsWithNestedObjects, TestSort, HttpPartitionOnCommitTest, TestShortCircuitedRequests, OverseerRolesTest, HDFSCollectionsAPITest, TestCrossCoreJoin, SaslZkACLProviderTest, TestCollationField, TestClusterStateProvider, HdfsSyncSliceTest, MoveReplicaHDFSTest, ChaosMonkeyNothingIsSafeTest, TestTestInjection, SolrIndexSplitterTest, TestCloudRecovery, RegexBytesRefFilterTest, TestUseDocValuesAsStored, TestExactStatsCache, HighlighterConfigTest, TestCloudNestedDocsSort, TestTlogReplica, VersionInfoTest, SearchRateTriggerTest, VMParamsZkACLAndCredentialsProvidersTest, TestLockTree, DistanceUnitsTest, ReplaceNodeNoTargetTest, BitVectorTest, SolrPluginUtilsTest, AliasIntegrationTest, TestNumericTokenStream, IndexBasedSpellCheckerTest, PluginInfoTest, LargeFieldTest, BasicDistributedZkTest, SimpleCollectionCreateDeleteTest, MetricUtilsTest, TestSolrFieldCacheBean, TestIndexSearcher, TestNodeAddedTrigger, TermVectorComponentDistributedTest, TestFastOutputStream, TestLegacyFieldReuse, DebugComponentTest, SolrGraphiteReporterTest, SolrSlf4jReporterTest, TestSchemaVersionResource, SolrCoreCheckLockOnStartupTest, TestGroupingSearch, OpenCloseCoreStressTest, TimeRoutedAliasUpdateProcessorTest, TestFieldCacheReopen, ConfigSetsAPITest, ResponseBuilderTest, TestStressLucene, DistributedFacetPivotWhiteBoxTest, ConfigureRecoveryStrategyTest, SuggestComponentContextFilterQueryTest, CreateRoutedAliasTest, TestRemoteStreaming, TestExtendedDismaxParser, TestJoin, XmlUpdateRequestHandlerTest, LIRRollingUpdatesTest, SynonymTokenizerTest, CursorPagingTest, TestSimDistributedQueue, OpenExchangeRatesOrgProviderTest, DistributedFacetSimpleRefinementLongTailTest, SolrMetricReporterTest, FullSolrCloudDistribCmdsTest, ZkSolrClientTest, TestRequestForwarding, TestSchemaNameResource, TestCryptoKeys, SimpleFacetsTest, TestConfigReload, InfoHandlerTest, TestChildDocTransformer, TestHashQParserPlugin, TestConfigSetsAPI, TestClusterStateMutator, BasicAuthStandaloneTest, TestDynamicFieldCollectionResource, ChaosMonkeyNothingIsSafeWithPullReplicasTest, SpellCheckCollatorTest, TestSolrDeletionPolicy1, DistributedExpandComponentTest, TestBinaryField, TestPseudoReturnFields, FieldMutatingUpdateProcessorTest, DirectUpdateHandlerOptimizeTest, DistanceFunctionTest, TestSurroundQueryParser, DisMaxRequestHandlerTest, TestWriterPerf, DirectSolrSpellCheckerTest, DocumentAnalysisRequestHandlerTest, PrimitiveFieldTypeTest, FileBasedSpellCheckerTest, RequestHandlersTest, TestValueSourceCache, TermVectorComponentTest, TestIndexingPerformance, FieldAnalysisRequestHandlerTest, FastVectorHighlighterTest, LoggingHandlerTest, ReturnFieldsTest, QueryParsingTest, TestAnalyzedSuggestions, BinaryUpdateRequestHandlerTest, TestPHPSerializedResponseWriter, CSVRequestHandlerTest, TestComponentsName, TestLFUCache, TestCursorMarkWithoutUniqueKey, TestHighlightDedupGrouping, TestTolerantSearch, TestLuceneIndexBackCompat, TestEmbeddedSolrServerConstructors, ConnectionReuseTest, CleanupOldIndexTest, CollectionPropsTest, ConnectionManagerTest, DeleteNodeTest, DistribCursorPagingTest, DistributedQueueTest, DistributedVersionInfoTest, MoveReplicaTest, RestartWhileUpdatingTest, SolrCLIZkUtilsTest, SolrCloudExampleTest, TestDistributedMap, TestExclusionRuleCollectionAccess, TestLeaderInitiatedRecoveryThread, TestPrepRecovery, TestPullReplica, TestRandomRequestDistribution, TestSegmentSorting, TestStressCloudBlindAtomicUpdates, TestStressInPlaceUpdates, TestStressLiveNodes, TestTolerantUpdateProcessorRandomCloud, TriLevelCompositeIdRoutingTest, AssignTest, CollectionsAPIAsyncDistributedZkTest, CustomCollectionTest, HdfsCollectionsAPIDistributedZkTest, ShardSplitTest, ComputePlanActionTest, MetricTriggerIntegrationTest, NodeLostTriggerIntegrationTest, RestoreTriggerStateTest, TriggerCooldownIntegrationTest, HdfsRecoveryZkTest, HdfsThreadLeakTest, HdfsTlogReplayBufferedWhileIndexingTest, HdfsUnloadDistributedZkTest, ZkStateReaderTest, DirectoryFactoryTest, ExitableDirectoryReaderTest, HdfsDirectoryFactoryTest, TestSolrXml, TestSolrCloudSnapshots, TestReqParamsAPI, TestRestoreCore, V2StandaloneTest, CoreAdminCreateDiscoverTest, CoreAdminOperationTest, CoreAdminRequestStatusTest, CoreMergeIndexesAdminHandlerTest, MetricsHandlerTest, SecurityConfHandlerTest, SegmentsInfoRequestHandlerTest]
   [junit4] Completed [660/803 (1!)] on J0 in 0.42s, 3 tests, 3 failures <<< FAILURES!

[...truncated 46641 lines...]
[repro] Jenkins log URL: https://jenkins.thetaphi.de/job/Lucene-Solr-master-Linux/21845/consoleText

[repro] Revision: 4ee92c22a4b731d3ec2f93409f3fe57ae348cea1

[repro] Ant options: "-Dargs=-server -XX:+UseConcMarkSweepGC"
[repro] Repro line:  ant test  -Dtestcase=SegmentsInfoRequestHandlerTest -Dtests.method=testSegmentInfosVersion -Dtests.seed=777D8BC1C7354EB9 -Dtests.multiplier=3 -Dtests.slow=true -Dtests.locale=ar-MA -Dtests.timezone=America/Lima -Dtests.asserts=true -Dtests.file.encoding=ISO-8859-1

[repro] Repro line:  ant test  -Dtestcase=SegmentsInfoRequestHandlerTest -Dtests.method=testSegmentInfosData -Dtests.seed=777D8BC1C7354EB9 -Dtests.multiplier=3 -Dtests.slow=true -Dtests.locale=ar-MA -Dtests.timezone=America/Lima -Dtests.asserts=true -Dtests.file.encoding=ISO-8859-1

[repro] Repro line:  ant test  -Dtestcase=SegmentsInfoRequestHandlerTest -Dtests.method=testSegmentInfos -Dtests.seed=777D8BC1C7354EB9 -Dtests.multiplier=3 -Dtests.slow=true -Dtests.locale=ar-MA -Dtests.timezone=America/Lima -Dtests.asserts=true -Dtests.file.encoding=ISO-8859-1

[repro] ant clean

[...truncated 6 lines...]
[repro] Test suites by module:
[repro]    solr/core
[repro]       SegmentsInfoRequestHandlerTest
[repro] ant compile-test

[...truncated 3298 lines...]
[repro] ant test-nocompile -Dtests.dups=5 -Dtests.maxfailures=5 -Dtests.class="*.SegmentsInfoRequestHandlerTest" -Dtests.showOutput=onerror "-Dargs=-server -XX:+UseConcMarkSweepGC" -Dtests.seed=777D8BC1C7354EB9 -Dtests.multiplier=3 -Dtests.slow=true -Dtests.locale=ar-MA -Dtests.timezone=America/Lima -Dtests.asserts=true -Dtests.file.encoding=ISO-8859-1

[...truncated 32 lines...]
   [junit4] Suite: org.apache.solr.handler.admin.SegmentsInfoRequestHandlerTest
   [junit4]   2> Creating dataDir: /home/jenkins/workspace/Lucene-Solr-master-Linux/solr/build/solr-core/test/J1/temp/solr.handler.admin.SegmentsInfoRequestHandlerTest_777D8BC1C7354EB9-001/init-core-data-001
   [junit4]   2> 2100 INFO  (SUITE-SegmentsInfoRequestHandlerTest-seed#[777D8BC1C7354EB9]-worker) [    ] o.a.s.SolrTestCaseJ4 Using PointFields (NUMERIC_POINTS_SYSPROP=true) w/NUMERIC_DOCVALUES_SYSPROP=true
   [junit4]   2> 2151 INFO  (SUITE-SegmentsInfoRequestHandlerTest-seed#[777D8BC1C7354EB9]-worker) [    ] o.e.j.u.log Logging initialized @2186ms to org.eclipse.jetty.util.log.Slf4jLog
   [junit4]   2> 2160 INFO  (SUITE-SegmentsInfoRequestHandlerTest-seed#[777D8BC1C7354EB9]-worker) [    ] o.a.s.SolrTestCaseJ4 Randomized ssl (false) and clientAuth (true) via: @org.apache.solr.util.RandomizeSSL(reason=, ssl=NaN, value=NaN, clientAuth=NaN)
   [junit4]   2> 2168 INFO  (SUITE-SegmentsInfoRequestHandlerTest-seed#[777D8BC1C7354EB9]-worker) [    ] o.a.s.SolrTestCaseJ4 SecureRandom sanity checks: test.solr.allowed.securerandom=null & java.security.egd=file:/dev/./urandom
   [junit4]   2> 2173 INFO  (SUITE-SegmentsInfoRequestHandlerTest-seed#[777D8BC1C7354EB9]-worker) [    ] o.a.s.SolrTestCaseJ4 ####initCore
   [junit4]   2> 2232 INFO  (SUITE-SegmentsInfoRequestHandlerTest-seed#[777D8BC1C7354EB9]-worker) [    ] o.a.s.c.SolrResourceLoader Using system property solr.solr.home: /home/jenkins/workspace/Lucene-Solr-master-Linux/solr/core/src/test-files/solr
   [junit4]   2> 2238 INFO  (SUITE-SegmentsInfoRequestHandlerTest-seed#[777D8BC1C7354EB9]-worker) [    ] o.a.s.c.SolrResourceLoader [null] Added 2 libs to classloader, from paths: [/home/jenkins/workspace/Lucene-Solr-master-Linux/solr/core/src/test-files/solr/collection1/lib, /home/jenkins/workspace/Lucene-Solr-master-Linux/solr/core/src/test-files/solr/collection1/lib/classes]
   [junit4]   2> 2492 INFO  (SUITE-SegmentsInfoRequestHandlerTest-seed#[777D8BC1C7354EB9]-worker) [    ] o.a.s.c.SolrConfig Using Lucene MatchVersion: 8.0.0
   [junit4]   2> 2682 INFO  (SUITE-SegmentsInfoRequestHandlerTest-seed#[777D8BC1C7354EB9]-worker) [    ] o.a.s.s.IndexSchema [null] Schema name=test
   [junit4]   2> 3016 WARN  (SUITE-SegmentsInfoRequestHandlerTest-seed#[777D8BC1C7354EB9]-worker) [    ] o.a.s.c.SolrResourceLoader Solr loaded a deprecated plugin/analysis class [solr.GeoHashField]. Please consult documentation how to replace it accordingly.
   [junit4]   2> 3024 WARN  (SUITE-SegmentsInfoRequestHandlerTest-seed#[777D8BC1C7354EB9]-worker) [    ] o.a.s.c.SolrResourceLoader Solr loaded a deprecated plugin/analysis class [solr.LatLonType]. Please consult documentation how to replace it accordingly.
   [junit4]   2> 3170 WARN  (SUITE-SegmentsInfoRequestHandlerTest-seed#[777D8BC1C7354EB9]-worker) [    ] o.a.s.c.SolrResourceLoader Solr loaded a deprecated plugin/analysis class [solr.CurrencyField]. Please consult documentation how to replace it accordingly.
   [junit4]   2> 3283 WARN  (SUITE-SegmentsInfoRequestHandlerTest-seed#[777D8BC1C7354EB9]-worker) [    ] o.a.s.s.IndexSchema Field text is not multivalued and destination for multiple copyFields (2)
   [junit4]   2> 3286 INFO  (SUITE-SegmentsInfoRequestHandlerTest-seed#[777D8BC1C7354EB9]-worker) [    ] o.a.s.s.IndexSchema Loaded schema test/1.4 with uniqueid field id
   [junit4]   2> 3993 INFO  (SUITE-SegmentsInfoRequestHandlerTest-seed#[777D8BC1C7354EB9]-worker) [    ] o.a.s.m.r.SolrJmxReporter JMX monitoring for 'solr.node' (registry 'solr.node') enabled at server: com.sun.jmx.mbeanserver.JmxMBeanServer@6e651e
   [junit4]   2> 3994 INFO  (SUITE-SegmentsInfoRequestHandlerTest-seed#[777D8BC1C7354EB9]-worker) [    ] o.a.s.m.r.SolrJmxReporter JMX monitoring for 'solr.jvm' (registry 'solr.jvm') enabled at server: com.sun.jmx.mbeanserver.JmxMBeanServer@6e651e
   [junit4]   2> 3995 INFO  (SUITE-SegmentsInfoRequestHandlerTest-seed#[777D8BC1C7354EB9]-worker) [    ] o.a.s.m.r.SolrJmxReporter JMX monitoring for 'solr.jetty' (registry 'solr.jetty') enabled at server: com.sun.jmx.mbeanserver.JmxMBeanServer@6e651e
   [junit4]   2> 4032 INFO  (coreLoadExecutor-6-thread-1) [    ] o.a.s.c.TransientSolrCoreCacheDefault Allocating transient cache for 2147483647 transient cores
   [junit4]   2> 4039 INFO  (coreLoadExecutor-6-thread-1) [    x:collection1] o.a.s.c.SolrResourceLoader [null] Added 2 libs to classloader, from paths: [/home/jenkins/workspace/Lucene-Solr-master-Linux/solr/core/src/test-files/solr/collection1/lib, /home/jenkins/workspace/Lucene-Solr-master-Linux/solr/core/src/test-files/solr/collection1/lib/classes]
   [junit4]   2> 4119 INFO  (coreLoadExecutor-6-thread-1) [    x:collection1] o.a.s.c.SolrConfig Using Lucene MatchVersion: 8.0.0
   [junit4]   2> 4193 INFO  (coreLoadExecutor-6-thread-1) [    x:collection1] o.a.s.s.IndexSchema [collection1] Schema name=test
   [junit4]   2> 4464 WARN  (coreLoadExecutor-6-thread-1) [    x:collection1] o.a.s.s.IndexSchema Field text is not multivalued and destination for multiple copyFields (2)
   [junit4]   2> 4485 INFO  (coreLoadExecutor-6-thread-1) [    x:collection1] o.a.s.s.IndexSchema Loaded schema test/1.4 with uniqueid field id
   [junit4]   2> 4540 INFO  (coreLoadExecutor-6-thread-1) [    x:collection1] o.a.s.c.CoreContainer Creating SolrCore 'collection1' using configuration from instancedir /home/jenkins/workspace/Lucene-Solr-master-Linux/solr/core/src/test-files/solr/collection1, trusted=true
   [junit4]   2> 4602 INFO  (coreLoadExecutor-6-thread-1) [    x:collection1] o.a.s.m.r.SolrJmxReporter JMX monitoring for 'solr.core.collection1' (registry 'solr.core.collection1') enabled at server: com.sun.jmx.mbeanserver.JmxMBeanServer@6e651e
   [junit4]   2> 4609 INFO  (coreLoadExecutor-6-thread-1) [    x:collection1] o.a.s.c.SolrCore solr.RecoveryStrategy.Builder
   [junit4]   2> 4617 INFO  (coreLoadExecutor-6-thread-1) [    x:collection1] o.a.s.c.SolrCore [[collection1] ] Opening new SolrCore at [/home/jenkins/workspace/Lucene-Solr-master-Linux/solr/core/src/test-files/solr/collection1], dataDir=[/home/jenkins/workspace/Lucene-Solr-master-Linux/solr/build/solr-core/test/J1/temp/solr.handler.admin.SegmentsInfoRequestHandlerTest_777D8BC1C7354EB9-001/init-core-data-001/]
   [junit4]   2> 5603 INFO  (coreLoadExecutor-6-thread-1) [    x:collection1] o.a.s.u.CommitTracker Hard AutoCommit: disabled
   [junit4]   2> 5603 INFO  (coreLoadExecutor-6-thread-1) [    x:collection1] o.a.s.u.CommitTracker Soft AutoCommit: disabled
   [junit4]   2> 5625 INFO  (coreLoadExecutor-6-thread-1) [    x:collection1] o.a.s.s.SolrIndexSearcher Opening [Searcher@19f2350[collection1] main]
   [junit4]   2> 5687 INFO  (coreLoadExecutor-6-thread-1) [    x:collection1] o.a.s.h.c.SpellCheckComponent Initializing spell checkers
   [junit4]   2> 5868 INFO  (coreLoadExecutor-6-thread-1) [    x:collection1] o.a.s.s.DirectSolrSpellChecker init: {name=direct,classname=DirectSolrSpellChecker,field=lowerfilt,minQueryLength=3}
   [junit4]   2> 6534 INFO  (coreLoadExecutor-6-thread-1) [    x:collection1] o.a.s.h.ReplicationHandler Commits will be reserved for 10000ms.
   [junit4]   2> 6536 INFO  (searcherExecutor-7-thread-1-processing-x:collection1) [    x:collection1] o.a.s.h.c.SpellCheckComponent Loading spell index for spellchecker: default
   [junit4]   2> 6540 INFO  (SUITE-SegmentsInfoRequestHandlerTest-seed#[777D8BC1C7354EB9]-worker) [    ] o.a.s.SolrTestCaseJ4 ####initCore end
   [junit4]   2> 6541 INFO  (searcherExecutor-7-thread-1-processing-x:collection1) [    x:collection1] o.a.s.h.c.SpellCheckComponent Loading spell index for spellchecker: direct
   [junit4]   2> 6541 INFO  (searcherExecutor-7-thread-1-processing-x:collection1) [    x:collection1] o.a.s.h.c.SpellCheckComponent Loading spell index for spellchecker: wordbreak
   [junit4]   2> 6541 INFO  (searcherExecutor-7-thread-1-processing-x:collection1) [    x:collecti

[...truncated too long message...]

   [junit4]    > 	at __randomizedtesting.SeedInfo.seed([777D8BC1C7354EB9:8FA31E29BF599FEA]:0)
   [junit4]    > 	at org.apache.lucene.index.IndexWriter$ReaderPool.noDups(IndexWriter.java:867)
   [junit4]    > 	at org.apache.lucene.index.IndexWriter$ReaderPool.get(IndexWriter.java:857)
   [junit4]    > 	at org.apache.lucene.index.IndexWriter.numDeletesToMerge(IndexWriter.java:5233)
   [junit4]    > 	at org.apache.lucene.index.LogMergePolicy.sizeDocs(LogMergePolicy.java:153)
   [junit4]    > 	at org.apache.lucene.index.LogDocMergePolicy.size(LogDocMergePolicy.java:44)
   [junit4]    > 	at org.apache.lucene.index.LogMergePolicy.findMerges(LogMergePolicy.java:469)
   [junit4]    > 	at org.apache.solr.handler.admin.SegmentsInfoRequestHandler.getMergeCandidatesNames(SegmentsInfoRequestHandler.java:100)
   [junit4]    > 	at org.apache.solr.handler.admin.SegmentsInfoRequestHandler.getSegmentsInfo(SegmentsInfoRequestHandler.java:59)
   [junit4]    > 	at org.apache.solr.handler.admin.SegmentsInfoRequestHandler.handleRequestBody(SegmentsInfoRequestHandler.java:48)
   [junit4]    > 	at org.apache.solr.handler.RequestHandlerBase.handleRequest(RequestHandlerBase.java:199)
   [junit4]    > 	at org.apache.solr.core.SolrCore.execute(SolrCore.java:2508)
   [junit4]    > 	at org.apache.solr.util.TestHarness.query(TestHarness.java:337)
   [junit4]    > 	at org.apache.solr.util.TestHarness.query(TestHarness.java:319)
   [junit4]    > 	at org.apache.solr.SolrTestCaseJ4.assertQ(SolrTestCaseJ4.java:890)
   [junit4]    > 	at org.apache.solr.handler.admin.SegmentsInfoRequestHandlerTest.testSegmentInfosVersion(SegmentsInfoRequestHandlerTest.java:68)
   [junit4]    > 	at java.lang.Thread.run(Thread.java:748)
   [junit4]   2> 8607 INFO  (TEST-SegmentsInfoRequestHandlerTest.testSegmentInfosData-seed#[777D8BC1C7354EB9]) [    ] o.a.s.SolrTestCaseJ4 ###Starting testSegmentInfosData
   [junit4]   2> 8609 INFO  (TEST-SegmentsInfoRequestHandlerTest.testSegmentInfosData-seed#[777D8BC1C7354EB9]) [    ] o.a.s.SolrTestCaseJ4 ###Ending testSegmentInfosData
   [junit4]   2> NOTE: reproduce with: ant test  -Dtestcase=SegmentsInfoRequestHandlerTest -Dtests.method=testSegmentInfosData -Dtests.seed=777D8BC1C7354EB9 -Dtests.multiplier=3 -Dtests.slow=true -Dtests.badapples=true -Dtests.locale=ar-MA -Dtests.timezone=America/Lima -Dtests.asserts=true -Dtests.file.encoding=ISO-8859-1
   [junit4] FAILURE 0.00s J0 | SegmentsInfoRequestHandlerTest.testSegmentInfosData <<<
   [junit4]    > Throwable #1: java.lang.AssertionError
   [junit4]    > 	at __randomizedtesting.SeedInfo.seed([777D8BC1C7354EB9:BD4A99A71DDF926]:0)
   [junit4]    > 	at org.apache.lucene.index.IndexWriter$ReaderPool.noDups(IndexWriter.java:867)
   [junit4]    > 	at org.apache.lucene.index.IndexWriter$ReaderPool.get(IndexWriter.java:857)
   [junit4]    > 	at org.apache.lucene.index.IndexWriter.numDeletesToMerge(IndexWriter.java:5233)
   [junit4]    > 	at org.apache.lucene.index.LogMergePolicy.sizeDocs(LogMergePolicy.java:153)
   [junit4]    > 	at org.apache.lucene.index.LogDocMergePolicy.size(LogDocMergePolicy.java:44)
   [junit4]    > 	at org.apache.lucene.index.LogMergePolicy.findMerges(LogMergePolicy.java:469)
   [junit4]    > 	at org.apache.solr.handler.admin.SegmentsInfoRequestHandler.getMergeCandidatesNames(SegmentsInfoRequestHandler.java:100)
   [junit4]    > 	at org.apache.solr.handler.admin.SegmentsInfoRequestHandler.getSegmentsInfo(SegmentsInfoRequestHandler.java:59)
   [junit4]    > 	at org.apache.solr.handler.admin.SegmentsInfoRequestHandler.handleRequestBody(SegmentsInfoRequestHandler.java:48)
   [junit4]    > 	at org.apache.solr.handler.RequestHandlerBase.handleRequest(RequestHandlerBase.java:199)
   [junit4]    > 	at org.apache.solr.core.SolrCore.execute(SolrCore.java:2508)
   [junit4]    > 	at org.apache.solr.util.TestHarness.query(TestHarness.java:337)
   [junit4]    > 	at org.apache.solr.util.TestHarness.query(TestHarness.java:319)
   [junit4]    > 	at org.apache.solr.SolrTestCaseJ4.assertQ(SolrTestCaseJ4.java:890)
   [junit4]    > 	at org.apache.solr.handler.admin.SegmentsInfoRequestHandlerTest.testSegmentInfosData(SegmentsInfoRequestHandlerTest.java:75)
   [junit4]    > 	at java.lang.Thread.run(Thread.java:748)
   [junit4] IGNOR/A 0.01s J0 | SegmentsInfoRequestHandlerTest.testSegmentInfos
   [junit4]    > Assumption #1: Ignored, failures limit reached (5 >= 5).
   [junit4]   2> 8618 INFO  (SUITE-SegmentsInfoRequestHandlerTest-seed#[777D8BC1C7354EB9]-worker) [    ] o.a.s.SolrTestCaseJ4 ###deleteCore
   [junit4]   2> 8618 INFO  (SUITE-SegmentsInfoRequestHandlerTest-seed#[777D8BC1C7354EB9]-worker) [    ] o.a.s.c.CoreContainer Shutting down CoreContainer instance=26890373
   [junit4]   2> 8618 INFO  (SUITE-SegmentsInfoRequestHandlerTest-seed#[777D8BC1C7354EB9]-worker) [    ] o.a.s.m.SolrMetricManager Closing metric reporters for registry=solr.node, tag=null
   [junit4]   2> 8618 INFO  (SUITE-SegmentsInfoRequestHandlerTest-seed#[777D8BC1C7354EB9]-worker) [    ] o.a.s.m.r.SolrJmxReporter Closing reporter [org.apache.solr.metrics.reporters.SolrJmxReporter@1e0a882: rootName = null, domain = solr.node, service url = null, agent id = null] for registry solr.node / com.codahale.metrics.MetricRegistry@12198f
   [junit4]   2> 8634 INFO  (SUITE-SegmentsInfoRequestHandlerTest-seed#[777D8BC1C7354EB9]-worker) [    ] o.a.s.m.SolrMetricManager Closing metric reporters for registry=solr.jvm, tag=null
   [junit4]   2> 8635 INFO  (SUITE-SegmentsInfoRequestHandlerTest-seed#[777D8BC1C7354EB9]-worker) [    ] o.a.s.m.r.SolrJmxReporter Closing reporter [org.apache.solr.metrics.reporters.SolrJmxReporter@13033a7: rootName = null, domain = solr.jvm, service url = null, agent id = null] for registry solr.jvm / com.codahale.metrics.MetricRegistry@e9c2f9
   [junit4]   2> 8635 INFO  (SUITE-SegmentsInfoRequestHandlerTest-seed#[777D8BC1C7354EB9]-worker) [    ] o.a.s.m.SolrMetricManager Closing metric reporters for registry=solr.jetty, tag=null
   [junit4]   2> 8635 INFO  (SUITE-SegmentsInfoRequestHandlerTest-seed#[777D8BC1C7354EB9]-worker) [    ] o.a.s.m.r.SolrJmxReporter Closing reporter [org.apache.solr.metrics.reporters.SolrJmxReporter@1c625be: rootName = null, domain = solr.jetty, service url = null, agent id = null] for registry solr.jetty / com.codahale.metrics.MetricRegistry@17f14e6
   [junit4]   2> 8636 INFO  (coreCloseExecutor-23-thread-1) [    x:collection1] o.a.s.c.SolrCore [collection1]  CLOSING SolrCore org.apache.solr.core.SolrCore@1b06dd8
   [junit4]   2> 8636 INFO  (coreCloseExecutor-23-thread-1) [    x:collection1] o.a.s.m.SolrMetricManager Closing metric reporters for registry=solr.core.collection1, tag=1b06dd8
   [junit4]   2> 8636 INFO  (coreCloseExecutor-23-thread-1) [    x:collection1] o.a.s.m.r.SolrJmxReporter Closing reporter [org.apache.solr.metrics.reporters.SolrJmxReporter@93901c: rootName = null, domain = solr.core.collection1, service url = null, agent id = null] for registry solr.core.collection1 / com.codahale.metrics.MetricRegistry@f2bee7
   [junit4]   2> NOTE: leaving temporary files on disk at: /home/jenkins/workspace/Lucene-Solr-master-Linux/solr/build/solr-core/test/J0/temp/solr.handler.admin.SegmentsInfoRequestHandlerTest_777D8BC1C7354EB9-002
   [junit4]   2> NOTE: test params are: codec=Asserting(Lucene70): {name=TestBloomFilteredLucenePostings(BloomFilteringPostingsFormat(Lucene50(blocksize=128))), id=TestBloomFilteredLucenePostings(BloomFilteringPostingsFormat(Lucene50(blocksize=128)))}, docValues:{}, maxPointsInLeafNode=1855, maxMBSortInHeap=5.217803678418882, sim=Asserting(org.apache.lucene.search.similarities.AssertingSimilarity@65fc3b), locale=ar-MA, timezone=America/Lima
   [junit4]   2> NOTE: Linux 4.13.0-37-generic i386/Oracle Corporation 1.8.0_162 (32-bit)/cpus=8,threads=1,free=35012248,total=64880640
   [junit4]   2> NOTE: All tests run in this JVM: [SegmentsInfoRequestHandlerTest, SegmentsInfoRequestHandlerTest]
   [junit4] Completed [5/5 (5!)] on J0 in 1.33s, 3 tests, 2 failures, 1 skipped <<< FAILURES!

[...truncated 20 lines...]
BUILD FAILED
/home/jenkins/workspace/Lucene-Solr-master-Linux/lucene/common-build.xml:1568: The following error occurred while executing this line:
/home/jenkins/workspace/Lucene-Solr-master-Linux/lucene/common-build.xml:1092: There were test failures: 5 suites, 15 tests, 13 failures, 2 ignored (2 assumptions) [seed: 777D8BC1C7354EB9]

Total time: 10 seconds

[repro] Setting last failure code to 256

[repro] Failures:
[repro]   5/5 failed: org.apache.solr.handler.admin.SegmentsInfoRequestHandlerTest
[repro] Exiting with code 256
+ mv lucene/build lucene/build.repro
+ mv solr/build solr/build.repro
+ mv lucene/build.orig lucene/build
+ mv solr/build.orig solr/build
Archiving artifacts
Setting ANT_1_8_2_HOME=/var/lib/jenkins/tools/hudson.tasks.Ant_AntInstallation/ANT_1.8.2
[WARNINGS] Parsing warnings in console log with parser Java Compiler (javac)
Setting ANT_1_8_2_HOME=/var/lib/jenkins/tools/hudson.tasks.Ant_AntInstallation/ANT_1.8.2
Setting ANT_1_8_2_HOME=/var/lib/jenkins/tools/hudson.tasks.Ant_AntInstallation/ANT_1.8.2
<Git Blamer> Using GitBlamer to create author and commit information for all warnings.
<Git Blamer> GIT_COMMIT=4ee92c22a4b731d3ec2f93409f3fe57ae348cea1, workspace=/var/lib/jenkins/workspace/Lucene-Solr-master-Linux
[WARNINGS] Computing warning deltas based on reference build #21844
Recording test results
Setting ANT_1_8_2_HOME=/var/lib/jenkins/tools/hudson.tasks.Ant_AntInstallation/ANT_1.8.2
Build step 'Publish JUnit test result report' changed build result to UNSTABLE
Email was triggered for: Unstable (Test Failures)
Sending email for trigger: Unstable (Test Failures)
Setting ANT_1_8_2_HOME=/var/lib/jenkins/tools/hudson.tasks.Ant_AntInstallation/ANT_1.8.2
Setting ANT_1_8_2_HOME=/var/lib/jenkins/tools/hudson.tasks.Ant_AntInstallation/ANT_1.8.2
Setting ANT_1_8_2_HOME=/var/lib/jenkins/tools/hudson.tasks.Ant_AntInstallation/ANT_1.8.2
Setting ANT_1_8_2_HOME=/var/lib/jenkins/tools/hudson.tasks.Ant_AntInstallation/ANT_1.8.2

Mime
View raw message