lucene-dev mailing list archives

Site index · List index
Message view « Date » · « Thread »
Top « Date » · « Thread »
From Policeman Jenkins Server <jenk...@thetaphi.de>
Subject [JENKINS] Lucene-Solr-7.x-Linux (64bit/jdk-9.0.4) - Build # 1820 - Unstable!
Date Sun, 29 Apr 2018 17:20:54 GMT
Build: https://jenkins.thetaphi.de/job/Lucene-Solr-7.x-Linux/1820/
Java: 64bit/jdk-9.0.4 -XX:+UseCompressedOops -XX:+UseG1GC

2 tests failed.
FAILED:  org.apache.solr.cloud.autoscaling.SearchRateTriggerTest.testTrigger

Error Message:
expected:<1> but was:<2>

Stack Trace:
java.lang.AssertionError: expected:<1> but was:<2>
	at __randomizedtesting.SeedInfo.seed([49B7F3F349C3E86E:2A7CC571D00C9B43]:0)
	at org.junit.Assert.fail(Assert.java:93)
	at org.junit.Assert.failNotEquals(Assert.java:647)
	at org.junit.Assert.assertEquals(Assert.java:128)
	at org.junit.Assert.assertEquals(Assert.java:472)
	at org.junit.Assert.assertEquals(Assert.java:456)
	at org.apache.solr.cloud.autoscaling.SearchRateTriggerTest.testTrigger(SearchRateTriggerTest.java:133)
	at java.base/jdk.internal.reflect.NativeMethodAccessorImpl.invoke0(Native Method)
	at java.base/jdk.internal.reflect.NativeMethodAccessorImpl.invoke(NativeMethodAccessorImpl.java:62)
	at java.base/jdk.internal.reflect.DelegatingMethodAccessorImpl.invoke(DelegatingMethodAccessorImpl.java:43)
	at java.base/java.lang.reflect.Method.invoke(Method.java:564)
	at com.carrotsearch.randomizedtesting.RandomizedRunner.invoke(RandomizedRunner.java:1737)
	at com.carrotsearch.randomizedtesting.RandomizedRunner$8.evaluate(RandomizedRunner.java:934)
	at com.carrotsearch.randomizedtesting.RandomizedRunner$9.evaluate(RandomizedRunner.java:970)
	at com.carrotsearch.randomizedtesting.RandomizedRunner$10.evaluate(RandomizedRunner.java:984)
	at com.carrotsearch.randomizedtesting.rules.SystemPropertiesRestoreRule$1.evaluate(SystemPropertiesRestoreRule.java:57)
	at org.apache.lucene.util.TestRuleSetupTeardownChained$1.evaluate(TestRuleSetupTeardownChained.java:49)
	at org.apache.lucene.util.AbstractBeforeAfterRule$1.evaluate(AbstractBeforeAfterRule.java:45)
	at org.apache.lucene.util.TestRuleThreadAndTestName$1.evaluate(TestRuleThreadAndTestName.java:48)
	at org.apache.lucene.util.TestRuleIgnoreAfterMaxFailures$1.evaluate(TestRuleIgnoreAfterMaxFailures.java:64)
	at org.apache.lucene.util.TestRuleMarkFailure$1.evaluate(TestRuleMarkFailure.java:47)
	at com.carrotsearch.randomizedtesting.rules.StatementAdapter.evaluate(StatementAdapter.java:36)
	at com.carrotsearch.randomizedtesting.ThreadLeakControl$StatementRunner.run(ThreadLeakControl.java:368)
	at com.carrotsearch.randomizedtesting.ThreadLeakControl.forkTimeoutingTask(ThreadLeakControl.java:817)
	at com.carrotsearch.randomizedtesting.ThreadLeakControl$3.evaluate(ThreadLeakControl.java:468)
	at com.carrotsearch.randomizedtesting.RandomizedRunner.runSingleTest(RandomizedRunner.java:943)
	at com.carrotsearch.randomizedtesting.RandomizedRunner$5.evaluate(RandomizedRunner.java:829)
	at com.carrotsearch.randomizedtesting.RandomizedRunner$6.evaluate(RandomizedRunner.java:879)
	at com.carrotsearch.randomizedtesting.RandomizedRunner$7.evaluate(RandomizedRunner.java:890)
	at com.carrotsearch.randomizedtesting.rules.StatementAdapter.evaluate(StatementAdapter.java:36)
	at com.carrotsearch.randomizedtesting.rules.SystemPropertiesRestoreRule$1.evaluate(SystemPropertiesRestoreRule.java:57)
	at org.apache.lucene.util.AbstractBeforeAfterRule$1.evaluate(AbstractBeforeAfterRule.java:45)
	at com.carrotsearch.randomizedtesting.rules.StatementAdapter.evaluate(StatementAdapter.java:36)
	at org.apache.lucene.util.TestRuleStoreClassName$1.evaluate(TestRuleStoreClassName.java:41)
	at com.carrotsearch.randomizedtesting.rules.NoShadowingOrOverridesOnMethodsRule$1.evaluate(NoShadowingOrOverridesOnMethodsRule.java:40)
	at com.carrotsearch.randomizedtesting.rules.NoShadowingOrOverridesOnMethodsRule$1.evaluate(NoShadowingOrOverridesOnMethodsRule.java:40)
	at com.carrotsearch.randomizedtesting.rules.StatementAdapter.evaluate(StatementAdapter.java:36)
	at com.carrotsearch.randomizedtesting.rules.StatementAdapter.evaluate(StatementAdapter.java:36)
	at org.apache.lucene.util.TestRuleAssertionsRequired$1.evaluate(TestRuleAssertionsRequired.java:53)
	at org.apache.lucene.util.TestRuleMarkFailure$1.evaluate(TestRuleMarkFailure.java:47)
	at org.apache.lucene.util.TestRuleIgnoreAfterMaxFailures$1.evaluate(TestRuleIgnoreAfterMaxFailures.java:64)
	at org.apache.lucene.util.TestRuleIgnoreTestSuites$1.evaluate(TestRuleIgnoreTestSuites.java:54)
	at com.carrotsearch.randomizedtesting.rules.StatementAdapter.evaluate(StatementAdapter.java:36)
	at com.carrotsearch.randomizedtesting.ThreadLeakControl$StatementRunner.run(ThreadLeakControl.java:368)
	at java.base/java.lang.Thread.run(Thread.java:844)


FAILED:  org.apache.solr.cloud.autoscaling.SearchRateTriggerTest.testTrigger

Error Message:
expected:<1> but was:<2>

Stack Trace:
java.lang.AssertionError: expected:<1> but was:<2>
	at __randomizedtesting.SeedInfo.seed([49B7F3F349C3E86E:2A7CC571D00C9B43]:0)
	at org.junit.Assert.fail(Assert.java:93)
	at org.junit.Assert.failNotEquals(Assert.java:647)
	at org.junit.Assert.assertEquals(Assert.java:128)
	at org.junit.Assert.assertEquals(Assert.java:472)
	at org.junit.Assert.assertEquals(Assert.java:456)
	at org.apache.solr.cloud.autoscaling.SearchRateTriggerTest.testTrigger(SearchRateTriggerTest.java:133)
	at java.base/jdk.internal.reflect.NativeMethodAccessorImpl.invoke0(Native Method)
	at java.base/jdk.internal.reflect.NativeMethodAccessorImpl.invoke(NativeMethodAccessorImpl.java:62)
	at java.base/jdk.internal.reflect.DelegatingMethodAccessorImpl.invoke(DelegatingMethodAccessorImpl.java:43)
	at java.base/java.lang.reflect.Method.invoke(Method.java:564)
	at com.carrotsearch.randomizedtesting.RandomizedRunner.invoke(RandomizedRunner.java:1737)
	at com.carrotsearch.randomizedtesting.RandomizedRunner$8.evaluate(RandomizedRunner.java:934)
	at com.carrotsearch.randomizedtesting.RandomizedRunner$9.evaluate(RandomizedRunner.java:970)
	at com.carrotsearch.randomizedtesting.RandomizedRunner$10.evaluate(RandomizedRunner.java:984)
	at com.carrotsearch.randomizedtesting.rules.SystemPropertiesRestoreRule$1.evaluate(SystemPropertiesRestoreRule.java:57)
	at org.apache.lucene.util.TestRuleSetupTeardownChained$1.evaluate(TestRuleSetupTeardownChained.java:49)
	at org.apache.lucene.util.AbstractBeforeAfterRule$1.evaluate(AbstractBeforeAfterRule.java:45)
	at org.apache.lucene.util.TestRuleThreadAndTestName$1.evaluate(TestRuleThreadAndTestName.java:48)
	at org.apache.lucene.util.TestRuleIgnoreAfterMaxFailures$1.evaluate(TestRuleIgnoreAfterMaxFailures.java:64)
	at org.apache.lucene.util.TestRuleMarkFailure$1.evaluate(TestRuleMarkFailure.java:47)
	at com.carrotsearch.randomizedtesting.rules.StatementAdapter.evaluate(StatementAdapter.java:36)
	at com.carrotsearch.randomizedtesting.ThreadLeakControl$StatementRunner.run(ThreadLeakControl.java:368)
	at com.carrotsearch.randomizedtesting.ThreadLeakControl.forkTimeoutingTask(ThreadLeakControl.java:817)
	at com.carrotsearch.randomizedtesting.ThreadLeakControl$3.evaluate(ThreadLeakControl.java:468)
	at com.carrotsearch.randomizedtesting.RandomizedRunner.runSingleTest(RandomizedRunner.java:943)
	at com.carrotsearch.randomizedtesting.RandomizedRunner$5.evaluate(RandomizedRunner.java:829)
	at com.carrotsearch.randomizedtesting.RandomizedRunner$6.evaluate(RandomizedRunner.java:879)
	at com.carrotsearch.randomizedtesting.RandomizedRunner$7.evaluate(RandomizedRunner.java:890)
	at com.carrotsearch.randomizedtesting.rules.StatementAdapter.evaluate(StatementAdapter.java:36)
	at com.carrotsearch.randomizedtesting.rules.SystemPropertiesRestoreRule$1.evaluate(SystemPropertiesRestoreRule.java:57)
	at org.apache.lucene.util.AbstractBeforeAfterRule$1.evaluate(AbstractBeforeAfterRule.java:45)
	at com.carrotsearch.randomizedtesting.rules.StatementAdapter.evaluate(StatementAdapter.java:36)
	at org.apache.lucene.util.TestRuleStoreClassName$1.evaluate(TestRuleStoreClassName.java:41)
	at com.carrotsearch.randomizedtesting.rules.NoShadowingOrOverridesOnMethodsRule$1.evaluate(NoShadowingOrOverridesOnMethodsRule.java:40)
	at com.carrotsearch.randomizedtesting.rules.NoShadowingOrOverridesOnMethodsRule$1.evaluate(NoShadowingOrOverridesOnMethodsRule.java:40)
	at com.carrotsearch.randomizedtesting.rules.StatementAdapter.evaluate(StatementAdapter.java:36)
	at com.carrotsearch.randomizedtesting.rules.StatementAdapter.evaluate(StatementAdapter.java:36)
	at org.apache.lucene.util.TestRuleAssertionsRequired$1.evaluate(TestRuleAssertionsRequired.java:53)
	at org.apache.lucene.util.TestRuleMarkFailure$1.evaluate(TestRuleMarkFailure.java:47)
	at org.apache.lucene.util.TestRuleIgnoreAfterMaxFailures$1.evaluate(TestRuleIgnoreAfterMaxFailures.java:64)
	at org.apache.lucene.util.TestRuleIgnoreTestSuites$1.evaluate(TestRuleIgnoreTestSuites.java:54)
	at com.carrotsearch.randomizedtesting.rules.StatementAdapter.evaluate(StatementAdapter.java:36)
	at com.carrotsearch.randomizedtesting.ThreadLeakControl$StatementRunner.run(ThreadLeakControl.java:368)
	at java.base/java.lang.Thread.run(Thread.java:844)




Build Log:
[...truncated 12906 lines...]
   [junit4] Suite: org.apache.solr.cloud.autoscaling.SearchRateTriggerTest
   [junit4]   2> Creating dataDir: /home/jenkins/workspace/Lucene-Solr-7.x-Linux/solr/build/solr-core/test/J2/temp/solr.cloud.autoscaling.SearchRateTriggerTest_49B7F3F349C3E86E-001/init-core-data-001
   [junit4]   2> 386808 WARN  (SUITE-SearchRateTriggerTest-seed#[49B7F3F349C3E86E]-worker) [    ] o.a.s.SolrTestCaseJ4 startTrackingSearchers: numOpens=7 numCloses=7
   [junit4]   2> 386809 INFO  (SUITE-SearchRateTriggerTest-seed#[49B7F3F349C3E86E]-worker) [    ] o.a.s.SolrTestCaseJ4 Using PointFields (NUMERIC_POINTS_SYSPROP=true) w/NUMERIC_DOCVALUES_SYSPROP=false
   [junit4]   2> 386809 INFO  (SUITE-SearchRateTriggerTest-seed#[49B7F3F349C3E86E]-worker) [    ] o.a.s.SolrTestCaseJ4 Randomized ssl (true) and clientAuth (true) via: @org.apache.solr.util.RandomizeSSL(reason="", ssl=0.0/0.0, value=0.0/0.0, clientAuth=0.0/0.0)
   [junit4]   2> 386810 INFO  (SUITE-SearchRateTriggerTest-seed#[49B7F3F349C3E86E]-worker) [    ] o.a.s.SolrTestCaseJ4 SecureRandom sanity checks: test.solr.allowed.securerandom=null & java.security.egd=file:/dev/./urandom
   [junit4]   2> 386811 INFO  (SUITE-SearchRateTriggerTest-seed#[49B7F3F349C3E86E]-worker) [    ] o.a.s.c.MiniSolrCloudCluster Starting cluster of 4 servers in /home/jenkins/workspace/Lucene-Solr-7.x-Linux/solr/build/solr-core/test/J2/temp/solr.cloud.autoscaling.SearchRateTriggerTest_49B7F3F349C3E86E-001/tempDir-001
   [junit4]   2> 386811 INFO  (SUITE-SearchRateTriggerTest-seed#[49B7F3F349C3E86E]-worker) [    ] o.a.s.c.ZkTestServer STARTING ZK TEST SERVER
   [junit4]   2> 386817 INFO  (Thread-832) [    ] o.a.s.c.ZkTestServer client port:0.0.0.0/0.0.0.0:0
   [junit4]   2> 386817 INFO  (Thread-832) [    ] o.a.s.c.ZkTestServer Starting server
   [junit4]   2> 386826 ERROR (Thread-832) [    ] o.a.z.s.ZooKeeperServer ZKShutdownHandler is not registered, so ZooKeeper server won't take any action on ERROR or SHUTDOWN server state changes
   [junit4]   2> 386917 INFO  (SUITE-SearchRateTriggerTest-seed#[49B7F3F349C3E86E]-worker) [    ] o.a.s.c.ZkTestServer start zk server on port:43299
   [junit4]   2> 386921 INFO  (zkConnectionManagerCallback-694-thread-1) [    ] o.a.s.c.c.ConnectionManager zkClient has connected
   [junit4]   2> 386924 INFO  (jetty-launcher-691-thread-3) [    ] o.e.j.s.Server jetty-9.4.8.v20171121, build timestamp: 2017-11-21T12:27:37-09:00, git hash: 82b8fb23f757335bb3329d540ce37a2a2615f0a8
   [junit4]   2> 386924 INFO  (jetty-launcher-691-thread-1) [    ] o.e.j.s.Server jetty-9.4.8.v20171121, build timestamp: 2017-11-21T12:27:37-09:00, git hash: 82b8fb23f757335bb3329d540ce37a2a2615f0a8
   [junit4]   2> 386924 INFO  (jetty-launcher-691-thread-2) [    ] o.e.j.s.Server jetty-9.4.8.v20171121, build timestamp: 2017-11-21T12:27:37-09:00, git hash: 82b8fb23f757335bb3329d540ce37a2a2615f0a8
   [junit4]   2> 386927 INFO  (jetty-launcher-691-thread-4) [    ] o.e.j.s.Server jetty-9.4.8.v20171121, build timestamp: 2017-11-21T12:27:37-09:00, git hash: 82b8fb23f757335bb3329d540ce37a2a2615f0a8
   [junit4]   2> 386942 INFO  (jetty-launcher-691-thread-2) [    ] o.e.j.s.session DefaultSessionIdManager workerName=node0
   [junit4]   2> 386942 INFO  (jetty-launcher-691-thread-2) [    ] o.e.j.s.session No SessionScavenger set, using defaults
   [junit4]   2> 386942 INFO  (jetty-launcher-691-thread-2) [    ] o.e.j.s.session Scavenging every 660000ms
   [junit4]   2> 386943 INFO  (jetty-launcher-691-thread-4) [    ] o.e.j.s.session DefaultSessionIdManager workerName=node0
   [junit4]   2> 386943 INFO  (jetty-launcher-691-thread-4) [    ] o.e.j.s.session No SessionScavenger set, using defaults
   [junit4]   2> 386943 INFO  (jetty-launcher-691-thread-4) [    ] o.e.j.s.session Scavenging every 600000ms
   [junit4]   2> 386943 INFO  (jetty-launcher-691-thread-1) [    ] o.e.j.s.session DefaultSessionIdManager workerName=node0
   [junit4]   2> 386943 INFO  (jetty-launcher-691-thread-1) [    ] o.e.j.s.session No SessionScavenger set, using defaults
   [junit4]   2> 386943 INFO  (jetty-launcher-691-thread-1) [    ] o.e.j.s.session Scavenging every 600000ms
   [junit4]   2> 386944 INFO  (jetty-launcher-691-thread-2) [    ] o.e.j.s.h.ContextHandler Started o.e.j.s.ServletContextHandler@4dddbfb4{/solr,null,AVAILABLE}
   [junit4]   2> 386946 INFO  (jetty-launcher-691-thread-4) [    ] o.e.j.s.h.ContextHandler Started o.e.j.s.ServletContextHandler@6483c1b6{/solr,null,AVAILABLE}
   [junit4]   2> 386946 INFO  (jetty-launcher-691-thread-1) [    ] o.e.j.s.h.ContextHandler Started o.e.j.s.ServletContextHandler@5308d0c5{/solr,null,AVAILABLE}
   [junit4]   2> 386946 INFO  (jetty-launcher-691-thread-2) [    ] o.e.j.s.AbstractConnector Started ServerConnector@65ef11b5{SSL,[ssl, http/1.1]}{127.0.0.1:38057}
   [junit4]   2> 386946 INFO  (jetty-launcher-691-thread-2) [    ] o.e.j.s.Server Started @386987ms
   [junit4]   2> 386946 INFO  (jetty-launcher-691-thread-2) [    ] o.a.s.c.s.e.JettySolrRunner Jetty properties: {hostContext=/solr, hostPort=38057}
   [junit4]   2> 386946 ERROR (jetty-launcher-691-thread-2) [    ] o.a.s.u.StartupLoggingUtils Missing Java Option solr.log.dir. Logging may be missing or incomplete.
   [junit4]   2> 386946 INFO  (jetty-launcher-691-thread-2) [    ] o.a.s.s.SolrDispatchFilter Using logger factory org.apache.logging.slf4j.Log4jLoggerFactory
   [junit4]   2> 386946 INFO  (jetty-launcher-691-thread-2) [    ] o.a.s.s.SolrDispatchFilter  ___      _       Welcome to Apache Solr? version 7.4.0
   [junit4]   2> 386946 INFO  (jetty-launcher-691-thread-2) [    ] o.a.s.s.SolrDispatchFilter / __| ___| |_ _   Starting in cloud mode on port null
   [junit4]   2> 386946 INFO  (jetty-launcher-691-thread-2) [    ] o.a.s.s.SolrDispatchFilter \__ \/ _ \ | '_|  Install dir: null
   [junit4]   2> 386946 INFO  (jetty-launcher-691-thread-2) [    ] o.a.s.s.SolrDispatchFilter |___/\___/_|_|    Start time: 2018-04-29T16:29:58.712819Z
   [junit4]   2> 386950 INFO  (jetty-launcher-691-thread-3) [    ] o.e.j.s.session DefaultSessionIdManager workerName=node0
   [junit4]   2> 386950 INFO  (jetty-launcher-691-thread-3) [    ] o.e.j.s.session No SessionScavenger set, using defaults
   [junit4]   2> 386950 INFO  (jetty-launcher-691-thread-3) [    ] o.e.j.s.session Scavenging every 660000ms
   [junit4]   2> 386950 INFO  (jetty-launcher-691-thread-4) [    ] o.e.j.s.AbstractConnector Started ServerConnector@5ef816cf{SSL,[ssl, http/1.1]}{127.0.0.1:35277}
   [junit4]   2> 386950 INFO  (jetty-launcher-691-thread-4) [    ] o.e.j.s.Server Started @386991ms
   [junit4]   2> 386950 INFO  (jetty-launcher-691-thread-4) [    ] o.a.s.c.s.e.JettySolrRunner Jetty properties: {hostContext=/solr, hostPort=35277}
   [junit4]   2> 386950 ERROR (jetty-launcher-691-thread-4) [    ] o.a.s.u.StartupLoggingUtils Missing Java Option solr.log.dir. Logging may be missing or incomplete.
   [junit4]   2> 386950 INFO  (jetty-launcher-691-thread-4) [    ] o.a.s.s.SolrDispatchFilter Using logger factory org.apache.logging.slf4j.Log4jLoggerFactory
   [junit4]   2> 386950 INFO  (jetty-launcher-691-thread-4) [    ] o.a.s.s.SolrDispatchFilter  ___      _       Welcome to Apache Solr? version 7.4.0
   [junit4]   2> 386950 INFO  (jetty-launcher-691-thread-4) [    ] o.a.s.s.SolrDispatchFilter / __| ___| |_ _   Starting in cloud mode on port null
   [junit4]   2> 386950 INFO  (jetty-launcher-691-thread-4) [    ] o.a.s.s.SolrDispatchFilter \__ \/ _ \ | '_|  Install dir: null
   [junit4]   2> 386950 INFO  (jetty-launcher-691-thread-4) [    ] o.a.s.s.SolrDispatchFilter |___/\___/_|_|    Start time: 2018-04-29T16:29:58.716709Z
   [junit4]   2> 386951 INFO  (jetty-launcher-691-thread-1) [    ] o.e.j.s.AbstractConnector Started ServerConnector@5c42e04a{SSL,[ssl, http/1.1]}{127.0.0.1:39513}
   [junit4]   2> 386951 INFO  (jetty-launcher-691-thread-1) [    ] o.e.j.s.Server Started @386992ms
   [junit4]   2> 386951 INFO  (jetty-launcher-691-thread-1) [    ] o.a.s.c.s.e.JettySolrRunner Jetty properties: {hostContext=/solr, hostPort=39513}
   [junit4]   2> 386951 ERROR (jetty-launcher-691-thread-1) [    ] o.a.s.u.StartupLoggingUtils Missing Java Option solr.log.dir. Logging may be missing or incomplete.
   [junit4]   2> 386951 INFO  (jetty-launcher-691-thread-1) [    ] o.a.s.s.SolrDispatchFilter Using logger factory org.apache.logging.slf4j.Log4jLoggerFactory
   [junit4]   2> 386951 INFO  (jetty-launcher-691-thread-1) [    ] o.a.s.s.SolrDispatchFilter  ___      _       Welcome to Apache Solr? version 7.4.0
   [junit4]   2> 386951 INFO  (jetty-launcher-691-thread-1) [    ] o.a.s.s.SolrDispatchFilter / __| ___| |_ _   Starting in cloud mode on port null
   [junit4]   2> 386951 INFO  (jetty-launcher-691-thread-1) [    ] o.a.s.s.SolrDispatchFilter \__ \/ _ \ | '_|  Install dir: null
   [junit4]   2> 386951 INFO  (jetty-launcher-691-thread-1) [    ] o.a.s.s.SolrDispatchFilter |___/\___/_|_|    Start time: 2018-04-29T16:29:58.717671Z
   [junit4]   2> 386958 INFO  (jetty-launcher-691-thread-3) [    ] o.e.j.s.h.ContextHandler Started o.e.j.s.ServletContextHandler@8e15126{/solr,null,AVAILABLE}
   [junit4]   2> 386962 INFO  (zkConnectionManagerCallback-698-thread-1) [    ] o.a.s.c.c.ConnectionManager zkClient has connected
   [junit4]   2> 386962 INFO  (zkConnectionManagerCallback-696-thread-1) [    ] o.a.s.c.c.ConnectionManager zkClient has connected
   [junit4]   2> 386962 INFO  (jetty-launcher-691-thread-4) [    ] o.a.s.s.SolrDispatchFilter solr.xml found in ZooKeeper. Loading...
   [junit4]   2> 386962 INFO  (jetty-launcher-691-thread-2) [    ] o.a.s.s.SolrDispatchFilter solr.xml found in ZooKeeper. Loading...
   [junit4]   2> 386962 INFO  (jetty-launcher-691-thread-3) [    ] o.e.j.s.AbstractConnector Started ServerConnector@6c6836dd{SSL,[ssl, http/1.1]}{127.0.0.1:46233}
   [junit4]   2> 386962 INFO  (jetty-launcher-691-thread-3) [    ] o.e.j.s.Server Started @387003ms
   [junit4]   2> 386962 INFO  (jetty-launcher-691-thread-3) [    ] o.a.s.c.s.e.JettySolrRunner Jetty properties: {hostContext=/solr, hostPort=46233}
   [junit4]   2> 386967 INFO  (zkConnectionManagerCallback-700-thread-1) [    ] o.a.s.c.c.ConnectionManager zkClient has connected
   [junit4]   2> 386967 ERROR (jetty-launcher-691-thread-3) [    ] o.a.s.u.StartupLoggingUtils Missing Java Option solr.log.dir. Logging may be missing or incomplete.
   [junit4]   2> 386967 INFO  (jetty-launcher-691-thread-3) [    ] o.a.s.s.SolrDispatchFilter Using logger factory org.apache.logging.slf4j.Log4jLoggerFactory
   [junit4]   2> 386967 INFO  (jetty-launcher-691-thread-3) [    ] o.a.s.s.SolrDispatchFilter  ___      _       Welcome to Apache Solr? version 7.4.0
   [junit4]   2> 386967 INFO  (jetty-launcher-691-thread-1) [    ] o.a.s.s.SolrDispatchFilter solr.xml found in ZooKeeper. Loading...
   [junit4]   2> 386967 INFO  (jetty-launcher-691-thread-3) [    ] o.a.s.s.SolrDispatchFilter / __| ___| |_ _   Starting in cloud mode on port null
   [junit4]   2> 386967 INFO  (jetty-launcher-691-thread-3) [    ] o.a.s.s.SolrDispatchFilter \__ \/ _ \ | '_|  Install dir: null
   [junit4]   2> 386968 INFO  (jetty-launcher-691-thread-3) [    ] o.a.s.s.SolrDispatchFilter |___/\___/_|_|    Start time: 2018-04-29T16:29:58.733978Z
   [junit4]   2> 386978 INFO  (zkConnectionManagerCallback-702-thread-1) [    ] o.a.s.c.c.ConnectionManager zkClient has connected
   [junit4]   2> 386978 INFO  (jetty-launcher-691-thread-3) [    ] o.a.s.s.SolrDispatchFilter solr.xml found in ZooKeeper. Loading...
   [junit4]   2> 386986 INFO  (jetty-launcher-691-thread-2) [    ] o.a.s.c.ZkContainer Zookeeper client=127.0.0.1:43299/solr
   [junit4]   2> 386987 INFO  (jetty-launcher-691-thread-4) [    ] o.a.s.c.ZkContainer Zookeeper client=127.0.0.1:43299/solr
   [junit4]   2> 386990 INFO  (jetty-launcher-691-thread-1) [    ] o.a.s.c.ZkContainer Zookeeper client=127.0.0.1:43299/solr
   [junit4]   2> 386994 INFO  (jetty-launcher-691-thread-3) [    ] o.a.s.c.ZkContainer Zookeeper client=127.0.0.1:43299/solr
   [junit4]   2> 386997 INFO  (zkConnectionManagerCallback-708-thread-1) [    ] o.a.s.c.c.ConnectionManager zkClient has connected
   [junit4]   2> 387002 INFO  (zkConnectionManagerCallback-715-thread-1) [    ] o.a.s.c.c.ConnectionManager zkClient has connected
   [junit4]   2> 387002 INFO  (zkConnectionManagerCallback-711-thread-1) [    ] o.a.s.c.c.ConnectionManager zkClient has connected
   [junit4]   2> 387002 WARN  (NIOServerCxn.Factory:0.0.0.0/0.0.0.0:0) [    ] o.a.z.s.NIOServerCnxn Unable to read additional data from client sessionid 0x1001102baa80007, likely client has closed socket
   [junit4]   2> 387005 INFO  (zkConnectionManagerCallback-718-thread-1) [    ] o.a.s.c.c.ConnectionManager zkClient has connected
   [junit4]   2> 387011 INFO  (zkConnectionManagerCallback-720-thread-1) [    ] o.a.s.c.c.ConnectionManager zkClient has connected
   [junit4]   2> 387014 INFO  (zkConnectionManagerCallback-724-thread-1) [    ] o.a.s.c.c.ConnectionManager zkClient has connected
   [junit4]   2> 387022 INFO  (zkConnectionManagerCallback-723-thread-1) [    ] o.a.s.c.c.ConnectionManager zkClient has connected
   [junit4]   2> 387026 INFO  (jetty-launcher-691-thread-4) [n:127.0.0.1:35277_solr    ] o.a.s.c.Overseer Overseer (id=null) closing
   [junit4]   2> 387026 INFO  (jetty-launcher-691-thread-4) [n:127.0.0.1:35277_solr    ] o.a.s.c.OverseerElectionContext I am going to be the leader 127.0.0.1:35277_solr
   [junit4]   2> 387027 INFO  (jetty-launcher-691-thread-4) [n:127.0.0.1:35277_solr    ] o.a.s.c.Overseer Overseer (id=72076297457106955-127.0.0.1:35277_solr-n_0000000000) starting
   [junit4]   2> 387028 INFO  (zkConnectionManagerCallback-726-thread-1) [    ] o.a.s.c.c.ConnectionManager zkClient has connected
   [junit4]   2> 387032 INFO  (jetty-launcher-691-thread-3) [n:127.0.0.1:46233_solr    ] o.a.s.c.Overseer Overseer (id=null) closing
   [junit4]   2> 387032 INFO  (jetty-launcher-691-thread-3) [n:127.0.0.1:46233_solr    ] o.a.s.c.ZkController Register node as live in ZooKeeper:/live_nodes/127.0.0.1:46233_solr
   [junit4]   2> 387038 INFO  (zkConnectionManagerCallback-739-thread-1) [    ] o.a.s.c.c.ConnectionManager zkClient has connected
   [junit4]   2> 387038 INFO  (zkCallback-725-thread-1) [    ] o.a.s.c.c.ZkStateReader Updated live nodes from ZooKeeper... (0) -> (1)
   [junit4]   2> 387038 INFO  (zkCallback-721-thread-1) [    ] o.a.s.c.c.ZkStateReader Updated live nodes from ZooKeeper... (0) -> (1)
   [junit4]   2> 387039 INFO  (jetty-launcher-691-thread-4) [n:127.0.0.1:35277_solr    ] o.a.s.c.c.ZkStateReader Updated live nodes from ZooKeeper... (0) -> (1)
   [junit4]   2> 387039 INFO  (jetty-launcher-691-thread-4) [n:127.0.0.1:35277_solr    ] o.a.s.c.s.i.ZkClientClusterStateProvider Cluster at 127.0.0.1:43299/solr ready
   [junit4]   2> 387042 INFO  (jetty-launcher-691-thread-4) [n:127.0.0.1:35277_solr    ] o.a.s.c.TransientSolrCoreCacheDefault Allocating transient cache for 2147483647 transient cores
   [junit4]   2> 387042 INFO  (jetty-launcher-691-thread-4) [n:127.0.0.1:35277_solr    ] o.a.s.c.ZkController Register node as live in ZooKeeper:/live_nodes/127.0.0.1:35277_solr
   [junit4]   2> 387043 INFO  (zkCallback-725-thread-1) [    ] o.a.s.c.c.ZkStateReader Updated live nodes from ZooKeeper... (1) -> (2)
   [junit4]   2> 387046 INFO  (zkCallback-738-thread-1) [    ] o.a.s.c.c.ZkStateReader Updated live nodes from ZooKeeper... (1) -> (2)
   [junit4]   2> 387050 INFO  (zkCallback-721-thread-1) [    ] o.a.s.c.c.ZkStateReader Updated live nodes from ZooKeeper... (1) -> (2)
   [junit4]   2> 387056 INFO  (jetty-launcher-691-thread-2) [n:127.0.0.1:38057_solr    ] o.a.s.c.c.ZkStateReader Updated live nodes from ZooKeeper... (0) -> (2)
   [junit4]   2> 387057 INFO  (jetty-launcher-691-thread-1) [n:127.0.0.1:39513_solr    ] o.a.s.c.c.ZkStateReader Updated live nodes from ZooKeeper... (0) -> (2)
   [junit4]   2> 387057 INFO  (jetty-launcher-691-thread-2) [n:127.0.0.1:38057_solr    ] o.a.s.c.Overseer Overseer (id=null) closing
   [junit4]   2> 387058 INFO  (jetty-launcher-691-thread-1) [n:127.0.0.1:39513_solr    ] o.a.s.c.Overseer Overseer (id=null) closing
   [junit4]   2> 387058 INFO  (jetty-launcher-691-thread-2) [n:127.0.0.1:38057_solr    ] o.a.s.c.TransientSolrCoreCacheDefault Allocating transient cache for 2147483647 transient cores
   [junit4]   2> 387058 INFO  (jetty-launcher-691-thread-2) [n:127.0.0.1:38057_solr    ] o.a.s.c.ZkController Register node as live in ZooKeeper:/live_nodes/127.0.0.1:38057_solr
   [junit4]   2> 387059 INFO  (zkCallback-725-thread-1) [    ] o.a.s.c.c.ZkStateReader Updated live nodes from ZooKeeper... (2) -> (3)
   [junit4]   2> 387062 INFO  (zkCallback-738-thread-1) [    ] o.a.s.c.c.ZkStateReader Updated live nodes from ZooKeeper... (2) -> (3)
   [junit4]   2> 387066 INFO  (zkCallback-721-thread-2) [    ] o.a.s.c.c.ZkStateReader Updated live nodes from ZooKeeper... (2) -> (3)
   [junit4]   2> 387066 INFO  (jetty-launcher-691-thread-1) [n:127.0.0.1:39513_solr    ] o.a.s.c.TransientSolrCoreCacheDefault Allocating transient cache for 2147483647 transient cores
   [junit4]   2> 387066 INFO  (jetty-launcher-691-thread-1) [n:127.0.0.1:39513_solr    ] o.a.s.c.ZkController Register node as live in ZooKeeper:/live_nodes/127.0.0.1:39513_solr
   [junit4]   2> 387070 INFO  (zkCallback-719-thread-1) [    ] o.a.s.c.c.ZkStateReader Updated live nodes from ZooKeeper... (2) -> (3)
   [junit4]   2> 387070 INFO  (zkCallback-725-thread-1) [    ] o.a.s.c.c.ZkStateReader Updated live nodes from ZooKeeper... (3) -> (4)
   [junit4]   2> 387070 INFO  (zkCallback-738-thread-1) [    ] o.a.s.c.c.ZkStateReader Updated live nodes from ZooKeeper... (3) -> (4)
   [junit4]   2> 387070 INFO  (zkCallback-721-thread-1) [    ] o.a.s.c.c.ZkStateReader Updated live nodes from ZooKeeper... (3) -> (4)
   [junit4]   2> 387074 INFO  (zkCallback-722-thread-1) [    ] o.a.s.c.c.ZkStateReader Updated live nodes from ZooKeeper... (2) -> (4)
   [junit4]   2> 387074 INFO  (zkCallback-719-thread-2) [    ] o.a.s.c.c.ZkStateReader Updated live nodes from ZooKeeper... (3) -> (4)
   [junit4]   2> 387107 INFO  (jetty-launcher-691-thread-3) [n:127.0.0.1:46233_solr    ] o.a.s.m.r.SolrJmxReporter JMX monitoring for 'solr_46233.solr.node' (registry 'solr.node') enabled at server: com.sun.jmx.mbeanserver.JmxMBeanServer@58623e81
   [junit4]   2> 387107 INFO  (jetty-launcher-691-thread-4) [n:127.0.0.1:35277_solr    ] o.a.s.m.r.SolrJmxReporter JMX monitoring for 'solr_35277.solr.node' (registry 'solr.node') enabled at server: com.sun.jmx.mbeanserver.JmxMBeanServer@58623e81
   [junit4]   2> 387115 INFO  (jetty-launcher-691-thread-3) [n:127.0.0.1:46233_solr    ] o.a.s.m.r.SolrJmxReporter JMX monitoring for 'solr_46233.solr.jvm' (registry 'solr.jvm') enabled at server: com.sun.jmx.mbeanserver.JmxMBeanServer@58623e81
   [junit4]   2> 387115 INFO  (jetty-launcher-691-thread-3) [n:127.0.0.1:46233_solr    ] o.a.s.m.r.SolrJmxReporter JMX monitoring for 'solr_46233.solr.jetty' (registry 'solr.jetty') enabled at server: com.sun.jmx.mbeanserver.JmxMBeanServer@58623e81
   [junit4]   2> 387116 INFO  (jetty-launcher-691-thread-4) [n:127.0.0.1:35277_solr    ] o.a.s.m.r.SolrJmxReporter JMX monitoring for 'solr_35277.solr.jvm' (registry 'solr.jvm') enabled at server: com.sun.jmx.mbeanserver.JmxMBeanServer@58623e81
   [junit4]   2> 387116 INFO  (jetty-launcher-691-thread-3) [n:127.0.0.1:46233_solr    ] o.a.s.c.CorePropertiesLocator Found 0 core definitions underneath /home/jenkins/workspace/Lucene-Solr-7.x-Linux/solr/build/solr-core/test/J2/temp/solr.cloud.autoscaling.SearchRateTriggerTest_49B7F3F349C3E86E-001/tempDir-001/node3/.
   [junit4]   2> 387116 INFO  (jetty-launcher-691-thread-4) [n:127.0.0.1:35277_solr    ] o.a.s.m.r.SolrJmxReporter JMX monitoring for 'solr_35277.solr.jetty' (registry 'solr.jetty') enabled at server: com.sun.jmx.mbeanserver.JmxMBeanServer@58623e81
   [junit4]   2> 387117 INFO  (jetty-launcher-691-thread-4) [n:127.0.0.1:35277_solr    ] o.a.s.c.CorePropertiesLocator Found 0 core definitions underneath /home/jenkins/workspace/Lucene-Solr-7.x-Linux/solr/build/solr-core/test/J2/temp/solr.cloud.autoscaling.SearchRateTriggerTest_49B7F3F349C3E86E-001/tempDir-001/node4/.
   [junit4]   2> 387126 INFO  (zkConnectionManagerCallback-744-thread-1) [    ] o.a.s.c.c.ConnectionManager zkClient has connected
   [junit4]   2> 387126 INFO  (jetty-launcher-691-thread-3) [n:127.0.0.1:46233_solr    ] o.a.s.c.c.ZkStateReader Updated live nodes from ZooKeeper... (0) -> (4)
   [junit4]   2> 387127 INFO  (jetty-launcher-691-thread-3) [n:127.0.0.1:46233_solr    ] o.a.s.c.s.i.ZkClientClusterStateProvider Cluster at 127.0.0.1:43299/solr ready
   [junit4]   2> 387129 INFO  (jetty-launcher-691-thread-2) [n:127.0.0.1:38057_solr    ] o.a.s.m.r.SolrJmxReporter JMX monitoring for 'solr_38057.solr.node' (registry 'solr.node') enabled at server: com.sun.jmx.mbeanserver.JmxMBeanServer@58623e81
   [junit4]   2> 387136 INFO  (jetty-launcher-691-thread-2) [n:127.0.0.1:38057_solr    ] o.a.s.m.r.SolrJmxReporter JMX monitoring for 'solr_38057.solr.jvm' (registry 'solr.jvm') enabled at server: com.sun.jmx.mbeanserver.JmxMBeanServer@58623e81
   [junit4]   2> 387136 INFO  (jetty-launcher-691-thread-2) [n:127.0.0.1:38057_solr    ] o.a.s.m.r.SolrJmxReporter JMX monitoring for 'solr_38057.solr.jetty' (registry 'solr.jetty') enabled at server: com.sun.jmx.mbeanserver.JmxMBeanServer@58623e81
   [junit4]   2> 387137 INFO  (jetty-launcher-691-thread-2) [n:127.0.0.1:38057_solr    ] o.a.s.c.CorePropertiesLocator Found 0 core definitions underneath /home/jenkins/workspace/Lucene-Solr-7.x-Linux/solr/build/solr-core/test/J2/temp/solr.cloud.autoscaling.SearchRateTriggerTest_49B7F3F349C3E86E-001/tempDir-001/node2/.
   [junit4]   2> 387158 INFO  (zkConnectionManagerCallback-749-thread-1) [    ] o.a.s.c.c.ConnectionManager zkClient has connected
   [junit4]   2> 387159 INFO  (jetty-launcher-691-thread-2) [n:127.0.0.1:38057_solr    ] o.a.s.c.c.ZkStateReader Updated live nodes from ZooKeeper... (0) -> (4)
   [junit4]   2> 387159 INFO  (jetty-launcher-691-thread-2) [n:127.0.0.1:38057_solr    ] o.a.s.c.s.i.ZkClientClusterStateProvider Cluster at 127.0.0.1:43299/solr ready
   [junit4]   2> 387201 INFO  (jetty-launcher-691-thread-1) [n:127.0.0.1:39513_solr    ] o.a.s.m.r.SolrJmxReporter JMX monitoring for 'solr_39513.solr.node' (registry 'solr.node') enabled at server: com.sun.jmx.mbeanserver.JmxMBeanServer@58623e81
   [junit4]   2> 387206 INFO  (jetty-launcher-691-thread-1) [n:127.0.0.1:39513_solr    ] o.a.s.m.r.SolrJmxReporter JMX monitoring for 'solr_39513.solr.jvm' (registry 'solr.jvm') enabled at server: com.sun.jmx.mbeanserver.JmxMBeanServer@58623e81
   [junit4]   2> 387207 INFO  (jetty-launcher-691-thread-1) [n:127.0.0.1:39513_solr    ] o.a.s.m.r.SolrJmxReporter JMX monitoring for 'solr_39513.solr.jetty' (registry 'solr.jetty') enabled at server: com.sun.jmx.mbeanserver.JmxMBeanServer@58623e81
   [junit4]   2> 387207 INFO  (jetty-launcher-691-thread-1) [n:127.0.0.1:39513_solr    ] o.a.s.c.CorePropertiesLocator Found 0 core definitions underneath /home/jenkins/workspace/Lucene-Solr-7.x-Linux/solr/build/solr-core/test/J2/temp/solr.cloud.autoscaling.SearchRateTriggerTest_49B7F3F349C3E86E-001/tempDir-001/node1/.
   [junit4]   2> 387214 INFO  (zkConnectionManagerCallback-754-thread-1) [    ] o.a.s.c.c.ConnectionManager zkClient has connected
   [junit4]   2> 387214 INFO  (jetty-launcher-691-thread-1) [n:127.0.0.1:39513_solr    ] o.a.s.c.c.ZkStateReader Updated live nodes from ZooKeeper... (0) -> (4)
   [junit4]   2> 387215 INFO  (jetty-launcher-691-thread-1) [n:127.0.0.1:39513_solr    ] o.a.s.c.s.i.ZkClientClusterStateProvider Cluster at 127.0.0.1:43299/solr ready
   [junit4]   2> 387250 INFO  (zkConnectionManagerCallback-756-thread-1) [    ] o.a.s.c.c.ConnectionManager zkClient has connected
   [junit4]   2> 387254 INFO  (zkConnectionManagerCallback-761-thread-1) [    ] o.a.s.c.c.ConnectionManager zkClient has connected
   [junit4]   2> 387255 INFO  (SUITE-SearchRateTriggerTest-seed#[49B7F3F349C3E86E]-worker) [    ] o.a.s.c.c.ZkStateReader Updated live nodes from ZooKeeper... (0) -> (4)
   [junit4]   2> 387255 INFO  (SUITE-SearchRateTriggerTest-seed#[49B7F3F349C3E86E]-worker) [    ] o.a.s.c.s.i.ZkClientClusterStateProvider Cluster at 127.0.0.1:43299/solr ready
   [junit4]   2> 387277 INFO  (TEST-SearchRateTriggerTest.testTrigger-seed#[49B7F3F349C3E86E]) [    ] o.a.s.SolrTestCaseJ4 ###Starting testTrigger
   [junit4]   2> 387277 INFO  (TEST-SearchRateTriggerTest.testTrigger-seed#[49B7F3F349C3E86E]) [    ] o.a.s.c.c.ZkStateReader Updated live nodes from ZooKeeper... (0) -> (4)
   [junit4]   2> 387292 INFO  (qtp1116451475-3747) [n:127.0.0.1:39513_solr    ] o.a.s.h.a.CollectionsHandler Invoked Collection Action :create with params replicationFactor=2&collection.configName=conf&maxShardsPerNode=1&name=SearchRateTriggerTest-collection1&nrtReplicas=2&action=CREATE&numShards=2&wt=javabin&version=2 and sendToOCPQueue=true
   [junit4]   2> 387294 INFO  (OverseerThreadFactory-816-thread-1) [    ] o.a.s.c.a.c.CreateCollectionCmd Create collection SearchRateTriggerTest-collection1
   [junit4]   2> 387398 INFO  (OverseerStateUpdate-72076297457106955-127.0.0.1:35277_solr-n_0000000000) [    ] o.a.s.c.o.SliceMutator createReplica() {
   [junit4]   2>   "operation":"ADDREPLICA",
   [junit4]   2>   "collection":"SearchRateTriggerTest-collection1",
   [junit4]   2>   "shard":"shard1",
   [junit4]   2>   "core":"SearchRateTriggerTest-collection1_shard1_replica_n1",
   [junit4]   2>   "state":"down",
   [junit4]   2>   "base_url":"https://127.0.0.1:46233/solr",
   [junit4]   2>   "type":"NRT",
   [junit4]   2>   "waitForFinalState":"false"} 
   [junit4]   2> 387399 INFO  (OverseerStateUpdate-72076297457106955-127.0.0.1:35277_solr-n_0000000000) [    ] o.a.s.c.o.SliceMutator createReplica() {
   [junit4]   2>   "operation":"ADDREPLICA",
   [junit4]   2>   "collection":"SearchRateTriggerTest-collection1",
   [junit4]   2>   "shard":"shard1",
   [junit4]   2>   "core":"SearchRateTriggerTest-collection1_shard1_replica_n2",
   [junit4]   2>   "state":"down",
   [junit4]   2>   "base_url":"https://127.0.0.1:39513/solr",
   [junit4]   2>   "type":"NRT",
   [junit4]   2>   "waitForFinalState":"false"} 
   [junit4]   2> 387399 INFO  (OverseerStateUpdate-72076297457106955-127.0.0.1:35277_solr-n_0000000000) [    ] o.a.s.c.o.SliceMutator createReplica() {
   [junit4]   2>   "operation":"ADDREPLICA",
   [junit4]   2>   "collection":"SearchRateTriggerTest-collection1",
   [junit4]   2>   "shard":"shard2",
   [junit4]   2>   "core":"SearchRateTriggerTest-collection1_shard2_replica_n4",
   [junit4]   2>   "state":"down",
   [junit4]   2>   "base_url":"https://127.0.0.1:35277/solr",
   [junit4]   2>   "type":"NRT",
   [junit4]   2>   "waitForFinalState":"false"} 
   [junit4]   2> 387400 INFO  (OverseerStateUpdate-72076297457106955-127.0.0.1:35277_solr-n_0000000000) [    ] o.a.s.c.o.SliceMutator createReplica() {
   [junit4]   2>   "operation":"ADDREPLICA",
   [junit4]   2>   "collection":"SearchRateTriggerTest-collection1",
   [junit4]   2>   "shard":"shard2",
   [junit4]   2>   "core":"SearchRateTriggerTest-collection1_shard2_replica_n6",
   [junit4]   2>   "state":"down",
   [junit4]   2>   "base_url":"https://127.0.0.1:38057/solr",
   [junit4]   2>   "type":"NRT",
   [junit4]   2>   "waitForFinalState":"false"} 
   [junit4]   2> 387605 INFO  (qtp1116451475-3749) [n:127.0.0.1:39513_solr    ] o.a.s.h.a.CoreAdminOperation core create command qt=/admin/cores&coreNodeName=core_node5&collection.configName=conf&newCollection=true&name=SearchRateTriggerTest-collection1_shard1_replica_n2&action=CREATE&numShards=2&collection=SearchRateTriggerTest-collection1&shard=shard1&wt=javabin&version=2&replicaType=NRT
   [junit4]   2> 387618 INFO  (qtp872535104-3753) [n:127.0.0.1:46233_solr    ] o.a.s.h.a.CoreAdminOperation core create command qt=/admin/cores&coreNodeName=core_node3&collection.configName=conf&newCollection=true&name=SearchRateTriggerTest-collection1_shard1_replica_n1&action=CREATE&numShards=2&collection=SearchRateTriggerTest-collection1&shard=shard1&wt=javabin&version=2&replicaType=NRT
   [junit4]   2> 387618 INFO  (qtp132276327-3751) [n:127.0.0.1:38057_solr    ] o.a.s.h.a.CoreAdminOperation core create command qt=/admin/cores&coreNodeName=core_node8&collection.configName=conf&newCollection=true&name=SearchRateTriggerTest-collection1_shard2_replica_n6&action=CREATE&numShards=2&collection=SearchRateTriggerTest-collection1&shard=shard2&wt=javabin&version=2&replicaType=NRT
   [junit4]   2> 387618 INFO  (qtp872535104-3753) [n:127.0.0.1:46233_solr    ] o.a.s.c.TransientSolrCoreCacheDefault Allocating transient cache for 2147483647 transient cores
   [junit4]   2> 387622 INFO  (qtp1847238326-3745) [n:127.0.0.1:35277_solr    ] o.a.s.h.a.CoreAdminOperation core create command qt=/admin/cores&coreNodeName=core_node7&collection.configName=conf&newCollection=true&name=SearchRateTriggerTest-collection1_shard2_replica_n4&action=CREATE&numShards=2&collection=SearchRateTriggerTest-collection1&shard=shard2&wt=javabin&version=2&replicaType=NRT
   [junit4]   2> 388613 INFO  (qtp1116451475-3749) [n:127.0.0.1:39513_solr c:SearchRateTriggerTest-collection1 s:shard1 r:core_node5 x:SearchRateTriggerTest-collection1_shard1_replica_n2] o.a.s.c.SolrConfig Using Lucene MatchVersion: 7.4.0
   [junit4]   2> 388618 INFO  (qtp1116451475-3749) [n:127.0.0.1:39513_solr c:SearchRateTriggerTest-collection1 s:shard1 r:core_node5 x:SearchRateTriggerTest-collection1_shard1_replica_n2] o.a.s.s.IndexSchema [SearchRateTriggerTest-collection1_shard1_replica_n2] Schema name=minimal
   [junit4]   2> 388619 INFO  (qtp1116451475-3749) [n:127.0.0.1:39513_solr c:SearchRateTriggerTest-collection1 s:shard1 r:core_node5 x:SearchRateTriggerTest-collection1_shard1_replica_n2] o.a.s.s.IndexSchema Loaded schema minimal/1.1 with uniqueid field id
   [junit4]   2> 388619 INFO  (qtp1116451475-3749) [n:127.0.0.1:39513_solr c:SearchRateTriggerTest-collection1 s:shard1 r:core_node5 x:SearchRateTriggerTest-collection1_shard1_replica_n2] o.a.s.c.CoreContainer Creating SolrCore 'SearchRateTriggerTest-collection1_shard1_replica_n2' using configuration from collection SearchRateTriggerTest-collection1, trusted=true
   [junit4]   2> 388620 INFO  (qtp1116451475-3749) [n:127.0.0.1:39513_solr c:SearchRateTriggerTest-collection1 s:shard1 r:core_node5 x:SearchRateTriggerTest-collection1_shard1_replica_n2] o.a.s.m.r.SolrJmxReporter JMX monitoring for 'solr_39513.solr.core.SearchRateTriggerTest-collection1.shard1.replica_n2' (registry 'solr.core.SearchRateTriggerTest-collection1.shard1.replica_n2') enabled at server: com.sun.jmx.mbeanserver.JmxMBeanServer@58623e81
   [junit4]   2> 388620 INFO  (qtp1116451475-3749) [n:127.0.0.1:39513_solr c:SearchRateTriggerTest-collection1 s:shard1 r:core_node5 x:SearchRateTriggerTest-collection1_shard1_replica_n2] o.a.s.c.SolrCore solr.RecoveryStrategy.Builder
   [junit4]   2> 388620 INFO  (qtp1116451475-3749) [n:127.0.0.1:39513_solr c:SearchRateTriggerTest-collection1 s:shard1 r:core_node5 x:SearchRateTriggerTest-collection1_shard1_replica_n2] o.a.s.c.SolrCore [[SearchRateTriggerTest-collection1_shard1_replica_n2] ] Opening new SolrCore at [/home/jenkins/workspace/Lucene-Solr-7.x-Linux/solr/build/solr-core/test/J2/temp/solr.cloud.autoscaling.SearchRateTriggerTest_49B7F3F349C3E86E-001/tempDir-001/node1/SearchRateTriggerTest-collection1_shard1_replica_n2], dataDir=[/home/jenkins/workspace/Lucene-Solr-7.x-Linux/solr/build/solr-core/test/J2/temp/solr.cloud.autoscaling.SearchRateTriggerTest_49B7F3F349C3E86E-001/tempDir-001/node1/./SearchRateTriggerTest-collection1_shard1_replica_n2/data/]
   [junit4]   2> 388629 INFO  (qtp872535104-3753) [n:127.0.0.1:46233_solr c:SearchRateTriggerTest-collection1 s:shard1 r:core_node3 x:SearchRateTriggerTest-collection1_shard1_replica_n1] o.a.s.c.SolrConfig Using Lucene MatchVersion: 7.4.0
   [junit4]   2> 388629 INFO  (qtp132276327-3751) [n:127.0.0.1:38057_solr c:SearchRateTriggerTest-collection1 s:shard2 r:core_node8 x:SearchRateTriggerTest-collection1_shard2_replica_n6] o.a.s.c.SolrConfig Using Lucene MatchVersion: 7.4.0
   [junit4]   2> 388632 INFO  (qtp1847238326-3745) [n:127.0.0.1:35277_solr c:SearchRateTriggerTest-collection1 s:shard2 r:core_node7 x:SearchRateTriggerTest-collection1_shard2_replica_n4] o.a.s.c.SolrConfig Using Lucene MatchVersion: 7.4.0
   [junit4]   2> 388635 INFO  (qtp1847238326-3745) [n:127.0.0.1:35277_solr c:SearchRateTriggerTest-collection1 s:shard2 r:core_node7 x:SearchRateTriggerTest-collection1_shard2_replica_n4] o.a.s.s.IndexSchema [SearchRateTriggerTest-collection1_shard2_replica_n4] Schema name=minimal
   [junit4]   2> 388635 INFO  (qtp872535104-3753) [n:127.0.0.1:46233_solr c:SearchRateTriggerTest-collection1 s:shard1 r:core_node3 x:SearchRateTriggerTest-collection1_shard1_replica_n1] o.a.s.s.IndexSchema [SearchRateTriggerTest-collection1_shard1_replica_n1] Schema name=minimal
   [junit4]   2> 388635 INFO  (qtp132276327-3751) [n:127.0.0.1:38057_solr c:SearchRateTriggerTest-collection1 s:shard2 r:core_node8 x:SearchRateTriggerTest-collection1_shard2_replica_n6] o.a.s.s.IndexSchema [SearchRateTriggerTest-collection1_shard2_replica_n6] Schema name=minimal
   [junit4]   2> 388637 INFO  (qtp872535104-3753) [n:127.0.0.1:46233_solr c:SearchRateTriggerTest-collection1 s:shard1 r:core_node3 x:SearchRateTriggerTest-collection1_shard1_replica_n1] o.a.s.s.IndexSchema Loaded schema minimal/1.1 with uniqueid field id
   [junit4]   2> 388637 INFO  (qtp132276327-3751) [n:127.0.0.1:38057_solr c:SearchRateTriggerTest-collection1 s:shard2 r:core_node8 x:SearchRateTriggerTest-collection1_shard2_replica_n6] o.a.s.s.IndexSchema Loaded schema minimal/1.1 with uniqueid field id
   [junit4]   2> 388637 INFO  (qtp872535104-3753) [n:127.0.0.1:46233_solr c:SearchRateTriggerTest-collection1 s:shard1 r:core_node3 x:SearchRateTriggerTest-collection1_shard1_replica_n1] o.a.s.c.CoreContainer Creating SolrCore 'SearchRateTriggerTest-collection1_shard1_replica_n1' using configuration from collection SearchRateTriggerTest-collection1, trusted=true
   [junit4]   2> 388637 INFO  (qtp132276327-3751) [n:127.0.0.1:38057_solr c:SearchRateTriggerTest-collection1 s:shard2 r:core_node8 x:SearchRateTriggerTest-collection1_shard2_replica_n6] o.a.s.c.CoreContainer Creating SolrCore 'SearchRateTriggerTest-collection1_shard2_replica_n6' using configuration from collection SearchRateTriggerTest-collection1, trusted=true
   [junit4]   2> 388637 INFO  (qtp1847238326-3745) [n:127.0.0.1:35277_solr c:SearchRateTriggerTest-collection1 s:shard2 r:core_node7 x:SearchRateTriggerTest-collection1_shard2_replica_n4] o.a.s.s.IndexSchema Loaded schema minimal/1.1 with uniqueid field id
   [junit4]   2> 388637 INFO  (qtp1847238326-3745) [n:127.0.0.1:35277_solr c:SearchRateTriggerTest-collection1 s:shard2 r:core_node7 x:SearchRateTriggerTest-collection1_shard2_replica_n4] o.a.s.c.CoreContainer Creating SolrCore 'SearchRateTriggerTest-collection1_shard2_replica_n4' using configuration from collection SearchRateTriggerTest-collection1, trusted=true
   [junit4]   2> 388637 INFO  (qtp872535104-3753) [n:127.0.0.1:46233_solr c:SearchRateTriggerTest-collection1 s:shard1 r:core_node3 x:SearchRateTriggerTest-collection1_shard1_replica_n1] o.a.s.m.r.SolrJmxReporter JMX monitoring for 'solr_46233.solr.core.SearchRateTriggerTest-collection1.shard1.replica_n1' (registry 'solr.core.SearchRateTriggerTest-collection1.shard1.replica_n1') enabled at server: com.sun.jmx.mbeanserver.JmxMBeanServer@58623e81
   [junit4]   2> 388637 INFO  (qtp132276327-3751) [n:127.0.0.1:38057_solr c:SearchRateTriggerTest-collection1 s:shard2 r:core_node8 x:SearchRateTriggerTest-collection1_shard2_replica_n6] o.a.s.m.r.SolrJmxReporter JMX monitoring for 'solr_38057.solr.core.SearchRateTriggerTest-collection1.shard2.replica_n6' (registry 'solr.core.SearchRateTriggerTest-collection1.shard2.replica_n6') enabled at server: com.sun.jmx.mbeanserver.JmxMBeanServer@58623e81
   [junit4]   2> 388637 INFO  (qtp1847238326-3745) [n:127.0.0.1:35277_solr c:SearchRateTriggerTest-collection1 s:shard2 r:core_node7 x:SearchRateTriggerTest-collection1_shard2_replica_n4] o.a.s.m.r.SolrJmxReporter JMX monitoring for 'solr_35277.solr.core.SearchRateTriggerTest-collection1.shard2.replica_n4' (registry 'solr.core.SearchRateTriggerTest-collection1.shard2.replica_n4') enabled at server: com.sun.jmx.mbeanserver.JmxMBeanServer@58623e81
   [junit4]   2> 388638 INFO  (qtp872535104-3753) [n:127.0.0.1:46233_solr c:SearchRateTriggerTest-collection1 s:shard1 r:core_node3 x:SearchRateTriggerTest-collection1_shard1_replica_n1] o.a.s.c.SolrCore solr.RecoveryStrategy.Builder
   [junit4]   2> 388638 INFO  (qtp1847238326-3745) [n:127.0.0.1:35277_solr c:SearchRateTriggerTest-collection1 s:shard2 r:core_node7 x:SearchRateTriggerTest-collection1_shard2_replica_n4] o.a.s.c.SolrCore solr.RecoveryStrategy.Builder
   [junit4]   2> 388638 INFO  (qtp132276327-3751) [n:127.0.0.1:38057_solr c:SearchRateTriggerTest-collection1 s:shard2 r:core_node8 x:SearchRateTriggerTest-collection1_shard2_replica_n6] o.a.s.c.SolrCore solr.RecoveryStrategy.Builder
   [junit4]   2> 388638 INFO  (qtp872535104-3753) [n:127.0.0.1:46233_solr c:SearchRateTriggerTest-collection1 s:shard1 r:core_node3 x:SearchRateTriggerTest-collection1_shard1_replica_n1] o.a.s.c.SolrCore [[SearchRateTriggerTest-collection1_shard1_replica_n1] ] Opening new SolrCore at [/home/jenkins/workspace/Lucene-Solr-7.x-Linux/solr/build/solr-core/test/J2/temp/solr.cloud.autoscaling.SearchRateTriggerTest_49B7F3F349C3E86E-001/tempDir-001/node3/SearchRateTriggerTest-collection1_shard1_replica_n1], dataDir=[/home/jenkins/workspace/Lucene-Solr-7.x-Linux/solr/build/solr-core/test/J2/temp/solr.cloud.autoscaling.SearchRateTriggerTest_49B7F3F349C3E86E-001/tempDir-001/node3/./SearchRateTriggerTest-collection1_shard1_replica_n1/data/]
   [junit4]   2> 388638 INFO  (qtp1847238326-3745) [n:127.0.0.1:35277_solr c:SearchRateTriggerTest-collection1 s:shard2 r:core_node7 x:SearchRateTriggerTest-collection1_shard2_replica_n4] o.a.s.c.SolrCore [[SearchRateTriggerTest-collection1_shard2_replica_n4] ] Opening new SolrCore at [/home/jenkins/workspace/Lucene-Solr-7.x-Linux/solr/build/solr-core/test/J2/temp/solr.cloud.autoscaling.SearchRateTriggerTest_49B7F3F349C3E86E-001/tempDir-001/node4/SearchRateTriggerTest-collection1_shard2_replica_n4], dataDir=[/home/jenkins/workspace/Lucene-Solr-7.x-Linux/solr/build/solr-core/test/J2/temp/solr.cloud.autoscaling.SearchRateTriggerTest_49B7F3F349C3E86E-001/tempDir-001/node4/./SearchRateTriggerTest-collection1_shard2_replica_n4/data/]
   [junit4]   2> 388638 INFO  (qtp132276327-3751) [n:127.0.0.1:38057_solr c:SearchRateTriggerTest-collection1 s:shard2 r:core_node8 x:SearchRateTriggerTest-collection1_shard2_replica_n6] o.a.s.c.SolrCore [[SearchRateTriggerTest-collection1_shard2_replica_n6] ] Opening new SolrCore at [/home/jenkins/workspace/Lucene-Solr-7.x-Linux/solr/build/solr-core/test/J2/temp/solr.cloud.autoscaling.SearchRateTriggerTest_49B7F3F349C3E86E-001/tempDir-001/node2/SearchRateTriggerTest-collection1_shard2_replica_n6], dataDir=[/home/jenkins/workspace/Lucene-Solr-7.x-Linux/solr/build/solr-core/test/J2/temp/solr.cloud.autoscaling.SearchRateTriggerTest_49B7F3F349C3E86E-001/tempDir-001/node2/./SearchRateTriggerTest-collection1_shard2_replica_n6/data/]
   [junit4]   2> 388683 INFO  (qtp1116451475-3749) [n:127.0.0.1:39513_solr c:SearchRateTriggerTest-collection1 s:shard1 r:core_node5 x:SearchRateTriggerTest-collection1_shard1_replica_n2] o.a.s.u.UpdateHandler Using UpdateLog implementation: org.apache.solr.update.UpdateLog
   [junit4]   2> 388683 INFO  (qtp1116451475-3749) [n:127.0.0.1:39513_solr c:SearchRateTriggerTest-collection1 s:shard1 r:core_node5 x:SearchRateTriggerTest-collection1_shard1_replica_n2] o.a.s.u.UpdateLog Initializing UpdateLog: dataDir=null defaultSyncLevel=FLUSH numRecordsToKeep=100 maxNumLogsToKeep=10 numVersionBuckets=65536
   [junit4]   2> 388684 INFO  (qtp1116451475-3749) [n:127.0.0.1:39513_solr c:SearchRateTriggerTest-collection1 s:shard1 r:core_node5 x:SearchRateTriggerTest-collection1_shard1_replica_n2] o.a.s.u.CommitTracker Hard AutoCommit: disabled
   [junit4]   2> 388684 INFO  (qtp1116451475-3749) [n:127.0.0.1:39513_solr c:SearchRateTriggerTest-collection1 s:shard1 r:core_node5 x:SearchRateTriggerTest-collection1_shard1_replica_n2] o.a.s.u.CommitTracker Soft AutoCommit: disabled
   [junit4]   2> 388685 INFO  (qtp1116451475-3749) [n:127.0.0.1:39513_solr c:SearchRateTriggerTest-collection1 s:shard1 r:core_node5 x:SearchRateTriggerTest-collection1_shard1_replica_n2] o.a.s.s.SolrIndexSearcher Opening [Searcher@7b0a4774[SearchRateTriggerTest-collection1_shard1_replica_n2] main]
   [junit4]   2> 388686 INFO  (qtp1116451475-3749) [n:127.0.0.1:39513_solr c:SearchRateTriggerTest-collection1 s:shard1 r:core_node5 x:SearchRateTriggerTest-collection1_shard1_replica_n2] o.a.s.r.ManagedResourceStorage Configured ZooKeeperStorageIO with znodeBase: /configs/conf
   [junit4]   2> 388686 INFO  (qtp1116451475-3749) [n:127.0.0.1:39513_solr c:SearchRateTriggerTest-collection1 s:shard1 r:core_node5 x:SearchRateTriggerTest-collection1_shard1_replica_n2] o.a.s.r.ManagedResourceStorage Loaded null at path _rest_managed.json using ZooKeeperStorageIO:path=/configs/conf
   [junit4]   2> 388687 INFO  (qtp1116451475-3749) [n:127.0.0.1:39513_solr c:SearchRateTriggerTest-collection1 s:shard1 r:core_node5 x:SearchRateTriggerTest-collection1_shard1_replica_n2] o.a.s.h.ReplicationHandler Commits will be reserved for 10000ms.
   [junit4]   2> 388688 INFO  (searcherExecutor-825-thread-1-processing-n:127.0.0.1:39513_solr x:SearchRateTriggerTest-collection1_shard1_replica_n2 c:SearchRateTriggerTest-collection1 s:shard1 r:core_node5) [n:127.0.0.1:39513_solr c:SearchRateTriggerTest-collection1 s:shard1 r:core_node5 x:SearchRateTriggerTest-collection1_shard1_replica_n2] o.a.s.c.SolrCore [SearchRateTriggerTest-collection1_shard1_replica_n2] Registered new searcher Searcher@7b0a4774[SearchRateTriggerTest-collection1_shard1_replica_n2] main{ExitableDirectoryReader(UninvertingDirectoryReader())}
   [junit4]   2> 388688 INFO  (qtp1116451475-3749) [n:127.0.0.1:39513_solr c:SearchRateTriggerTest-collection1 s:shard1 r:core_node5 x:SearchRateTriggerTest-collection1_shard1_replica_n2] o.a.s.u.UpdateLog Could not find max version in index or recent updates, using new clock 1599098742850453504
   [junit4]   2> 388691 INFO  (qtp132276327-3751) [n:127.0.0.1:38057_solr c:SearchRateTriggerTest-collection1 s:shard2 r:core_node8 x:SearchRateTriggerTest-collection1_shard2_replica_n6] o.a.s.u.UpdateHandler Using UpdateLog implementation: org.apache.solr.update.UpdateLog
   [junit4]   2> 388691 INFO  (qtp132276327-3751) [n:127.0.0.1:38057_solr c:SearchRateTriggerTest-collection1 s:shard2 r:core_node8 x:SearchRateTriggerTest-collection1_shard2_replica_n6] o.a.s.u.UpdateLog Initializing UpdateLog: dataDir=null defaultSyncLevel=FLUSH numRecordsToKeep=100 maxNumLogsToKeep=10 numVersionBuckets=65536
   [junit4]   2> 388691 INFO  (qtp1116451475-3749) [n:127.0.0.1:39513_solr c:SearchRateTriggerTest-collection1 s:shard1 r:core_node5 x:SearchRateTriggerTest-collection1_shard1_replica_n2] o.a.s.c.ZkShardTerms Successful update of terms at /collections/SearchRateTriggerTest-collection1/terms/shard1 to Terms{values={core_node5=0}, version=0}
   [junit4]   2> 388693 INFO  (qtp132276327-3751) [n:127.0.0.1:38057_solr c:SearchRateTriggerTest-collection1 s:shard2 r:core_node8 x:SearchRateTriggerTest-collection1_shard2_replica_n6] o.a.s.u.CommitTracker Hard AutoCommit: disabled
   [junit4]   2> 388693 INFO  (qtp132276327-3751) [n:127.0.0.1:38057_solr c:SearchRateTriggerTest-collection1 s:shard2 r:core_node8 x:SearchRateTriggerTest-collection1_shard2_replica_n6] o.a.s.u.CommitTracker Soft AutoCommit: disabled
   [junit4]   2> 388693 INFO  (qtp1847238326-3745) [n:127.0.0.1:35277_solr c:SearchRateTriggerTest-collection1 s:shard2 r:core_node7 x:SearchRateTriggerTest-collection1_shard2_replica_n4] o.a.s.u.UpdateHandler Using UpdateLog implementation: org.apache.solr.update.UpdateLog
   [junit4]   2> 388693 INFO  (qtp1847238326-3745) [n:127.0.0.1:35277_solr c:SearchRateTriggerTest-collection1 s:shard2 r:core_node7 x:SearchRateTriggerTest-collection1_shard2_replica_n4] o.a.s.u.UpdateLog Initializing UpdateLog: dataDir=null defaultSyncLevel=FLUSH numRecordsToKeep=100 maxNumLogsToKeep=10 numVersionBuckets=65536
   [junit4]   2> 388693 INFO  (qtp1116451475-3749) [n:127.0.0.1:39513_solr c:SearchRateTriggerTest-collection1 s:shard1 r:core_node5 x:SearchRateTriggerTest-collection1_shard1_replica_n2] o.a.s.c.ShardLeaderElectionContext Waiting until we see more replicas up for shard shard1: total=2 found=1 timeoutin=9999ms
   [junit4]   2> 388694 INFO  (qtp132276327-3751) [n:127.0.0.1:38057_solr c:SearchRateTriggerTest-collection1 s:shard2 r:core_node8 x:SearchRateTriggerTest-collection1_shard2_replica_n6] o.a.s.s.SolrIndexSearcher Opening [Searcher@5b3dc51b[SearchRateTriggerTest-collection1_shard2_replica_n6] main]
   [junit4]   2> 388694 INFO  (qtp1847238326-3745) [n:127.0.0.1:35277_solr c:SearchRateTriggerTest-collection1 s:shard2 r:core_node7 x:SearchRateTriggerTest-collection1_shard2_replica_n4] o.a.s.u.CommitTracker Hard AutoCommit: disabled
   [junit4]   2> 388694 INFO  (qtp1847238326-3745) [n:127.0.0.1:35277_solr c:SearchRateTriggerTest-collection1 s:shard2 r:core_node7 x:SearchRateTriggerTest-collection1_shard2_replica_n4] o.a.s.u.CommitTracker Soft AutoCommit: disabled
   [junit4]   2> 388695 INFO  (qtp132276327-3751) [n:127.0.0.1:38057_solr c:SearchRateTriggerTest-collection1 s:shard2 r:core_node8 x:SearchRateTriggerTest-collection1_shard2_replica_n6] o.a.s.r.ManagedResourceStorage Configured ZooKeeperStorageIO with znodeBase: /configs/conf
   [junit4]   2> 388695 INFO  (qtp132276327-3751) [n:127.0.0.1:38057_solr c:SearchRateTriggerTest-collection1 s:shard2 r:core_node8 x:SearchRateTriggerTest-collection1_shard2_replica_n6] o.a.s.r.ManagedResourceStorage Loaded null at path _rest_managed.json using ZooKeeperStorageIO:path=/configs/conf
   [junit4]   2> 388695 INFO  (qtp1847238326-3745) [n:127.0.0.1:35277_solr c:SearchRateTriggerTest-collection1 s:shard2 r:core_node7 x:SearchRateTriggerTest-collection1_shard2_replica_n4] o.a.s.s.SolrIndexSearcher Opening [Searcher@8a3d989[SearchRateTriggerTest-collection1_shard2_replica_n4] main]
   [junit4]   2> 388696 INFO  (qtp1847238326-3745) [n:127.0.0.1:35277_solr c:SearchRateTriggerTest-collection1 s:shard2 r:core_node7 x:SearchRateTriggerTest-collection1_shard2_replica_n4] o.a.s.r.ManagedResourceStorage Configured ZooKeeperStorageIO with znodeBase: /configs/conf
   [junit4]   2> 388696 INFO  (qtp132276327-3751) [n:127.0.0.1:38057_solr c:SearchRateTriggerTest-collection1 s:shard2 r:core_node8 x:SearchRateTriggerTest-collection1_shard2_replica_n6] o.a.s.h.ReplicationHandler Commits will be reserved for 10000ms.
   [junit4]   2> 388696 INFO  (qtp132276327-3751) [n:127.0.0.1:38057_solr c:SearchRateTriggerTest-collection1 s:shard2 r:core_node8 x:SearchRateTriggerTest-collection1_shard2_replica_n6] o.a.s.u.UpdateLog Could not find max version in index or recent updates, using new clock 1599098742858842112
   [junit4]   2> 388696 INFO  (qtp1847238326-3745) [n:127.0.0.1:35277_solr c:SearchRateTriggerTest-collection1 s:shard2 r:core_node7 x:SearchRateTriggerTest-collection1_shard2_replica_n4] o.a.s.r.ManagedResourceStorage Loaded null at path _rest_managed.json using ZooKeeperStorageIO:path=/configs/conf
   [junit4]   2> 388696 INFO  (qtp1847238326-3745) [n:127.0.0.1:35277_solr c:SearchRateTriggerTest-collection1 s:shard2 r:core_node7 x:SearchRateTriggerTest-collection1_shard2_replica_n4] o.a.s.h.ReplicationHandler Commits will be reserved for 10000ms.
   [junit4]   2> 388697 INFO  (searcherExecutor-827-thread-1-processing-n:127.0.0.1:38057_solr x:SearchRateTriggerTest-collection1_shard2_replica_n6 c:SearchRateTriggerTest-collection1 s:shard2 r:core_node8) [n:127.0.0.1:38057_solr c:SearchRateTriggerTest-collection1 s:shard2 r:core_node8 x:SearchRateTriggerTest-collection1_shard2_replica_n6] o.a.s.c.SolrCore [SearchRateTriggerTest-collection1_shard2_replica_n6] Registered new searcher Searcher@5b3dc51b[SearchRateTriggerTest-collection1_shard2_replica_n6] main{ExitableDirectoryReader(UninvertingDirectoryReader())}
   [junit4]   2> 388697 INFO  (searcherExecutor-828-thread-1-processing-n:127.0.0.1:35277_solr x:SearchRateTriggerTest-collection1_shard2_replica_n4 c:SearchRateTriggerTest-collection1 s:shard2 r:core_node7) [n:127.0.0.1:35277_solr c:SearchRateTriggerTest-collection1 s:shard2 r:core_node7 x:SearchRateTriggerTest-collection1_shard2_replica_n4] o.a.s.c.SolrCore [SearchRateTriggerTest-collection1_shard2_replica_n4] Registered new searcher Searcher@8a3d989[SearchRateTriggerTest-collection1_shard2_replica_n4] main{ExitableDirectoryReader(UninvertingDirectoryReader())}
   [junit4]   2> 388697 INFO  (qtp1847238326-3745) [n:127.0.0.1:35277_solr c:SearchRateTriggerTest-collection1 s:shard2 r:core_node7 x:SearchRateTriggerTest-collection1_shard2_replica_n4] o.a.s.u.UpdateLog Could not find max version in index or recent updates, using new clock 1599098742859890688
   [junit4]   2> 388699 INFO  (qtp872535104-3753) [n:127.0.0.1:46233_solr c:SearchRateTriggerTest-collection1 s:shard1 r:core_node3 x:SearchRateTriggerTest-collection1_shard1_replica_n1] o.a.s.u.UpdateHandler Using UpdateLog implementation: org.apache.solr.update.UpdateLog
   [junit4]   2> 388699 INFO  (qtp872535104-3753) [n:127.0.0.1:46233_solr c:SearchRateTriggerTest-collection1 s:shard1 r:core_node3 x:SearchRateTriggerTest-collection1_shard1_replica_n1] o.a.s.u.UpdateLog Initializing UpdateLog: dataDir=null defaultSyncLevel=FLUSH numRecordsToKeep=100 maxNumLogsToKeep=10 numVersionBuckets=65536
   [junit4]   2> 388700 INFO  (qtp132276327-3751) [n:127.0.0.1:38057_solr c:SearchRateTriggerTest-collection1 s:shard2 r:core_node8 x:SearchRateTriggerTest-collection1_shard2_replica_n6] o.a.s.c.ZkShardTerms Successful update of terms at /collections/SearchRateTriggerTest-collection1/terms/shard2 to Terms{values={core_node8=0}, version=0}
   [junit4]   2> 388700 INFO  (qtp872535104-3753) [n:127.0.0.1:46233_solr c:SearchRateTriggerTest-collection1 s:shard1 r:core_node3 x:SearchRateTriggerTest-collection1_shard1_replica_n1] o.a.s.u.CommitTracker Hard AutoCommit: disabled
   [junit4]   2> 388700 INFO  (qtp872535104-3753) [n:127.0.0.1:46233_solr c:SearchRateTriggerTest-collection1 s:shard1 r:core_node3 x:SearchRateTriggerTest-collection1_shard1_replica_n1] o.a.s.u.CommitTracker Soft AutoCommit: disabled
   [junit4]   2> 388701 INFO  (qtp872535104-3753) [n:127.0.0.1:46233_solr c:SearchRateTriggerTest-collection1 s:shard1 r:core_node3 x:SearchRateTriggerTest-collection1_shard1_replica_n1] o.a.s.s.SolrIndexSearcher Opening [Searcher@1bf3d123[SearchRateTriggerTest-collection1_shard1_replica_n1] main]
   [junit4]   2> 388701 INFO  (qtp1847238326-3745) [n:127.0.0.1:35277_solr c:SearchRateTriggerTest-collection1 s:shard2 r:core_node7 x:SearchRateTriggerTest-collection1_shard2_replica_n4] o.a.s.c.ZkShardTerms Successful update of terms at /collections/SearchRateTriggerTest-collection1/terms/shard2 to Terms{values={core_node7=0, core_node8=0}, version=1}
   [junit4]   2> 388702 INFO  (qtp872535104-3753) [n:127.0.0.1:46233_solr c:SearchRateTriggerTest-collection1 s:shard1 r:core_node3 x:SearchRateTriggerTest-collection1_shard1_replica_n1] o.a.s.r.ManagedResourceStorage Configured ZooKeeperStorageIO with znodeBase: /configs/conf
   [junit4]   2> 388702 INFO  (qtp872535104-3753) [n:127.0.0.1:46233_solr c:SearchRateTriggerTest-collection1 s:shard1 r:core_node3 x:SearchRateTriggerTest-collection1_shard1_replica_n1] o.a.s.r.ManagedResourceStorage Loaded null at path _rest_managed.json using ZooKeeperStorageIO:path=/configs/conf
   [junit4]   2> 388703 INFO  (qtp872535104-3753) [n:127.0.0.1:46233_solr c:SearchRateTriggerTest-collection1 s:shard1 r:core_node3 x:SearchRateTriggerTest-collection1_shard1_replica_n1] o.a.s.h.ReplicationHandler Commits will be reserved for 10000ms.
   [junit4]   2> 388703 INFO  (qtp132276327-3751) [n:127.0.0.1:38057_solr c:SearchRateTriggerTest-collection1 s:shard2 r:core_node8 x:SearchRateTriggerTest-collection1_shard2_replica_n6] o.a.s.c.ShardLeaderElectionContext Enough replicas found to continue.
   [junit4]   2> 388703 INFO  (qtp132276327-3751) [n:127.0.0.1:38057_solr c:SearchRateTriggerTest-collection1 s:shard2 r:core_node8 x:SearchRateTriggerTest-collection1_shard2_replica_n6] o.a.s.c.ShardLeaderElectionContext I may be the new leader - try and sync
   [junit4]   2> 388703 INFO  (qtp132276327-3751) [n:127.0.0.1:38057_solr c:SearchRateTriggerTest-collection1 s:shard2 r:core_node8 x:SearchRateTriggerTest-collection1_shard2_replica_n6] o.a.s.c.SyncStrategy Sync replicas to https://127.0.0.1:38057/solr/SearchRateTriggerTest-collection1_shard2_replica_n6/
   [junit4]   2> 388703 INFO  (qtp872535104-3753) [n:127.0.0.1:46233_solr c:SearchRateTriggerTest-collection1 s:shard1 r:core_node3 x:SearchRateTriggerTest-collection1_shard1_replica_n1] o.a.s.u.UpdateLog Could not find max version in index or recent updates, using new clock 1599098742866182144
   [junit4]   2> 388703 INFO  (qtp132276327-3751) [n:127.0.0.1:38057_solr c:SearchRateTriggerTest-collection1 s:shard2 r:core_node8 x:SearchRateTriggerTest-collection1_shard2_replica_n6] o.a.s.u.PeerSync PeerSync: core=SearchRateTriggerTest-collection1_shard2_replica_n6 url=https://127.0.0.1:38057/solr START replicas=[https://127.0.0.1:35277/solr/SearchRateTriggerTest-collection1_shard2_replica_n4/] nUpdates=100
   [junit4]   2> 388707 INFO  (searcherExecutor-826-thread-1-processing-n:127.0.0.1:46233_solr x:SearchRateTriggerTest-collection1_shard1_replica_n1 c:SearchRateTriggerTest-collection1 s:shard1 r:core_node3) [n:127.0.0.1:46233_solr c:SearchRateTriggerTest-collection1 s:shard1 r:core_node3 x:SearchRateTriggerTest-collection1_shard1_replica_n1] o.a.s.c.SolrCore [SearchRateTriggerTest-collection1_shard1_replica_n1] Registered new searcher Searcher@1bf3d123[SearchRateTriggerTest-collection1_shard1_replica_n1] main{ExitableDirectoryReader(UninvertingDirectoryReader())}
   [junit4]   2> 388715 INFO  (qtp872535104-3753) [n:127.0.0.1:46233_solr c:SearchRateTriggerTest-collection1 s:shard1 r:core_node3 x:SearchRateTriggerTest-collection1_shard1_replica_n1] o.a.s.c.ZkShardTerms Successful update of terms at /collections/SearchRateTriggerTest-collection1/terms/shard1 to Terms{values={core_node3=0, core_node5=0}, version=1}
   [junit4]   2> 388715 INFO  (qtp1847238326-3879) [n:127.0.0.1:35277_solr c:SearchRateTriggerTest-collection1 s:shard2 r:core_node7 x:SearchRateTriggerTest-collection1_shard2_replica_n4] o.a.s.c.S.Request [SearchRateTriggerTest-collection1_shard2_replica_n4]  webapp=/solr path=/get params={distrib=false&qt=/get&fingerprint=false&getVersions=100&wt=javabin&version=2} status=0 QTime=1
   [junit4]   2> 389003 INFO  (qtp132276327-3751) [n:127.0.0.1:38057_solr c:SearchRateTriggerTest-collection1 s:shard2 r:core_node8 x:SearchRateTriggerTest-collection1_shard2_replica_n6] o.a.s.u.PeerSync PeerSync: core=SearchRateTriggerTest-collection1_shard2_replica_n6 url=https://127.0.0.1:38057/solr DONE.  We have no versions.  sync failed.
   [junit4]   2> 389003 INFO  (qtp132276327-3751) [n:127.0.0.1:38057_solr c:SearchRateTriggerTest-collection1 s:shard2 r:core_node8 x:SearchRateTriggerTest-collection1_shard2_replica_n6] o.a.s.c.SyncStrategy Leader's attempt to sync with shard failed, moving to the next candidate
   [junit4]   2> 389003 INFO  (qtp132276327-3751) [n:127.0.0.1:38057_solr c:SearchRateTriggerTest-collection1 s:shard2 r:core_node8 x:SearchRateTriggerTest-collection1_shard2_replica_n6] o.a.s.c.ShardLeaderElectionContext We failed sync, but we have no versions - we can't sync in that case - we were active before, so become leader anyway
   [junit4]   2> 389003 INFO  (qtp132276327-3751) [n:127.0.0.1:38057_solr c:SearchRateTriggerTest-collection1 s:shard2 r:core_node8 x:SearchRateTriggerTest-collection1_shard2_replica_n6] o.a.s.c.ShardLeaderElectionContext Found all replicas participating in election, clear LIR
   [junit4]   2> 389006 INFO  (qtp132276327-3751) [n:127.0.0.1:38057_solr c:SearchRateTriggerTest-collection1 s:shard2 r:core_node8 x:SearchRateTriggerTest-collection1_shard2_replica_n6] o.a.s.c.ShardLeaderElectionContext I am the new leader: https://127.0.0.1:38057/solr/SearchRateTriggerTest-collection1_shard2_replica_n6/ shard2
   [junit4]   2> 389158 INFO  (qtp132276327-3751) [n:127.0.0.1:38057_solr c:SearchRateTriggerTest-collection1 s:shard2 r:core_node8 x:SearchRateTriggerTest-collection1_shard2_replica_n6] o.a.s.c.ZkController I am the leader, no recovery necessary
   [junit4]   2> 389161 INFO  (qtp132276327-3751) [n:127.0.0.1:38057_solr c:SearchRateTriggerTest-collection1 s:shard2 r:core_node8 x:SearchRateTriggerTest-collection1_shard2_replica_n6] o.a.s.s.HttpSolrCall [admin] webapp=null path=/admin/cores params={qt=/admin/cores&coreNodeName=core_node8&collection.configName=conf&newCollection=true&name=SearchRateTriggerTest-collection1_shard2_replica_n6&action=CREATE&numShards=2&collection=SearchRateTriggerTest-collection1&shard=shard2&wt=javabin&version=2&replicaType=NRT} status=0 QTime=1543
   [junit4]   2> 389194 INFO  (qtp1116451475-3749) [n:127.0.0.1:39513_solr c:SearchRateTriggerTest-collection1 s:shard1 r:core_node5 x:SearchRateTriggerTest-collection1_shard1_replica_n2] o.a.s.c.ShardLeaderElectionContext Enough replicas found to continue.
   [junit4]   2> 389194 INFO  (qtp1116451475-3749) [n:127.0.0.1:39513_solr c:SearchRateTriggerTest-collection1 s:shard1 r:core_node5 x:SearchRateTriggerTest-collection1_shard1_replica_n2] o.a.s.c.ShardLeaderElectionContext I may be the new leader - try and sync
   [junit4]   2> 389194 INFO  (qtp1116451475-3749) [n:127.0.0.1:39513_solr c:SearchRateTriggerTest-collection1 s:shard1 r:core_node5 x:SearchRateTriggerTest-collection1_shard1_replica_n2] o.a.s.c.SyncStrategy Sync replicas to https://127.0.0.1:39513/solr/SearchRateTriggerTest-collection1_shard1_replica_n2/
   [junit4]   2> 389195 INFO  (qtp1116451475-3749) [n:127.0.0.1:39513_solr c:SearchRateTriggerTest-collection1 s:shard1 r:core_node5 x:SearchRateTriggerTest-collection1_shard1_replica_n2] o.a.s.u.PeerSync PeerSync: core=SearchRateTriggerTest-collection1_shard1_replica_n2 url=https://127.0.0.1:39513/solr START replicas=[https://127.0.0.1:46233/solr/SearchRateTriggerTest-collection1_shard1_replica_n1/] nUpdates=100
   [junit4]   2> 389198 INFO  (qtp872535104-3756) [n:127.0.0.1:46233_solr c:SearchRateTriggerTest-collection1 s:shard1 r:core_node3 x:SearchRateTriggerTest-collection1_shard1_replica_n1] o.a.s.c.S.Request [SearchRateTriggerTest-collection1_shard1_replica_n1]  webapp=/solr path=/get params={distrib=false&qt=/get&fingerprint=false&getVersions=100&wt=javabin&version=2} status=0 QTime=0
   [junit4]   2> 389261 INFO  (zkCallback-719-thread-2) [    ] o.a.s.c.c.ZkStateReader A cluster state change: [WatchedEvent state:SyncConnected type:NodeDataChanged path:/collections/SearchRateTriggerTest-collection1/state.json] for collection [SearchRateTriggerTest-collection1] has occurred - updating... (live nodes size: [4])
   [junit4]   2> 389495 INFO  (qtp1116451475-3749) [n:127.0.0.1:39513_solr c:SearchRateTriggerTest-collection1 s:shard1 r:core_node5 x:SearchRateTriggerTest-collection1_shard1_replica_n2] o.a.s.u.PeerSync PeerSync: core=SearchRateTriggerTest-collection1_shard1_replica_n2 url=https://127.0.0.1:39513/solr DONE.  We have no versions.  sync failed.
   [junit4]   2> 389495 INFO  (qtp1116451475-3749) [n:127.0.0.1:39513_solr c:SearchRateTriggerTest-collection1 s:shard1 r:core_node5 x:SearchRateTriggerTest-collection1_shard1_replica_n2] o.a.s.c.SyncStrategy Leader's attempt to sync with shard failed, moving to the next candidate
   [junit4]   2> 389495 INFO  (qtp1116451475-3749) [n:127.0.0.1:39513_solr c:SearchRateTriggerTest-collection1 s:shard1 r:core_node5 x:SearchRateTriggerTest-collection1_shard1_replica_n2] o.a.s.c.ShardLeaderElectionContext We failed sync, but we have no versions - we can't sync in that case - we were active before, so become leader anyway
   [junit4]   2> 389495 INFO  (qtp1116451475-3749) [n:127.0.0.1:39513_solr c:SearchRateTriggerTest-collection1 s:shard1 r:core_node5 x:SearchRateTriggerTest-collection1_shard1_replica_n2] o.a.s.c.ShardLeaderElectionContext Found all replicas participating in election, clear LIR
   [junit4]   2> 389498 INFO  (qtp1116451475-3749) [n:127.0.0.1:39513_solr c:SearchRateTriggerTest-collection1 s:shard1 r:core_node5 x:SearchRateTriggerTest-collection1_shard1_replica_n2] o.a.s.c.ShardLeaderElectionContext I am the new leader: https://127.0.0.1:39513/solr/SearchRateTriggerTest-collection1_shard1_replica_n2/ shard1
   [junit4]   2> 389600 INFO  (zkCallback-719-thread-2) [    ] o.a.s.c.c.ZkStateReader A cluster state change: [WatchedEvent state:SyncConnected type:NodeDataChanged path:/collections/SearchRateTriggerTest-collection1/state.json] for collection [SearchRateTriggerTest-collection1] has occurred - updating... (live nodes size: [4])
   [junit4]   2> 389650 INFO  (qtp1116451475-3749) [n:127.0.0.1:39513_solr c:SearchRateTriggerTest-collection1 s:shard1 r:core_node5 x:SearchRateTriggerTest-collection1_shard1_replica_n2] o.a.s.c.ZkController I am the leader, no recovery necessary
   [junit4]   2> 389652 INFO  (qtp1116451475-3749) [n:127.0.0.1:39513_solr c:SearchRateTriggerTest-collection1 s:shard1 r:core_node5 x:SearchRateTriggerTest-collection1_shard1_replica_n2] o.a.s.s.HttpSolrCall [admin] webapp=null path=/admin/cores params={qt=/admin/cores&coreNodeName=core_node5&collection.configName=conf&newCollection=true&name=SearchRateTriggerTest-collection1_shard1_replica_n2&action=CREATE&numShards=2&collection=SearchRateTriggerTest-collection1&shard=shard1&wt=javabin&version=2&replicaType=NRT} status=0 QTime=2047
   [junit4]   2> 389706 INFO  (qtp1847238326-3745) [n:127.0.0.1:35277_solr c:SearchRateTriggerTest-collection1 s:shard2 r:core_node7 x:SearchRateTriggerTest-collection1_shard2_replica_n4] o.a.s.s.HttpSolrCall [admin] webapp=null path=/admin/cores params={qt=/admin/cores&coreNodeName=core_node7&collection.configName=conf&newCollection=true&name=SearchRateTriggerTest-collection1_shard2_replica_n4&action=CREATE&numShards=2&collection=SearchRateTriggerTest-collection1&shard=shard2&wt=javabin&version=2&replicaType=NRT} status=0 QTime=2084
   [junit4]   2> 389719 INFO  (qtp872535104-3753) [n:127.0.0.1:46233_solr c:SearchRateTriggerTest-collection1 s:shard1 r:core_node3 x:SearchRateTriggerTest-collection1_shard1_replica_n1] o.a.s.s.HttpSolrCall [admin] webapp=null path=/admin/cores params={qt=/admin/cores&coreNodeName=core_node3&collection.configName=conf&newCollection=true&name=SearchRateTriggerTest-collection1_shard1_replica_n1&action=CREATE&numShards=2&collection=SearchRateTriggerTest-collection1&shard=shard1&wt=javabin&version=2&replicaType=NRT} status=0 QTime=2101
   [junit4]   2> 389721 INFO  (qtp1116451475-3747) [n:127.0.0.1:39513_solr    ] o.a.s.h.a.CollectionsHandler Wait for new collection to be active for at most 30 seconds. Check all shard replicas
   [junit4]   2> 389818 INFO  (zkCallback-719-thread-2) [    ] o.a.s.c.c.ZkStateReader A cluster state change: [WatchedEvent state:SyncConnected type:NodeDataChanged path:/collections/SearchRateTriggerTest-collection1/state.json] for collection [SearchRateTriggerTest-collection1] has occurred - updating... (live nodes size: [4])
   [junit4]   2> 389818 INFO  (zkCallback-722-thread-1) [    ] o.a.s.c.c.ZkStateReader A cluster state change: [WatchedEvent state:SyncConnected type:NodeDataChanged path:/collections/SearchRateTriggerTest-collection1/state.json] for collection [SearchRateTriggerTest-collection1] has occurred - updating... (live nodes size: [4])
   [junit4]   2> 389818 INFO  (zkCallback-725-thread-1) [    ] o.a.s.c.c.ZkStateReader A cluster state change: [WatchedEvent state:SyncConnected type:NodeDataChanged path:/collections/SearchRateTriggerTest-collection1/state.json] for collection [SearchRateTriggerTest-collection1] has occurred - updating... (live nodes size: [4])
   [junit4]   2> 389818 INFO  (zkCallback-721-thread-1) [    ] o.a.s.c.c.ZkStateReader A cluster state change: [WatchedEvent state:SyncConnected type:NodeDataChanged path:/collections/SearchRateTriggerTest-collection1/state.json] for collection [SearchRateTriggerTest-collection1] has occurred - updating... (live nodes size: [4])
   [junit4]   2> 390721 INFO  (qtp1116451475-3747) [n:127.0.0.1:39513_solr    ] o.a.s.s.HttpSolrCall [admin] webapp=null path=/admin/collections params={replicationFactor=2&collection.configName=conf&maxShardsPerNode=1&name=SearchRateTriggerTest-collection1&nrtReplicas=2&action=CREATE&numShards=2&wt=javabin&version=2} status=0 QTime=3429
   [junit4]   2> 390722 INFO  (qtp1116451475-3754) [n:127.0.0.1:39513_solr    ] o.a.s.h.a.CollectionsHandler Invoked Collection Action :create with params replicationFactor=2&collection.configName=conf&maxShardsPerNode=1&name=SearchRateTriggerTest-collection2&nrtReplicas=2&action=CREATE&numShards=2&wt=javabin&version=2 and sendToOCPQueue=true
   [junit4]   2> 390723 INFO  (OverseerThreadFactory-816-thread-2) [    ] o.a.s.c.a.c.CreateCollectionCmd Create collection SearchRateTriggerTest-collection2
   [junit4]   2> 390723 INFO  (OverseerCollectionConfigSetProcessor-72076297457106955-127.0.0.1:35277_solr-n_0000000000) [    ] o.a.s.c.OverseerTaskQueue Response ZK path: /overseer/collection-queue-work/qnr-0000000000 doesn't exist.  Requestor may have disconnected from ZooKeeper
   [junit4]   2> 390928 INFO  (OverseerStateUpdate-72076297457106955-127.0.0.1:35277_solr-n_0000000000) [    ] o.a.s.c.o.SliceMutator createReplica() {
   [junit4]   2>   "operation":"ADDREPLICA",
   [junit4]   2>   "collection":"SearchRateTriggerTest-collection2",
   [junit4]   2>   "shard":"shard1",
   [junit4]   2>   "core":"SearchRateTriggerTest-collection2_shard1_replica_n1",
   [junit4]   2>   "state":"down",
   [junit4]   2>   "base_url":"https://127.0.0.1:38057/solr",
   [junit4]   2>   "type":"NRT",
   [junit4]   2>   "waitForFinalState":"false"} 
   [junit4]   2> 390929 INFO  (OverseerStateUpdate-72076297457106955-127.0.0.1:35277_solr-n_0000000000) [    ] o.a.s.c.o.SliceMutator createReplica() {
   [junit4]   2>   "operation":"ADDREPLICA",
   [junit4]   2>   "collection":"SearchRateTriggerTest-collection2",
   [junit4]   2>   "shard":"shard1",
   [junit4]   2>   "core":"SearchRateTriggerTest-collection2_shard1_replica_n2",
   [junit4]   2>   "state":"down",
   [junit4]   2>   "base_url":"https://127.0.0.1:35277/solr",
   [junit4]   2>   "type":"NRT",
   [junit4]   2>   "waitForFinalState":"false"} 
   [junit4]   2> 390930 INFO  (OverseerStateUpdate-72076297457106955-127.0.0.1:35277_solr-n_0000000000) [    ] o.a.s.c.o.SliceMutator createReplica() {
   [junit4]   2>   "operation":"ADDREPLICA",
   [junit4]   2>   "collection":"SearchRateTriggerTest-collection2",
   [junit4]   2>   "shard":"shard2",
   [junit4]   2>   "core":"SearchRateTriggerTest-collection2_shard2_replica_n4",
   [junit4]   2>   "state":"down",
   [junit4]   2>   "base_url":"https://127.0.0.1:46233/solr",
   [junit4]   2>   "type":"NRT",
   [junit4]   2>   "waitForFinalState":"false"} 
   [junit4]   2> 390931 INFO  (OverseerStateUpdate-72076297457106955-127.0.0.1:35277_solr-n_0000000000) [    ] o.a.s.c.o.SliceMutator createReplica() {
   [junit4]   2>   "operation":"ADDREPLICA",
   [junit4]   2>   "collection":"SearchRateTriggerTest-collection2",
   [junit4]   2>   "shard":"shard2",
   [junit4]   2>   "core":"SearchRateTriggerTest-collection2_shard2_replica_n6",
   [junit4]   2>   "state":"down",
   [junit4]   2>   "base_url":"https://127.0.0.1:39513/solr",
   [junit4]   2>   "type":"NRT",
   [junit4]   2>   "waitForFinalState":"false"} 
   [junit4]   2> 391134 INFO  (qtp1116451475-3730) [n:127.0.0.1:39513_solr    ] o.a.s.h.a.CoreAdminOperation core create command qt=/admin/cores&coreNodeName=core_node8&collection.configName=conf&newCollection=true&name=SearchRateTriggerTest-collection2_shard2_replica_n6&action=CREATE&numShards=2&collection=SearchRateTriggerTest-collection2&shard=shard2&wt=javabin&version=2&replicaType=NRT
   [junit4]   2> 391134 INFO  (qtp1847238326-3752) [n:127.0.0.1:35277_solr    ] o.a.s.h.a.CoreAdminOperation core create command qt=/admin/cores&coreNodeName=core_node5&collection.configName=conf&newCollection=true&name=SearchRateTriggerTest-collection2_shard1_replica_n2&action=CREATE&numShards=2&collection=SearchRateTriggerTest-collection2&shard=shard1&wt=javabin&version=2&replicaType=NRT
   [junit4]   2> 391134 INFO  (qtp132276327-3740) [n:127.0.0.1:38057_solr    ] o.a.s.h.a.CoreAdminOperation core create command qt=/admin/cores&coreNodeName=core_node3&collection.configName=conf&newCollection=true&name=SearchRateTriggerTest-collection2_shard1_replica_n1&action=CREATE&numShards=2&collection=SearchRateTriggerTest-collection2&shard=shard1&wt=javabin&version=2&replicaType=NRT
   [junit4]   2> 391134 INFO  (qtp872535104-3759) [n:127.0.0.1:46233_solr    ] o.a.s.h.a.CoreAdminOperation core create command qt=/admin/cores&coreNodeName=core_node7&collection.configName=conf&newCollection=true&name=SearchRateTriggerTest-collection2_shard2_replica_n4&action=CREATE&numShards=2&collection=SearchRateTriggerTest-collection2&shard=shard2&wt=javabin&version=2&replicaType=NRT
   [junit4]   2> 392141 INFO  (qtp872535104-3759) [n:127.0.0.1:46233_solr c:SearchRateTriggerTest-collection2 s:shard2 r:core_node7 x:SearchRateTriggerTest-collection2_shard2_replica_n4] o.a.s.c.SolrConfig Using Lucene MatchVersion: 7.4.0
   [junit4]   2> 392141 INFO  (qtp1116451475-3730) [n:127.0.0.1:39513_solr c:SearchRateTriggerTest-collection2 s:shard2 r:core_node8 x:SearchRateTriggerTest-collection2_shard2_replica_n6] o.a.s.c.SolrConfig Using Lucene MatchVersion: 7.4.0
   [junit4]   2> 392141 INFO  (qtp132276327-3740) [n:127.0.0.1:38057_solr c:SearchRateTriggerTest-collection2 s:shard1 r:core_node3 x:SearchRateTriggerTest-collection2_shard1_replica_n1] o.a.s.c.SolrConfig Using Lucene MatchVersion: 7.4.0
   [junit4]   2> 392141 INFO  (qtp1847238326-3752) [n:127.0.0.1:35277_solr c:SearchRateTriggerTest-collection2 s:shard1 r:core_node5 x:SearchRateTriggerTest-collection2_shard1_replica_n2] o.a.s.c.SolrConfig Using Lucene MatchVersion: 7.4.0
   [junit4]   2> 392146 INFO  (qtp872535104-3759) [n:127.0.0.1:46233_solr c:SearchRateTriggerTest-collection2 s:shard2 r:core_node7 x:SearchRateTriggerTest-collection2_shard2_replica_n4] o.a.s.s.IndexSchema [SearchRateTriggerTest-collection2_shard2_replica_n4] Schema name=minimal
   [junit4]   2> 392146 INFO  (qtp1116451475-3730) [n:127.0.0.1:39513_solr c:SearchRateTriggerTest-collection2 s:shard2 r:core_node8 x:SearchRateTriggerTest-collection2_shard2_replica_n6] o.a.s.s.IndexSchema [SearchRateTriggerTest-collection2_shard2_replica_n6] Schema name=minimal
   [junit4]   2> 392147 INFO  (qtp132276327-3740) [n:127.0.0.1:38057_solr c:SearchRateTriggerTest-collection2 s:shard1 r:core_node3 x:SearchRateTriggerTest-collection2_shard1_replica_n1] o.a.s.s.IndexSchema [SearchRateTriggerTest-collection2_shard1_replica_n1] Schema name=minimal
   [junit4]   2> 392147 INFO  (qtp1847238326-3752) [n:127.0.0.1:35277_solr c:SearchRateTriggerTest-collection2 s:shard1 r:core_node5 x:SearchRateTriggerTest-collection2_shard1_replica_n2] o.a.s.s.IndexSchema [SearchRateTriggerTest-collection2_shard1_replica_n2] Schema name=minimal
   [junit4]   2> 392147 INFO  (qtp872535104-3759) [n:127.0.0.1:46233_solr c:SearchRateTriggerTest-collection2 s:shard2 r:core_node7 x:SearchRateTriggerTest-collection2_shard2_replica_n4] o.a.s.s.IndexSchema Loaded schema minimal/1.1 with uniqueid field id
   [junit4]   2> 392147 INFO  (qtp872535104-3759) [n:127.0.0.1:46233_solr c:SearchRateTriggerTest-collection2 s:shard2 r:core_node7 x:SearchRateTriggerTest-collection2_shard2_replica_n4] o.a.s.c.CoreContainer Creating SolrCore 'SearchRateTriggerTest-collection2_shard2_replica_n4' using configuration from collection SearchRateTriggerTest-collection2, trusted=true
   [junit4]   2> 392147 INFO  (qtp872535104-3759) [n:127.0.0.1:46233_solr c:SearchRateTriggerTest-collection2 s:shard2 r:core_node7 x:SearchRateTriggerTest-collection2_shard2_replica_n4] o.a.s.m.r.SolrJmxReporter JMX monitoring for 'solr_46233.solr.core.SearchRateTriggerTest-collection2.shard2.replica_n4' (registry 'solr.core.SearchRateTriggerTest-collection2.shard2.replica_n4') enabled at server: com.sun.jmx.mbeanserver.JmxMBeanServer@58623e81
   [junit4]   2> 392148 INFO  (qtp1116451475-3730) [n:127.0.0.1:39513_solr c:SearchRateTriggerTest-collection2 s:shard2 r:core_node8 x:SearchRateTriggerTest-collection2_shard2_replica_n6] o.a.s.s.IndexSchema Loaded schema minimal/1.1 with uniqueid field id
   [junit4]   2> 392148 INFO  (qtp132276327-3740) [n:127.0.0.1:38057_solr c:SearchRateTriggerTest-collection2 s:shard1 r:core_node3 x:SearchRateTriggerTest-collection2_shard1_replica_n1] o.a.s.s.IndexSchema Loaded schema minimal/1.1 with uniqueid field id
   [junit4]   2> 392148 INFO  (qtp1116451475-3730) [n:127.0.0.1:39513_solr c:SearchRateTriggerTest-collection2 s:shard2 r:core_node8 x:SearchRateTriggerTest-collection2_shard2_replica_n6] o.a.s.c.CoreContainer Creating SolrCore 'SearchRateTriggerTest-collection2_shard2_replica_n6' using configuration from collection SearchRateTriggerTest-collection2, trusted=true
   [junit4]   2> 392148 INFO  (qtp132276327-3740) [n:127.0.0.1:38057_solr c:SearchRateTriggerTest-collection2 s:shard1 r:core_node3 x:SearchRateTriggerTest-collection2_shard1_replica_n1] o.a.s.c.CoreContainer Creating SolrCore 'SearchRateTriggerTest-collection2_shard1_replica_n1' using configuration from collection SearchRateTriggerTest-collection2, trusted=true
   [junit4]   2> 392148 INFO  (qtp872535104-3759) [n:127.0.0.1:46233_solr c:SearchRateTriggerTest-collection2 s:shard2 r:core_node7 x:SearchRateTriggerTest-collection2_shard2_replica_n4] o.a.s.c.SolrCore solr.RecoveryStrategy.Builder
   [junit4]   2> 392148 INFO  (qtp872535104-3759) [n:127.0.0.1:46233_solr c:SearchRateTriggerTest-collection2 s:shard2 r:core_node7 x:SearchRateTriggerTest-collection2_shard2_replica_n4] o.a.s.c.SolrCore [[SearchRateTriggerTest-collection2_shard2_replica_n4] ] Opening new SolrCore at [/home/jenkins/workspace/Lucene-Solr-7.x-Linux/solr/build/solr-core/test/J2/temp/solr.cloud.autoscaling.SearchRateTriggerTest_49B7F3F349C3E86E-001/tempDir-001/node3/SearchRateTriggerTest-collection2_shard2_replica_n4], dataDir=[/home/jenkins/workspace/Lucene-Solr-7.x-Linux/solr/build/solr-core/test/J2/temp/solr.cloud.autoscaling.SearchRateTriggerTest_49B7F3F349C3E86E-001/tempDir-001/node3/./SearchRateTriggerTest-collection2_shard2_replica_n4/data/]
   [junit4]   2> 392148 INFO  (qtp132276327-3740) [n:127.0.0.1:38057_solr c:SearchRateTriggerTest-collection2 s:shard1 r:core_node3 x:SearchRateTriggerTest-collection2_shard1_replica_n1] o.a.s.m.r.SolrJmxReporter JMX monitoring for 'solr_38057.solr.core.SearchRateTriggerTest-collection2.shard1.replica_n1' (registry 'solr.core.SearchRateTriggerTest-collection2.shard1.replica_n1') enabled at server: com.sun.jmx.mbeanserver.JmxMBeanServer@58623e81
   [junit4]   2> 392148 INFO  (qtp1116451475-3730) [n:127.0.0.1:39513_solr c:SearchRateTriggerTest-collection2 s:shard2 r:core_node8 x:SearchRateTriggerTest-collection2_shard2_replica_n6] o.a.s.m.r.SolrJmxReporter JMX monitoring for 'solr_39513.solr.core.SearchRateTriggerTest-collection2.shard2.replica_n6' (registry 'solr.core.SearchRateTriggerTest-collection2.shard2.replica_n6') enabled at server: com.sun.jmx.mbeanserver.JmxMBeanServer@58623e81
   [junit4]   2> 392148 INFO  (qtp132276327-3740) [n:127.0.0.1:38057_solr c:SearchRateTriggerTest-collection2 s:shard1 r:core_node3 x:SearchRateTriggerTest-collection2_shard1_replica_n1] o.a.s.c.SolrCore solr.RecoveryStrategy.Builder
   [junit4]   2> 392148 INFO  (qtp1847238326-3752) [n:127.0.0.1:35277_solr c:SearchRateTriggerTest-collection2 s:shard1 r:core_node5 x:SearchRateTriggerTest-collection2_shard1_replica_n2] o.a.s.s.IndexSchema Loaded schema minimal/1.1 with uniqueid field id
   [junit4]   2> 392148 INFO  (qtp1116451475-3730) [n:127.0.0.1:39513_solr c:SearchRateTriggerTest-collection2 s:shard2 r:core_node8 x:SearchRateTriggerTest-collection2_shard2_replica_n6] o.a.s.c.SolrCore solr.RecoveryStrategy.Builder
   [junit4]   2> 392148 INFO  (qtp1847238326-3752) [n:127.0.0.1:35277_solr c:SearchRateTriggerTest-collection2 s:shard1 r:core_node5 x:SearchRateTriggerTest-collection2_shard1_replica_n2] o.a.s.c.CoreContainer Creating SolrCore 'SearchRateTriggerTest-collection2_shard1_replica_n2' using configuration from collection SearchRateTriggerTest-collection2, trusted=true
   [junit4]   2> 392148 INFO  (qtp132276327-3740) [n:127.0.0.1:38057_solr c:SearchRateTriggerTest-collection2 s:shard1 r:core_node3 x:SearchRateTriggerTest-collection2_shard1_replica_n1] o.a.s.c.SolrCore [[SearchRateTriggerTest-collection2_shard1_replica_n1] ] Opening new SolrCore at [/home/jenkins/workspace/Lucene-Solr-7.x-Linux/solr/build/solr-core/test/J2/temp/solr.cloud.autoscaling.SearchRateTriggerTest_49B7F3F349C3E86E-001/tempDir-001/node2/SearchRateTriggerTest-collection2_shard1_replica_n1], dataDir=[/home/jenkins/workspace/Lucene-Solr-7.x-Linux/solr/build/solr-core/test/J2/temp/solr.cloud.autoscaling.SearchRateTriggerTest_49B7F3F349C3E86E-001/tempDir-001/node2/./SearchRateTriggerTest-collection2_shard1_replica_n1/data/]
   [junit4]   2> 392148 INFO  (qtp1116451475-3730) [n:127.0.0.1:39513_solr c:SearchRateTriggerTest-collection2 s:shard2 r:core_node8 x:SearchRateTriggerTest-collection2_shard2_replica_n6] o.a.s.c.SolrCore [[SearchRateTriggerTest-collection2_shard2_replica_n6] ] Opening new SolrCore at [/home/jenkins/workspace/Lucene-Solr-7.x-Linux/solr/build/solr-core/test/J2/temp/solr.cloud.autoscaling.SearchRateTriggerTest_49B7F3F349C3E86E-001/tempDir-001/node1/SearchRateTriggerTest-collection2_shard2_replica_n6], dataDir=[/home/jenkins/workspace/Lucene-Solr-7.x-Linux/solr/build/solr-core/test/J2/temp/solr.cloud.autoscaling.SearchRateTriggerTest_49B7F3F349C3E86E-001/tempDir-001/node1/./SearchRateTriggerTest-collection2_shard2_replica_n6/data/]
   [junit4]   2> 392148 INFO  (qtp1847238326-3752) [n:127.0.0.1:35277_solr c:SearchRateTriggerTest-collection2 s:shard1 r:core_node5 x:SearchRateTriggerTest-collection2_shard1_replica_n2] o.a.s.m.r.SolrJmxReporter JMX monitoring for 'solr_35277.solr.core.SearchRateTriggerTest-collection2.shard1.replica_n2' (registry 'solr.core.SearchRateTriggerTest-collection2.shard1.replica_n2') enabled at server: com.sun.jmx.mbeanserver.JmxMBeanServer@58623e81
   [junit4]   2> 392149 INFO  (qtp1847238326-3752) [n:127.0.0.1:35277_solr c:SearchRateTriggerTest-collection2 s:shard1 r:core_node5 x:SearchRateTriggerTest-collection2_shard1_replica_n2] o.a.s.c.SolrCore solr.RecoveryStrategy.Builder
   [junit4]   2> 392149 INFO  (qtp1847238326-3752) [n:127.0.0.1:35277_solr c:SearchRateTriggerTest-collection2 s:shard1 r:core_node5 x:SearchRateTriggerTest-collection2_shard1_replica_n2] o.a.s.c.SolrCore [[SearchRateTriggerTest-collection2_shard1_replica_n2] ] Opening new SolrCore at [/home/jenkins/workspace/Lucene-Solr-7.x-Linux/solr/build/solr-core/test/J2/temp/solr.cloud.autoscaling.SearchRateTriggerTest_49B7F3F349C3E86E-001/tempDir-001/node4/SearchRateTriggerTest-collection2_shard1_replica_n2], dataDir=[/home/jenkins/workspace/Lucene-Solr-7.x-Linux/solr/build/solr-core/test/J2/temp/solr.cloud.autoscaling.SearchRateTriggerTest_49B7F3F349C3E86E-001/tempDir-001/node4/./SearchRateTriggerTest-collection2_shard1_replica_n2/data/]
   [junit4]   2> 392193 INFO  (qtp872535104-3759) [n:127.0.0.1:46233_solr c:SearchRateTriggerTest-collection2 s:shard2 r:core_node7 x:SearchRateTriggerTest-collection2_shard2_replica_n4] o.a.s.u.UpdateHandler Using UpdateLog implementation: org.apache.solr.update.UpdateLog
   [junit4]   2> 392193 INFO  (qtp872535104-3759) [n:127.0.0.1:46233_solr c:SearchRateTriggerTest-collection2 s:shard2 r:core_node7 x:SearchRateTriggerTest-collection2_shard2_replica_n4] o.a.s.u.UpdateLog Initializing UpdateLog: dataDir=null defaultSyncLevel=FLUSH numRecordsToKeep=100 maxNumLogsToKeep=10 numVersionBuckets=65536
   [junit4]   2> 392194 INFO  (qtp872535104-3759) [n:127.0.0.1:46233_solr c:SearchRateTriggerTest-collection2 s:shard2 r:core_node7 x:SearchRateTriggerTest-collection2_shard2_replica_n4] o.a.s.u.CommitTracker Hard AutoCommit: disabled
   [junit4]   2> 392194 INFO  (qtp872535104-3759) [n:127.0.0.1:46233_solr c:SearchRateTriggerTest-collection2 s:shard2 r:core_node7 x:SearchRateTriggerTest-collection2_shard2_replica_n4] o.a.s.u.CommitTracker Soft AutoCommit: disabled
   [junit4]   2> 392195 INFO  (qtp872535104-3759) [n:127.0.0.1:46233_solr c:SearchRateTriggerTest-collection2 s:shard2 r:core_node7 x:SearchRateTriggerTest-collection2_shard2_replica_n4] o.a.s.s.SolrInd

[...truncated too long message...]

   [junit4]   2> 137901 INFO  (zkCallback-127-thread-2) [    ] o.a.s.c.c.ZkStateReader Updated live nodes from ZooKeeper... (3) -> (2)
   [junit4]   2> 137901 INFO  (zkCallback-125-thread-1) [    ] o.a.s.c.c.ZkStateReader Updated live nodes from ZooKeeper... (3) -> (2)
   [junit4]   2> 137901 INFO  (zkCallback-155-thread-1) [    ] o.a.s.c.c.ZkStateReader Updated live nodes from ZooKeeper... (3) -> (2)
   [junit4]   2> 137901 INFO  (zkCallback-131-thread-2) [    ] o.a.s.c.c.ZkStateReader Updated live nodes from ZooKeeper... (3) -> (2)
   [junit4]   2> 137900 INFO  (zkCallback-136-thread-1) [    ] o.a.s.c.c.ZkStateReader Updated live nodes from ZooKeeper... (3) -> (2)
   [junit4]   2> 137900 INFO  (zkCallback-109-thread-2) [    ] o.a.s.c.c.ZkStateReader Updated live nodes from ZooKeeper... (3) -> (2)
   [junit4]   2> 137900 INFO  (zkCallback-150-thread-1) [    ] o.a.s.c.c.ZkStateReader Updated live nodes from ZooKeeper... (3) -> (2)
   [junit4]   2> 137906 INFO  (jetty-closer-94-thread-3) [    ] o.a.s.m.SolrMetricManager Closing metric reporters for registry=solr.cluster, tag=null
   [junit4]   2> 137910 INFO  (zkCallback-155-thread-1) [    ] o.a.s.c.c.ZkStateReader Updated live nodes from ZooKeeper... (2) -> (1)
   [junit4]   2> 137910 INFO  (zkCallback-125-thread-1) [    ] o.a.s.c.c.ZkStateReader Updated live nodes from ZooKeeper... (2) -> (1)
   [junit4]   2> 137910 INFO  (zkCallback-127-thread-1) [    ] o.a.s.c.c.ZkStateReader Updated live nodes from ZooKeeper... (2) -> (1)
   [junit4]   2> 137910 INFO  (zkCallback-109-thread-1) [    ] o.a.s.c.c.ZkStateReader Updated live nodes from ZooKeeper... (2) -> (1)
   [junit4]   2> 137910 INFO  (zkCallback-131-thread-2) [    ] o.a.s.c.c.ZkStateReader Updated live nodes from ZooKeeper... (2) -> (1)
   [junit4]   2> 137910 WARN  (NIOServerCxn.Factory:0.0.0.0/0.0.0.0:0) [    ] o.a.z.s.NIOServerCnxn Unable to read additional data from client sessionid 0x100112e55dd0010, likely client has closed socket
   [junit4]   2> 137911 INFO  (zkCallback-136-thread-1) [    ] o.a.s.c.c.ZkStateReader Updated live nodes from ZooKeeper... (2) -> (1)
   [junit4]   2> 137911 WARN  (zkCallback-150-thread-1) [    ] o.a.s.c.c.ZkStateReader ZooKeeper watch triggered, but Solr cannot talk to ZK: [KeeperErrorCode = Session expired for /live_nodes]
   [junit4]   2> 137912 WARN  (NIOServerCxn.Factory:0.0.0.0/0.0.0.0:0) [    ] o.a.z.s.NIOServerCnxn Unable to read additional data from client sessionid 0x100112e55dd000c, likely client has closed socket
   [junit4]   2> 137913 INFO  (jetty-closer-94-thread-3) [    ] o.e.j.s.h.ContextHandler Stopped o.e.j.s.ServletContextHandler@5669fef7{/solr,null,UNAVAILABLE}
   [junit4]   2> 137913 INFO  (jetty-closer-94-thread-3) [    ] o.e.j.s.session Stopped scavenging
   [junit4]   2> 137913 INFO  (jetty-closer-94-thread-1) [    ] o.e.j.s.h.ContextHandler Stopped o.e.j.s.ServletContextHandler@3ee47265{/solr,null,UNAVAILABLE}
   [junit4]   2> 137913 INFO  (jetty-closer-94-thread-1) [    ] o.e.j.s.session Stopped scavenging
   [junit4]   2> 137915 INFO  (jetty-closer-94-thread-4) [    ] o.a.s.m.SolrMetricManager Closing metric reporters for registry=solr.jvm, tag=null
   [junit4]   2> 137915 INFO  (jetty-closer-94-thread-4) [    ] o.a.s.m.r.SolrJmxReporter Closing reporter [org.apache.solr.metrics.reporters.SolrJmxReporter@296255a8: rootName = solr_33055, domain = solr.jvm, service url = null, agent id = null] for registry solr.jvm / com.codahale.metrics.MetricRegistry@3ce59f83
   [junit4]   2> 137922 INFO  (jetty-closer-94-thread-4) [    ] o.a.s.m.SolrMetricManager Closing metric reporters for registry=solr.jetty, tag=null
   [junit4]   2> 137923 INFO  (jetty-closer-94-thread-4) [    ] o.a.s.m.r.SolrJmxReporter Closing reporter [org.apache.solr.metrics.reporters.SolrJmxReporter@72a2f19a: rootName = solr_33055, domain = solr.jetty, service url = null, agent id = null] for registry solr.jetty / com.codahale.metrics.MetricRegistry@282df1b9
   [junit4]   2> 137924 INFO  (jetty-closer-94-thread-4) [    ] o.a.s.c.ZkController Remove node as live in ZooKeeper:/live_nodes/127.0.0.1:33055_solr
   [junit4]   2> 137924 INFO  (jetty-closer-94-thread-4) [    ] o.a.s.m.SolrMetricManager Closing metric reporters for registry=solr.cluster, tag=null
   [junit4]   2> 137924 INFO  (zkCallback-109-thread-1) [    ] o.a.s.c.c.ZkStateReader Updated live nodes from ZooKeeper... (1) -> (0)
   [junit4]   2> 137924 INFO  (zkCallback-136-thread-1) [    ] o.a.s.c.c.ZkStateReader Updated live nodes from ZooKeeper... (1) -> (0)
   [junit4]   2> 137926 INFO  (jetty-closer-94-thread-4) [    ] o.a.s.c.Overseer Overseer (id=72076484744642566-127.0.0.1:33055_solr-n_0000000000) closing
   [junit4]   2> 137926 INFO  (OverseerStateUpdate-72076484744642566-127.0.0.1:33055_solr-n_0000000000) [    ] o.a.s.c.Overseer Overseer Loop exiting : 127.0.0.1:33055_solr
   [junit4]   2> 137926 WARN  (OverseerAutoScalingTriggerThread-72076484744642566-127.0.0.1:33055_solr-n_0000000000) [    ] o.a.s.c.a.OverseerTriggerThread OverseerTriggerThread woken up but we are closed, exiting.
   [junit4]   2> 137930 INFO  (jetty-closer-94-thread-4) [    ] o.e.j.s.h.ContextHandler Stopped o.e.j.s.ServletContextHandler@56b7da7{/solr,null,UNAVAILABLE}
   [junit4]   2> 137930 INFO  (jetty-closer-94-thread-4) [    ] o.e.j.s.session Stopped scavenging
   [junit4]   2> 139413 INFO  (jetty-closer-94-thread-2) [    ] o.e.j.s.h.ContextHandler Stopped o.e.j.s.ServletContextHandler@19ec4f73{/solr,null,UNAVAILABLE}
   [junit4]   2> 139413 INFO  (jetty-closer-94-thread-2) [    ] o.e.j.s.session Stopped scavenging
   [junit4]   2> 139413 ERROR (SUITE-SearchRateTriggerTest-seed#[49B7F3F349C3E86E]-worker) [    ] o.a.z.s.ZooKeeperServer ZKShutdownHandler is not registered, so ZooKeeper server won't take any action on ERROR or SHUTDOWN server state changes
   [junit4]   2> 139414 INFO  (SUITE-SearchRateTriggerTest-seed#[49B7F3F349C3E86E]-worker) [    ] o.a.s.c.ZkTestServer connecting to 127.0.0.1:39535 39535
   [junit4]   2> 141052 INFO  (Thread-63) [    ] o.a.s.c.ZkTestServer connecting to 127.0.0.1:39535 39535
   [junit4]   2> 141052 WARN  (Thread-63) [    ] o.a.s.c.ZkTestServer Watch limit violations: 
   [junit4]   2> Maximum concurrent create/delete watches above limit:
   [junit4]   2> 
   [junit4]   2> 	15	/solr/collections/SearchRateTriggerTest-collection1/terms/shard1
   [junit4]   2> 	15	/solr/collections/SearchRateTriggerTest-collection1/terms/shard2
   [junit4]   2> 	12	/solr/aliases.json
   [junit4]   2> 	8	/solr/configs/conf
   [junit4]   2> 	8	/solr/collections/SearchRateTriggerTest-collection2/terms/shard2
   [junit4]   2> 	7	/solr/collections/SearchRateTriggerTest-collection2/terms/shard1
   [junit4]   2> 	4	/solr/security.json
   [junit4]   2> 
   [junit4]   2> Maximum concurrent data watches above limit:
   [junit4]   2> 
   [junit4]   2> 	12	/solr/clusterprops.json
   [junit4]   2> 	12	/solr/clusterstate.json
   [junit4]   2> 	8	/solr/collections/SearchRateTriggerTest-collection1/state.json
   [junit4]   2> 	4	/solr/collections/SearchRateTriggerTest-collection2/state.json
   [junit4]   2> 
   [junit4]   2> Maximum concurrent children watches above limit:
   [junit4]   2> 
   [junit4]   2> 	23	/solr/collections
   [junit4]   2> 	12	/solr/live_nodes
   [junit4]   2> 
   [junit4]   2> NOTE: leaving temporary files on disk at: /home/jenkins/workspace/Lucene-Solr-7.x-Linux/solr/build/solr-core/test/J0/temp/solr.cloud.autoscaling.SearchRateTriggerTest_49B7F3F349C3E86E-001
   [junit4]   2> NOTE: test params are: codec=Asserting(Lucene70): {}, docValues:{}, maxPointsInLeafNode=859, maxMBSortInHeap=6.116156851668904, sim=RandomSimilarity(queryNorm=false): {}, locale=fr-NC, timezone=Asia/Vladivostok
   [junit4]   2> NOTE: Linux 4.13.0-39-generic amd64/Oracle Corporation 9.0.4 (64-bit)/cpus=8,threads=1,free=245370352,total=536870912
   [junit4]   2> NOTE: All tests run in this JVM: [SearchRateTriggerTest, SearchRateTriggerTest]
   [junit4] Completed [4/5 (1!)] on J0 in 47.37s, 3 tests, 1 failure <<< FAILURES!

[...truncated 17 lines...]
BUILD FAILED
/home/jenkins/workspace/Lucene-Solr-7.x-Linux/lucene/common-build.xml:1568: The following error occurred while executing this line:
/home/jenkins/workspace/Lucene-Solr-7.x-Linux/lucene/common-build.xml:1092: There were test failures: 5 suites, 15 tests, 1 failure [seed: 49B7F3F349C3E86E]

Total time: 2 minutes 47 seconds

[repro] Setting last failure code to 256

[repro] Failures:
[repro]   1/5 failed: org.apache.solr.cloud.autoscaling.SearchRateTriggerTest
[repro] Exiting with code 256
+ mv lucene/build lucene/build.repro
+ mv solr/build solr/build.repro
+ mv lucene/build.orig lucene/build
+ mv solr/build.orig solr/build
Archiving artifacts
Setting ANT_1_8_2_HOME=/var/lib/jenkins/tools/hudson.tasks.Ant_AntInstallation/ANT_1.8.2
[WARNINGS] Parsing warnings in console log with parser Java Compiler (javac)
Setting ANT_1_8_2_HOME=/var/lib/jenkins/tools/hudson.tasks.Ant_AntInstallation/ANT_1.8.2
Setting ANT_1_8_2_HOME=/var/lib/jenkins/tools/hudson.tasks.Ant_AntInstallation/ANT_1.8.2
<Git Blamer> Using GitBlamer to create author and commit information for all warnings.
<Git Blamer> GIT_COMMIT=56998e6de3d1c71ad19a7400a99cd7dd2925de05, workspace=/var/lib/jenkins/workspace/Lucene-Solr-7.x-Linux
[WARNINGS] Computing warning deltas based on reference build #1819
Recording test results
Setting ANT_1_8_2_HOME=/var/lib/jenkins/tools/hudson.tasks.Ant_AntInstallation/ANT_1.8.2
Build step 'Publish JUnit test result report' changed build result to UNSTABLE
Email was triggered for: Unstable (Test Failures)
Sending email for trigger: Unstable (Test Failures)
Setting ANT_1_8_2_HOME=/var/lib/jenkins/tools/hudson.tasks.Ant_AntInstallation/ANT_1.8.2
Setting ANT_1_8_2_HOME=/var/lib/jenkins/tools/hudson.tasks.Ant_AntInstallation/ANT_1.8.2
Setting ANT_1_8_2_HOME=/var/lib/jenkins/tools/hudson.tasks.Ant_AntInstallation/ANT_1.8.2
Setting ANT_1_8_2_HOME=/var/lib/jenkins/tools/hudson.tasks.Ant_AntInstallation/ANT_1.8.2

Mime
View raw message