lucene-dev mailing list archives

Site index · List index
Message view « Date » · « Thread »
Top « Date » · « Thread »
From Policeman Jenkins Server <jenk...@thetaphi.de>
Subject [JENKINS] Lucene-Solr-7.x-MacOSX (64bit/jdk1.8.0) - Build # 582 - Unstable!
Date Thu, 19 Apr 2018 09:15:23 GMT
Build: https://jenkins.thetaphi.de/job/Lucene-Solr-7.x-MacOSX/582/
Java: 64bit/jdk1.8.0 -XX:+UseCompressedOops -XX:+UseConcMarkSweepGC

5 tests failed.
FAILED:  org.apache.solr.cloud.autoscaling.IndexSizeTriggerTest.testSplitIntegration

Error Message:


Stack Trace:
java.util.concurrent.TimeoutException
	at __randomizedtesting.SeedInfo.seed([975A58BABAE12C70:AED4E1FA951EE58E]:0)
	at org.apache.solr.cloud.CloudTestUtils.waitForState(CloudTestUtils.java:109)
	at org.apache.solr.cloud.autoscaling.IndexSizeTriggerTest.testSplitIntegration(IndexSizeTriggerTest.java:299)
	at sun.reflect.NativeMethodAccessorImpl.invoke0(Native Method)
	at sun.reflect.NativeMethodAccessorImpl.invoke(NativeMethodAccessorImpl.java:62)
	at sun.reflect.DelegatingMethodAccessorImpl.invoke(DelegatingMethodAccessorImpl.java:43)
	at java.lang.reflect.Method.invoke(Method.java:498)
	at com.carrotsearch.randomizedtesting.RandomizedRunner.invoke(RandomizedRunner.java:1737)
	at com.carrotsearch.randomizedtesting.RandomizedRunner$8.evaluate(RandomizedRunner.java:934)
	at com.carrotsearch.randomizedtesting.RandomizedRunner$9.evaluate(RandomizedRunner.java:970)
	at com.carrotsearch.randomizedtesting.RandomizedRunner$10.evaluate(RandomizedRunner.java:984)
	at com.carrotsearch.randomizedtesting.rules.SystemPropertiesRestoreRule$1.evaluate(SystemPropertiesRestoreRule.java:57)
	at org.apache.lucene.util.TestRuleSetupTeardownChained$1.evaluate(TestRuleSetupTeardownChained.java:49)
	at org.apache.lucene.util.AbstractBeforeAfterRule$1.evaluate(AbstractBeforeAfterRule.java:45)
	at org.apache.lucene.util.TestRuleThreadAndTestName$1.evaluate(TestRuleThreadAndTestName.java:48)
	at org.apache.lucene.util.TestRuleIgnoreAfterMaxFailures$1.evaluate(TestRuleIgnoreAfterMaxFailures.java:64)
	at org.apache.lucene.util.TestRuleMarkFailure$1.evaluate(TestRuleMarkFailure.java:47)
	at com.carrotsearch.randomizedtesting.rules.StatementAdapter.evaluate(StatementAdapter.java:36)
	at com.carrotsearch.randomizedtesting.ThreadLeakControl$StatementRunner.run(ThreadLeakControl.java:368)
	at com.carrotsearch.randomizedtesting.ThreadLeakControl.forkTimeoutingTask(ThreadLeakControl.java:817)
	at com.carrotsearch.randomizedtesting.ThreadLeakControl$3.evaluate(ThreadLeakControl.java:468)
	at com.carrotsearch.randomizedtesting.RandomizedRunner.runSingleTest(RandomizedRunner.java:943)
	at com.carrotsearch.randomizedtesting.RandomizedRunner$5.evaluate(RandomizedRunner.java:829)
	at com.carrotsearch.randomizedtesting.RandomizedRunner$6.evaluate(RandomizedRunner.java:879)
	at com.carrotsearch.randomizedtesting.RandomizedRunner$7.evaluate(RandomizedRunner.java:890)
	at com.carrotsearch.randomizedtesting.rules.StatementAdapter.evaluate(StatementAdapter.java:36)
	at com.carrotsearch.randomizedtesting.rules.SystemPropertiesRestoreRule$1.evaluate(SystemPropertiesRestoreRule.java:57)
	at org.apache.lucene.util.AbstractBeforeAfterRule$1.evaluate(AbstractBeforeAfterRule.java:45)
	at com.carrotsearch.randomizedtesting.rules.StatementAdapter.evaluate(StatementAdapter.java:36)
	at org.apache.lucene.util.TestRuleStoreClassName$1.evaluate(TestRuleStoreClassName.java:41)
	at com.carrotsearch.randomizedtesting.rules.NoShadowingOrOverridesOnMethodsRule$1.evaluate(NoShadowingOrOverridesOnMethodsRule.java:40)
	at com.carrotsearch.randomizedtesting.rules.NoShadowingOrOverridesOnMethodsRule$1.evaluate(NoShadowingOrOverridesOnMethodsRule.java:40)
	at com.carrotsearch.randomizedtesting.rules.StatementAdapter.evaluate(StatementAdapter.java:36)
	at com.carrotsearch.randomizedtesting.rules.StatementAdapter.evaluate(StatementAdapter.java:36)
	at com.carrotsearch.randomizedtesting.rules.StatementAdapter.evaluate(StatementAdapter.java:36)
	at org.apache.lucene.util.TestRuleAssertionsRequired$1.evaluate(TestRuleAssertionsRequired.java:53)
	at org.apache.lucene.util.TestRuleMarkFailure$1.evaluate(TestRuleMarkFailure.java:47)
	at org.apache.lucene.util.TestRuleIgnoreAfterMaxFailures$1.evaluate(TestRuleIgnoreAfterMaxFailures.java:64)
	at org.apache.lucene.util.TestRuleIgnoreTestSuites$1.evaluate(TestRuleIgnoreTestSuites.java:54)
	at com.carrotsearch.randomizedtesting.rules.StatementAdapter.evaluate(StatementAdapter.java:36)
	at com.carrotsearch.randomizedtesting.ThreadLeakControl$StatementRunner.run(ThreadLeakControl.java:368)
	at java.lang.Thread.run(Thread.java:748)


FAILED:  org.apache.solr.cloud.autoscaling.IndexSizeTriggerTest.testMergeIntegration

Error Message:
did not finish processing in time

Stack Trace:
java.lang.AssertionError: did not finish processing in time
	at __randomizedtesting.SeedInfo.seed([975A58BABAE12C70:C4E31A0A58F0B98A]:0)
	at org.junit.Assert.fail(Assert.java:93)
	at org.junit.Assert.assertTrue(Assert.java:43)
	at org.apache.solr.cloud.autoscaling.IndexSizeTriggerTest.testMergeIntegration(IndexSizeTriggerTest.java:404)
	at sun.reflect.NativeMethodAccessorImpl.invoke0(Native Method)
	at sun.reflect.NativeMethodAccessorImpl.invoke(NativeMethodAccessorImpl.java:62)
	at sun.reflect.DelegatingMethodAccessorImpl.invoke(DelegatingMethodAccessorImpl.java:43)
	at java.lang.reflect.Method.invoke(Method.java:498)
	at com.carrotsearch.randomizedtesting.RandomizedRunner.invoke(RandomizedRunner.java:1737)
	at com.carrotsearch.randomizedtesting.RandomizedRunner$8.evaluate(RandomizedRunner.java:934)
	at com.carrotsearch.randomizedtesting.RandomizedRunner$9.evaluate(RandomizedRunner.java:970)
	at com.carrotsearch.randomizedtesting.RandomizedRunner$10.evaluate(RandomizedRunner.java:984)
	at com.carrotsearch.randomizedtesting.rules.SystemPropertiesRestoreRule$1.evaluate(SystemPropertiesRestoreRule.java:57)
	at org.apache.lucene.util.TestRuleSetupTeardownChained$1.evaluate(TestRuleSetupTeardownChained.java:49)
	at org.apache.lucene.util.AbstractBeforeAfterRule$1.evaluate(AbstractBeforeAfterRule.java:45)
	at org.apache.lucene.util.TestRuleThreadAndTestName$1.evaluate(TestRuleThreadAndTestName.java:48)
	at org.apache.lucene.util.TestRuleIgnoreAfterMaxFailures$1.evaluate(TestRuleIgnoreAfterMaxFailures.java:64)
	at org.apache.lucene.util.TestRuleMarkFailure$1.evaluate(TestRuleMarkFailure.java:47)
	at com.carrotsearch.randomizedtesting.rules.StatementAdapter.evaluate(StatementAdapter.java:36)
	at com.carrotsearch.randomizedtesting.ThreadLeakControl$StatementRunner.run(ThreadLeakControl.java:368)
	at com.carrotsearch.randomizedtesting.ThreadLeakControl.forkTimeoutingTask(ThreadLeakControl.java:817)
	at com.carrotsearch.randomizedtesting.ThreadLeakControl$3.evaluate(ThreadLeakControl.java:468)
	at com.carrotsearch.randomizedtesting.RandomizedRunner.runSingleTest(RandomizedRunner.java:943)
	at com.carrotsearch.randomizedtesting.RandomizedRunner$5.evaluate(RandomizedRunner.java:829)
	at com.carrotsearch.randomizedtesting.RandomizedRunner$6.evaluate(RandomizedRunner.java:879)
	at com.carrotsearch.randomizedtesting.RandomizedRunner$7.evaluate(RandomizedRunner.java:890)
	at com.carrotsearch.randomizedtesting.rules.StatementAdapter.evaluate(StatementAdapter.java:36)
	at com.carrotsearch.randomizedtesting.rules.SystemPropertiesRestoreRule$1.evaluate(SystemPropertiesRestoreRule.java:57)
	at org.apache.lucene.util.AbstractBeforeAfterRule$1.evaluate(AbstractBeforeAfterRule.java:45)
	at com.carrotsearch.randomizedtesting.rules.StatementAdapter.evaluate(StatementAdapter.java:36)
	at org.apache.lucene.util.TestRuleStoreClassName$1.evaluate(TestRuleStoreClassName.java:41)
	at com.carrotsearch.randomizedtesting.rules.NoShadowingOrOverridesOnMethodsRule$1.evaluate(NoShadowingOrOverridesOnMethodsRule.java:40)
	at com.carrotsearch.randomizedtesting.rules.NoShadowingOrOverridesOnMethodsRule$1.evaluate(NoShadowingOrOverridesOnMethodsRule.java:40)
	at com.carrotsearch.randomizedtesting.rules.StatementAdapter.evaluate(StatementAdapter.java:36)
	at com.carrotsearch.randomizedtesting.rules.StatementAdapter.evaluate(StatementAdapter.java:36)
	at com.carrotsearch.randomizedtesting.rules.StatementAdapter.evaluate(StatementAdapter.java:36)
	at org.apache.lucene.util.TestRuleAssertionsRequired$1.evaluate(TestRuleAssertionsRequired.java:53)
	at org.apache.lucene.util.TestRuleMarkFailure$1.evaluate(TestRuleMarkFailure.java:47)
	at org.apache.lucene.util.TestRuleIgnoreAfterMaxFailures$1.evaluate(TestRuleIgnoreAfterMaxFailures.java:64)
	at org.apache.lucene.util.TestRuleIgnoreTestSuites$1.evaluate(TestRuleIgnoreTestSuites.java:54)
	at com.carrotsearch.randomizedtesting.rules.StatementAdapter.evaluate(StatementAdapter.java:36)
	at com.carrotsearch.randomizedtesting.ThreadLeakControl$StatementRunner.run(ThreadLeakControl.java:368)
	at java.lang.Thread.run(Thread.java:748)


FAILED:  org.apache.solr.cloud.autoscaling.IndexSizeTriggerTest.testSplitIntegration

Error Message:


Stack Trace:
java.util.concurrent.TimeoutException
	at __randomizedtesting.SeedInfo.seed([975A58BABAE12C70:AED4E1FA951EE58E]:0)
	at org.apache.solr.cloud.CloudTestUtils.waitForState(CloudTestUtils.java:109)
	at org.apache.solr.cloud.autoscaling.IndexSizeTriggerTest.testSplitIntegration(IndexSizeTriggerTest.java:299)
	at sun.reflect.NativeMethodAccessorImpl.invoke0(Native Method)
	at sun.reflect.NativeMethodAccessorImpl.invoke(NativeMethodAccessorImpl.java:62)
	at sun.reflect.DelegatingMethodAccessorImpl.invoke(DelegatingMethodAccessorImpl.java:43)
	at java.lang.reflect.Method.invoke(Method.java:498)
	at com.carrotsearch.randomizedtesting.RandomizedRunner.invoke(RandomizedRunner.java:1737)
	at com.carrotsearch.randomizedtesting.RandomizedRunner$8.evaluate(RandomizedRunner.java:934)
	at com.carrotsearch.randomizedtesting.RandomizedRunner$9.evaluate(RandomizedRunner.java:970)
	at com.carrotsearch.randomizedtesting.RandomizedRunner$10.evaluate(RandomizedRunner.java:984)
	at com.carrotsearch.randomizedtesting.rules.SystemPropertiesRestoreRule$1.evaluate(SystemPropertiesRestoreRule.java:57)
	at org.apache.lucene.util.TestRuleSetupTeardownChained$1.evaluate(TestRuleSetupTeardownChained.java:49)
	at org.apache.lucene.util.AbstractBeforeAfterRule$1.evaluate(AbstractBeforeAfterRule.java:45)
	at org.apache.lucene.util.TestRuleThreadAndTestName$1.evaluate(TestRuleThreadAndTestName.java:48)
	at org.apache.lucene.util.TestRuleIgnoreAfterMaxFailures$1.evaluate(TestRuleIgnoreAfterMaxFailures.java:64)
	at org.apache.lucene.util.TestRuleMarkFailure$1.evaluate(TestRuleMarkFailure.java:47)
	at com.carrotsearch.randomizedtesting.rules.StatementAdapter.evaluate(StatementAdapter.java:36)
	at com.carrotsearch.randomizedtesting.ThreadLeakControl$StatementRunner.run(ThreadLeakControl.java:368)
	at com.carrotsearch.randomizedtesting.ThreadLeakControl.forkTimeoutingTask(ThreadLeakControl.java:817)
	at com.carrotsearch.randomizedtesting.ThreadLeakControl$3.evaluate(ThreadLeakControl.java:468)
	at com.carrotsearch.randomizedtesting.RandomizedRunner.runSingleTest(RandomizedRunner.java:943)
	at com.carrotsearch.randomizedtesting.RandomizedRunner$5.evaluate(RandomizedRunner.java:829)
	at com.carrotsearch.randomizedtesting.RandomizedRunner$6.evaluate(RandomizedRunner.java:879)
	at com.carrotsearch.randomizedtesting.RandomizedRunner$7.evaluate(RandomizedRunner.java:890)
	at com.carrotsearch.randomizedtesting.rules.StatementAdapter.evaluate(StatementAdapter.java:36)
	at com.carrotsearch.randomizedtesting.rules.SystemPropertiesRestoreRule$1.evaluate(SystemPropertiesRestoreRule.java:57)
	at org.apache.lucene.util.AbstractBeforeAfterRule$1.evaluate(AbstractBeforeAfterRule.java:45)
	at com.carrotsearch.randomizedtesting.rules.StatementAdapter.evaluate(StatementAdapter.java:36)
	at org.apache.lucene.util.TestRuleStoreClassName$1.evaluate(TestRuleStoreClassName.java:41)
	at com.carrotsearch.randomizedtesting.rules.NoShadowingOrOverridesOnMethodsRule$1.evaluate(NoShadowingOrOverridesOnMethodsRule.java:40)
	at com.carrotsearch.randomizedtesting.rules.NoShadowingOrOverridesOnMethodsRule$1.evaluate(NoShadowingOrOverridesOnMethodsRule.java:40)
	at com.carrotsearch.randomizedtesting.rules.StatementAdapter.evaluate(StatementAdapter.java:36)
	at com.carrotsearch.randomizedtesting.rules.StatementAdapter.evaluate(StatementAdapter.java:36)
	at com.carrotsearch.randomizedtesting.rules.StatementAdapter.evaluate(StatementAdapter.java:36)
	at org.apache.lucene.util.TestRuleAssertionsRequired$1.evaluate(TestRuleAssertionsRequired.java:53)
	at org.apache.lucene.util.TestRuleMarkFailure$1.evaluate(TestRuleMarkFailure.java:47)
	at org.apache.lucene.util.TestRuleIgnoreAfterMaxFailures$1.evaluate(TestRuleIgnoreAfterMaxFailures.java:64)
	at org.apache.lucene.util.TestRuleIgnoreTestSuites$1.evaluate(TestRuleIgnoreTestSuites.java:54)
	at com.carrotsearch.randomizedtesting.rules.StatementAdapter.evaluate(StatementAdapter.java:36)
	at com.carrotsearch.randomizedtesting.ThreadLeakControl$StatementRunner.run(ThreadLeakControl.java:368)
	at java.lang.Thread.run(Thread.java:748)


FAILED:  org.apache.solr.cloud.autoscaling.IndexSizeTriggerTest.testSplitIntegration

Error Message:


Stack Trace:
java.util.concurrent.TimeoutException
	at __randomizedtesting.SeedInfo.seed([975A58BABAE12C70:AED4E1FA951EE58E]:0)
	at org.apache.solr.cloud.CloudTestUtils.waitForState(CloudTestUtils.java:109)
	at org.apache.solr.cloud.autoscaling.IndexSizeTriggerTest.testSplitIntegration(IndexSizeTriggerTest.java:299)
	at sun.reflect.NativeMethodAccessorImpl.invoke0(Native Method)
	at sun.reflect.NativeMethodAccessorImpl.invoke(NativeMethodAccessorImpl.java:62)
	at sun.reflect.DelegatingMethodAccessorImpl.invoke(DelegatingMethodAccessorImpl.java:43)
	at java.lang.reflect.Method.invoke(Method.java:498)
	at com.carrotsearch.randomizedtesting.RandomizedRunner.invoke(RandomizedRunner.java:1737)
	at com.carrotsearch.randomizedtesting.RandomizedRunner$8.evaluate(RandomizedRunner.java:934)
	at com.carrotsearch.randomizedtesting.RandomizedRunner$9.evaluate(RandomizedRunner.java:970)
	at com.carrotsearch.randomizedtesting.RandomizedRunner$10.evaluate(RandomizedRunner.java:984)
	at com.carrotsearch.randomizedtesting.rules.SystemPropertiesRestoreRule$1.evaluate(SystemPropertiesRestoreRule.java:57)
	at org.apache.lucene.util.TestRuleSetupTeardownChained$1.evaluate(TestRuleSetupTeardownChained.java:49)
	at org.apache.lucene.util.AbstractBeforeAfterRule$1.evaluate(AbstractBeforeAfterRule.java:45)
	at org.apache.lucene.util.TestRuleThreadAndTestName$1.evaluate(TestRuleThreadAndTestName.java:48)
	at org.apache.lucene.util.TestRuleIgnoreAfterMaxFailures$1.evaluate(TestRuleIgnoreAfterMaxFailures.java:64)
	at org.apache.lucene.util.TestRuleMarkFailure$1.evaluate(TestRuleMarkFailure.java:47)
	at com.carrotsearch.randomizedtesting.rules.StatementAdapter.evaluate(StatementAdapter.java:36)
	at com.carrotsearch.randomizedtesting.ThreadLeakControl$StatementRunner.run(ThreadLeakControl.java:368)
	at com.carrotsearch.randomizedtesting.ThreadLeakControl.forkTimeoutingTask(ThreadLeakControl.java:817)
	at com.carrotsearch.randomizedtesting.ThreadLeakControl$3.evaluate(ThreadLeakControl.java:468)
	at com.carrotsearch.randomizedtesting.RandomizedRunner.runSingleTest(RandomizedRunner.java:943)
	at com.carrotsearch.randomizedtesting.RandomizedRunner$5.evaluate(RandomizedRunner.java:829)
	at com.carrotsearch.randomizedtesting.RandomizedRunner$6.evaluate(RandomizedRunner.java:879)
	at com.carrotsearch.randomizedtesting.RandomizedRunner$7.evaluate(RandomizedRunner.java:890)
	at com.carrotsearch.randomizedtesting.rules.StatementAdapter.evaluate(StatementAdapter.java:36)
	at com.carrotsearch.randomizedtesting.rules.SystemPropertiesRestoreRule$1.evaluate(SystemPropertiesRestoreRule.java:57)
	at org.apache.lucene.util.AbstractBeforeAfterRule$1.evaluate(AbstractBeforeAfterRule.java:45)
	at com.carrotsearch.randomizedtesting.rules.StatementAdapter.evaluate(StatementAdapter.java:36)
	at org.apache.lucene.util.TestRuleStoreClassName$1.evaluate(TestRuleStoreClassName.java:41)
	at com.carrotsearch.randomizedtesting.rules.NoShadowingOrOverridesOnMethodsRule$1.evaluate(NoShadowingOrOverridesOnMethodsRule.java:40)
	at com.carrotsearch.randomizedtesting.rules.NoShadowingOrOverridesOnMethodsRule$1.evaluate(NoShadowingOrOverridesOnMethodsRule.java:40)
	at com.carrotsearch.randomizedtesting.rules.StatementAdapter.evaluate(StatementAdapter.java:36)
	at com.carrotsearch.randomizedtesting.rules.StatementAdapter.evaluate(StatementAdapter.java:36)
	at com.carrotsearch.randomizedtesting.rules.StatementAdapter.evaluate(StatementAdapter.java:36)
	at org.apache.lucene.util.TestRuleAssertionsRequired$1.evaluate(TestRuleAssertionsRequired.java:53)
	at org.apache.lucene.util.TestRuleMarkFailure$1.evaluate(TestRuleMarkFailure.java:47)
	at org.apache.lucene.util.TestRuleIgnoreAfterMaxFailures$1.evaluate(TestRuleIgnoreAfterMaxFailures.java:64)
	at org.apache.lucene.util.TestRuleIgnoreTestSuites$1.evaluate(TestRuleIgnoreTestSuites.java:54)
	at com.carrotsearch.randomizedtesting.rules.StatementAdapter.evaluate(StatementAdapter.java:36)
	at com.carrotsearch.randomizedtesting.ThreadLeakControl$StatementRunner.run(ThreadLeakControl.java:368)
	at java.lang.Thread.run(Thread.java:748)


FAILED:  org.apache.solr.cloud.autoscaling.IndexSizeTriggerTest.testSplitIntegration

Error Message:


Stack Trace:
java.util.concurrent.TimeoutException
	at __randomizedtesting.SeedInfo.seed([975A58BABAE12C70:AED4E1FA951EE58E]:0)
	at org.apache.solr.cloud.CloudTestUtils.waitForState(CloudTestUtils.java:109)
	at org.apache.solr.cloud.autoscaling.IndexSizeTriggerTest.testSplitIntegration(IndexSizeTriggerTest.java:299)
	at sun.reflect.NativeMethodAccessorImpl.invoke0(Native Method)
	at sun.reflect.NativeMethodAccessorImpl.invoke(NativeMethodAccessorImpl.java:62)
	at sun.reflect.DelegatingMethodAccessorImpl.invoke(DelegatingMethodAccessorImpl.java:43)
	at java.lang.reflect.Method.invoke(Method.java:498)
	at com.carrotsearch.randomizedtesting.RandomizedRunner.invoke(RandomizedRunner.java:1737)
	at com.carrotsearch.randomizedtesting.RandomizedRunner$8.evaluate(RandomizedRunner.java:934)
	at com.carrotsearch.randomizedtesting.RandomizedRunner$9.evaluate(RandomizedRunner.java:970)
	at com.carrotsearch.randomizedtesting.RandomizedRunner$10.evaluate(RandomizedRunner.java:984)
	at com.carrotsearch.randomizedtesting.rules.SystemPropertiesRestoreRule$1.evaluate(SystemPropertiesRestoreRule.java:57)
	at org.apache.lucene.util.TestRuleSetupTeardownChained$1.evaluate(TestRuleSetupTeardownChained.java:49)
	at org.apache.lucene.util.AbstractBeforeAfterRule$1.evaluate(AbstractBeforeAfterRule.java:45)
	at org.apache.lucene.util.TestRuleThreadAndTestName$1.evaluate(TestRuleThreadAndTestName.java:48)
	at org.apache.lucene.util.TestRuleIgnoreAfterMaxFailures$1.evaluate(TestRuleIgnoreAfterMaxFailures.java:64)
	at org.apache.lucene.util.TestRuleMarkFailure$1.evaluate(TestRuleMarkFailure.java:47)
	at com.carrotsearch.randomizedtesting.rules.StatementAdapter.evaluate(StatementAdapter.java:36)
	at com.carrotsearch.randomizedtesting.ThreadLeakControl$StatementRunner.run(ThreadLeakControl.java:368)
	at com.carrotsearch.randomizedtesting.ThreadLeakControl.forkTimeoutingTask(ThreadLeakControl.java:817)
	at com.carrotsearch.randomizedtesting.ThreadLeakControl$3.evaluate(ThreadLeakControl.java:468)
	at com.carrotsearch.randomizedtesting.RandomizedRunner.runSingleTest(RandomizedRunner.java:943)
	at com.carrotsearch.randomizedtesting.RandomizedRunner$5.evaluate(RandomizedRunner.java:829)
	at com.carrotsearch.randomizedtesting.RandomizedRunner$6.evaluate(RandomizedRunner.java:879)
	at com.carrotsearch.randomizedtesting.RandomizedRunner$7.evaluate(RandomizedRunner.java:890)
	at com.carrotsearch.randomizedtesting.rules.StatementAdapter.evaluate(StatementAdapter.java:36)
	at com.carrotsearch.randomizedtesting.rules.SystemPropertiesRestoreRule$1.evaluate(SystemPropertiesRestoreRule.java:57)
	at org.apache.lucene.util.AbstractBeforeAfterRule$1.evaluate(AbstractBeforeAfterRule.java:45)
	at com.carrotsearch.randomizedtesting.rules.StatementAdapter.evaluate(StatementAdapter.java:36)
	at org.apache.lucene.util.TestRuleStoreClassName$1.evaluate(TestRuleStoreClassName.java:41)
	at com.carrotsearch.randomizedtesting.rules.NoShadowingOrOverridesOnMethodsRule$1.evaluate(NoShadowingOrOverridesOnMethodsRule.java:40)
	at com.carrotsearch.randomizedtesting.rules.NoShadowingOrOverridesOnMethodsRule$1.evaluate(NoShadowingOrOverridesOnMethodsRule.java:40)
	at com.carrotsearch.randomizedtesting.rules.StatementAdapter.evaluate(StatementAdapter.java:36)
	at com.carrotsearch.randomizedtesting.rules.StatementAdapter.evaluate(StatementAdapter.java:36)
	at com.carrotsearch.randomizedtesting.rules.StatementAdapter.evaluate(StatementAdapter.java:36)
	at org.apache.lucene.util.TestRuleAssertionsRequired$1.evaluate(TestRuleAssertionsRequired.java:53)
	at org.apache.lucene.util.TestRuleMarkFailure$1.evaluate(TestRuleMarkFailure.java:47)
	at org.apache.lucene.util.TestRuleIgnoreAfterMaxFailures$1.evaluate(TestRuleIgnoreAfterMaxFailures.java:64)
	at org.apache.lucene.util.TestRuleIgnoreTestSuites$1.evaluate(TestRuleIgnoreTestSuites.java:54)
	at com.carrotsearch.randomizedtesting.rules.StatementAdapter.evaluate(StatementAdapter.java:36)
	at com.carrotsearch.randomizedtesting.ThreadLeakControl$StatementRunner.run(ThreadLeakControl.java:368)
	at java.lang.Thread.run(Thread.java:748)




Build Log:
[...truncated 12611 lines...]
   [junit4] Suite: org.apache.solr.cloud.autoscaling.IndexSizeTriggerTest
   [junit4]   2> Creating dataDir: /Users/jenkins/workspace/Lucene-Solr-7.x-MacOSX/solr/build/solr-core/test/J0/temp/solr.cloud.autoscaling.IndexSizeTriggerTest_975A58BABAE12C70-001/init-core-data-001
   [junit4]   2> 368363 WARN  (SUITE-IndexSizeTriggerTest-seed#[975A58BABAE12C70]-worker) [    ] o.a.s.SolrTestCaseJ4 startTrackingSearchers: numOpens=7 numCloses=7
   [junit4]   2> 368363 INFO  (SUITE-IndexSizeTriggerTest-seed#[975A58BABAE12C70]-worker) [    ] o.a.s.SolrTestCaseJ4 Using PointFields (NUMERIC_POINTS_SYSPROP=true) w/NUMERIC_DOCVALUES_SYSPROP=true
   [junit4]   2> 368367 INFO  (SUITE-IndexSizeTriggerTest-seed#[975A58BABAE12C70]-worker) [    ] o.a.s.SolrTestCaseJ4 Randomized ssl (true) and clientAuth (false) via: @org.apache.solr.util.RandomizeSSL(reason=, value=NaN, ssl=NaN, clientAuth=NaN) w/ MAC_OS_X supressed clientAuth
   [junit4]   2> 368368 INFO  (SUITE-IndexSizeTriggerTest-seed#[975A58BABAE12C70]-worker) [    ] o.a.s.SolrTestCaseJ4 SecureRandom sanity checks: test.solr.allowed.securerandom=null & java.security.egd=file:/dev/./urandom
   [junit4]   2> 368369 INFO  (SUITE-IndexSizeTriggerTest-seed#[975A58BABAE12C70]-worker) [    ] o.a.s.c.MiniSolrCloudCluster Starting cluster of 2 servers in /Users/jenkins/workspace/Lucene-Solr-7.x-MacOSX/solr/build/solr-core/test/J0/temp/solr.cloud.autoscaling.IndexSizeTriggerTest_975A58BABAE12C70-001/tempDir-001
   [junit4]   2> 368369 INFO  (SUITE-IndexSizeTriggerTest-seed#[975A58BABAE12C70]-worker) [    ] o.a.s.c.ZkTestServer STARTING ZK TEST SERVER
   [junit4]   2> 368370 INFO  (Thread-646) [    ] o.a.s.c.ZkTestServer client port:0.0.0.0/0.0.0.0:0
   [junit4]   2> 368370 INFO  (Thread-646) [    ] o.a.s.c.ZkTestServer Starting server
   [junit4]   2> 368373 ERROR (Thread-646) [    ] o.a.z.s.ZooKeeperServer ZKShutdownHandler is not registered, so ZooKeeper server won't take any action on ERROR or SHUTDOWN server state changes
   [junit4]   2> 368477 INFO  (SUITE-IndexSizeTriggerTest-seed#[975A58BABAE12C70]-worker) [    ] o.a.s.c.ZkTestServer start zk server on port:54318
   [junit4]   2> 368486 INFO  (zkConnectionManagerCallback-974-thread-1) [    ] o.a.s.c.c.ConnectionManager zkClient has connected
   [junit4]   2> 368495 INFO  (jetty-launcher-971-thread-1) [    ] o.e.j.s.Server jetty-9.4.8.v20171121, build timestamp: 2017-11-22T10:27:37+13:00, git hash: 82b8fb23f757335bb3329d540ce37a2a2615f0a8
   [junit4]   2> 368495 INFO  (jetty-launcher-971-thread-2) [    ] o.e.j.s.Server jetty-9.4.8.v20171121, build timestamp: 2017-11-22T10:27:37+13:00, git hash: 82b8fb23f757335bb3329d540ce37a2a2615f0a8
   [junit4]   2> 368498 INFO  (jetty-launcher-971-thread-2) [    ] o.e.j.s.session DefaultSessionIdManager workerName=node0
   [junit4]   2> 368498 INFO  (jetty-launcher-971-thread-2) [    ] o.e.j.s.session No SessionScavenger set, using defaults
   [junit4]   2> 368498 INFO  (jetty-launcher-971-thread-1) [    ] o.e.j.s.session DefaultSessionIdManager workerName=node0
   [junit4]   2> 368498 INFO  (jetty-launcher-971-thread-1) [    ] o.e.j.s.session No SessionScavenger set, using defaults
   [junit4]   2> 368498 INFO  (jetty-launcher-971-thread-2) [    ] o.e.j.s.session Scavenging every 660000ms
   [junit4]   2> 368498 INFO  (jetty-launcher-971-thread-1) [    ] o.e.j.s.session Scavenging every 660000ms
   [junit4]   2> 368498 INFO  (jetty-launcher-971-thread-1) [    ] o.e.j.s.h.ContextHandler Started o.e.j.s.ServletContextHandler@30db167f{/solr,null,AVAILABLE}
   [junit4]   2> 368498 INFO  (jetty-launcher-971-thread-2) [    ] o.e.j.s.h.ContextHandler Started o.e.j.s.ServletContextHandler@c42609c{/solr,null,AVAILABLE}
   [junit4]   2> 368499 INFO  (jetty-launcher-971-thread-1) [    ] o.e.j.s.AbstractConnector Started ServerConnector@74dee6f0{SSL,[ssl, http/1.1]}{127.0.0.1:54320}
   [junit4]   2> 368499 INFO  (jetty-launcher-971-thread-1) [    ] o.e.j.s.Server Started @368581ms
   [junit4]   2> 368499 INFO  (jetty-launcher-971-thread-1) [    ] o.a.s.c.s.e.JettySolrRunner Jetty properties: {hostContext=/solr, hostPort=54320}
   [junit4]   2> 368499 INFO  (jetty-launcher-971-thread-2) [    ] o.e.j.s.AbstractConnector Started ServerConnector@72545903{SSL,[ssl, http/1.1]}{127.0.0.1:54321}
   [junit4]   2> 368499 INFO  (jetty-launcher-971-thread-2) [    ] o.e.j.s.Server Started @368581ms
   [junit4]   2> 368499 ERROR (jetty-launcher-971-thread-1) [    ] o.a.s.u.StartupLoggingUtils Missing Java Option solr.log.dir. Logging may be missing or incomplete.
   [junit4]   2> 368499 INFO  (jetty-launcher-971-thread-2) [    ] o.a.s.c.s.e.JettySolrRunner Jetty properties: {hostContext=/solr, hostPort=54321}
   [junit4]   2> 368499 INFO  (jetty-launcher-971-thread-1) [    ] o.a.s.s.SolrDispatchFilter Using logger factory org.apache.logging.slf4j.Log4jLoggerFactory
   [junit4]   2> 368500 ERROR (jetty-launcher-971-thread-2) [    ] o.a.s.u.StartupLoggingUtils Missing Java Option solr.log.dir. Logging may be missing or incomplete.
   [junit4]   2> 368500 INFO  (jetty-launcher-971-thread-2) [    ] o.a.s.s.SolrDispatchFilter Using logger factory org.apache.logging.slf4j.Log4jLoggerFactory
   [junit4]   2> 368500 INFO  (jetty-launcher-971-thread-2) [    ] o.a.s.s.SolrDispatchFilter  ___      _       Welcome to Apache Solr™ version 7.4.0
   [junit4]   2> 368500 INFO  (jetty-launcher-971-thread-2) [    ] o.a.s.s.SolrDispatchFilter / __| ___| |_ _   Starting in cloud mode on port null
   [junit4]   2> 368500 INFO  (jetty-launcher-971-thread-2) [    ] o.a.s.s.SolrDispatchFilter \__ \/ _ \ | '_|  Install dir: null
   [junit4]   2> 368500 INFO  (jetty-launcher-971-thread-2) [    ] o.a.s.s.SolrDispatchFilter |___/\___/_|_|    Start time: 2018-04-19T07:53:45.936Z
   [junit4]   2> 368500 INFO  (jetty-launcher-971-thread-1) [    ] o.a.s.s.SolrDispatchFilter  ___      _       Welcome to Apache Solr™ version 7.4.0
   [junit4]   2> 368500 INFO  (jetty-launcher-971-thread-1) [    ] o.a.s.s.SolrDispatchFilter / __| ___| |_ _   Starting in cloud mode on port null
   [junit4]   2> 368500 INFO  (jetty-launcher-971-thread-1) [    ] o.a.s.s.SolrDispatchFilter \__ \/ _ \ | '_|  Install dir: null
   [junit4]   2> 368500 INFO  (jetty-launcher-971-thread-1) [    ] o.a.s.s.SolrDispatchFilter |___/\___/_|_|    Start time: 2018-04-19T07:53:45.936Z
   [junit4]   2> 368504 INFO  (zkConnectionManagerCallback-976-thread-1) [    ] o.a.s.c.c.ConnectionManager zkClient has connected
   [junit4]   2> 368504 INFO  (zkConnectionManagerCallback-978-thread-1) [    ] o.a.s.c.c.ConnectionManager zkClient has connected
   [junit4]   2> 368504 INFO  (jetty-launcher-971-thread-2) [    ] o.a.s.s.SolrDispatchFilter solr.xml found in ZooKeeper. Loading...
   [junit4]   2> 368504 INFO  (jetty-launcher-971-thread-1) [    ] o.a.s.s.SolrDispatchFilter solr.xml found in ZooKeeper. Loading...
   [junit4]   2> 368519 INFO  (jetty-launcher-971-thread-2) [    ] o.a.s.c.ZkContainer Zookeeper client=127.0.0.1:54318/solr
   [junit4]   2> 368519 INFO  (jetty-launcher-971-thread-1) [    ] o.a.s.c.ZkContainer Zookeeper client=127.0.0.1:54318/solr
   [junit4]   2> 368521 INFO  (zkConnectionManagerCallback-985-thread-1) [    ] o.a.s.c.c.ConnectionManager zkClient has connected
   [junit4]   2> 368521 INFO  (zkConnectionManagerCallback-986-thread-1) [    ] o.a.s.c.c.ConnectionManager zkClient has connected
   [junit4]   2> 368524 INFO  (zkConnectionManagerCallback-988-thread-1) [    ] o.a.s.c.c.ConnectionManager zkClient has connected
   [junit4]   2> 368524 INFO  (zkConnectionManagerCallback-990-thread-1) [    ] o.a.s.c.c.ConnectionManager zkClient has connected
   [junit4]   2> 368662 INFO  (jetty-launcher-971-thread-2) [n:127.0.0.1:54321_solr    ] o.a.s.c.Overseer Overseer (id=null) closing
   [junit4]   2> 368663 INFO  (jetty-launcher-971-thread-1) [n:127.0.0.1:54320_solr    ] o.a.s.c.Overseer Overseer (id=null) closing
   [junit4]   2> 368663 INFO  (jetty-launcher-971-thread-2) [n:127.0.0.1:54321_solr    ] o.a.s.c.OverseerElectionContext I am going to be the leader 127.0.0.1:54321_solr
   [junit4]   2> 368664 INFO  (jetty-launcher-971-thread-1) [n:127.0.0.1:54320_solr    ] o.a.s.c.ZkController Register node as live in ZooKeeper:/live_nodes/127.0.0.1:54320_solr
   [junit4]   2> 368664 INFO  (jetty-launcher-971-thread-2) [n:127.0.0.1:54321_solr    ] o.a.s.c.Overseer Overseer (id=72148695032922117-127.0.0.1:54321_solr-n_0000000000) starting
   [junit4]   2> 368666 INFO  (zkCallback-987-thread-1) [    ] o.a.s.c.c.ZkStateReader Updated live nodes from ZooKeeper... (0) -> (1)
   [junit4]   2> 368667 INFO  (zkCallback-989-thread-1) [    ] o.a.s.c.c.ZkStateReader Updated live nodes from ZooKeeper... (0) -> (1)
   [junit4]   2> 368682 INFO  (zkConnectionManagerCallback-999-thread-1) [    ] o.a.s.c.c.ConnectionManager zkClient has connected
   [junit4]   2> 368683 INFO  (jetty-launcher-971-thread-2) [n:127.0.0.1:54321_solr    ] o.a.s.c.c.ZkStateReader Updated live nodes from ZooKeeper... (0) -> (1)
   [junit4]   2> 368685 INFO  (jetty-launcher-971-thread-2) [n:127.0.0.1:54321_solr    ] o.a.s.c.s.i.ZkClientClusterStateProvider Cluster at 127.0.0.1:54318/solr ready
   [junit4]   2> 368686 DEBUG (OverseerAutoScalingTriggerThread-72148695032922117-127.0.0.1:54321_solr-n_0000000000) [    ] o.a.s.c.a.OverseerTriggerThread Adding .auto_add_replicas and .scheduled_maintenance triggers
   [junit4]   2> 368687 DEBUG (OverseerAutoScalingTriggerThread-72148695032922117-127.0.0.1:54321_solr-n_0000000000) [    ] o.a.s.c.a.OverseerTriggerThread Refreshing /autoscaling.json with znode version 1
   [junit4]   2> 368687 DEBUG (OverseerAutoScalingTriggerThread-72148695032922117-127.0.0.1:54321_solr-n_0000000000) [    ] o.a.s.c.a.OverseerTriggerThread Current znodeVersion 1, lastZnodeVersion -1
   [junit4]   2> 368687 DEBUG (OverseerAutoScalingTriggerThread-72148695032922117-127.0.0.1:54321_solr-n_0000000000) [    ] o.a.s.c.a.OverseerTriggerThread Processed trigger updates upto znodeVersion 1
   [junit4]   2> 368690 INFO  (jetty-launcher-971-thread-2) [n:127.0.0.1:54321_solr    ] o.a.s.c.TransientSolrCoreCacheDefault Allocating transient cache for 2147483647 transient cores
   [junit4]   2> 368690 INFO  (jetty-launcher-971-thread-2) [n:127.0.0.1:54321_solr    ] o.a.s.c.ZkController Register node as live in ZooKeeper:/live_nodes/127.0.0.1:54321_solr
   [junit4]   2> 368693 INFO  (zkCallback-998-thread-1) [    ] o.a.s.c.c.ZkStateReader Updated live nodes from ZooKeeper... (1) -> (2)
   [junit4]   2> 368703 INFO  (zkCallback-989-thread-1) [    ] o.a.s.c.c.ZkStateReader Updated live nodes from ZooKeeper... (1) -> (2)
   [junit4]   2> 368703 INFO  (zkCallback-987-thread-1) [    ] o.a.s.c.c.ZkStateReader Updated live nodes from ZooKeeper... (1) -> (2)
   [junit4]   2> 368705 DEBUG (OverseerAutoScalingTriggerThread-72148695032922117-127.0.0.1:54321_solr-n_0000000000) [    ] o.a.s.c.a.NodeLostTrigger NodeLostTrigger .auto_add_replicas - Initial livenodes: [127.0.0.1:54320_solr, 127.0.0.1:54321_solr]
   [junit4]   2> 368706 DEBUG (OverseerAutoScalingTriggerThread-72148695032922117-127.0.0.1:54321_solr-n_0000000000) [    ] o.a.s.c.a.OverseerTriggerThread -- clean old nodeAdded markers
   [junit4]   2> 368706 DEBUG (OverseerAutoScalingTriggerThread-72148695032922117-127.0.0.1:54321_solr-n_0000000000) [    ] o.a.s.c.a.OverseerTriggerThread Current znodeVersion 1, lastZnodeVersion 1
   [junit4]   2> 368707 DEBUG (ScheduledTrigger-1608-thread-1) [    ] o.a.s.c.a.NodeLostTrigger Running NodeLostTrigger: .auto_add_replicas with currently live nodes: 2
   [junit4]   2> 368870 INFO  (jetty-launcher-971-thread-2) [n:127.0.0.1:54321_solr    ] o.a.s.m.r.SolrJmxReporter JMX monitoring for 'solr_54321.solr.node' (registry 'solr.node') enabled at server: com.sun.jmx.mbeanserver.JmxMBeanServer@59e58e43
   [junit4]   2> 368875 INFO  (jetty-launcher-971-thread-2) [n:127.0.0.1:54321_solr    ] o.a.s.m.r.SolrJmxReporter JMX monitoring for 'solr_54321.solr.jvm' (registry 'solr.jvm') enabled at server: com.sun.jmx.mbeanserver.JmxMBeanServer@59e58e43
   [junit4]   2> 368875 INFO  (jetty-launcher-971-thread-2) [n:127.0.0.1:54321_solr    ] o.a.s.m.r.SolrJmxReporter JMX monitoring for 'solr_54321.solr.jetty' (registry 'solr.jetty') enabled at server: com.sun.jmx.mbeanserver.JmxMBeanServer@59e58e43
   [junit4]   2> 368876 INFO  (jetty-launcher-971-thread-2) [n:127.0.0.1:54321_solr    ] o.a.s.c.CorePropertiesLocator Found 0 core definitions underneath /Users/jenkins/workspace/Lucene-Solr-7.x-MacOSX/solr/build/solr-core/test/J0/temp/solr.cloud.autoscaling.IndexSizeTriggerTest_975A58BABAE12C70-001/tempDir-001/node2/.
   [junit4]   2> 369102 INFO  (jetty-launcher-971-thread-1) [n:127.0.0.1:54320_solr    ] o.a.s.m.r.SolrJmxReporter JMX monitoring for 'solr_54320.solr.node' (registry 'solr.node') enabled at server: com.sun.jmx.mbeanserver.JmxMBeanServer@59e58e43
   [junit4]   2> 369108 INFO  (jetty-launcher-971-thread-1) [n:127.0.0.1:54320_solr    ] o.a.s.m.r.SolrJmxReporter JMX monitoring for 'solr_54320.solr.jvm' (registry 'solr.jvm') enabled at server: com.sun.jmx.mbeanserver.JmxMBeanServer@59e58e43
   [junit4]   2> 369108 INFO  (jetty-launcher-971-thread-1) [n:127.0.0.1:54320_solr    ] o.a.s.m.r.SolrJmxReporter JMX monitoring for 'solr_54320.solr.jetty' (registry 'solr.jetty') enabled at server: com.sun.jmx.mbeanserver.JmxMBeanServer@59e58e43
   [junit4]   2> 369109 INFO  (jetty-launcher-971-thread-1) [n:127.0.0.1:54320_solr    ] o.a.s.c.CorePropertiesLocator Found 0 core definitions underneath /Users/jenkins/workspace/Lucene-Solr-7.x-MacOSX/solr/build/solr-core/test/J0/temp/solr.cloud.autoscaling.IndexSizeTriggerTest_975A58BABAE12C70-001/tempDir-001/node1/.
   [junit4]   2> 369114 INFO  (zkConnectionManagerCallback-1004-thread-1) [    ] o.a.s.c.c.ConnectionManager zkClient has connected
   [junit4]   2> 369116 INFO  (jetty-launcher-971-thread-1) [n:127.0.0.1:54320_solr    ] o.a.s.c.c.ZkStateReader Updated live nodes from ZooKeeper... (0) -> (2)
   [junit4]   2> 369117 INFO  (jetty-launcher-971-thread-1) [n:127.0.0.1:54320_solr    ] o.a.s.c.s.i.ZkClientClusterStateProvider Cluster at 127.0.0.1:54318/solr ready
   [junit4]   2> 369144 INFO  (zkConnectionManagerCallback-1006-thread-1) [    ] o.a.s.c.c.ConnectionManager zkClient has connected
   [junit4]   2> 369151 INFO  (zkConnectionManagerCallback-1011-thread-1) [    ] o.a.s.c.c.ConnectionManager zkClient has connected
   [junit4]   2> 369153 INFO  (SUITE-IndexSizeTriggerTest-seed#[975A58BABAE12C70]-worker) [    ] o.a.s.c.c.ZkStateReader Updated live nodes from ZooKeeper... (0) -> (2)
   [junit4]   2> 369155 INFO  (SUITE-IndexSizeTriggerTest-seed#[975A58BABAE12C70]-worker) [    ] o.a.s.c.s.i.ZkClientClusterStateProvider Cluster at 127.0.0.1:54318/solr ready
   [junit4]   2> 369186 DEBUG (Simulated OverseerAutoScalingTriggerThread) [    ] o.a.s.c.a.OverseerTriggerThread Adding .auto_add_replicas and .scheduled_maintenance triggers
   [junit4]   2> 369186 DEBUG (Simulated OverseerAutoScalingTriggerThread) [    ] o.a.s.c.a.OverseerTriggerThread Refreshing /autoscaling.json with znode version 0
   [junit4]   2> 369186 DEBUG (Simulated OverseerAutoScalingTriggerThread) [    ] o.a.s.c.a.OverseerTriggerThread Current znodeVersion 0, lastZnodeVersion -1
   [junit4]   2> 369186 DEBUG (Simulated OverseerAutoScalingTriggerThread) [    ] o.a.s.c.a.OverseerTriggerThread Processed trigger updates upto znodeVersion 0
   [junit4]   2> 369191 DEBUG (Simulated OverseerAutoScalingTriggerThread) [    ] o.a.s.c.a.NodeLostTrigger NodeLostTrigger .auto_add_replicas - Initial livenodes: [127.0.0.1:10001_solr, 127.0.0.1:10000_solr]
   [junit4]   2> 369191 DEBUG (Simulated OverseerAutoScalingTriggerThread) [    ] o.a.s.c.a.OverseerTriggerThread -- clean old nodeAdded markers
   [junit4]   2> 369191 DEBUG (Simulated OverseerAutoScalingTriggerThread) [    ] o.a.s.c.a.OverseerTriggerThread Current znodeVersion 0, lastZnodeVersion 0
   [junit4]   2> 369192 DEBUG (ScheduledTrigger-1617-thread-2) [    ] o.a.s.c.a.NodeLostTrigger Running NodeLostTrigger: .auto_add_replicas with currently live nodes: 2
   [junit4]   2> 369220 DEBUG (ScheduledTrigger-1617-thread-3) [    ] o.a.s.c.a.NodeLostTrigger Running NodeLostTrigger: .auto_add_replicas with currently live nodes: 2
   [junit4]   2> 369244 DEBUG (ScheduledTrigger-1617-thread-4) [    ] o.a.s.c.a.NodeLostTrigger Running NodeLostTrigger: .auto_add_replicas with currently live nodes: 2
   [junit4]   2> 369266 DEBUG (ScheduledTrigger-1617-thread-3) [    ] o.a.s.c.a.NodeLostTrigger Running NodeLostTrigger: .auto_add_replicas with currently live nodes: 2
   [junit4]   2> 369296 DEBUG (ScheduledTrigger-1617-thread-4) [    ] o.a.s.c.a.NodeLostTrigger Running NodeLostTrigger: .auto_add_replicas with currently live nodes: 2
   [junit4]   2> 369316 DEBUG (ScheduledTrigger-1617-thread-2) [    ] o.a.s.c.a.NodeLostTrigger Running NodeLostTrigger: .auto_add_replicas with currently live nodes: 2
   [junit4]   2> 369346 DEBUG (ScheduledTrigger-1617-thread-2) [    ] o.a.s.c.a.NodeLostTrigger Running NodeLostTrigger: .auto_add_replicas with currently live nodes: 2
   [junit4]   2> 369377 DEBUG (ScheduledTrigger-1617-thread-2) [    ] o.a.s.c.a.NodeLostTrigger Running NodeLostTrigger: .auto_add_replicas with currently live nodes: 2
   [junit4]   2> 369398 DEBUG (ScheduledTrigger-1617-thread-2) [    ] o.a.s.c.a.NodeLostTrigger Running NodeLostTrigger: .auto_add_replicas with currently live nodes: 2
   [junit4]   2> 369418 INFO  (TEST-IndexSizeTriggerTest.testMixedBounds-seed#[975A58BABAE12C70]) [    ] o.a.s.SolrTestCaseJ4 ###Starting testMixedBounds
   [junit4]   2> 369418 WARN  (TEST-IndexSizeTriggerTest.testMixedBounds-seed#[975A58BABAE12C70]) [    ] o.a.s.c.a.IndexSizeTriggerTest Requires SOLR-12208
   [junit4]   2> 369421 INFO  (TEST-IndexSizeTriggerTest.testMixedBounds-seed#[975A58BABAE12C70]) [    ] o.a.s.c.a.IndexSizeTriggerTest #######################################
   [junit4]   2> ############ CLUSTER STATE ############
   [junit4]   2> #######################################
   [junit4]   2> ## Live nodes:		2
   [junit4]   2> ## Empty nodes:	2
   [junit4]   2> ## Dead nodes:		0
   [junit4]   2> ## Collections:	[]
   [junit4]   2> ## Max replicas per node:	0
   [junit4]   2> ## Min replicas per node:	0
   [junit4]   2> ## Total replicas:		0
   [junit4]   2> ######### Solr op counts ##########
   [junit4]   2> ######### Autoscaling event counts ###########
   [junit4]   2> 
   [junit4]   2> 369421 DEBUG (TEST-IndexSizeTriggerTest.testMixedBounds-seed#[975A58BABAE12C70]) [    ] o.a.s.c.a.OverseerTriggerThread Refreshing /autoscaling.json with znode version 1
   [junit4]   2> 369421 DEBUG (Simulated OverseerAutoScalingTriggerThread) [    ] o.a.s.c.a.OverseerTriggerThread Processed trigger updates upto znodeVersion 1
   [junit4]   2> 369421 DEBUG (Simulated OverseerAutoScalingTriggerThread) [    ] o.a.s.c.a.OverseerTriggerThread -- clean old nodeLost markers
   [junit4]   2> 369422 DEBUG (Simulated OverseerAutoScalingTriggerThread) [    ] o.a.s.c.a.OverseerTriggerThread -- clean old nodeAdded markers
   [junit4]   2> 369422 DEBUG (Simulated OverseerAutoScalingTriggerThread) [    ] o.a.s.c.a.OverseerTriggerThread Current znodeVersion 1, lastZnodeVersion 1
   [junit4]   2> 369531 INFO  (TEST-IndexSizeTriggerTest.testMixedBounds-seed#[975A58BABAE12C70]) [    ] o.a.s.SolrTestCaseJ4 ###Ending testMixedBounds
   [junit4]   2> 369548 INFO  (TEST-IndexSizeTriggerTest.testMergeIntegration-seed#[975A58BABAE12C70]) [    ] o.a.s.SolrTestCaseJ4 ###Starting testMergeIntegration
   [junit4]   2> 369638 DEBUG (simCloudManagerPool-1616-thread-6) [    ] o.a.s.c.a.s.SimClusterStateProvider -- elected new leader for testMergeIntegration_collection / shard2: {"core_node3":{
   [junit4]   2>     "core":"testMergeIntegration_collection_shard2_replica_n3",
   [junit4]   2>     "leader":"true",
   [junit4]   2>     "SEARCHER.searcher.maxDoc":0,
   [junit4]   2>     "SEARCHER.searcher.deletedDocs":0,
   [junit4]   2>     "INDEX.sizeInBytes":1,
   [junit4]   2>     "node_name":"127.0.0.1:10000_solr",
   [junit4]   2>     "state":"active",
   [junit4]   2>     "type":"NRT",
   [junit4]   2>     "SEARCHER.searcher.numDocs":0,
   [junit4]   2>     "shard":"shard2",
   [junit4]   2>     "collection":"testMergeIntegration_collection"}}
   [junit4]   2> 369638 DEBUG (simCloudManagerPool-1616-thread-7) [    ] o.a.s.c.a.s.SimClusterStateProvider -- elected new leader for testMergeIntegration_collection / shard1: {"core_node1":{
   [junit4]   2>     "core":"testMergeIntegration_collection_shard1_replica_n1",
   [junit4]   2>     "leader":"true",
   [junit4]   2>     "SEARCHER.searcher.maxDoc":0,
   [junit4]   2>     "SEARCHER.searcher.deletedDocs":0,
   [junit4]   2>     "INDEX.sizeInBytes":1,
   [junit4]   2>     "node_name":"127.0.0.1:10000_solr",
   [junit4]   2>     "state":"active",
   [junit4]   2>     "type":"NRT",
   [junit4]   2>     "SEARCHER.searcher.numDocs":0,
   [junit4]   2>     "shard":"shard1",
   [junit4]   2>     "collection":"testMergeIntegration_collection"}}
   [junit4]   2> 369657 DEBUG (simCloudManagerPool-1616-thread-19) [    ] o.a.s.c.a.AutoScalingHandler Verified autoscaling configuration
   [junit4]   2> 369657 DEBUG (simCloudManagerPool-1616-thread-19) [    ] o.a.s.c.a.OverseerTriggerThread Refreshing /autoscaling.json with znode version 2
   [junit4]   2> 369658 DEBUG (Simulated OverseerAutoScalingTriggerThread) [    ] o.a.s.c.a.OverseerTriggerThread Processed trigger updates upto znodeVersion 2
   [junit4]   2> 369658 DEBUG (Simulated OverseerAutoScalingTriggerThread) [    ] o.a.s.c.a.OverseerTriggerThread -- clean old nodeLost markers
   [junit4]   2> 369658 DEBUG (Simulated OverseerAutoScalingTriggerThread) [    ] o.a.s.c.a.OverseerTriggerThread -- clean old nodeAdded markers
   [junit4]   2> 369658 DEBUG (Simulated OverseerAutoScalingTriggerThread) [    ] o.a.s.c.a.OverseerTriggerThread Current znodeVersion 2, lastZnodeVersion 2
   [junit4]   2> 369665 DEBUG (simCloudManagerPool-1616-thread-20) [    ] o.a.s.c.a.AutoScalingHandler Verified autoscaling configuration
   [junit4]   2> 369665 DEBUG (simCloudManagerPool-1616-thread-20) [    ] o.a.s.c.a.OverseerTriggerThread Refreshing /autoscaling.json with znode version 3
   [junit4]   2> 369666 DEBUG (Simulated OverseerAutoScalingTriggerThread) [    ] o.a.s.c.a.OverseerTriggerThread Processed trigger updates upto znodeVersion 3
   [junit4]   2> 369666 DEBUG (Simulated OverseerAutoScalingTriggerThread) [    ] o.a.s.c.a.OverseerTriggerThread -- clean old nodeLost markers
   [junit4]   2> 369666 DEBUG (Simulated OverseerAutoScalingTriggerThread) [    ] o.a.s.c.a.OverseerTriggerThread -- clean old nodeAdded markers
   [junit4]   2> 369666 DEBUG (Simulated OverseerAutoScalingTriggerThread) [    ] o.a.s.c.a.OverseerTriggerThread Current znodeVersion 3, lastZnodeVersion 3
   [junit4]   2> 369669 DEBUG (simCloudManagerPool-1616-thread-21) [    ] o.a.s.c.a.AutoScalingHandler Verified autoscaling configuration
   [junit4]   2> 369669 DEBUG (simCloudManagerPool-1616-thread-21) [    ] o.a.s.c.a.OverseerTriggerThread Refreshing /autoscaling.json with znode version 4
   [junit4]   2> 369669 DEBUG (Simulated OverseerAutoScalingTriggerThread) [    ] o.a.s.c.a.OverseerTriggerThread Processed trigger updates upto znodeVersion 4
   [junit4]   2> 369669 DEBUG (Simulated OverseerAutoScalingTriggerThread) [    ] o.a.s.c.a.OverseerTriggerThread -- clean old nodeLost markers
   [junit4]   2> 369669 DEBUG (Simulated OverseerAutoScalingTriggerThread) [    ] o.a.s.c.a.OverseerTriggerThread -- clean old nodeAdded markers
   [junit4]   2> 369670 DEBUG (Simulated OverseerAutoScalingTriggerThread) [    ] o.a.s.c.a.OverseerTriggerThread Current znodeVersion 4, lastZnodeVersion 4
   [junit4]   2> 369710 DEBUG (ScheduledTrigger-1608-thread-3) [    ] o.a.s.c.a.NodeLostTrigger Running NodeLostTrigger: .auto_add_replicas with currently live nodes: 2
   [junit4]   2> 369835 DEBUG (ScheduledTrigger-1617-thread-4) [    ] o.a.s.c.a.ScheduledTriggers ++++++++ Cooldown inactive - processing event: {
   [junit4]   2>   "id":"4f04dbbbae59dT43vhp6y2aikhuy4h1i5n0fn3w",
   [junit4]   2>   "source":"index_size_trigger",
   [junit4]   2>   "eventTime":1390116559578525,
   [junit4]   2>   "eventType":"INDEXSIZE",
   [junit4]   2>   "properties":{
   [junit4]   2>     "aboveSize":{},
   [junit4]   2>     "belowSize":{"testMergeIntegration_collection":[
   [junit4]   2>         "{\"core_node1\":{\n    \"core\":\"testMergeIntegration_collection_shard1_replica_n1\",\n    \"leader\":\"true\",\n    \"SEARCHER.searcher.maxDoc\":7,\n    \"SEARCHER.searcher.deletedDocs\":5,\n    \"INDEX.sizeInBytes\":1,\n    \"__docs__\":2,\n    \"violationType\":\"belowDocs\",\n    \"node_name\":\"127.0.0.1:10000_solr\",\n    \"state\":\"active\",\n    \"type\":\"NRT\",\n    \"SEARCHER.searcher.numDocs\":2,\n    \"__bytes__\":1,\n    \"shard\":\"shard1\",\n    \"collection\":\"testMergeIntegration_collection\"}}",
   [junit4]   2>         "{\"core_node3\":{\n    \"core\":\"testMergeIntegration_collection_shard2_replica_n3\",\n    \"leader\":\"true\",\n    \"SEARCHER.searcher.maxDoc\":3,\n    \"SEARCHER.searcher.deletedDocs\":0,\n    \"INDEX.sizeInBytes\":1,\n    \"__docs__\":3,\n    \"violationType\":\"belowDocs\",\n    \"node_name\":\"127.0.0.1:10000_solr\",\n    \"state\":\"active\",\n    \"type\":\"NRT\",\n    \"SEARCHER.searcher.numDocs\":3,\n    \"__bytes__\":1,\n    \"shard\":\"shard2\",\n    \"collection\":\"testMergeIntegration_collection\"}}"]},
   [junit4]   2>     "requestedOps":["Op{action=MERGESHARDS, hints={COLL_SHARD=[{\n  \"first\":\"testMergeIntegration_collection\",\n  \"second\":\"shard2\"}, {\n  \"first\":\"testMergeIntegration_collection\",\n  \"second\":\"shard1\"}]}}"]}}
   [junit4]   2> 369835 DEBUG (ScheduledTrigger-1617-thread-4) [    ] o.a.s.c.a.ScheduledTriggers Pausing all triggers: [index_size_trigger]
   [junit4]   2> 369836 INFO  (ScheduledTrigger-1617-thread-4) [    ] o.a.s.c.a.IndexSizeTriggerTest =======> CapturedEvent{timestamp=1390125336166075, stage=STARTED, actionName='null', event={
   [junit4]   2>   "id":"4f04dbbbae59dT43vhp6y2aikhuy4h1i5n0fn3w",
   [junit4]   2>   "source":"index_size_trigger",
   [junit4]   2>   "eventTime":1390116559578525,
   [junit4]   2>   "eventType":"INDEXSIZE",
   [junit4]   2>   "properties":{
   [junit4]   2>     "aboveSize":{},
   [junit4]   2>     "belowSize":{"testMergeIntegration_collection":[
   [junit4]   2>         "{\"core_node1\":{\n    \"core\":\"testMergeIntegration_collection_shard1_replica_n1\",\n    \"leader\":\"true\",\n    \"SEARCHER.searcher.maxDoc\":7,\n    \"SEARCHER.searcher.deletedDocs\":5,\n    \"INDEX.sizeInBytes\":1,\n    \"__docs__\":2,\n    \"violationType\":\"belowDocs\",\n    \"node_name\":\"127.0.0.1:10000_solr\",\n    \"state\":\"active\",\n    \"type\":\"NRT\",\n    \"SEARCHER.searcher.numDocs\":2,\n    \"__bytes__\":1,\n    \"shard\":\"shard1\",\n    \"collection\":\"testMergeIntegration_collection\"}}",
   [junit4]   2>         "{\"core_node3\":{\n    \"core\":\"testMergeIntegration_collection_shard2_replica_n3\",\n    \"leader\":\"true\",\n    \"SEARCHER.searcher.maxDoc\":3,\n    \"SEARCHER.searcher.deletedDocs\":0,\n    \"INDEX.sizeInBytes\":1,\n    \"__docs__\":3,\n    \"violationType\":\"belowDocs\",\n    \"node_name\":\"127.0.0.1:10000_solr\",\n    \"state\":\"active\",\n    \"type\":\"NRT\",\n    \"SEARCHER.searcher.numDocs\":3,\n    \"__bytes__\":1,\n    \"shard\":\"shard2\",\n    \"collection\":\"testMergeIntegration_collection\"}}"]},
   [junit4]   2>     "_enqueue_time_":1390125294974275,
   [junit4]   2>     "requestedOps":["Op{action=MERGESHARDS, hints={COLL_SHARD=[{\n  \"first\":\"testMergeIntegration_collection\",\n  \"second\":\"shard2\"}, {\n  \"first\":\"testMergeIntegration_collection\",\n  \"second\":\"shard1\"}]}}"]}}, context={}, config={
   [junit4]   2>   "trigger":"index_size_trigger",
   [junit4]   2>   "stage":[
   [junit4]   2>     "STARTED",
   [junit4]   2>     "ABORTED",
   [junit4]   2>     "SUCCEEDED",
   [junit4]   2>     "FAILED"],
   [junit4]   2>   "afterAction":[
   [junit4]   2>     "compute_plan",
   [junit4]   2>     "execute_plan"],
   [junit4]   2>   "class":"org.apache.solr.cloud.autoscaling.IndexSizeTriggerTest$CapturingTriggerListener",
   [junit4]   2>   "beforeAction":[
   [junit4]   2>     "compute_plan",
   [junit4]   2>     "execute_plan"]}, message='null'}
   [junit4]   2> 369840 DEBUG (AutoscalingActionExecutor-1618-thread-1) [    ] o.a.s.c.a.ScheduledTriggers -- processing actions for {
   [junit4]   2>   "id":"4f04dbbbae59dT43vhp6y2aikhuy4h1i5n0fn3w",
   [junit4]   2>   "source":"index_size_trigger",
   [junit4]   2>   "eventTime":1390116559578525,
   [junit4]   2>   "eventType":"INDEXSIZE",
   [junit4]   2>   "properties":{
   [junit4]   2>     "aboveSize":{},
   [junit4]   2>     "belowSize":{"testMergeIntegration_collection":[
   [junit4]   2>         "{\"core_node1\":{\n    \"core\":\"testMergeIntegration_collection_shard1_replica_n1\",\n    \"leader\":\"true\",\n    \"SEARCHER.searcher.maxDoc\":7,\n    \"SEARCHER.searcher.deletedDocs\":5,\n    \"INDEX.sizeInBytes\":1,\n    \"__docs__\":2,\n    \"violationType\":\"belowDocs\",\n    \"node_name\":\"127.0.0.1:10000_solr\",\n    \"state\":\"active\",\n    \"type\":\"NRT\",\n    \"SEARCHER.searcher.numDocs\":2,\n    \"__bytes__\":1,\n    \"shard\":\"shard1\",\n    \"collection\":\"testMergeIntegration_collection\"}}",
   [junit4]   2>         "{\"core_node3\":{\n    \"core\":\"testMergeIntegration_collection_shard2_replica_n3\",\n    \"leader\":\"true\",\n    \"SEARCHER.searcher.maxDoc\":3,\n    \"SEARCHER.searcher.deletedDocs\":0,\n    \"INDEX.sizeInBytes\":1,\n    \"__docs__\":3,\n    \"violationType\":\"belowDocs\",\n    \"node_name\":\"127.0.0.1:10000_solr\",\n    \"state\":\"active\",\n    \"type\":\"NRT\",\n    \"SEARCHER.searcher.numDocs\":3,\n    \"__bytes__\":1,\n    \"shard\":\"shard2\",\n    \"collection\":\"testMergeIntegration_collection\"}}"]},
   [junit4]   2>     "_enqueue_time_":1390125294974275,
   [junit4]   2>     "requestedOps":["Op{action=MERGESHARDS, hints={COLL_SHARD=[{\n  \"first\":\"testMergeIntegration_collection\",\n  \"second\":\"shard2\"}, {\n  \"first\":\"testMergeIntegration_collection\",\n  \"second\":\"shard1\"}]}}"]}}
   [junit4]   2> 369841 INFO  (AutoscalingActionExecutor-1618-thread-1) [    ] o.a.s.c.a.IndexSizeTriggerTest =======> CapturedEvent{timestamp=1390125553595975, stage=BEFORE_ACTION, actionName='compute_plan', event={
   [junit4]   2>   "id":"4f04dbbbae59dT43vhp6y2aikhuy4h1i5n0fn3w",
   [junit4]   2>   "source":"index_size_trigger",
   [junit4]   2>   "eventTime":1390116559578525,
   [junit4]   2>   "eventType":"INDEXSIZE",
   [junit4]   2>   "properties":{
   [junit4]   2>     "aboveSize":{},
   [junit4]   2>     "belowSize":{"testMergeIntegration_collection":[
   [junit4]   2>         "{\"core_node1\":{\n    \"core\":\"testMergeIntegration_collection_shard1_replica_n1\",\n    \"leader\":\"true\",\n    \"SEARCHER.searcher.maxDoc\":7,\n    \"SEARCHER.searcher.deletedDocs\":5,\n    \"INDEX.sizeInBytes\":1,\n    \"__docs__\":2,\n    \"violationType\":\"belowDocs\",\n    \"node_name\":\"127.0.0.1:10000_solr\",\n    \"state\":\"active\",\n    \"type\":\"NRT\",\n    \"SEARCHER.searcher.numDocs\":2,\n    \"__bytes__\":1,\n    \"shard\":\"shard1\",\n    \"collection\":\"testMergeIntegration_collection\"}}",
   [junit4]   2>         "{\"core_node3\":{\n    \"core\":\"testMergeIntegration_collection_shard2_replica_n3\",\n    \"leader\":\"true\",\n    \"SEARCHER.searcher.maxDoc\":3,\n    \"SEARCHER.searcher.deletedDocs\":0,\n    \"INDEX.sizeInBytes\":1,\n    \"__docs__\":3,\n    \"violationType\":\"belowDocs\",\n    \"node_name\":\"127.0.0.1:10000_solr\",\n    \"state\":\"active\",\n    \"type\":\"NRT\",\n    \"SEARCHER.searcher.numDocs\":3,\n    \"__bytes__\":1,\n    \"shard\":\"shard2\",\n    \"collection\":\"testMergeIntegration_collection\"}}"]},
   [junit4]   2>     "_enqueue_time_":1390125294974275,
   [junit4]   2>     "requestedOps":["Op{action=MERGESHARDS, hints={COLL_SHARD=[{\n  \"first\":\"testMergeIntegration_collection\",\n  \"second\":\"shard2\"}, {\n  \"first\":\"testMergeIntegration_collection\",\n  \"second\":\"shard1\"}]}}"]}}, context={properties.BEFORE_ACTION=[compute_plan], source=index_size_trigger}, config={
   [junit4]   2>   "trigger":"index_size_trigger",
   [junit4]   2>   "stage":[
   [junit4]   2>     "STARTED",
   [junit4]   2>     "ABORTED",
   [junit4]   2>     "SUCCEEDED",
   [junit4]   2>     "FAILED"],
   [junit4]   2>   "afterAction":[
   [junit4]   2>     "compute_plan",
   [junit4]   2>     "execute_plan"],
   [junit4]   2>   "class":"org.apache.solr.cloud.autoscaling.IndexSizeTriggerTest$CapturingTriggerListener",
   [junit4]   2>   "beforeAction":[
   [junit4]   2>     "compute_plan",
   [junit4]   2>     "execute_plan"]}, message='null'}
   [junit4]   2> 369841 DEBUG (AutoscalingActionExecutor-1618-thread-1) [    ] o.a.s.c.a.ComputePlanAction -- processing event: {
   [junit4]   2>   "id":"4f04dbbbae59dT43vhp6y2aikhuy4h1i5n0fn3w",
   [junit4]   2>   "source":"index_size_trigger",
   [junit4]   2>   "eventTime":1390116559578525,
   [junit4]   2>   "eventType":"INDEXSIZE",
   [junit4]   2>   "properties":{
   [junit4]   2>     "aboveSize":{},
   [junit4]   2>     "belowSize":{"testMergeIntegration_collection":[
   [junit4]   2>         "{\"core_node1\":{\n    \"core\":\"testMergeIntegration_collection_shard1_replica_n1\",\n    \"leader\":\"true\",\n    \"SEARCHER.searcher.maxDoc\":7,\n    \"SEARCHER.searcher.deletedDocs\":5,\n    \"INDEX.sizeInBytes\":1,\n    \"__docs__\":2,\n    \"violationType\":\"belowDocs\",\n    \"node_name\":\"127.0.0.1:10000_solr\",\n    \"state\":\"active\",\n    \"type\":\"NRT\",\n    \"SEARCHER.searcher.numDocs\":2,\n    \"__bytes__\":1,\n    \"shard\":\"shard1\",\n    \"collection\":\"testMergeIntegration_collection\"}}",
   [junit4]   2>         "{\"core_node3\":{\n    \"core\":\"testMergeIntegration_collection_shard2_replica_n3\",\n    \"leader\":\"true\",\n    \"SEARCHER.searcher.maxDoc\":3,\n    \"SEARCHER.searcher.deletedDocs\":0,\n    \"INDEX.sizeInBytes\":1,\n    \"__docs__\":3,\n    \"violationType\":\"belowDocs\",\n    \"node_name\":\"127.0.0.1:10000_solr\",\n    \"state\":\"active\",\n    \"type\":\"NRT\",\n    \"SEARCHER.searcher.numDocs\":3,\n    \"__bytes__\":1,\n    \"shard\":\"shard2\",\n    \"collection\":\"testMergeIntegration_collection\"}}"]},
   [junit4]   2>     "_enqueue_time_":1390125294974275,
   [junit4]   2>     "requestedOps":["Op{action=MERGESHARDS, hints={COLL_SHARD=[{\n  \"first\":\"testMergeIntegration_collection\",\n  \"second\":\"shard2\"}, {\n  \"first\":\"testMergeIntegration_collection\",\n  \"second\":\"shard1\"}]}}"]}} with context properties: {BEFORE_ACTION=[compute_plan]}
   [junit4]   2> 369843 INFO  (AutoscalingActionExecutor-1618-thread-1) [    ] o.a.s.c.a.ComputePlanAction Computed plan empty, remained 0 requested ops to try.
   [junit4]   2> 369843 INFO  (AutoscalingActionExecutor-1618-thread-1) [    ] o.a.s.c.s.c.a.PolicyHelper returnSession, curr-time 1390125671 sessionWrapper.createTime 1390125591591325, this.sessionWrapper.createTime 1390125591591325 
   [junit4]   2> 369843 INFO  (AutoscalingActionExecutor-1618-thread-1) [    ] o.a.s.c.a.IndexSizeTriggerTest =======> CapturedEvent{timestamp=1390125674329075, stage=AFTER_ACTION, actionName='compute_plan', event={
   [junit4]   2>   "id":"4f04dbbbae59dT43vhp6y2aikhuy4h1i5n0fn3w",
   [junit4]   2>   "source":"index_size_trigger",
   [junit4]   2>   "eventTime":1390116559578525,
   [junit4]   2>   "eventType":"INDEXSIZE",
   [junit4]   2>   "properties":{
   [junit4]   2>     "__start__":1,
   [junit4]   2>     "aboveSize":{},
   [junit4]   2>     "belowSize":{"testMergeIntegration_collection":[
   [junit4]   2>         "{\"core_node1\":{\n    \"core\":\"testMergeIntegration_collection_shard1_replica_n1\",\n    \"leader\":\"true\",\n    \"SEARCHER.searcher.maxDoc\":7,\n    \"SEARCHER.searcher.deletedDocs\":5,\n    \"INDEX.sizeInBytes\":1,\n    \"__docs__\":2,\n    \"violationType\":\"belowDocs\",\n    \"node_name\":\"127.0.0.1:10000_solr\",\n    \"state\":\"active\",\n    \"type\":\"NRT\",\n    \"SEARCHER.searcher.numDocs\":2,\n    \"__bytes__\":1,\n    \"shard\":\"shard1\",\n    \"collection\":\"testMergeIntegration_collection\"}}",
   [junit4]   2>         "{\"core_node3\":{\n    \"core\":\"testMergeIntegration_collection_shard2_replica_n3\",\n    \"leader\":\"true\",\n    \"SEARCHER.searcher.maxDoc\":3,\n    \"SEARCHER.searcher.deletedDocs\":0,\n    \"INDEX.sizeInBytes\":1,\n    \"__docs__\":3,\n    \"violationType\":\"belowDocs\",\n    \"node_name\":\"127.0.0.1:10000_solr\",\n    \"state\":\"active\",\n    \"type\":\"NRT\",\n    \"SEARCHER.searcher.numDocs\":3,\n    \"__bytes__\":1,\n    \"shard\":\"shard2\",\n    \"collection\":\"testMergeIntegration_collection\"}}"]},
   [junit4]   2>     "_enqueue_time_":1390125294974275,
   [junit4]   2>     "requestedOps":["Op{action=MERGESHARDS, hints={COLL_SHARD=[{\n  \"first\":\"testMergeIntegration_collection\",\n  \"second\":\"shard2\"}, {\n  \"first\":\"testMergeIntegration_collection\",\n  \"second\":\"shard1\"}]}}"]}}, context={properties.unsupportedOps=[Op{action=MERGESHARDS, hints={COLL_SHARD=[{
   [junit4]   2>   "first":"testMergeIntegration_collection",
   [junit4]   2>   "second":"shard2"}, {
   [junit4]   2>   "first":"testMergeIntegration_collection",
   [junit4]   2>   "second":"shard1"}]}}], properties.BEFORE_ACTION=[compute_plan], source=index_size_trigger, properties.AFTER_ACTION=[compute_plan]}, config={
   [junit4]   2>   "trigger":"index_size_trigger",
   [junit4]   2>   "stage":[
   [junit4]   2>     "STARTED",
   [junit4]   2>     "ABORTED",
   [junit4]   2>     "SUCCEEDED",
   [junit4]   2>     "FAILED"],
   [junit4]   2>   "afterAction":[
   [junit4]   2>     "compute_plan",
   [junit4]   2>     "execute_plan"],
   [junit4]   2>   "class":"org.apache.solr.cloud.autoscaling.IndexSizeTriggerTest$CapturingTriggerListener",
   [junit4]   2>   "beforeAction":[
   [junit4]   2>     "compute_plan",
   [junit4]   2>     "execute_plan"]}, message='null'}
   [junit4]   2> 369843 INFO  (AutoscalingActionExecutor-1618-thread-1) [    ] o.a.s.c.a.IndexSizeTriggerTest =======> CapturedEvent{timestamp=1390125689951475, stage=BEFORE_ACTION, actionName='execute_plan', event={
   [junit4]   2>   "id":"4f04dbbbae59dT43vhp6y2aikhuy4h1i5n0fn3w",
   [junit4]   2>   "source":"index_size_trigger",
   [junit4]   2>   "eventTime":1390116559578525,
   [junit4]   2>   "eventType":"INDEXSIZE",
   [junit4]   2>   "properties":{
   [junit4]   2>     "__start__":1,
   [junit4]   2>     "aboveSize":{},
   [junit4]   2>     "belowSize":{"testMergeIntegration_collection":[
   [junit4]   2>         "{\"core_node1\":{\n    \"core\":\"testMergeIntegration_collection_shard1_replica_n1\",\n    \"leader\":\"true\",\n    \"SEARCHER.searcher.maxDoc\":7,\n    \"SEARCHER.searcher.deletedDocs\":5,\n    \"INDEX.sizeInBytes\":1,\n    \"__docs__\":2,\n    \"violationType\":\"belowDocs\",\n    \"node_name\":\"127.0.0.1:10000_solr\",\n    \"state\":\"active\",\n    \"type\":\"NRT\",\n    \"SEARCHER.searcher.numDocs\":2,\n    \"__bytes__\":1,\n    \"shard\":\"shard1\",\n    \"collection\":\"testMergeIntegration_collection\"}}",
   [junit4]   2>         "{\"core_node3\":{\n    \"core\":\"testMergeIntegration_collection_shard2_replica_n3\",\n    \"leader\":\"true\",\n    \"SEARCHER.searcher.maxDoc\":3,\n    \"SEARCHER.searcher.deletedDocs\":0,\n    \"INDEX.sizeInBytes\":1,\n    \"__docs__\":3,\n    \"violationType\":\"belowDocs\",\n    \"node_name\":\"127.0.0.1:10000_solr\",\n    \"state\":\"active\",\n    \"type\":\"NRT\",\n    \"SEARCHER.searcher.numDocs\":3,\n    \"__bytes__\":1,\n    \"shard\":\"shard2\",\n    \"collection\":\"testMergeIntegration_collection\"}}"]},
   [junit4]   2>     "_enqueue_time_":1390125294974275,
   [junit4]   2>     "requestedOps":["Op{action=MERGESHARDS, hints={COLL_SHARD=[{\n  \"first\":\"testMergeIntegration_collection\",\n  \"second\":\"shard2\"}, {\n  \"first\":\"testMergeIntegration_collection\",\n  \"second\":\"shard1\"}]}}"]}}, context={properties.unsupportedOps=[Op{action=MERGESHARDS, hints={COLL_SHARD=[{
   [junit4]   2>   "first":"testMergeIntegration_collection",
   [junit4]   2>   "second":"shard2"}, {
   [junit4]   2>   "first":"testMergeIntegration_collection",
   [junit4]   2>   "second":"shard1"}]}}], properties.BEFORE_ACTION=[compute_plan, execute_plan], source=index_size_trigger, properties.AFTER_ACTION=[compute_plan]}, config={
   [junit4]   2>   "trigger":"index_size_trigger",
   [junit4]   2>   "stage":[
   [junit4]   2>     "STARTED",
   [junit4]   2>     "ABORTED",
   [junit4]   2>     "SUCCEEDED",
   [junit4]   2>     "FAILED"],
   [junit4]   2>   "afterAction":[
   [junit4]   2>     "compute_plan",
   [junit4]   2>     "execute_plan"],
   [junit4]   2>   "class":"org.apache.solr.cloud.autoscaling.IndexSizeTriggerTest$CapturingTriggerListener",
   [junit4]   2>   "beforeAction":[
   [junit4]   2>     "compute_plan",
   [junit4]   2>     "execute_plan"]}, message='null'}
   [junit4]   2> 369843 DEBUG (AutoscalingActionExecutor-1618-thread-1) [    ] o.a.s.c.a.ExecutePlanAction -- processing event: {
   [junit4]   2>   "id":"4f04dbbbae59dT43vhp6y2aikhuy4h1i5n0fn3w",
   [junit4]   2>   "source":"index_size_trigger",
   [junit4]   2>   "eventTime":1390116559578525,
   [junit4]   2>   "eventType":"INDEXSIZE",
   [junit4]   2>   "properties":{
   [junit4]   2>     "__start__":1,
   [junit4]   2>     "aboveSize":{},
   [junit4]   2>     "belowSize":{"testMergeIntegration_collection":[
   [junit4]   2>         "{\"core_node1\":{\n    \"core\":\"testMergeIntegration_collection_shard1_replica_n1\",\n    \"leader\":\"true\",\n    \"SEARCHER.searcher.maxDoc\":7,\n    \"SEARCHER.searcher.deletedDocs\":5,\n    \"INDEX.sizeInBytes\":1,\n    \"__docs__\":2,\n    \"violationType\":\"belowDocs\",\n    \"node_name\":\"127.0.0.1:10000_solr\",\n    \"state\":\"active\",\n    \"type\":\"NRT\",\n    \"SEARCHER.searcher.numDocs\":2,\n    \"__bytes__\":1,\n    \"shard\":\"shard1\",\n    \"collection\":\"testMergeIntegration_collection\"}}",
   [junit4]   2>         "{\"core_node3\":{\n    \"core\":\"testMergeIntegration_collection_shard2_replica_n3\",\n    \"leader\":\"true\",\n    \"SEARCHER.searcher.maxDoc\":3,\n    \"SEARCHER.searcher.deletedDocs\":0,\n    \"INDEX.sizeInBytes\":1,\n    \"__docs__\":3,\n    \"violationType\":\"belowDocs\",\n    \"node_name\":\"127.0.0.1:10000_solr\",\n    \"state\":\"active\",\n    \"type\":\"NRT\",\n    \"SEARCHER.searcher.numDocs\":3,\n    \"__bytes__\":1,\n    \"shard\":\"shard2\",\n    \"collection\":\"testMergeIntegration_collection\"}}"]},
   [junit4]   2>     "_enqueue_time_":1390125294974275,
   [junit4]   2>     "requestedOps":["Op{action=MERGESHARDS, hints={COLL_SHARD=[{\n  \"first\":\"testMergeIntegration_collection\",\n  \"second\":\"shard2\"}, {\n  \"first\":\"testMergeIntegration_collection\",\n  \"second\":\"shard1\"}]}}"]}} with context properties: {AFTER_ACTION=[compute_plan], unsupportedOps=[Op{action=MERGESHARDS, hints={COLL_SHARD=[{
   [junit4]   2>   "first":"testMergeIntegration_collection",
   [junit4]   2>   "second":"shard2"}, {
   [junit4]   2>   "first":"testMergeIntegration_collection",
   [junit4]   2>   "second":"shard1"}]}}], BEFORE_ACTION=[compute_plan, execute_plan]}
   [junit4]   2> 369844 INFO  (AutoscalingActionExecutor-1618-thread-1) [    ] o.a.s.c.a.ExecutePlanAction No operations to execute for event: {
   [junit4]   2>   "id":"4f04dbbbae59dT43vhp6y2aikhuy4h1i5n0fn3w",
   [junit4]   2>   "source":"index_size_trigger",
   [junit4]   2>   "eventTime":1390116559578525,
   [junit4]   2>   "eventType":"INDEXSIZE",
   [junit4]   2>   "properties":{
   [junit4]   2>     "__start__":1,
   [junit4]   2>     "aboveSize":{},
   [junit4]   2>     "belowSize":{"testMergeIntegration_collection":[
   [junit4]   2>         "{\"core_node1\":{\n    \"core\":\"testMergeIntegration_collection_shard1_replica_n1\",\n    \"leader\":\"true\",\n    \"SEARCHER.searcher.maxDoc\":7,\n    \"SEARCHER.searcher.deletedDocs\":5,\n    \"INDEX.sizeInBytes\":1,\n    \"__docs__\":2,\n    \"violationType\":\"belowDocs\",\n    \"node_name\":\"127.0.0.1:10000_solr\",\n    \"state\":\"active\",\n    \"type\":\"NRT\",\n    \"SEARCHER.searcher.numDocs\":2,\n    \"__bytes__\":1,\n    \"shard\":\"shard1\",\n    \"collection\":\"testMergeIntegration_collection\"}}",
   [junit4]   2>         "{\"core_node3\":{\n    \"core\":\"testMergeIntegration_collection_shard2_replica_n3\",\n    \"leader\":\"true\",\n    \"SEARCHER.searcher.maxDoc\":3,\n    \"SEARCHER.searcher.deletedDocs\":0,\n    \"INDEX.sizeInBytes\":1,\n    \"__docs__\":3,\n    \"violationType\":\"belowDocs\",\n    \"node_name\":\"127.0.0.1:10000_solr\",\n    \"state\":\"active\",\n    \"type\":\"NRT\",\n    \"SEARCHER.searcher.numDocs\":3,\n    \"__bytes__\":1,\n    \"shard\":\"shard2\",\n    \"collection\":\"testMergeIntegration_collection\"}}"]},
   [junit4]   2>     "_enqueue_time_":1390125294974275,
   [junit4]   2>     "requestedOps":["Op{action=MERGESHARDS, hints={COLL_SHARD=[{\n  \"first\":\"testMergeIntegration_collection\",\n  \"second\":\"shard2\"}, {\n  \"first\":\"testMergeIntegration_collection\",\n  \"second\":\"shard1\"}]}}"]}}
   [junit4]   2> 369844 INFO  (AutoscalingActionExecutor-1618-thread-1) [    ] o.a.s.c.a.IndexSizeTriggerTest =======> CapturedEvent{timestamp=1390125729496525, stage=AFTER_ACTION, actionName='execute_plan', event={
   [junit4]   2>   "id":"4f04dbbbae59dT43vhp6y2aikhuy4h1i5n0fn3w",
   [junit4]   2>   "source":"index_size_trigger",
   [junit4]   2>   "eventTime":1390116559578525,
   [junit4]   2>   "eventType":"INDEXSIZE",
   [junit4]   2>   "properties":{
   [junit4]   2>     "__start__":1,
   [junit4]   2>     "aboveSize":{},
   [junit4]   2>     "belowSize":{"testMergeIntegration_collection":[
   [junit4]   2>         "{\"core_node1\":{\n    \"core\":\"testMergeIntegration_collection_shard1_replica_n1\",\n    \"leader\":\"true\",\n    \"SEARCHER.searcher.maxDoc\":7,\n    \"SEARCHER.searcher.deletedDocs\":5,\n    \"INDEX.sizeInBytes\":1,\n    \"__docs__\":2,\n    \"violationType\":\"belowDocs\",\n    \"node_name\":\"127.0.0.1:10000_solr\",\n    \"state\":\"active\",\n    \"type\":\"NRT\",\n    \"SEARCHER.searcher.numDocs\":2,\n    \"__bytes__\":1,\n    \"shard\":\"shard1\",\n    \"collection\":\"testMergeIntegration_collection\"}}",
   [junit4]   2>         "{\"core_node3\":{\n    \"core\":\"testMergeIntegration_collection_shard2_replica_n3\",\n    \"leader\":\"true\",\n    \"SEARCHER.searcher.maxDoc\":3,\n    \"SEARCHER.searcher.deletedDocs\":0,\n    \"INDEX.sizeInBytes\":1,\n    \"__docs__\":3,\n    \"violationType\":\"belowDocs\",\n    \"node_name\":\"127.0.0.1:10000_solr\",\n    \"state\":\"active\",\n    \"type\":\"NRT\",\n    \"SEARCHER.searcher.numDocs\":3,\n    \"__bytes__\":1,\n    \"shard\":\"shard2\",\n    \"collection\":\"testMergeIntegration_collection\"}}"]},
   [junit4]   2>     "_enqueue_time_":1390125294974275,
   [junit4]   2>     "requestedOps":["Op{action=MERGESHARDS, hints={COLL_SHARD=[{\n  \"first\":\"testMergeIntegration_collection\",\n  \"second\":\"shard2\"}, {\n  \"first\":\"testMergeIntegration_collection\",\n  \"second\":\"shard1\"}]}}"]}}, context={properties.unsupportedOps=[Op{action=MERGESHARDS, hints={COLL_SHARD=[{
   [junit4]   2>   "first":"testMergeIntegration_collection",
   [junit4]   2>   "second":"shard2"}, {
   [junit4]   2>   "first":"testMergeIntegration_collection",
   [junit4]   2>   "second":"shard1"}]}}], properties.BEFORE_ACTION=[compute_plan, execute_plan], source=index_size_trigger, properties.AFTER_ACTION=[compute_plan, execute_plan]}, config={
   [junit4]   2>   "trigger":"index_size_trigger",
   [junit4]   2>   "stage":[
   [junit4]   2>     "STARTED",
   [junit4]   2>     "ABORTED",
   [junit4]   2>     "SUCCEEDED",
   [junit4]   2>     "FAILED"],
   [junit4]   2>   "afterAction":[
   [junit4]   2>     "compute_plan",
   [junit4]   2>     "execute_plan"],
   [junit4]   2>   "class":"org.apache.solr.cloud.autoscaling.IndexSizeTriggerTest$CapturingTriggerListener",
   [junit4]   2>   "beforeAction":[
   [junit4]   2>     "compute_plan",
   [junit4]   2>     "execute_plan"]}, message='null'}
   [junit4]   2> 369844 INFO  (AutoscalingActionExecutor-1618-thread-1) [    ] o.a.s.c.a.IndexSizeTriggerTest =======> CapturedEvent{timestamp=1390125747924525, stage=SUCCEEDED, actionName='null', event={
   [junit4]   2>   "id":"4f04dbbbae59dT43vhp6y2aikhuy4h1i5n0fn3w",
   [junit4]   2>   "source":"index_size_trigger",
   [junit4]   2>   "eventTime":1390116559578525,
   [junit4]   2>   "eventType":"INDEXSIZE",
   [junit4]   2>   "properties":{
   [junit4]   2>     "__start__":1,
   [junit4]   2>     "aboveSize":{},
   [junit4]   2>     "belowSize":{"testMergeIntegration_collection":[
   [junit4]   2>         "{\"core_node1\":{\n    \"core\":\"testMergeIntegration_collection_shard1_replica_n1\",\n    \"leader\":\"true\",\n    \"SEARCHER.searcher.maxDoc\":7,\n    \"SEARCHER.searcher.deletedDocs\":5,\n    \"INDEX.sizeInBytes\":1,\n    \"__docs__\":2,\n    \"violationType\":\"belowDocs\",\n    \"node_name\":\"127.0.0.1:10000_solr\",\n    \"state\":\"active\",\n    \"type\":\"NRT\",\n    \"SEARCHER.searcher.numDocs\":2,\n    \"__bytes__\":1,\n    \"shard\":\"shard1\",\n    \"collection\":\"testMergeIntegration_collection\"}}",
   [junit4]   2>         "{\"core_node3\":{\n    \"core\":\"testMergeIntegration_collection_shard2_replica_n3\",\n    \"leader\":\"true\",\n    \"SEARCHER.searcher.maxDoc\":3,\n    \"SEARCHER.searcher.deletedDocs\":0,\n    \"INDEX.sizeInBytes\":1,\n    \"__docs__\":3,\n    \"violationType\":\"belowDocs\",\n    \"node_name\":\"127.0.0.1:10000_solr\",\n    \"state\":\"active\",\n    \"type\":\"NRT\",\n    \"SEARCHER.searcher.numDocs\":3,\n    \"__bytes__\":1,\n    \"shard\":\"shard2\",\n    \"collection\":\"testMergeIntegration_collection\"}}"]},
   [junit4]   2>     "_enqueue_time_":1390125294974275,
   [junit4]   2>     "requestedOps":["Op{action=MERGESHARDS, hints={COLL_SHARD=[{\n  \"first\":\"testMergeIntegration_collection\",\n  \"second\":\"shard2\"}, {\n  \"first\":\"testMergeIntegration_collection\",\n  \"second\":\"shard1\"}]}}"]}}, context={}, config={
   [junit4]   2>   "trigger":"index_size_trigger",
   [junit4]   2>   "stage":[
   [junit4]   2>     "STARTED",
   [junit4]   2>     "ABORTED",
   [junit4]   2>     "SUCCEEDED",
   [junit4]   2>     "FAILED"],
   [junit4]   2>   "afterAction":[
   [junit4]   2>     "compute_plan",
   [junit4]   2>     "execute_plan"],
   [junit4]   2>   "class":"org.apache.solr.cloud.autoscaling.IndexSizeTriggerTest$CapturingTriggerListener",
   [junit4]   2>   "beforeAction":[
   [junit4]   2>     "compute_plan",
   [junit4]   2>     "execute_plan"]}, message='null'}
   [junit4]   2> 369845 DEBUG (AutoscalingActionExecutor-1618-thread-1) [    ] o.a.s.c.a.ScheduledTriggers Resuming trigger: index_size_trigger after 100ms
   [junit4]   2> 369845 DEBUG (AutoscalingActionExecutor-1618-thread-1) [    ] o.a.s.c.a.ScheduledTriggers -- processing took 282 ms for event id=4f04dbbbae59dT43vhp6y2aikhuy4h1i5n0fn3w
   [junit4]   2> 369865 INFO  (TEST-IndexSizeTriggerTest.testMergeIntegration-seed#[975A58BABAE12C70]) [    ] o.a.s.c.a.IndexSizeTriggerTest #######################################
   [junit4]   2> ############ CLUSTER STATE ############
   [junit4]   2> #######################################
   [junit4]   2> ## Live nodes:		2
   [junit4]   2> ## Empty nodes:	0
   [junit4]   2> ## Dead nodes:		0
   [junit4]   2> ## Collections:	[testMergeIntegration_collection]
   [junit4]   2> DocCollection(testMergeIntegration_collection//clusterstate.json/21)={
   [junit4]   2>   "replicationFactor":"2",
   [junit4]   2>   "pullReplicas":"0",
   [junit4]   2>   "router":{"name":"compositeId"},
   [junit4]   2>   "maxShardsPerNode":"2",
   [junit4]   2>   "autoAddReplicas":"false",
   [junit4]   2>   "nrtReplicas":"2",
   [junit4]   2>   "tlogReplicas":"0",
   [junit4]   2>   "autoCreated":"true",
   [junit4]   2>   "shards":{
   [junit4]   2>     "shard2":{
   [junit4]   2>       "replicas":{
   [junit4]   2>         "core_node3":{
   [junit4]   2>           "core":"testMergeIntegration_collection_shard2_replica_n3",
   [junit4]   2>           "leader":"true",
   [junit4]   2>           "SEARCHER.searcher.maxDoc":3,
   [junit4]   2>           "SEARCHER.searcher.deletedDocs":0,
   [junit4]   2>           "INDEX.sizeInBytes":1,
   [junit4]   2>           "node_name":"127.0.0.1:10000_solr",
   [junit4]   2>           "state":"active",
   [junit4]   2>           "type":"NRT",
   [junit4]   2>           "SEARCHER.searcher.numDocs":3},
   [junit4]   2>         "core_node4":{
   [junit4]   2>           "core":"testMergeIntegration_collection_shard2_replica_n4",
   [junit4]   2>           "SEARCHER.searcher.maxDoc":3,
   [junit4]   2>           "SEARCHER.searcher.deletedDocs":0,
   [junit4]   2>           "INDEX.sizeInBytes":1,
   [junit4]   2>           "node_name":"127.0.0.1:10001_solr",
   [junit4]   2>           "state":"active",
   [junit4]   2>           "type":"NRT",
   [junit4]   2>           "SEARCHER.searcher.numDocs":3}},
   [junit4]   2>       "range":"0-7fffffff",
   [junit4]   2>       "state":"active"},
   [junit4]   2>     "shard1":{
   [junit4]   2>       "replicas":{
   [junit4]   2>         "core_node1":{
   [junit4]   2>           "core":"testMergeIntegration_collection_shard1_replica_n1",
   [junit4]   2>           "leader":"true",
   [junit4]   2>           "SEARCHER.searcher.maxDoc":7,
   [junit4]   2>           "SEARCHER.searcher.deletedDocs":5,
   [junit4]   2>           "INDEX.sizeInBytes":1,
   [junit4]   2>           "node_name":"127.0.0.1:10000_solr",
   [junit4]   2>           "state":"active",
   [junit4]   2>           "type":"NRT",
   [junit4]   2>           "SEARCHER.searcher.numDocs":2},
   [junit4]   2>         "core_node2":{
   [junit4]   2>           "core":"testMergeIntegration_collection_shard1_replica_n2",
   [junit4]   2>           "SEARCHER.searcher.maxDoc":7,
   [junit4]   2>           "SEARCHER.searcher.deletedDocs":5,
   [junit4]   2>           "INDEX.sizeInBytes":1,
   [junit4]   2>           "node_name":"127.0.0.1:10001_solr",
   [junit4]   2>           "state":"active",
   [junit4]   2>           "type":"NRT",
   [junit4]   2>           "SEARCHER.searcher.numDocs":2}},
   [junit4]   2>       "range":"80000000-ffffffff",
   [junit4]   2>       "state":"active"}}}
   [junit4]   2> ## Max replicas per node:	2
   [junit4]   2> ## Min replicas per node:	2
   [junit4]   2> ## Total replicas:		4
   [junit4]   2> ## * testMergeIntegration_collection		4
   [junit4]   2> ##		- active           4
   [junit4]   2> ######### Solr op counts ##########
   [junit4]   2> ##		- CREATE             1
   [junit4]   2> ##		- autoscaling        3
   [junit4]   2> ##		- update            19
   [junit4]   2> ######### Autoscaling event counts ###########
   [junit4]   2> ## * Trigger: index_size_trigger
   [junit4]   2> ##		- STARTED         1
   [junit4]   2> ##		- SUCCEEDED       1
   [junit4]   2> 
   [junit4]   2> 369866 DEBUG (TEST-IndexSizeTriggerTest.testMergeIntegration-seed#[975A58BABAE12C70]) [    ] o.a.s.c.a.OverseerTriggerThread Refreshing /autoscaling.json with znode version 5
   [junit4]   2> 369866 DEBUG (Simulated OverseerAutoScalingTriggerThread) [    ] o.a.s.c.a.OverseerTriggerThread Processed trigger updates upto znodeVersion 5
   [junit4]   2> 369866 DEBUG (Simulated OverseerAutoScalingTriggerThread) [    ] o.a.s.c.a.OverseerTriggerThread -- clean old nodeLost markers
   [junit4]   2> 369866 DEBUG (Simulated OverseerAutoScalingTriggerThread) [    ] o.a.s.c.a.OverseerTriggerThread -- clean old nodeAdded markers
   [junit4]   2> 369866 DEBUG (Simulated OverseerAutoScalingTriggerThread) [    ] o.a.s.c.a.OverseerTriggerThread Current znodeVersion 5, lastZnodeVersion 5
   [junit4]   2> 369967 INFO  (TEST-IndexSizeTriggerTest.testMergeIntegration-seed#[975A58BABAE12C70]) [    ] o.a.s.SolrTestCaseJ4 ###Ending testMergeIntegration
   [junit4]   2> 369993 INFO  (TEST-IndexSizeTriggerTest.testSplitIntegration-seed#[975A58BABAE12C70]) [    ] o.a.s.SolrTestCaseJ4 ###Starting testSplitIntegration
   [junit4]   2> 370032 DEBUG (simCloudManagerPool-1616-thread-36) [    ] o.a.s.c.a.s.SimClusterStateProvider -- elected new leader for testSplitIntegration_collection / shard1: {"core_node1":{
   [junit4]   2>     "core":"testSplitIntegration_collection_shard1_replica_n1",
   [junit4]   2>     "leader":"true",
   [junit4]   2>     "SEARCHER.searcher.maxDoc":0,
   [junit4]   2>     "SEARCHER.searcher.deletedDocs":0,
   [junit4]   2>     "INDEX.sizeInBytes":1,
   [junit4]   2>     "node_name":"127.0.0.1:10000_solr",
   [junit4]   2>     "state":"active",
   [junit4]   2>     "type":"NRT",
   [junit4]   2>     "SEARCHER.searcher.numDocs":0,
   [junit4]   2>     "shard":"shard1",
   [junit4]   2>     "collection":"testSplitIntegration_collection"}}
   [junit4]   2> 370059 DEBUG (simCloudManagerPool-1616-thread-37) [    ] o.a.s.c.a.AutoScalingHandler Verified autoscaling configuration
   [junit4]   2> 370059 DEBUG (simCloudManagerPool-1616-thread-37) [    ] o.a.s.c.a.OverseerTriggerThread Refreshing /autoscaling.json with znode version 6
   [junit4]   2> 370059 DEBUG (Simulated OverseerAutoScalingTriggerThread) [    ] o.a.s.c.a.OverseerTriggerThread Processed trigger updates upto znodeVersion 6
   [junit4]   2> 370060 DEBUG (Simulated OverseerAutoScalingTriggerThread) [    ] o.a.s.c.a.OverseerTriggerThread -- clean old nodeLost markers
   [junit4]   2> 370060 DEBUG (Simulated OverseerAutoScalingTriggerThread) [    ] o.a.s.c.a.OverseerTriggerThread -- clean old nodeAdded markers
   [junit4]   2> 370060 DEBUG (Simulated OverseerAutoScalingTriggerThread) [    ] o.a.s.c.a.OverseerTriggerThread Current znodeVersion 6, lastZnodeVersion 6
   [junit4]   2> 370066 DEBUG (simCloudManagerPool-1616-thread-38) [    ] o.a.s.c.a.AutoScalingHandler Verified autoscaling configuration
   [junit4]   2> 370067 DEBUG (simCloudManagerPool-1616-thread-38) [    ] o.a.s.c.a.OverseerTriggerThread Refreshing /autoscaling.json with znode version 7
   [junit4]   2> 370067 DEBUG (Simulated OverseerAutoScalingTriggerThread) [    ] o.a.s.c.a.OverseerTriggerThread Processed trigger updates upto znodeVersion 7
   [junit4]   2> 370067 DEBUG (Simulated OverseerAutoScalingTriggerThread) [    ] o.a.s.c.a.OverseerTriggerThread -- clean old nodeLost markers
   [junit4]   2> 370067 DEBUG (Simulated OverseerAutoScalingTriggerThread) [    ] o.a.s.c.a.OverseerTriggerThread -- clean old nodeAdded markers
   [junit4]   2> 370067 DEBUG (Simulated OverseerAutoScalingTriggerThread) [    ] o.a.s.c.a.OverseerTriggerThread Current znodeVersion 7, lastZnodeVersion 7
   [junit4]   2> 370078 DEBUG (simCloudManagerPool-1616-thread-39) [    ] o.a.s.c.a.AutoScalingHandler Verified autoscaling configuration
   [junit4]   2> 370078 DEBUG (simCloudManagerPool-1616-thread-39) [    ] o.a.s.c.a.OverseerTriggerThread Refreshing /autoscaling.json with znode version 8
   [junit4]   2> 370078 DEBUG (Simulated OverseerAutoScalingTriggerThread) [    ] o.a.s.c.a.OverseerTriggerThread Processed trigger updates upto znodeVersion 8
   [junit4]   2> 370078 DEBUG (Simulated OverseerAutoScalingTriggerThread) [    ] o.a.s.c.a.OverseerTriggerThread -- clean old nodeLost markers
   [junit4]   2> 370078 DEBUG (Simulated OverseerAutoScalingTriggerThread) [    ] o.a.s.c.a.OverseerTriggerThread -- clean old nodeAdded markers
   [junit4]   2> 370078 DEBUG (Simulated OverseerAutoScalingTriggerThread) [    ] o.a.s.c.a.OverseerTriggerThread Current znodeVersion 8, lastZnodeVersion 8
   [junit4]   2> 370132 DEBUG (ScheduledTrigger-1617-thread-2) [    ] o.a.s.c.a.ScheduledTriggers ++++++++ Cooldown inactive - processing event: {
   [junit4]   2>   "id":"4f0526194009fT43vhp6y2aikhuy4h1i5n0fn3z",
   [junit4]   2>   "source":"index_size_trigger",
   [junit4]   2>   "eventTime":1390136521916575,
   [junit4]   2>   "eventType":"INDEXSIZE",
   [junit4]   2>   "properties":{
   [junit4]   2>     "aboveSize":{"testSplitIntegration_collection":["{\"core_node1\":{\n    \"core\":\"testSplitIntegration_collection_shard1_replica_n1\",\n    \"leader\":\"true\",\n    \"SEARCHER.searcher.maxDoc\":14,\n    \"SEARCHER.searcher.deletedDocs\":0,\n    \"INDEX.sizeInBytes\":1,\n    \"__docs__\":14,\n    \"violationType\":\"aboveDocs\",\n    \"node_name\":\"127.0.0.1:10000_solr\",\n    \"state\":\"active\",\n    \"type\":\"NRT\",\n    \"SEARCHER.searcher.numDocs\":14,\n    \"__bytes__\":1,\n    \"shard\":\"shard1\",\n    \"collection\":\"testSplitIntegration_collection\"}}"]},
   [junit4]   2>     "belowSize":{},
   [junit4]   2>     "requestedOps":["Op{action=SPLITSHARD, hints={COLL_SHARD=[{\n  \"first\":\"testSplitIntegration_collection\",\n  \"second\":\"shard1\"}]}}"]}}
   [junit4]   2> 370132 DEBUG (ScheduledTrigger-1617-thread-2) [    ] o.a.s.c.a.ScheduledTriggers Pausing all triggers: [index_size_trigger]
   [junit4]   2> 370132 INFO  (ScheduledTrigger-1617-thread-2) [    ] o.a.s.c.a.IndexSizeTriggerTest =======> CapturedEvent{timestamp=1390140126674425, stage=STARTED, actionName='null', event={
   [junit4]   2>   "id":"4f0526194009fT43vhp6y2aikhuy4h1i5n0fn3z",
   [junit4]   2>   "source":"index_size_trigger",
   [junit4]   2>   "eventTime":1390136521916575,
   [junit4]   2>   "eventType":"INDEXSIZE",
   [junit4]   2>   "properties":{
   [junit4]   2>     "aboveSize":{"testSplitIntegration_collection":["{\"core_node1\":{\n    \"core\":\"testSplitIntegration_collection_shard1_replica_n1\",\n    \"leader\":\"true\",\n    \"SEARCHER.searcher.maxDoc\":14,\n    \"SEARCHER.searcher.deletedDocs\":0,\n    \"INDEX.sizeInBytes\":1,\n    \"__docs__\":14,\n    \"violationType\":\"aboveDocs\",\n    \"node_name\":\"127.0.0.1:10000_solr\",\n    \"state\":\"active\",\n    \"type\":\"NRT\",\n    \"SEARCHER.searcher.numDocs\":14,\n    \"__bytes__\":1,\n    \"shard\":\"shard1\",\n    \"collection\":\"testSplitIntegration_collection\"}}"]},
   [junit4]   2>     "belowSize":{},
   [junit4]   2>     "_enqueue_time_":1390140120055275,
   [junit4]   2>     "requestedOps":["Op{action=SPLITSHARD, hints={COLL_SHARD=[{\n  \"first\":\"testSplitIntegration_collection\",\n  \"second\":\"shard1\"}]}}"]}}, context={}, config={
   [junit4]   2>   "trigger":"index_size_trigger",
   [junit4]   2>   "stage":[
   [junit4]   2>     "STARTED",
   [junit4]   2>     "ABORTED",
   [junit4]   2>     "SUCCEEDED",
   [junit4]   2>     "FAILED"],
   [junit4]   2>   "afterAction":[
   [junit4]   2>     "compute_plan",
   [junit4]   2>     "execute_plan"],
   [junit4]   2>   "class":"org.apache.solr.cloud.autoscaling.IndexSizeTriggerTest$CapturingTriggerListener",
   [junit4]   2>   "beforeAction":[
   [junit4]   2>     "compute_plan",
   [junit4]   2>     "execute_plan"]}, message='null'}
   [junit4]   2> 370133 DEBUG (AutoscalingActionExecutor-1618-thread-1) [    ] o.a.s.c.a.ScheduledTriggers -- processing actions for {
   [junit4]   2>   "id":"4f0526194009fT43vhp6y2aikhuy4h1i5n0fn3z",
   [junit4]   2>   "source":"index_size_trigger",
   [junit4]   2>   "eventTime":1390136521916575,
   [junit4]   2>   "eventType":"INDEXSIZE",
   [junit4]   2>   "properties":{
   [junit4]   2>     "aboveSize":{"testSplitIntegration_collection":["{\"core_node1\":{\n    \"core\":\"testSplitIntegration_collection_shard1_replica_n1\",\n    \"leader\":\"true\",\n    \"SEARCHER.searcher.maxDoc\":14,\n    \"SEARCHER.searcher.deletedDocs\":0,\n    \"INDEX.sizeInBytes\":1,\n    \"__docs__\":14,\n    \"violationType\":\"aboveDocs\",\n    \"node_name\":\"127.0.0.1:10000_solr\",\n    \"state\":\"active\",\n    \"type\":\"NRT\",\n    \"SEARCHER.searcher.numDocs\":14,\n    \"__bytes__\":1,\n    \"shard\":\"shard1\",\n    \"collection\":\"testSplitIntegration_collection\"}}"]},
   [junit4]   2>     "belowSize":{},
   [junit4]   2>     "_enqueue_time_":1390140120055275,
   [junit4]   2>     "requestedOps":["Op{action=SPLITSHARD, hints={COLL_SHARD=[{\n  \"first\":\"testSplitIntegration_collection\",\n  \"second\":\"shard1\"}]}}"]}}
   [junit4]   2> 370134 INFO  (AutoscalingActionExecutor-1618-thread-1) [    ] o.a.s.c.a.IndexSizeTriggerTest =======> CapturedEvent{timestamp=1390140205041175, stage=BEFORE_ACTION, actionName='compute_plan', event={
   [junit4]   2>   "id":"4f0526194009fT43vhp6y2aikhuy4h1i5n0fn3z",
   [junit4]   2>   "source":"index_size_trigger",
   [junit4]   2>   "eventTime":1390136521916575,
   [junit4]   2>   "eventType":"INDEXSIZE",
   [junit4]   2>   "properties":{
   [junit4]   2>     "aboveSize":{"testSplitIntegration_collection":["{\"core_node1\":{\n    \"core\":\"testSplitIntegration_collection_shard1_replica_n1\",\n    \"leader\":\"true\",\n    \"SEARCHER.searcher.maxDoc\":14,\n    \"SEARCHER.searcher.deletedDocs\":0,\n    \"INDEX.sizeInBytes\":1,\n    \"__docs__\":14,\n    \"violationType\":\"aboveDocs\",\n    \"node_name\":\"127.0.0.1:10000_solr\",\n    \"state\":\"active\",\n    \"type\":\"NRT\",\n    \"SEARCHER.searcher.numDocs\":14,\n    \"__bytes__\":1,\n    \"shard\":\"shard1\",\n    \"collection\":\"testSplitIntegration_collection\"}}"]},
   [junit4]   2>     "belowSize":{},
   [junit4]   2>     "_enqueue_time_":1390140120055275,
   [junit4]   2>     "requestedOps":["Op{action=SPLITSHARD, hints={COLL_SHARD=[{\n  \"first\":\"testSplitIntegration_collection\",\n  \"second\":\"shard1\"}]}}"]}}, context={properties.BEFORE_ACTION=[compute_plan], source=index_size_trigger}, config={
   [junit4]   2>   "trigger":"index_size_trigger",
   [junit4]   2>   "stage":[
   [junit4]   2>     "STARTED",
   [junit4]   2>     "ABORTED",
   [junit4]   2>     "SUCCEEDED",
   [junit4]   2>     "FAILED"],
   [junit4]   2>   "afterAction":[
   [junit4]   2>     "compute_plan",
   [junit4]   2>     "execute_plan"],
   [junit4]   2>   "class":"org.apache.solr.cloud.autoscaling.IndexSizeTriggerTest$CapturingTriggerListener",
   [junit4]   2>   "beforeAction":[
   [junit4]   2>     "compute_plan",
   [junit4]   2>     "execute_plan"]}, message='null'}
   [junit4]   2> 370134 DEBUG (AutoscalingActionExecutor-1618-thread-1) [    ] o.a.s.c.a.ComputePlanAction -- processing event: {
   [junit4]   2>   "id":"4f0526194009fT43vhp6y2aikhuy4h1i5n0fn3z",
   [junit4]   2>   "source":"index_size_trigger",
   [junit4]   2>   "eventTime":1390136521916575,
   [junit4]   2>   "eventType":"INDEXSIZE",
   [junit4]   2>   "properties":{
   [junit4]   2>     "aboveSize":{"testSplitIntegration_collection":["{\"core_node1\":{\n    \"core\":\"testSplitIntegration_collection_shard1_replica_n1\",\n    \"leader\":\"true\",\n    \"SEARCHER.searcher.maxDoc\":14,\n    \"SEARCHER.searcher.deletedDocs\":0,\n    \"INDEX.sizeInBytes\":1,\n    \"__docs__\":14,\n    \"violationType\":\"aboveDocs\",\n    \"node_name\":\"127.0.0.1:10000_solr\",\n    \"state\":\"active\",\n    \"type\":\"NRT\",\n    \"SEARCHER.searcher.numDocs\":14,\n    \"__bytes__\":1,\n    \"shard\":\"shard1\",\n    \"collection\":\"testSplitIntegration_collection\"}}"]},
   [junit4]   2>     "belowSize":{},
   [junit4]   2>     "_enqueue_time_":1390140120055275,
   [junit4]   2>     "requestedOps":["Op{action=SPLITSHARD, hints={COLL_SHARD=[{\n  \"first\":\"testSplitIntegration_collection\",\n  \"second\":\"shard1\"}]}}"]}} with context properties: {BEFORE_ACTION=[compute_plan]}
   [junit4]   2> 370135 INFO  (AutoscalingActionExecutor-1618-thread-1) [    ] o.a.s.c.a.ComputePlanAction Computed Plan: action=SPLITSHARD&collection=testSplitIntegration_collection&shard=shard1
   [junit4]   2> 370135 INFO  (AutoscalingActionExecutor-1618-thread-1) [    ] o.a.s.c.s.c.a.PolicyHelper returnSession, curr-time 1390140301 sessionWrapper.createTime 1390140229701275, this.sessionWrapper.createTime 1390140229701275 
   [junit4]   2> 370136 INFO  (AutoscalingActionExecutor-1618-thread-1) [    ] o.a.s.c.a.IndexSizeTriggerTest =======> CapturedEvent{timestamp=1390140303507925, stage=AFTER_ACTION, actionName='compute_plan', event={
   [junit4]   2>   "id":"4f0526194009fT43vhp6y2aikhuy4h1i5n0fn3z",
   [junit4]   2>   "source":"index_size_trigger",
   [junit4]   2>   "eventTime":1390136521916575,
   [junit4]   2>   "eventType":"INDEXSIZE",
   [junit4]   2>   "properties":{
   [junit4]   2>     "__start__":1,
   [junit4]   2>     "aboveSize":{"testSplitIntegration_collection":["{\"core_node1\":{\n    \"core\":\"testSplitIntegration_collection_shard1_replica_n1\",\n    \"leader\":\"true\",\n    \"SEARCHER.searcher.maxDoc\":14,\n    \"SEARCHER.searcher.deletedDocs\":0,\

[...truncated too long message...]

topped ServerConnector@549e67ba{SSL,[ssl, http/1.1]}{127.0.0.1:0}
   [junit4]   2> 26299 INFO  (jetty-closer-43-thread-1) [    ] o.a.s.c.CoreContainer Shutting down CoreContainer instance=1039658334
   [junit4]   2> 26299 INFO  (jetty-closer-43-thread-1) [    ] o.a.s.m.SolrMetricManager Closing metric reporters for registry=solr.node, tag=null
   [junit4]   2> 26300 INFO  (jetty-closer-43-thread-1) [    ] o.a.s.m.r.SolrJmxReporter Closing reporter [org.apache.solr.metrics.reporters.SolrJmxReporter@433aba96: rootName = solr_55358, domain = solr.node, service url = null, agent id = null] for registry solr.node / com.codahale.metrics.MetricRegistry@3924ffcd
   [junit4]   2> 26305 INFO  (jetty-closer-43-thread-2) [    ] o.a.s.c.ZkController Remove node as live in ZooKeeper:/live_nodes/127.0.0.1:55360_solr
   [junit4]   2> 26306 INFO  (jetty-closer-43-thread-2) [    ] o.a.s.m.SolrMetricManager Closing metric reporters for registry=solr.cluster, tag=null
   [junit4]   2> 26308 INFO  (zkCallback-60-thread-1) [    ] o.a.s.c.c.ZkStateReader Updated live nodes from ZooKeeper... (2) -> (1)
   [junit4]   2> 26308 INFO  (zkCallback-58-thread-1) [    ] o.a.s.c.c.ZkStateReader Updated live nodes from ZooKeeper... (2) -> (1)
   [junit4]   2> 26308 INFO  (zkCallback-69-thread-1) [    ] o.a.s.c.c.ZkStateReader Updated live nodes from ZooKeeper... (2) -> (1)
   [junit4]   2> 26313 INFO  (jetty-closer-43-thread-1) [    ] o.a.s.m.SolrMetricManager Closing metric reporters for registry=solr.jvm, tag=null
   [junit4]   2> 26330 INFO  (jetty-closer-43-thread-1) [    ] o.a.s.m.r.SolrJmxReporter Closing reporter [org.apache.solr.metrics.reporters.SolrJmxReporter@6e96e1f6: rootName = solr_55358, domain = solr.jvm, service url = null, agent id = null] for registry solr.jvm / com.codahale.metrics.MetricRegistry@5a2b678c
   [junit4]   2> 26333 INFO  (jetty-closer-43-thread-2) [    ] o.a.s.c.Overseer Overseer (id=72149009447714821-127.0.0.1:55360_solr-n_0000000000) closing
   [junit4]   2> 26333 INFO  (zkCallback-74-thread-1) [    ] o.a.s.c.c.ZkStateReader Updated live nodes from ZooKeeper... (2) -> (1)
   [junit4]   2> 26333 INFO  (OverseerStateUpdate-72149009447714821-127.0.0.1:55360_solr-n_0000000000) [    ] o.a.s.c.Overseer Overseer Loop exiting : 127.0.0.1:55360_solr
   [junit4]   2> 26334 WARN  (OverseerAutoScalingTriggerThread-72149009447714821-127.0.0.1:55360_solr-n_0000000000) [    ] o.a.s.c.a.OverseerTriggerThread OverseerTriggerThread woken up but we are closed, exiting.
   [junit4]   2> 26335 DEBUG (jetty-closer-43-thread-2) [    ] o.a.s.c.a.ScheduledTriggers Shutting down scheduled thread pool executor now
   [junit4]   2> 26335 DEBUG (jetty-closer-43-thread-2) [    ] o.a.s.c.a.ScheduledTriggers Shutting down action executor now
   [junit4]   2> 26335 DEBUG (jetty-closer-43-thread-2) [    ] o.a.s.c.a.ScheduledTriggers Awaiting termination for action executor
   [junit4]   2> 26335 DEBUG (jetty-closer-43-thread-2) [    ] o.a.s.c.a.ScheduledTriggers Awaiting termination for scheduled thread pool executor
   [junit4]   2> 26335 INFO  (jetty-closer-43-thread-1) [    ] o.a.s.m.SolrMetricManager Closing metric reporters for registry=solr.jetty, tag=null
   [junit4]   2> 26335 INFO  (jetty-closer-43-thread-1) [    ] o.a.s.m.r.SolrJmxReporter Closing reporter [org.apache.solr.metrics.reporters.SolrJmxReporter@331a885b: rootName = solr_55358, domain = solr.jetty, service url = null, agent id = null] for registry solr.jetty / com.codahale.metrics.MetricRegistry@3383ea5d
   [junit4]   2> 26336 DEBUG (jetty-closer-43-thread-2) [    ] o.a.s.c.a.ScheduledTriggers ScheduledTriggers closed completely
   [junit4]   2> 26336 DEBUG (jetty-closer-43-thread-2) [    ] o.a.s.c.a.OverseerTriggerThread OverseerTriggerThread has been closed explicitly
   [junit4]   2> 26340 INFO  (jetty-closer-43-thread-1) [    ] o.a.s.c.ZkController Remove node as live in ZooKeeper:/live_nodes/127.0.0.1:55358_solr
   [junit4]   2> 26341 INFO  (zkCallback-60-thread-1) [    ] o.a.s.c.OverseerElectionContext I am going to be the leader 127.0.0.1:55358_solr
   [junit4]   2> 26342 INFO  (jetty-closer-43-thread-1) [    ] o.a.s.m.SolrMetricManager Closing metric reporters for registry=solr.cluster, tag=null
   [junit4]   2> 26343 INFO  (zkCallback-60-thread-2) [    ] o.a.s.c.c.ZkStateReader Updated live nodes from ZooKeeper... (1) -> (0)
   [junit4]   2> 26343 INFO  (zkCallback-74-thread-1) [    ] o.a.s.c.c.ZkStateReader Updated live nodes from ZooKeeper... (1) -> (0)
   [junit4]   2> 26343 INFO  (jetty-closer-43-thread-1) [    ] o.a.s.c.TransientSolrCoreCacheDefault Allocating transient cache for 2147483647 transient cores
   [junit4]   2> 26345 INFO  (jetty-closer-43-thread-2) [    ] o.e.j.s.h.ContextHandler Stopped o.e.j.s.ServletContextHandler@10f8553{/solr,null,UNAVAILABLE}
   [junit4]   2> 26349 INFO  (jetty-closer-43-thread-2) [    ] o.e.j.s.session Stopped scavenging
   [junit4]   2> 26367 INFO  (jetty-closer-43-thread-1) [    ] o.e.j.s.h.ContextHandler Stopped o.e.j.s.ServletContextHandler@1cdf3e62{/solr,null,UNAVAILABLE}
   [junit4]   2> 26377 INFO  (jetty-closer-43-thread-1) [    ] o.e.j.s.session Stopped scavenging
   [junit4]   2> 26398 ERROR (SUITE-IndexSizeTriggerTest-seed#[975A58BABAE12C70]-worker) [    ] o.a.z.s.ZooKeeperServer ZKShutdownHandler is not registered, so ZooKeeper server won't take any action on ERROR or SHUTDOWN server state changes
   [junit4]   2> 26398 INFO  (SUITE-IndexSizeTriggerTest-seed#[975A58BABAE12C70]-worker) [    ] o.a.s.c.ZkTestServer connecting to 127.0.0.1:55356 55356
   [junit4]   2> 26421 INFO  (Thread-21) [    ] o.a.s.c.ZkTestServer connecting to 127.0.0.1:55356 55356
   [junit4]   2> 26733 WARN  (Thread-21) [    ] o.a.s.c.ZkTestServer Watch limit violations: 
   [junit4]   2> Maximum concurrent create/delete watches above limit:
   [junit4]   2> 
   [junit4]   2> 	5	/solr/aliases.json
   [junit4]   2> 	2	/solr/security.json
   [junit4]   2> 
   [junit4]   2> Maximum concurrent data watches above limit:
   [junit4]   2> 
   [junit4]   2> 	5	/solr/clusterstate.json
   [junit4]   2> 	5	/solr/clusterprops.json
   [junit4]   2> 
   [junit4]   2> Maximum concurrent children watches above limit:
   [junit4]   2> 
   [junit4]   2> 	5	/solr/live_nodes
   [junit4]   2> 	5	/solr/collections
   [junit4]   2> 
   [junit4]   2> NOTE: leaving temporary files on disk at: /Users/jenkins/workspace/Lucene-Solr-7.x-MacOSX/solr/build/solr-core/test/J0/temp/solr.cloud.autoscaling.IndexSizeTriggerTest_975A58BABAE12C70-002
   [junit4]   2> NOTE: test params are: codec=Asserting(Lucene70), sim=RandomSimilarity(queryNorm=false): {}, locale=ga-IE, timezone=Europe/Bucharest
   [junit4]   2> NOTE: Mac OS X 10.11.6 x86_64/Oracle Corporation 1.8.0_144 (64-bit)/cpus=3,threads=1,free=14862760,total=54788096
   [junit4]   2> NOTE: All tests run in this JVM: [IndexSizeTriggerTest, IndexSizeTriggerTest]
   [junit4] Completed [4/5 (4!)] on J0 in 3.72s, 4 tests, 1 error <<< FAILURES!
   [junit4] 
   [junit4] Suite: org.apache.solr.cloud.autoscaling.IndexSizeTriggerTest
   [junit4] OK      0.14s J1 | IndexSizeTriggerTest.testMixedBounds
   [junit4] OK      0.41s J1 | IndexSizeTriggerTest.testMergeIntegration
   [junit4] OK      0.64s J1 | IndexSizeTriggerTest.testSplitIntegration
   [junit4] OK      0.40s J1 | IndexSizeTriggerTest.testTrigger
   [junit4] Completed [5/5 (4!)] on J1 in 3.71s, 4 tests
   [junit4] 
   [junit4] 
   [junit4] Tests with failures [seed: 975A58BABAE12C70]:
   [junit4]   - org.apache.solr.cloud.autoscaling.IndexSizeTriggerTest.testSplitIntegration
   [junit4]   - org.apache.solr.cloud.autoscaling.IndexSizeTriggerTest.testSplitIntegration
   [junit4]   - org.apache.solr.cloud.autoscaling.IndexSizeTriggerTest.testMergeIntegration
   [junit4]   - org.apache.solr.cloud.autoscaling.IndexSizeTriggerTest.testSplitIntegration
   [junit4] 
   [junit4] 
   [junit4] JVM J0:     0.71 ..    27.57 =    26.86s
   [junit4] JVM J1:     0.71 ..    30.58 =    29.87s
   [junit4] Execution time total: 30 seconds
   [junit4] Tests summary: 5 suites, 20 tests, 3 errors, 1 failure

BUILD FAILED
/Users/jenkins/workspace/Lucene-Solr-7.x-MacOSX/lucene/common-build.xml:1568: The following error occurred while executing this line:
/Users/jenkins/workspace/Lucene-Solr-7.x-MacOSX/lucene/common-build.xml:1092: There were test failures: 5 suites, 20 tests, 3 errors, 1 failure [seed: 975A58BABAE12C70]

Total time: 32 seconds

[repro] Setting last failure code to 256

[repro] Failures:
[repro]   4/5 failed: org.apache.solr.cloud.autoscaling.IndexSizeTriggerTest
[repro] Exiting with code 256
+ mv lucene/build lucene/build.repro
+ mv solr/build solr/build.repro
+ mv lucene/build.orig lucene/build
+ mv solr/build.orig solr/build
Archiving artifacts
Setting ANT_1_8_2_HOME=/Users/jenkins/tools/hudson.tasks.Ant_AntInstallation/ANT_1.8.2
[WARNINGS] Parsing warnings in console log with parser Java Compiler (javac)
Setting ANT_1_8_2_HOME=/Users/jenkins/tools/hudson.tasks.Ant_AntInstallation/ANT_1.8.2
Setting ANT_1_8_2_HOME=/Users/jenkins/tools/hudson.tasks.Ant_AntInstallation/ANT_1.8.2
<Git Blamer> Using GitBlamer to create author and commit information for all warnings.
<Git Blamer> GIT_COMMIT=9c8e527cd1b361e2f4ad8d4f71110142b411f0d8, workspace=/Users/jenkins/workspace/Lucene-Solr-7.x-MacOSX
[WARNINGS] Computing warning deltas based on reference build #581
Recording test results
Setting ANT_1_8_2_HOME=/Users/jenkins/tools/hudson.tasks.Ant_AntInstallation/ANT_1.8.2
Build step 'Publish JUnit test result report' changed build result to UNSTABLE
Email was triggered for: Unstable (Test Failures)
Sending email for trigger: Unstable (Test Failures)
Setting ANT_1_8_2_HOME=/Users/jenkins/tools/hudson.tasks.Ant_AntInstallation/ANT_1.8.2
Setting ANT_1_8_2_HOME=/Users/jenkins/tools/hudson.tasks.Ant_AntInstallation/ANT_1.8.2
Setting ANT_1_8_2_HOME=/Users/jenkins/tools/hudson.tasks.Ant_AntInstallation/ANT_1.8.2
Setting ANT_1_8_2_HOME=/Users/jenkins/tools/hudson.tasks.Ant_AntInstallation/ANT_1.8.2

Mime
View raw message