lucene-dev mailing list archives

Site index · List index
Message view « Date » · « Thread »
Top « Date » · « Thread »
From Policeman Jenkins Server <jenk...@thetaphi.de>
Subject [JENKINS] Lucene-Solr-master-Windows (64bit/jdk-10) - Build # 7252 - Still Unstable!
Date Tue, 03 Apr 2018 23:56:59 GMT
Build: https://jenkins.thetaphi.de/job/Lucene-Solr-master-Windows/7252/
Java: 64bit/jdk-10 -XX:+UseCompressedOops -XX:+UseG1GC

8 tests failed.
FAILED:  org.apache.solr.handler.TestReplicationHandler.doTestStressReplication

Error Message:
found:2[index.20180404015240914, index.20180404015241823, index.properties, replication.properties, snapshot_metadata]

Stack Trace:
java.lang.AssertionError: found:2[index.20180404015240914, index.20180404015241823, index.properties, replication.properties, snapshot_metadata]
	at __randomizedtesting.SeedInfo.seed([CD5DAE6ED7143F:DB665D686BFF7D8C]:0)
	at org.junit.Assert.fail(Assert.java:93)
	at org.junit.Assert.assertTrue(Assert.java:43)
	at org.apache.solr.handler.TestReplicationHandler.checkForSingleIndex(TestReplicationHandler.java:963)
	at org.apache.solr.handler.TestReplicationHandler.checkForSingleIndex(TestReplicationHandler.java:934)
	at org.apache.solr.handler.TestReplicationHandler.doTestStressReplication(TestReplicationHandler.java:910)
	at java.base/jdk.internal.reflect.NativeMethodAccessorImpl.invoke0(Native Method)
	at java.base/jdk.internal.reflect.NativeMethodAccessorImpl.invoke(NativeMethodAccessorImpl.java:62)
	at java.base/jdk.internal.reflect.DelegatingMethodAccessorImpl.invoke(DelegatingMethodAccessorImpl.java:43)
	at java.base/java.lang.reflect.Method.invoke(Method.java:564)
	at com.carrotsearch.randomizedtesting.RandomizedRunner.invoke(RandomizedRunner.java:1737)
	at com.carrotsearch.randomizedtesting.RandomizedRunner$8.evaluate(RandomizedRunner.java:934)
	at com.carrotsearch.randomizedtesting.RandomizedRunner$9.evaluate(RandomizedRunner.java:970)
	at com.carrotsearch.randomizedtesting.RandomizedRunner$10.evaluate(RandomizedRunner.java:984)
	at com.carrotsearch.randomizedtesting.rules.SystemPropertiesRestoreRule$1.evaluate(SystemPropertiesRestoreRule.java:57)
	at org.apache.lucene.util.TestRuleSetupTeardownChained$1.evaluate(TestRuleSetupTeardownChained.java:49)
	at org.apache.lucene.util.AbstractBeforeAfterRule$1.evaluate(AbstractBeforeAfterRule.java:45)
	at org.apache.lucene.util.TestRuleThreadAndTestName$1.evaluate(TestRuleThreadAndTestName.java:48)
	at org.apache.lucene.util.TestRuleIgnoreAfterMaxFailures$1.evaluate(TestRuleIgnoreAfterMaxFailures.java:64)
	at org.apache.lucene.util.TestRuleMarkFailure$1.evaluate(TestRuleMarkFailure.java:47)
	at com.carrotsearch.randomizedtesting.rules.StatementAdapter.evaluate(StatementAdapter.java:36)
	at com.carrotsearch.randomizedtesting.ThreadLeakControl$StatementRunner.run(ThreadLeakControl.java:368)
	at com.carrotsearch.randomizedtesting.ThreadLeakControl.forkTimeoutingTask(ThreadLeakControl.java:817)
	at com.carrotsearch.randomizedtesting.ThreadLeakControl$3.evaluate(ThreadLeakControl.java:468)
	at com.carrotsearch.randomizedtesting.RandomizedRunner.runSingleTest(RandomizedRunner.java:943)
	at com.carrotsearch.randomizedtesting.RandomizedRunner$5.evaluate(RandomizedRunner.java:829)
	at com.carrotsearch.randomizedtesting.RandomizedRunner$6.evaluate(RandomizedRunner.java:879)
	at com.carrotsearch.randomizedtesting.RandomizedRunner$7.evaluate(RandomizedRunner.java:890)
	at com.carrotsearch.randomizedtesting.rules.StatementAdapter.evaluate(StatementAdapter.java:36)
	at com.carrotsearch.randomizedtesting.rules.SystemPropertiesRestoreRule$1.evaluate(SystemPropertiesRestoreRule.java:57)
	at org.apache.lucene.util.AbstractBeforeAfterRule$1.evaluate(AbstractBeforeAfterRule.java:45)
	at com.carrotsearch.randomizedtesting.rules.StatementAdapter.evaluate(StatementAdapter.java:36)
	at org.apache.lucene.util.TestRuleStoreClassName$1.evaluate(TestRuleStoreClassName.java:41)
	at com.carrotsearch.randomizedtesting.rules.NoShadowingOrOverridesOnMethodsRule$1.evaluate(NoShadowingOrOverridesOnMethodsRule.java:40)
	at com.carrotsearch.randomizedtesting.rules.NoShadowingOrOverridesOnMethodsRule$1.evaluate(NoShadowingOrOverridesOnMethodsRule.java:40)
	at com.carrotsearch.randomizedtesting.rules.StatementAdapter.evaluate(StatementAdapter.java:36)
	at com.carrotsearch.randomizedtesting.rules.StatementAdapter.evaluate(StatementAdapter.java:36)
	at org.apache.lucene.util.TestRuleAssertionsRequired$1.evaluate(TestRuleAssertionsRequired.java:53)
	at org.apache.lucene.util.TestRuleMarkFailure$1.evaluate(TestRuleMarkFailure.java:47)
	at org.apache.lucene.util.TestRuleIgnoreAfterMaxFailures$1.evaluate(TestRuleIgnoreAfterMaxFailures.java:64)
	at org.apache.lucene.util.TestRuleIgnoreTestSuites$1.evaluate(TestRuleIgnoreTestSuites.java:54)
	at com.carrotsearch.randomizedtesting.rules.StatementAdapter.evaluate(StatementAdapter.java:36)
	at com.carrotsearch.randomizedtesting.ThreadLeakControl$StatementRunner.run(ThreadLeakControl.java:368)
	at java.base/java.lang.Thread.run(Thread.java:844)


FAILED:  org.apache.solr.handler.TestReplicationHandler.doTestStressReplication

Error Message:
found:2[index.20180404015414908, index.20180404015415322, index.properties, replication.properties, snapshot_metadata]

Stack Trace:
java.lang.AssertionError: found:2[index.20180404015414908, index.20180404015415322, index.properties, replication.properties, snapshot_metadata]
	at __randomizedtesting.SeedInfo.seed([CD5DAE6ED7143F:DB665D686BFF7D8C]:0)
	at org.junit.Assert.fail(Assert.java:93)
	at org.junit.Assert.assertTrue(Assert.java:43)
	at org.apache.solr.handler.TestReplicationHandler.checkForSingleIndex(TestReplicationHandler.java:963)
	at org.apache.solr.handler.TestReplicationHandler.checkForSingleIndex(TestReplicationHandler.java:934)
	at org.apache.solr.handler.TestReplicationHandler.doTestStressReplication(TestReplicationHandler.java:910)
	at java.base/jdk.internal.reflect.NativeMethodAccessorImpl.invoke0(Native Method)
	at java.base/jdk.internal.reflect.NativeMethodAccessorImpl.invoke(NativeMethodAccessorImpl.java:62)
	at java.base/jdk.internal.reflect.DelegatingMethodAccessorImpl.invoke(DelegatingMethodAccessorImpl.java:43)
	at java.base/java.lang.reflect.Method.invoke(Method.java:564)
	at com.carrotsearch.randomizedtesting.RandomizedRunner.invoke(RandomizedRunner.java:1737)
	at com.carrotsearch.randomizedtesting.RandomizedRunner$8.evaluate(RandomizedRunner.java:934)
	at com.carrotsearch.randomizedtesting.RandomizedRunner$9.evaluate(RandomizedRunner.java:970)
	at com.carrotsearch.randomizedtesting.RandomizedRunner$10.evaluate(RandomizedRunner.java:984)
	at com.carrotsearch.randomizedtesting.rules.SystemPropertiesRestoreRule$1.evaluate(SystemPropertiesRestoreRule.java:57)
	at org.apache.lucene.util.TestRuleSetupTeardownChained$1.evaluate(TestRuleSetupTeardownChained.java:49)
	at org.apache.lucene.util.AbstractBeforeAfterRule$1.evaluate(AbstractBeforeAfterRule.java:45)
	at org.apache.lucene.util.TestRuleThreadAndTestName$1.evaluate(TestRuleThreadAndTestName.java:48)
	at org.apache.lucene.util.TestRuleIgnoreAfterMaxFailures$1.evaluate(TestRuleIgnoreAfterMaxFailures.java:64)
	at org.apache.lucene.util.TestRuleMarkFailure$1.evaluate(TestRuleMarkFailure.java:47)
	at com.carrotsearch.randomizedtesting.rules.StatementAdapter.evaluate(StatementAdapter.java:36)
	at com.carrotsearch.randomizedtesting.ThreadLeakControl$StatementRunner.run(ThreadLeakControl.java:368)
	at com.carrotsearch.randomizedtesting.ThreadLeakControl.forkTimeoutingTask(ThreadLeakControl.java:817)
	at com.carrotsearch.randomizedtesting.ThreadLeakControl$3.evaluate(ThreadLeakControl.java:468)
	at com.carrotsearch.randomizedtesting.RandomizedRunner.runSingleTest(RandomizedRunner.java:943)
	at com.carrotsearch.randomizedtesting.RandomizedRunner$5.evaluate(RandomizedRunner.java:829)
	at com.carrotsearch.randomizedtesting.RandomizedRunner$6.evaluate(RandomizedRunner.java:879)
	at com.carrotsearch.randomizedtesting.RandomizedRunner$7.evaluate(RandomizedRunner.java:890)
	at com.carrotsearch.randomizedtesting.rules.StatementAdapter.evaluate(StatementAdapter.java:36)
	at com.carrotsearch.randomizedtesting.rules.SystemPropertiesRestoreRule$1.evaluate(SystemPropertiesRestoreRule.java:57)
	at org.apache.lucene.util.AbstractBeforeAfterRule$1.evaluate(AbstractBeforeAfterRule.java:45)
	at com.carrotsearch.randomizedtesting.rules.StatementAdapter.evaluate(StatementAdapter.java:36)
	at org.apache.lucene.util.TestRuleStoreClassName$1.evaluate(TestRuleStoreClassName.java:41)
	at com.carrotsearch.randomizedtesting.rules.NoShadowingOrOverridesOnMethodsRule$1.evaluate(NoShadowingOrOverridesOnMethodsRule.java:40)
	at com.carrotsearch.randomizedtesting.rules.NoShadowingOrOverridesOnMethodsRule$1.evaluate(NoShadowingOrOverridesOnMethodsRule.java:40)
	at com.carrotsearch.randomizedtesting.rules.StatementAdapter.evaluate(StatementAdapter.java:36)
	at com.carrotsearch.randomizedtesting.rules.StatementAdapter.evaluate(StatementAdapter.java:36)
	at org.apache.lucene.util.TestRuleAssertionsRequired$1.evaluate(TestRuleAssertionsRequired.java:53)
	at org.apache.lucene.util.TestRuleMarkFailure$1.evaluate(TestRuleMarkFailure.java:47)
	at org.apache.lucene.util.TestRuleIgnoreAfterMaxFailures$1.evaluate(TestRuleIgnoreAfterMaxFailures.java:64)
	at org.apache.lucene.util.TestRuleIgnoreTestSuites$1.evaluate(TestRuleIgnoreTestSuites.java:54)
	at com.carrotsearch.randomizedtesting.rules.StatementAdapter.evaluate(StatementAdapter.java:36)
	at com.carrotsearch.randomizedtesting.ThreadLeakControl$StatementRunner.run(ThreadLeakControl.java:368)
	at java.base/java.lang.Thread.run(Thread.java:844)


FAILED:  org.apache.solr.handler.TestReplicationHandler.doTestStressReplication

Error Message:
found:2[index.20180404015422368, index.20180404015425024, index.properties, replication.properties, snapshot_metadata]

Stack Trace:
java.lang.AssertionError: found:2[index.20180404015422368, index.20180404015425024, index.properties, replication.properties, snapshot_metadata]
	at __randomizedtesting.SeedInfo.seed([CD5DAE6ED7143F:DB665D686BFF7D8C]:0)
	at org.junit.Assert.fail(Assert.java:93)
	at org.junit.Assert.assertTrue(Assert.java:43)
	at org.apache.solr.handler.TestReplicationHandler.checkForSingleIndex(TestReplicationHandler.java:963)
	at org.apache.solr.handler.TestReplicationHandler.checkForSingleIndex(TestReplicationHandler.java:934)
	at org.apache.solr.handler.TestReplicationHandler.doTestStressReplication(TestReplicationHandler.java:910)
	at java.base/jdk.internal.reflect.NativeMethodAccessorImpl.invoke0(Native Method)
	at java.base/jdk.internal.reflect.NativeMethodAccessorImpl.invoke(NativeMethodAccessorImpl.java:62)
	at java.base/jdk.internal.reflect.DelegatingMethodAccessorImpl.invoke(DelegatingMethodAccessorImpl.java:43)
	at java.base/java.lang.reflect.Method.invoke(Method.java:564)
	at com.carrotsearch.randomizedtesting.RandomizedRunner.invoke(RandomizedRunner.java:1737)
	at com.carrotsearch.randomizedtesting.RandomizedRunner$8.evaluate(RandomizedRunner.java:934)
	at com.carrotsearch.randomizedtesting.RandomizedRunner$9.evaluate(RandomizedRunner.java:970)
	at com.carrotsearch.randomizedtesting.RandomizedRunner$10.evaluate(RandomizedRunner.java:984)
	at com.carrotsearch.randomizedtesting.rules.SystemPropertiesRestoreRule$1.evaluate(SystemPropertiesRestoreRule.java:57)
	at org.apache.lucene.util.TestRuleSetupTeardownChained$1.evaluate(TestRuleSetupTeardownChained.java:49)
	at org.apache.lucene.util.AbstractBeforeAfterRule$1.evaluate(AbstractBeforeAfterRule.java:45)
	at org.apache.lucene.util.TestRuleThreadAndTestName$1.evaluate(TestRuleThreadAndTestName.java:48)
	at org.apache.lucene.util.TestRuleIgnoreAfterMaxFailures$1.evaluate(TestRuleIgnoreAfterMaxFailures.java:64)
	at org.apache.lucene.util.TestRuleMarkFailure$1.evaluate(TestRuleMarkFailure.java:47)
	at com.carrotsearch.randomizedtesting.rules.StatementAdapter.evaluate(StatementAdapter.java:36)
	at com.carrotsearch.randomizedtesting.ThreadLeakControl$StatementRunner.run(ThreadLeakControl.java:368)
	at com.carrotsearch.randomizedtesting.ThreadLeakControl.forkTimeoutingTask(ThreadLeakControl.java:817)
	at com.carrotsearch.randomizedtesting.ThreadLeakControl$3.evaluate(ThreadLeakControl.java:468)
	at com.carrotsearch.randomizedtesting.RandomizedRunner.runSingleTest(RandomizedRunner.java:943)
	at com.carrotsearch.randomizedtesting.RandomizedRunner$5.evaluate(RandomizedRunner.java:829)
	at com.carrotsearch.randomizedtesting.RandomizedRunner$6.evaluate(RandomizedRunner.java:879)
	at com.carrotsearch.randomizedtesting.RandomizedRunner$7.evaluate(RandomizedRunner.java:890)
	at com.carrotsearch.randomizedtesting.rules.StatementAdapter.evaluate(StatementAdapter.java:36)
	at com.carrotsearch.randomizedtesting.rules.SystemPropertiesRestoreRule$1.evaluate(SystemPropertiesRestoreRule.java:57)
	at org.apache.lucene.util.AbstractBeforeAfterRule$1.evaluate(AbstractBeforeAfterRule.java:45)
	at com.carrotsearch.randomizedtesting.rules.StatementAdapter.evaluate(StatementAdapter.java:36)
	at org.apache.lucene.util.TestRuleStoreClassName$1.evaluate(TestRuleStoreClassName.java:41)
	at com.carrotsearch.randomizedtesting.rules.NoShadowingOrOverridesOnMethodsRule$1.evaluate(NoShadowingOrOverridesOnMethodsRule.java:40)
	at com.carrotsearch.randomizedtesting.rules.NoShadowingOrOverridesOnMethodsRule$1.evaluate(NoShadowingOrOverridesOnMethodsRule.java:40)
	at com.carrotsearch.randomizedtesting.rules.StatementAdapter.evaluate(StatementAdapter.java:36)
	at com.carrotsearch.randomizedtesting.rules.StatementAdapter.evaluate(StatementAdapter.java:36)
	at org.apache.lucene.util.TestRuleAssertionsRequired$1.evaluate(TestRuleAssertionsRequired.java:53)
	at org.apache.lucene.util.TestRuleMarkFailure$1.evaluate(TestRuleMarkFailure.java:47)
	at org.apache.lucene.util.TestRuleIgnoreAfterMaxFailures$1.evaluate(TestRuleIgnoreAfterMaxFailures.java:64)
	at org.apache.lucene.util.TestRuleIgnoreTestSuites$1.evaluate(TestRuleIgnoreTestSuites.java:54)
	at com.carrotsearch.randomizedtesting.rules.StatementAdapter.evaluate(StatementAdapter.java:36)
	at com.carrotsearch.randomizedtesting.ThreadLeakControl$StatementRunner.run(ThreadLeakControl.java:368)
	at java.base/java.lang.Thread.run(Thread.java:844)


FAILED:  org.apache.solr.handler.TestReplicationHandler.doTestStressReplication

Error Message:
found:2[index.20180404015532039, index.20180404015533381, index.properties, replication.properties, snapshot_metadata]

Stack Trace:
java.lang.AssertionError: found:2[index.20180404015532039, index.20180404015533381, index.properties, replication.properties, snapshot_metadata]
	at __randomizedtesting.SeedInfo.seed([CD5DAE6ED7143F:DB665D686BFF7D8C]:0)
	at org.junit.Assert.fail(Assert.java:93)
	at org.junit.Assert.assertTrue(Assert.java:43)
	at org.apache.solr.handler.TestReplicationHandler.checkForSingleIndex(TestReplicationHandler.java:963)
	at org.apache.solr.handler.TestReplicationHandler.checkForSingleIndex(TestReplicationHandler.java:934)
	at org.apache.solr.handler.TestReplicationHandler.doTestStressReplication(TestReplicationHandler.java:910)
	at java.base/jdk.internal.reflect.NativeMethodAccessorImpl.invoke0(Native Method)
	at java.base/jdk.internal.reflect.NativeMethodAccessorImpl.invoke(NativeMethodAccessorImpl.java:62)
	at java.base/jdk.internal.reflect.DelegatingMethodAccessorImpl.invoke(DelegatingMethodAccessorImpl.java:43)
	at java.base/java.lang.reflect.Method.invoke(Method.java:564)
	at com.carrotsearch.randomizedtesting.RandomizedRunner.invoke(RandomizedRunner.java:1737)
	at com.carrotsearch.randomizedtesting.RandomizedRunner$8.evaluate(RandomizedRunner.java:934)
	at com.carrotsearch.randomizedtesting.RandomizedRunner$9.evaluate(RandomizedRunner.java:970)
	at com.carrotsearch.randomizedtesting.RandomizedRunner$10.evaluate(RandomizedRunner.java:984)
	at com.carrotsearch.randomizedtesting.rules.SystemPropertiesRestoreRule$1.evaluate(SystemPropertiesRestoreRule.java:57)
	at org.apache.lucene.util.TestRuleSetupTeardownChained$1.evaluate(TestRuleSetupTeardownChained.java:49)
	at org.apache.lucene.util.AbstractBeforeAfterRule$1.evaluate(AbstractBeforeAfterRule.java:45)
	at org.apache.lucene.util.TestRuleThreadAndTestName$1.evaluate(TestRuleThreadAndTestName.java:48)
	at org.apache.lucene.util.TestRuleIgnoreAfterMaxFailures$1.evaluate(TestRuleIgnoreAfterMaxFailures.java:64)
	at org.apache.lucene.util.TestRuleMarkFailure$1.evaluate(TestRuleMarkFailure.java:47)
	at com.carrotsearch.randomizedtesting.rules.StatementAdapter.evaluate(StatementAdapter.java:36)
	at com.carrotsearch.randomizedtesting.ThreadLeakControl$StatementRunner.run(ThreadLeakControl.java:368)
	at com.carrotsearch.randomizedtesting.ThreadLeakControl.forkTimeoutingTask(ThreadLeakControl.java:817)
	at com.carrotsearch.randomizedtesting.ThreadLeakControl$3.evaluate(ThreadLeakControl.java:468)
	at com.carrotsearch.randomizedtesting.RandomizedRunner.runSingleTest(RandomizedRunner.java:943)
	at com.carrotsearch.randomizedtesting.RandomizedRunner$5.evaluate(RandomizedRunner.java:829)
	at com.carrotsearch.randomizedtesting.RandomizedRunner$6.evaluate(RandomizedRunner.java:879)
	at com.carrotsearch.randomizedtesting.RandomizedRunner$7.evaluate(RandomizedRunner.java:890)
	at com.carrotsearch.randomizedtesting.rules.StatementAdapter.evaluate(StatementAdapter.java:36)
	at com.carrotsearch.randomizedtesting.rules.SystemPropertiesRestoreRule$1.evaluate(SystemPropertiesRestoreRule.java:57)
	at org.apache.lucene.util.AbstractBeforeAfterRule$1.evaluate(AbstractBeforeAfterRule.java:45)
	at com.carrotsearch.randomizedtesting.rules.StatementAdapter.evaluate(StatementAdapter.java:36)
	at org.apache.lucene.util.TestRuleStoreClassName$1.evaluate(TestRuleStoreClassName.java:41)
	at com.carrotsearch.randomizedtesting.rules.NoShadowingOrOverridesOnMethodsRule$1.evaluate(NoShadowingOrOverridesOnMethodsRule.java:40)
	at com.carrotsearch.randomizedtesting.rules.NoShadowingOrOverridesOnMethodsRule$1.evaluate(NoShadowingOrOverridesOnMethodsRule.java:40)
	at com.carrotsearch.randomizedtesting.rules.StatementAdapter.evaluate(StatementAdapter.java:36)
	at com.carrotsearch.randomizedtesting.rules.StatementAdapter.evaluate(StatementAdapter.java:36)
	at org.apache.lucene.util.TestRuleAssertionsRequired$1.evaluate(TestRuleAssertionsRequired.java:53)
	at org.apache.lucene.util.TestRuleMarkFailure$1.evaluate(TestRuleMarkFailure.java:47)
	at org.apache.lucene.util.TestRuleIgnoreAfterMaxFailures$1.evaluate(TestRuleIgnoreAfterMaxFailures.java:64)
	at org.apache.lucene.util.TestRuleIgnoreTestSuites$1.evaluate(TestRuleIgnoreTestSuites.java:54)
	at com.carrotsearch.randomizedtesting.rules.StatementAdapter.evaluate(StatementAdapter.java:36)
	at com.carrotsearch.randomizedtesting.ThreadLeakControl$StatementRunner.run(ThreadLeakControl.java:368)
	at java.base/java.lang.Thread.run(Thread.java:844)


FAILED:  org.apache.solr.handler.TestReplicationHandler.doTestStressReplication

Error Message:
found:2[index.20180404004109564, index.20180404004111092, index.properties, replication.properties, snapshot_metadata]

Stack Trace:
java.lang.AssertionError: found:2[index.20180404004109564, index.20180404004111092, index.properties, replication.properties, snapshot_metadata]
	at __randomizedtesting.SeedInfo.seed([CD5DAE6ED7143F:DB665D686BFF7D8C]:0)
	at org.junit.Assert.fail(Assert.java:93)
	at org.junit.Assert.assertTrue(Assert.java:43)
	at org.apache.solr.handler.TestReplicationHandler.checkForSingleIndex(TestReplicationHandler.java:963)
	at org.apache.solr.handler.TestReplicationHandler.checkForSingleIndex(TestReplicationHandler.java:934)
	at org.apache.solr.handler.TestReplicationHandler.doTestStressReplication(TestReplicationHandler.java:910)
	at java.base/jdk.internal.reflect.NativeMethodAccessorImpl.invoke0(Native Method)
	at java.base/jdk.internal.reflect.NativeMethodAccessorImpl.invoke(NativeMethodAccessorImpl.java:62)
	at java.base/jdk.internal.reflect.DelegatingMethodAccessorImpl.invoke(DelegatingMethodAccessorImpl.java:43)
	at java.base/java.lang.reflect.Method.invoke(Method.java:564)
	at com.carrotsearch.randomizedtesting.RandomizedRunner.invoke(RandomizedRunner.java:1737)
	at com.carrotsearch.randomizedtesting.RandomizedRunner$8.evaluate(RandomizedRunner.java:934)
	at com.carrotsearch.randomizedtesting.RandomizedRunner$9.evaluate(RandomizedRunner.java:970)
	at com.carrotsearch.randomizedtesting.RandomizedRunner$10.evaluate(RandomizedRunner.java:984)
	at com.carrotsearch.randomizedtesting.rules.SystemPropertiesRestoreRule$1.evaluate(SystemPropertiesRestoreRule.java:57)
	at org.apache.lucene.util.TestRuleSetupTeardownChained$1.evaluate(TestRuleSetupTeardownChained.java:49)
	at org.apache.lucene.util.AbstractBeforeAfterRule$1.evaluate(AbstractBeforeAfterRule.java:45)
	at org.apache.lucene.util.TestRuleThreadAndTestName$1.evaluate(TestRuleThreadAndTestName.java:48)
	at org.apache.lucene.util.TestRuleIgnoreAfterMaxFailures$1.evaluate(TestRuleIgnoreAfterMaxFailures.java:64)
	at org.apache.lucene.util.TestRuleMarkFailure$1.evaluate(TestRuleMarkFailure.java:47)
	at com.carrotsearch.randomizedtesting.rules.StatementAdapter.evaluate(StatementAdapter.java:36)
	at com.carrotsearch.randomizedtesting.ThreadLeakControl$StatementRunner.run(ThreadLeakControl.java:368)
	at com.carrotsearch.randomizedtesting.ThreadLeakControl.forkTimeoutingTask(ThreadLeakControl.java:817)
	at com.carrotsearch.randomizedtesting.ThreadLeakControl$3.evaluate(ThreadLeakControl.java:468)
	at com.carrotsearch.randomizedtesting.RandomizedRunner.runSingleTest(RandomizedRunner.java:943)
	at com.carrotsearch.randomizedtesting.RandomizedRunner$5.evaluate(RandomizedRunner.java:829)
	at com.carrotsearch.randomizedtesting.RandomizedRunner$6.evaluate(RandomizedRunner.java:879)
	at com.carrotsearch.randomizedtesting.RandomizedRunner$7.evaluate(RandomizedRunner.java:890)
	at com.carrotsearch.randomizedtesting.rules.StatementAdapter.evaluate(StatementAdapter.java:36)
	at com.carrotsearch.randomizedtesting.rules.SystemPropertiesRestoreRule$1.evaluate(SystemPropertiesRestoreRule.java:57)
	at org.apache.lucene.util.AbstractBeforeAfterRule$1.evaluate(AbstractBeforeAfterRule.java:45)
	at com.carrotsearch.randomizedtesting.rules.StatementAdapter.evaluate(StatementAdapter.java:36)
	at org.apache.lucene.util.TestRuleStoreClassName$1.evaluate(TestRuleStoreClassName.java:41)
	at com.carrotsearch.randomizedtesting.rules.NoShadowingOrOverridesOnMethodsRule$1.evaluate(NoShadowingOrOverridesOnMethodsRule.java:40)
	at com.carrotsearch.randomizedtesting.rules.NoShadowingOrOverridesOnMethodsRule$1.evaluate(NoShadowingOrOverridesOnMethodsRule.java:40)
	at com.carrotsearch.randomizedtesting.rules.StatementAdapter.evaluate(StatementAdapter.java:36)
	at com.carrotsearch.randomizedtesting.rules.StatementAdapter.evaluate(StatementAdapter.java:36)
	at org.apache.lucene.util.TestRuleAssertionsRequired$1.evaluate(TestRuleAssertionsRequired.java:53)
	at org.apache.lucene.util.TestRuleMarkFailure$1.evaluate(TestRuleMarkFailure.java:47)
	at org.apache.lucene.util.TestRuleIgnoreAfterMaxFailures$1.evaluate(TestRuleIgnoreAfterMaxFailures.java:64)
	at org.apache.lucene.util.TestRuleIgnoreTestSuites$1.evaluate(TestRuleIgnoreTestSuites.java:54)
	at com.carrotsearch.randomizedtesting.rules.StatementAdapter.evaluate(StatementAdapter.java:36)
	at com.carrotsearch.randomizedtesting.ThreadLeakControl$StatementRunner.run(ThreadLeakControl.java:368)
	at java.base/java.lang.Thread.run(Thread.java:844)


FAILED:  org.apache.solr.common.util.TestTimeSource.testEpochTime

Error Message:
SimTimeSource:50.0 time diff=35999850

Stack Trace:
java.lang.AssertionError: SimTimeSource:50.0 time diff=35999850
	at __randomizedtesting.SeedInfo.seed([77F2846609293A1C:4F9EF7439DF9985A]:0)
	at org.junit.Assert.fail(Assert.java:93)
	at org.junit.Assert.assertTrue(Assert.java:43)
	at org.apache.solr.common.util.TestTimeSource.doTestEpochTime(TestTimeSource.java:48)
	at org.apache.solr.common.util.TestTimeSource.testEpochTime(TestTimeSource.java:32)
	at java.base/jdk.internal.reflect.NativeMethodAccessorImpl.invoke0(Native Method)
	at java.base/jdk.internal.reflect.NativeMethodAccessorImpl.invoke(NativeMethodAccessorImpl.java:62)
	at java.base/jdk.internal.reflect.DelegatingMethodAccessorImpl.invoke(DelegatingMethodAccessorImpl.java:43)
	at java.base/java.lang.reflect.Method.invoke(Method.java:564)
	at com.carrotsearch.randomizedtesting.RandomizedRunner.invoke(RandomizedRunner.java:1737)
	at com.carrotsearch.randomizedtesting.RandomizedRunner$8.evaluate(RandomizedRunner.java:934)
	at com.carrotsearch.randomizedtesting.RandomizedRunner$9.evaluate(RandomizedRunner.java:970)
	at com.carrotsearch.randomizedtesting.RandomizedRunner$10.evaluate(RandomizedRunner.java:984)
	at com.carrotsearch.randomizedtesting.rules.SystemPropertiesRestoreRule$1.evaluate(SystemPropertiesRestoreRule.java:57)
	at org.apache.lucene.util.TestRuleSetupTeardownChained$1.evaluate(TestRuleSetupTeardownChained.java:49)
	at org.apache.lucene.util.AbstractBeforeAfterRule$1.evaluate(AbstractBeforeAfterRule.java:45)
	at org.apache.lucene.util.TestRuleThreadAndTestName$1.evaluate(TestRuleThreadAndTestName.java:48)
	at org.apache.lucene.util.TestRuleIgnoreAfterMaxFailures$1.evaluate(TestRuleIgnoreAfterMaxFailures.java:64)
	at org.apache.lucene.util.TestRuleMarkFailure$1.evaluate(TestRuleMarkFailure.java:47)
	at com.carrotsearch.randomizedtesting.rules.StatementAdapter.evaluate(StatementAdapter.java:36)
	at com.carrotsearch.randomizedtesting.ThreadLeakControl$StatementRunner.run(ThreadLeakControl.java:368)
	at com.carrotsearch.randomizedtesting.ThreadLeakControl.forkTimeoutingTask(ThreadLeakControl.java:817)
	at com.carrotsearch.randomizedtesting.ThreadLeakControl$3.evaluate(ThreadLeakControl.java:468)
	at com.carrotsearch.randomizedtesting.RandomizedRunner.runSingleTest(RandomizedRunner.java:943)
	at com.carrotsearch.randomizedtesting.RandomizedRunner$5.evaluate(RandomizedRunner.java:829)
	at com.carrotsearch.randomizedtesting.RandomizedRunner$6.evaluate(RandomizedRunner.java:879)
	at com.carrotsearch.randomizedtesting.RandomizedRunner$7.evaluate(RandomizedRunner.java:890)
	at com.carrotsearch.randomizedtesting.rules.StatementAdapter.evaluate(StatementAdapter.java:36)
	at com.carrotsearch.randomizedtesting.rules.SystemPropertiesRestoreRule$1.evaluate(SystemPropertiesRestoreRule.java:57)
	at org.apache.lucene.util.AbstractBeforeAfterRule$1.evaluate(AbstractBeforeAfterRule.java:45)
	at com.carrotsearch.randomizedtesting.rules.StatementAdapter.evaluate(StatementAdapter.java:36)
	at org.apache.lucene.util.TestRuleStoreClassName$1.evaluate(TestRuleStoreClassName.java:41)
	at com.carrotsearch.randomizedtesting.rules.NoShadowingOrOverridesOnMethodsRule$1.evaluate(NoShadowingOrOverridesOnMethodsRule.java:40)
	at com.carrotsearch.randomizedtesting.rules.NoShadowingOrOverridesOnMethodsRule$1.evaluate(NoShadowingOrOverridesOnMethodsRule.java:40)
	at com.carrotsearch.randomizedtesting.rules.StatementAdapter.evaluate(StatementAdapter.java:36)
	at com.carrotsearch.randomizedtesting.rules.StatementAdapter.evaluate(StatementAdapter.java:36)
	at org.apache.lucene.util.TestRuleAssertionsRequired$1.evaluate(TestRuleAssertionsRequired.java:53)
	at org.apache.lucene.util.TestRuleMarkFailure$1.evaluate(TestRuleMarkFailure.java:47)
	at org.apache.lucene.util.TestRuleIgnoreAfterMaxFailures$1.evaluate(TestRuleIgnoreAfterMaxFailures.java:64)
	at org.apache.lucene.util.TestRuleIgnoreTestSuites$1.evaluate(TestRuleIgnoreTestSuites.java:54)
	at com.carrotsearch.randomizedtesting.rules.StatementAdapter.evaluate(StatementAdapter.java:36)
	at com.carrotsearch.randomizedtesting.ThreadLeakControl$StatementRunner.run(ThreadLeakControl.java:368)
	at java.base/java.lang.Thread.run(Thread.java:844)


FAILED:  org.apache.solr.common.util.TestTimeSource.testEpochTime

Error Message:
SimTimeSource:50.0 time diff=118815900

Stack Trace:
java.lang.AssertionError: SimTimeSource:50.0 time diff=118815900
	at __randomizedtesting.SeedInfo.seed([77F2846609293A1C:4F9EF7439DF9985A]:0)
	at org.junit.Assert.fail(Assert.java:93)
	at org.junit.Assert.assertTrue(Assert.java:43)
	at org.apache.solr.common.util.TestTimeSource.doTestEpochTime(TestTimeSource.java:48)
	at org.apache.solr.common.util.TestTimeSource.testEpochTime(TestTimeSource.java:32)
	at java.base/jdk.internal.reflect.NativeMethodAccessorImpl.invoke0(Native Method)
	at java.base/jdk.internal.reflect.NativeMethodAccessorImpl.invoke(NativeMethodAccessorImpl.java:62)
	at java.base/jdk.internal.reflect.DelegatingMethodAccessorImpl.invoke(DelegatingMethodAccessorImpl.java:43)
	at java.base/java.lang.reflect.Method.invoke(Method.java:564)
	at com.carrotsearch.randomizedtesting.RandomizedRunner.invoke(RandomizedRunner.java:1737)
	at com.carrotsearch.randomizedtesting.RandomizedRunner$8.evaluate(RandomizedRunner.java:934)
	at com.carrotsearch.randomizedtesting.RandomizedRunner$9.evaluate(RandomizedRunner.java:970)
	at com.carrotsearch.randomizedtesting.RandomizedRunner$10.evaluate(RandomizedRunner.java:984)
	at com.carrotsearch.randomizedtesting.rules.SystemPropertiesRestoreRule$1.evaluate(SystemPropertiesRestoreRule.java:57)
	at org.apache.lucene.util.TestRuleSetupTeardownChained$1.evaluate(TestRuleSetupTeardownChained.java:49)
	at org.apache.lucene.util.AbstractBeforeAfterRule$1.evaluate(AbstractBeforeAfterRule.java:45)
	at org.apache.lucene.util.TestRuleThreadAndTestName$1.evaluate(TestRuleThreadAndTestName.java:48)
	at org.apache.lucene.util.TestRuleIgnoreAfterMaxFailures$1.evaluate(TestRuleIgnoreAfterMaxFailures.java:64)
	at org.apache.lucene.util.TestRuleMarkFailure$1.evaluate(TestRuleMarkFailure.java:47)
	at com.carrotsearch.randomizedtesting.rules.StatementAdapter.evaluate(StatementAdapter.java:36)
	at com.carrotsearch.randomizedtesting.ThreadLeakControl$StatementRunner.run(ThreadLeakControl.java:368)
	at com.carrotsearch.randomizedtesting.ThreadLeakControl.forkTimeoutingTask(ThreadLeakControl.java:817)
	at com.carrotsearch.randomizedtesting.ThreadLeakControl$3.evaluate(ThreadLeakControl.java:468)
	at com.carrotsearch.randomizedtesting.RandomizedRunner.runSingleTest(RandomizedRunner.java:943)
	at com.carrotsearch.randomizedtesting.RandomizedRunner$5.evaluate(RandomizedRunner.java:829)
	at com.carrotsearch.randomizedtesting.RandomizedRunner$6.evaluate(RandomizedRunner.java:879)
	at com.carrotsearch.randomizedtesting.RandomizedRunner$7.evaluate(RandomizedRunner.java:890)
	at com.carrotsearch.randomizedtesting.rules.StatementAdapter.evaluate(StatementAdapter.java:36)
	at com.carrotsearch.randomizedtesting.rules.SystemPropertiesRestoreRule$1.evaluate(SystemPropertiesRestoreRule.java:57)
	at org.apache.lucene.util.AbstractBeforeAfterRule$1.evaluate(AbstractBeforeAfterRule.java:45)
	at com.carrotsearch.randomizedtesting.rules.StatementAdapter.evaluate(StatementAdapter.java:36)
	at org.apache.lucene.util.TestRuleStoreClassName$1.evaluate(TestRuleStoreClassName.java:41)
	at com.carrotsearch.randomizedtesting.rules.NoShadowingOrOverridesOnMethodsRule$1.evaluate(NoShadowingOrOverridesOnMethodsRule.java:40)
	at com.carrotsearch.randomizedtesting.rules.NoShadowingOrOverridesOnMethodsRule$1.evaluate(NoShadowingOrOverridesOnMethodsRule.java:40)
	at com.carrotsearch.randomizedtesting.rules.StatementAdapter.evaluate(StatementAdapter.java:36)
	at com.carrotsearch.randomizedtesting.rules.StatementAdapter.evaluate(StatementAdapter.java:36)
	at org.apache.lucene.util.TestRuleAssertionsRequired$1.evaluate(TestRuleAssertionsRequired.java:53)
	at org.apache.lucene.util.TestRuleMarkFailure$1.evaluate(TestRuleMarkFailure.java:47)
	at org.apache.lucene.util.TestRuleIgnoreAfterMaxFailures$1.evaluate(TestRuleIgnoreAfterMaxFailures.java:64)
	at org.apache.lucene.util.TestRuleIgnoreTestSuites$1.evaluate(TestRuleIgnoreTestSuites.java:54)
	at com.carrotsearch.randomizedtesting.rules.StatementAdapter.evaluate(StatementAdapter.java:36)
	at com.carrotsearch.randomizedtesting.ThreadLeakControl$StatementRunner.run(ThreadLeakControl.java:368)
	at java.base/java.lang.Thread.run(Thread.java:844)


FAILED:  org.apache.solr.common.util.TestTimeSource.testEpochTime

Error Message:
SimTimeSource:50.0 time diff=34150950

Stack Trace:
java.lang.AssertionError: SimTimeSource:50.0 time diff=34150950
	at __randomizedtesting.SeedInfo.seed([77F2846609293A1C:4F9EF7439DF9985A]:0)
	at org.junit.Assert.fail(Assert.java:93)
	at org.junit.Assert.assertTrue(Assert.java:43)
	at org.apache.solr.common.util.TestTimeSource.doTestEpochTime(TestTimeSource.java:48)
	at org.apache.solr.common.util.TestTimeSource.testEpochTime(TestTimeSource.java:32)
	at java.base/jdk.internal.reflect.NativeMethodAccessorImpl.invoke0(Native Method)
	at java.base/jdk.internal.reflect.NativeMethodAccessorImpl.invoke(NativeMethodAccessorImpl.java:62)
	at java.base/jdk.internal.reflect.DelegatingMethodAccessorImpl.invoke(DelegatingMethodAccessorImpl.java:43)
	at java.base/java.lang.reflect.Method.invoke(Method.java:564)
	at com.carrotsearch.randomizedtesting.RandomizedRunner.invoke(RandomizedRunner.java:1737)
	at com.carrotsearch.randomizedtesting.RandomizedRunner$8.evaluate(RandomizedRunner.java:934)
	at com.carrotsearch.randomizedtesting.RandomizedRunner$9.evaluate(RandomizedRunner.java:970)
	at com.carrotsearch.randomizedtesting.RandomizedRunner$10.evaluate(RandomizedRunner.java:984)
	at com.carrotsearch.randomizedtesting.rules.SystemPropertiesRestoreRule$1.evaluate(SystemPropertiesRestoreRule.java:57)
	at org.apache.lucene.util.TestRuleSetupTeardownChained$1.evaluate(TestRuleSetupTeardownChained.java:49)
	at org.apache.lucene.util.AbstractBeforeAfterRule$1.evaluate(AbstractBeforeAfterRule.java:45)
	at org.apache.lucene.util.TestRuleThreadAndTestName$1.evaluate(TestRuleThreadAndTestName.java:48)
	at org.apache.lucene.util.TestRuleIgnoreAfterMaxFailures$1.evaluate(TestRuleIgnoreAfterMaxFailures.java:64)
	at org.apache.lucene.util.TestRuleMarkFailure$1.evaluate(TestRuleMarkFailure.java:47)
	at com.carrotsearch.randomizedtesting.rules.StatementAdapter.evaluate(StatementAdapter.java:36)
	at com.carrotsearch.randomizedtesting.ThreadLeakControl$StatementRunner.run(ThreadLeakControl.java:368)
	at com.carrotsearch.randomizedtesting.ThreadLeakControl.forkTimeoutingTask(ThreadLeakControl.java:817)
	at com.carrotsearch.randomizedtesting.ThreadLeakControl$3.evaluate(ThreadLeakControl.java:468)
	at com.carrotsearch.randomizedtesting.RandomizedRunner.runSingleTest(RandomizedRunner.java:943)
	at com.carrotsearch.randomizedtesting.RandomizedRunner$5.evaluate(RandomizedRunner.java:829)
	at com.carrotsearch.randomizedtesting.RandomizedRunner$6.evaluate(RandomizedRunner.java:879)
	at com.carrotsearch.randomizedtesting.RandomizedRunner$7.evaluate(RandomizedRunner.java:890)
	at com.carrotsearch.randomizedtesting.rules.StatementAdapter.evaluate(StatementAdapter.java:36)
	at com.carrotsearch.randomizedtesting.rules.SystemPropertiesRestoreRule$1.evaluate(SystemPropertiesRestoreRule.java:57)
	at org.apache.lucene.util.AbstractBeforeAfterRule$1.evaluate(AbstractBeforeAfterRule.java:45)
	at com.carrotsearch.randomizedtesting.rules.StatementAdapter.evaluate(StatementAdapter.java:36)
	at org.apache.lucene.util.TestRuleStoreClassName$1.evaluate(TestRuleStoreClassName.java:41)
	at com.carrotsearch.randomizedtesting.rules.NoShadowingOrOverridesOnMethodsRule$1.evaluate(NoShadowingOrOverridesOnMethodsRule.java:40)
	at com.carrotsearch.randomizedtesting.rules.NoShadowingOrOverridesOnMethodsRule$1.evaluate(NoShadowingOrOverridesOnMethodsRule.java:40)
	at com.carrotsearch.randomizedtesting.rules.StatementAdapter.evaluate(StatementAdapter.java:36)
	at com.carrotsearch.randomizedtesting.rules.StatementAdapter.evaluate(StatementAdapter.java:36)
	at org.apache.lucene.util.TestRuleAssertionsRequired$1.evaluate(TestRuleAssertionsRequired.java:53)
	at org.apache.lucene.util.TestRuleMarkFailure$1.evaluate(TestRuleMarkFailure.java:47)
	at org.apache.lucene.util.TestRuleIgnoreAfterMaxFailures$1.evaluate(TestRuleIgnoreAfterMaxFailures.java:64)
	at org.apache.lucene.util.TestRuleIgnoreTestSuites$1.evaluate(TestRuleIgnoreTestSuites.java:54)
	at com.carrotsearch.randomizedtesting.rules.StatementAdapter.evaluate(StatementAdapter.java:36)
	at com.carrotsearch.randomizedtesting.ThreadLeakControl$StatementRunner.run(ThreadLeakControl.java:368)
	at java.base/java.lang.Thread.run(Thread.java:844)




Build Log:
[...truncated 1867 lines...]
   [junit4] JVM J1: stdout was not empty, see: C:\Users\jenkins\workspace\Lucene-Solr-master-Windows\lucene\build\core\test\temp\junit4-J1-20180403_221106_93312273207625335445202.sysout
   [junit4] >>> JVM J1 emitted unexpected output (verbatim) ----
   [junit4] codec: FastDecompressionCompressingStoredFields, pf: RAMOnly, dvf: Lucene70
   [junit4] <<< JVM J1: EOF ----

[...truncated 10661 lines...]
   [junit4] Suite: org.apache.solr.handler.TestReplicationHandler
   [junit4]   2> 555668 INFO  (SUITE-TestReplicationHandler-seed#[CD5DAE6ED7143F]-worker) [    ] o.a.s.SolrTestCaseJ4 SecureRandom sanity checks: test.solr.allowed.securerandom=null & java.security.egd=file:/dev/./urandom
   [junit4]   2> Creating dataDir: C:\Users\jenkins\workspace\Lucene-Solr-master-Windows\solr\build\solr-core\test\J0\temp\solr.handler.TestReplicationHandler_CD5DAE6ED7143F-001\init-core-data-001
   [junit4]   2> 555669 WARN  (SUITE-TestReplicationHandler-seed#[CD5DAE6ED7143F]-worker) [    ] o.a.s.SolrTestCaseJ4 startTrackingSearchers: numOpens=27 numCloses=27
   [junit4]   2> 555669 INFO  (SUITE-TestReplicationHandler-seed#[CD5DAE6ED7143F]-worker) [    ] o.a.s.SolrTestCaseJ4 Using PointFields (NUMERIC_POINTS_SYSPROP=true) w/NUMERIC_DOCVALUES_SYSPROP=false
   [junit4]   2> 555671 INFO  (SUITE-TestReplicationHandler-seed#[CD5DAE6ED7143F]-worker) [    ] o.a.s.SolrTestCaseJ4 Randomized ssl (false) and clientAuth (false) via: @org.apache.solr.SolrTestCaseJ4$SuppressSSL(bugUrl="None")
   [junit4]   2> 555673 INFO  (TEST-TestReplicationHandler.testEmptyCommits-seed#[CD5DAE6ED7143F]) [    ] o.a.s.SolrTestCaseJ4 ###Starting testEmptyCommits
   [junit4]   2> 555674 INFO  (TEST-TestReplicationHandler.testEmptyCommits-seed#[CD5DAE6ED7143F]) [    ] o.a.s.SolrTestCaseJ4 Writing core.properties file to C:\Users\jenkins\workspace\Lucene-Solr-master-Windows\solr\build\solr-core\test\J0\temp\solr.handler.TestReplicationHandler_CD5DAE6ED7143F-001\solr-instance-001\collection1
   [junit4]   2> 555679 INFO  (TEST-TestReplicationHandler.testEmptyCommits-seed#[CD5DAE6ED7143F]) [    ] o.e.j.s.Server jetty-9.4.8.v20171121, build timestamp: ????-??-??T??:??:??+01:00, git hash: 82b8fb23f757335bb3329d540ce37a2a2615f0a8
   [junit4]   2> 555679 INFO  (TEST-TestReplicationHandler.testEmptyCommits-seed#[CD5DAE6ED7143F]) [    ] o.e.j.s.session DefaultSessionIdManager workerName=node0
   [junit4]   2> 555679 INFO  (TEST-TestReplicationHandler.testEmptyCommits-seed#[CD5DAE6ED7143F]) [    ] o.e.j.s.session No SessionScavenger set, using defaults
   [junit4]   2> 555679 INFO  (TEST-TestReplicationHandler.testEmptyCommits-seed#[CD5DAE6ED7143F]) [    ] o.e.j.s.session Scavenging every 660000ms
   [junit4]   2> 555680 INFO  (TEST-TestReplicationHandler.testEmptyCommits-seed#[CD5DAE6ED7143F]) [    ] o.e.j.s.h.ContextHandler Started o.e.j.s.ServletContextHandler@25f77a19{/solr,null,AVAILABLE}
   [junit4]   2> 555682 INFO  (TEST-TestReplicationHandler.testEmptyCommits-seed#[CD5DAE6ED7143F]) [    ] o.e.j.s.AbstractConnector Started ServerConnector@3d3bf921{HTTP/1.1,[http/1.1]}{127.0.0.1:57172}
   [junit4]   2> 555682 INFO  (TEST-TestReplicationHandler.testEmptyCommits-seed#[CD5DAE6ED7143F]) [    ] o.e.j.s.Server Started @555748ms
   [junit4]   2> 555682 INFO  (TEST-TestReplicationHandler.testEmptyCommits-seed#[CD5DAE6ED7143F]) [    ] o.a.s.c.s.e.JettySolrRunner Jetty properties: {hostContext=/solr, solr.data.dir=C:\Users\jenkins\workspace\Lucene-Solr-master-Windows\solr\build\solr-core\test\J0\temp\solr.handler.TestReplicationHandler_CD5DAE6ED7143F-001\solr-instance-001\collection1\data, hostPort=57172}
   [junit4]   2> 555683 ERROR (TEST-TestReplicationHandler.testEmptyCommits-seed#[CD5DAE6ED7143F]) [    ] o.a.s.u.StartupLoggingUtils Missing Java Option solr.log.dir. Logging may be missing or incomplete.
   [junit4]   2> 555683 INFO  (TEST-TestReplicationHandler.testEmptyCommits-seed#[CD5DAE6ED7143F]) [    ] o.a.s.s.SolrDispatchFilter Using logger factory org.apache.logging.slf4j.Log4jLoggerFactory
   [junit4]   2> 555683 INFO  (TEST-TestReplicationHandler.testEmptyCommits-seed#[CD5DAE6ED7143F]) [    ] o.a.s.s.SolrDispatchFilter  ___      _       Welcome to Apache Solr? version 8.0.0
   [junit4]   2> 555683 INFO  (TEST-TestReplicationHandler.testEmptyCommits-seed#[CD5DAE6ED7143F]) [    ] o.a.s.s.SolrDispatchFilter / __| ___| |_ _   Starting in standalone mode on port null
   [junit4]   2> 555683 INFO  (TEST-TestReplicationHandler.testEmptyCommits-seed#[CD5DAE6ED7143F]) [    ] o.a.s.s.SolrDispatchFilter \__ \/ _ \ | '_|  Install dir: null
   [junit4]   2> 555683 INFO  (TEST-TestReplicationHandler.testEmptyCommits-seed#[CD5DAE6ED7143F]) [    ] o.a.s.s.SolrDispatchFilter |___/\___/_|_|    Start time: 2018-04-03T22:40:25.566692900Z
   [junit4]   2> 555684 INFO  (TEST-TestReplicationHandler.testEmptyCommits-seed#[CD5DAE6ED7143F]) [    ] o.a.s.c.SolrXmlConfig Loading container configuration from C:\Users\jenkins\workspace\Lucene-Solr-master-Windows\solr\build\solr-core\test\J0\temp\solr.handler.TestReplicationHandler_CD5DAE6ED7143F-001\solr-instance-001\solr.xml
   [junit4]   2> 555688 INFO  (TEST-TestReplicationHandler.testEmptyCommits-seed#[CD5DAE6ED7143F]) [    ] o.a.s.c.SolrXmlConfig Configuration parameter autoReplicaFailoverWorkLoopDelay is ignored
   [junit4]   2> 555688 INFO  (TEST-TestReplicationHandler.testEmptyCommits-seed#[CD5DAE6ED7143F]) [    ] o.a.s.c.SolrXmlConfig Configuration parameter autoReplicaFailoverBadNodeExpiration is ignored
   [junit4]   2> 555689 INFO  (TEST-TestReplicationHandler.testEmptyCommits-seed#[CD5DAE6ED7143F]) [    ] o.a.s.c.SolrXmlConfig MBean server found: com.sun.jmx.mbeanserver.JmxMBeanServer@48951a4d, but no JMX reporters were configured - adding default JMX reporter.
   [junit4]   2> 555746 INFO  (TEST-TestReplicationHandler.testEmptyCommits-seed#[CD5DAE6ED7143F]) [    ] o.a.s.m.r.SolrJmxReporter JMX monitoring for 'solr.node' (registry 'solr.node') enabled at server: com.sun.jmx.mbeanserver.JmxMBeanServer@48951a4d
   [junit4]   2> 555754 INFO  (TEST-TestReplicationHandler.testEmptyCommits-seed#[CD5DAE6ED7143F]) [    ] o.a.s.m.r.SolrJmxReporter JMX monitoring for 'solr.jvm' (registry 'solr.jvm') enabled at server: com.sun.jmx.mbeanserver.JmxMBeanServer@48951a4d
   [junit4]   2> 555756 INFO  (TEST-TestReplicationHandler.testEmptyCommits-seed#[CD5DAE6ED7143F]) [    ] o.a.s.m.r.SolrJmxReporter JMX monitoring for 'solr.jetty' (registry 'solr.jetty') enabled at server: com.sun.jmx.mbeanserver.JmxMBeanServer@48951a4d
   [junit4]   2> 555759 INFO  (TEST-TestReplicationHandler.testEmptyCommits-seed#[CD5DAE6ED7143F]) [    ] o.a.s.c.CorePropertiesLocator Found 1 core definitions underneath C:\Users\jenkins\workspace\Lucene-Solr-master-Windows\solr\build\solr-core\test\J0\temp\solr.handler.TestReplicationHandler_CD5DAE6ED7143F-001\solr-instance-001\.
   [junit4]   2> 555759 INFO  (TEST-TestReplicationHandler.testEmptyCommits-seed#[CD5DAE6ED7143F]) [    ] o.a.s.c.CorePropertiesLocator Cores are: [collection1]
   [junit4]   2> 555838 INFO  (coreLoadExecutor-1220-thread-1) [    ] o.a.s.c.TransientSolrCoreCacheDefault Allocating transient cache for 4 transient cores
   [junit4]   2> 555858 INFO  (coreLoadExecutor-1220-thread-1) [    x:collection1] o.a.s.c.SolrConfig Using Lucene MatchVersion: 8.0.0
   [junit4]   2> 555866 INFO  (coreLoadExecutor-1220-thread-1) [    x:collection1] o.a.s.s.IndexSchema [collection1] Schema name=test
   [junit4]   2> 555868 INFO  (coreLoadExecutor-1220-thread-1) [    x:collection1] o.a.s.s.IndexSchema Loaded schema test/1.2 with uniqueid field id
   [junit4]   2> 555868 INFO  (coreLoadExecutor-1220-thread-1) [    x:collection1] o.a.s.c.CoreContainer Creating SolrCore 'collection1' using configuration from instancedir C:\Users\jenkins\workspace\Lucene-Solr-master-Windows\solr\build\solr-core\test\J0\temp\solr.handler.TestReplicationHandler_CD5DAE6ED7143F-001\solr-instance-001\.\collection1, trusted=true
   [junit4]   2> 555868 INFO  (coreLoadExecutor-1220-thread-1) [    x:collection1] o.a.s.m.r.SolrJmxReporter JMX monitoring for 'solr.core.collection1' (registry 'solr.core.collection1') enabled at server: com.sun.jmx.mbeanserver.JmxMBeanServer@48951a4d
   [junit4]   2> 555868 INFO  (coreLoadExecutor-1220-thread-1) [    x:collection1] o.a.s.c.SolrCore solr.RecoveryStrategy.Builder
   [junit4]   2> 555868 INFO  (coreLoadExecutor-1220-thread-1) [    x:collection1] o.a.s.c.SolrCore [[collection1] ] Opening new SolrCore at [C:\Users\jenkins\workspace\Lucene-Solr-master-Windows\solr\build\solr-core\test\J0\temp\solr.handler.TestReplicationHandler_CD5DAE6ED7143F-001\solr-instance-001\collection1], dataDir=[C:\Users\jenkins\workspace\Lucene-Solr-master-Windows\solr\build\solr-core\test\J0\temp\solr.handler.TestReplicationHandler_CD5DAE6ED7143F-001\solr-instance-001\.\collection1\data\]
   [junit4]   2> 555873 INFO  (coreLoadExecutor-1220-thread-1) [    x:collection1] o.a.s.u.RandomMergePolicy RandomMergePolicy wrapping class org.apache.lucene.index.AlcoholicMergePolicy: [AlcoholicMergePolicy: minMergeSize=0, mergeFactor=10, maxMergeSize=162445068, maxMergeSizeForForcedMerge=9223372036854775807, calibrateSizeByDeletes=true, maxMergeDocs=2147483647, maxCFSSegmentSizeMB=8.796093022207999E12, noCFSRatio=0.1]
   [junit4]   2> 555951 INFO  (coreLoadExecutor-1220-thread-1) [    x:collection1] o.a.s.u.CommitTracker Hard AutoCommit: disabled
   [junit4]   2> 555951 INFO  (coreLoadExecutor-1220-thread-1) [    x:collection1] o.a.s.u.CommitTracker Soft AutoCommit: disabled
   [junit4]   2> 555952 INFO  (coreLoadExecutor-1220-thread-1) [    x:collection1] o.a.s.u.RandomMergePolicy RandomMergePolicy wrapping class org.apache.lucene.index.TieredMergePolicy: [TieredMergePolicy: maxMergeAtOnce=49, maxMergeAtOnceExplicit=24, maxMergedSegmentMB=99.1005859375, floorSegmentMB=2.126953125, forceMergeDeletesPctAllowed=5.596005768841035, segmentsPerTier=44.0, maxCFSSegmentSizeMB=8.796093022207999E12, noCFSRatio=1.0
   [junit4]   2> 555954 INFO  (coreLoadExecutor-1220-thread-1) [    x:collection1] o.a.s.s.SolrIndexSearcher Opening [Searcher@3bba7c98[collection1] main]
   [junit4]   2> 555955 INFO  (coreLoadExecutor-1220-thread-1) [    x:collection1] o.a.s.r.ManagedResourceStorage File-based storage initialized to use dir: C:\Users\jenkins\workspace\Lucene-Solr-master-Windows\solr\build\solr-core\test\J0\temp\solr.handler.TestReplicationHandler_CD5DAE6ED7143F-001\solr-instance-001\collection1\conf
   [junit4]   2> 555956 INFO  (coreLoadExecutor-1220-thread-1) [    x:collection1] o.a.s.h.ReplicationHandler Replication enabled for following config files: schema.xml,xslt/dummy.xsl
   [junit4]   2> 555956 INFO  (coreLoadExecutor-1220-thread-1) [    x:collection1] o.a.s.h.ReplicationHandler Commits will be reserved for 10000ms.
   [junit4]   2> 555958 INFO  (searcherExecutor-1221-thread-1-processing-x:collection1) [    x:collection1] o.a.s.c.SolrCore [collection1] Registered new searcher Searcher@3bba7c98[collection1] main{ExitableDirectoryReader(UninvertingDirectoryReader())}
   [junit4]   2> 556458 INFO  (TEST-TestReplicationHandler.testEmptyCommits-seed#[CD5DAE6ED7143F]) [    ] o.a.s.SolrTestCaseJ4 Writing core.properties file to C:\Users\jenkins\workspace\Lucene-Solr-master-Windows\solr\build\solr-core\test\J0\temp\solr.handler.TestReplicationHandler_CD5DAE6ED7143F-001\solr-instance-002\collection1
   [junit4]   2> 556461 INFO  (TEST-TestReplicationHandler.testEmptyCommits-seed#[CD5DAE6ED7143F]) [    ] o.e.j.s.Server jetty-9.4.8.v20171121, build timestamp: ????-??-??T??:??:??+01:00, git hash: 82b8fb23f757335bb3329d540ce37a2a2615f0a8
   [junit4]   2> 556461 INFO  (TEST-TestReplicationHandler.testEmptyCommits-seed#[CD5DAE6ED7143F]) [    ] o.e.j.s.session DefaultSessionIdManager workerName=node0
   [junit4]   2> 556461 INFO  (TEST-TestReplicationHandler.testEmptyCommits-seed#[CD5DAE6ED7143F]) [    ] o.e.j.s.session No SessionScavenger set, using defaults
   [junit4]   2> 556461 INFO  (TEST-TestReplicationHandler.testEmptyCommits-seed#[CD5DAE6ED7143F]) [    ] o.e.j.s.session Scavenging every 660000ms
   [junit4]   2> 556462 INFO  (TEST-TestReplicationHandler.testEmptyCommits-seed#[CD5DAE6ED7143F]) [    ] o.e.j.s.h.ContextHandler Started o.e.j.s.ServletContextHandler@292a29db{/solr,null,AVAILABLE}
   [junit4]   2> 556462 INFO  (TEST-TestReplicationHandler.testEmptyCommits-seed#[CD5DAE6ED7143F]) [    ] o.e.j.s.AbstractConnector Started ServerConnector@6fba351b{HTTP/1.1,[http/1.1]}{127.0.0.1:57189}
   [junit4]   2> 556462 INFO  (TEST-TestReplicationHandler.testEmptyCommits-seed#[CD5DAE6ED7143F]) [    ] o.e.j.s.Server Started @556528ms
   [junit4]   2> 556462 INFO  (TEST-TestReplicationHandler.testEmptyCommits-seed#[CD5DAE6ED7143F]) [    ] o.a.s.c.s.e.JettySolrRunner Jetty properties: {hostContext=/solr, solr.data.dir=C:\Users\jenkins\workspace\Lucene-Solr-master-Windows\solr\build\solr-core\test\J0\temp\solr.handler.TestReplicationHandler_CD5DAE6ED7143F-001\solr-instance-002\collection1\data, hostPort=57189}
   [junit4]   2> 556463 ERROR (TEST-TestReplicationHandler.testEmptyCommits-seed#[CD5DAE6ED7143F]) [    ] o.a.s.u.StartupLoggingUtils Missing Java Option solr.log.dir. Logging may be missing or incomplete.
   [junit4]   2> 556463 INFO  (TEST-TestReplicationHandler.testEmptyCommits-seed#[CD5DAE6ED7143F]) [    ] o.a.s.s.SolrDispatchFilter Using logger factory org.apache.logging.slf4j.Log4jLoggerFactory
   [junit4]   2> 556463 INFO  (TEST-TestReplicationHandler.testEmptyCommits-seed#[CD5DAE6ED7143F]) [    ] o.a.s.s.SolrDispatchFilter  ___      _       Welcome to Apache Solr? version 8.0.0
   [junit4]   2> 556463 INFO  (TEST-TestReplicationHandler.testEmptyCommits-seed#[CD5DAE6ED7143F]) [    ] o.a.s.s.SolrDispatchFilter / __| ___| |_ _   Starting in standalone mode on port null
   [junit4]   2> 556463 INFO  (TEST-TestReplicationHandler.testEmptyCommits-seed#[CD5DAE6ED7143F]) [    ] o.a.s.s.SolrDispatchFilter \__ \/ _ \ | '_|  Install dir: null
   [junit4]   2> 556463 INFO  (TEST-TestReplicationHandler.testEmptyCommits-seed#[CD5DAE6ED7143F]) [    ] o.a.s.s.SolrDispatchFilter |___/\___/_|_|    Start time: 2018-04-03T22:40:26.346511300Z
   [junit4]   2> 556463 INFO  (TEST-TestReplicationHandler.testEmptyCommits-seed#[CD5DAE6ED7143F]) [    ] o.a.s.c.SolrXmlConfig Loading container configuration from C:\Users\jenkins\workspace\Lucene-Solr-master-Windows\solr\build\solr-core\test\J0\temp\solr.handler.TestReplicationHandler_CD5DAE6ED7143F-001\solr-instance-002\solr.xml
   [junit4]   2> 556466 INFO  (TEST-TestReplicationHandler.testEmptyCommits-seed#[CD5DAE6ED7143F]) [    ] o.a.s.c.SolrXmlConfig Configuration parameter autoReplicaFailoverWorkLoopDelay is ignored
   [junit4]   2> 556466 INFO  (TEST-TestReplicationHandler.testEmptyCommits-seed#[CD5DAE6ED7143F]) [    ] o.a.s.c.SolrXmlConfig Configuration parameter autoReplicaFailoverBadNodeExpiration is ignored
   [junit4]   2> 556466 INFO  (TEST-TestReplicationHandler.testEmptyCommits-seed#[CD5DAE6ED7143F]) [    ] o.a.s.c.SolrXmlConfig MBean server found: com.sun.jmx.mbeanserver.JmxMBeanServer@48951a4d, but no JMX reporters were configured - adding default JMX reporter.
   [junit4]   2> 556540 INFO  (TEST-TestReplicationHandler.testEmptyCommits-seed#[CD5DAE6ED7143F]) [    ] o.a.s.m.r.SolrJmxReporter JMX monitoring for 'solr.node' (registry 'solr.node') enabled at server: com.sun.jmx.mbeanserver.JmxMBeanServer@48951a4d
   [junit4]   2> 556549 INFO  (TEST-TestReplicationHandler.testEmptyCommits-seed#[CD5DAE6ED7143F]) [    ] o.a.s.m.r.SolrJmxReporter JMX monitoring for 'solr.jvm' (registry 'solr.jvm') enabled at server: com.sun.jmx.mbeanserver.JmxMBeanServer@48951a4d
   [junit4]   2> 556550 INFO  (TEST-TestReplicationHandler.testEmptyCommits-seed#[CD5DAE6ED7143F]) [    ] o.a.s.m.r.SolrJmxReporter JMX monitoring for 'solr.jetty' (registry 'solr.jetty') enabled at server: com.sun.jmx.mbeanserver.JmxMBeanServer@48951a4d
   [junit4]   2> 556553 INFO  (TEST-TestReplicationHandler.testEmptyCommits-seed#[CD5DAE6ED7143F]) [    ] o.a.s.c.CorePropertiesLocator Found 1 core definitions underneath C:\Users\jenkins\workspace\Lucene-Solr-master-Windows\solr\build\solr-core\test\J0\temp\solr.handler.TestReplicationHandler_CD5DAE6ED7143F-001\solr-instance-002\.
   [junit4]   2> 556553 INFO  (TEST-TestReplicationHandler.testEmptyCommits-seed#[CD5DAE6ED7143F]) [    ] o.a.s.c.CorePropertiesLocator Cores are: [collection1]
   [junit4]   2> 556581 INFO  (coreLoadExecutor-1230-thread-1) [    ] o.a.s.c.TransientSolrCoreCacheDefault Allocating transient cache for 4 transient cores
   [junit4]   2> 556592 INFO  (coreLoadExecutor-1230-thread-1) [    x:collection1] o.a.s.c.SolrConfig Using Lucene MatchVersion: 8.0.0
   [junit4]   2> 556593 INFO  (coreLoadExecutor-1230-thread-1) [    x:collection1] o.a.s.s.IndexSchema [collection1] Schema name=test
   [junit4]   2> 556598 INFO  (coreLoadExecutor-1230-thread-1) [    x:collection1] o.a.s.s.IndexSchema Loaded schema test/1.2 with uniqueid field id
   [junit4]   2> 556598 INFO  (coreLoadExecutor-1230-thread-1) [    x:collection1] o.a.s.c.CoreContainer Creating SolrCore 'collection1' using configuration from instancedir C:\Users\jenkins\workspace\Lucene-Solr-master-Windows\solr\build\solr-core\test\J0\temp\solr.handler.TestReplicationHandler_CD5DAE6ED7143F-001\solr-instance-002\.\collection1, trusted=true
   [junit4]   2> 556598 INFO  (coreLoadExecutor-1230-thread-1) [    x:collection1] o.a.s.m.r.SolrJmxReporter JMX monitoring for 'solr.core.collection1' (registry 'solr.core.collection1') enabled at server: com.sun.jmx.mbeanserver.JmxMBeanServer@48951a4d
   [junit4]   2> 556598 INFO  (coreLoadExecutor-1230-thread-1) [    x:collection1] o.a.s.c.SolrCore solr.RecoveryStrategy.Builder
   [junit4]   2> 556598 INFO  (coreLoadExecutor-1230-thread-1) [    x:collection1] o.a.s.c.SolrCore [[collection1] ] Opening new SolrCore at [C:\Users\jenkins\workspace\Lucene-Solr-master-Windows\solr\build\solr-core\test\J0\temp\solr.handler.TestReplicationHandler_CD5DAE6ED7143F-001\solr-instance-002\collection1], dataDir=[C:\Users\jenkins\workspace\Lucene-Solr-master-Windows\solr\build\solr-core\test\J0\temp\solr.handler.TestReplicationHandler_CD5DAE6ED7143F-001\solr-instance-002\.\collection1\data\]
   [junit4]   2> 556600 INFO  (coreLoadExecutor-1230-thread-1) [    x:collection1] o.a.s.u.RandomMergePolicy RandomMergePolicy wrapping class org.apache.lucene.index.AlcoholicMergePolicy: [AlcoholicMergePolicy: minMergeSize=0, mergeFactor=10, maxMergeSize=162445068, maxMergeSizeForForcedMerge=9223372036854775807, calibrateSizeByDeletes=true, maxMergeDocs=2147483647, maxCFSSegmentSizeMB=8.796093022207999E12, noCFSRatio=0.1]
   [junit4]   2> 556708 INFO  (coreLoadExecutor-1230-thread-1) [    x:collection1] o.a.s.u.CommitTracker Hard AutoCommit: disabled
   [junit4]   2> 556708 INFO  (coreLoadExecutor-1230-thread-1) [    x:collection1] o.a.s.u.CommitTracker Soft AutoCommit: disabled
   [junit4]   2> 556709 INFO  (coreLoadExecutor-1230-thread-1) [    x:collection1] o.a.s.u.RandomMergePolicy RandomMergePolicy wrapping class org.apache.lucene.index.TieredMergePolicy: [TieredMergePolicy: maxMergeAtOnce=49, maxMergeAtOnceExplicit=24, maxMergedSegmentMB=99.1005859375, floorSegmentMB=2.126953125, forceMergeDeletesPctAllowed=5.596005768841035, segmentsPerTier=44.0, maxCFSSegmentSizeMB=8.796093022207999E12, noCFSRatio=1.0
   [junit4]   2> 556709 INFO  (coreLoadExecutor-1230-thread-1) [    x:collection1] o.a.s.s.SolrIndexSearcher Opening [Searcher@4fe51b2c[collection1] main]
   [junit4]   2> 556710 INFO  (coreLoadExecutor-1230-thread-1) [    x:collection1] o.a.s.r.ManagedResourceStorage File-based storage initialized to use dir: C:\Users\jenkins\workspace\Lucene-Solr-master-Windows\solr\build\solr-core\test\J0\temp\solr.handler.TestReplicationHandler_CD5DAE6ED7143F-001\solr-instance-002\collection1\conf
   [junit4]   2> 556712 INFO  (coreLoadExecutor-1230-thread-1) [    x:collection1] o.a.s.h.ReplicationHandler Poll scheduled at an interval of 1000ms
   [junit4]   2> 556712 INFO  (coreLoadExecutor-1230-thread-1) [    x:collection1] o.a.s.h.ReplicationHandler Commits will be reserved for 10000ms.
   [junit4]   2> 556713 INFO  (searcherExecutor-1231-thread-1-processing-x:collection1) [    x:collection1] o.a.s.c.SolrCore [collection1] Registered new searcher Searcher@4fe51b2c[collection1] main{ExitableDirectoryReader(UninvertingDirectoryReader())}
   [junit4]   2> 556715 INFO  (qtp226801540-3182) [    x:collection1] o.a.s.c.S.Request [collection1]  webapp=/solr path=/replication params={qt=/replication&wt=javabin&version=2&command=indexversion} status=0 QTime=0
   [junit4]   2> 556715 INFO  (indexFetcher-1235-thread-1) [    ] o.a.s.h.IndexFetcher Master's generation: 1
   [junit4]   2> 556715 INFO  (indexFetcher-1235-thread-1) [    ] o.a.s.h.IndexFetcher Master's version: 0
   [junit4]   2> 556715 INFO  (indexFetcher-1235-thread-1) [    ] o.a.s.h.IndexFetcher Slave's generation: 1
   [junit4]   2> 556715 INFO  (indexFetcher-1235-thread-1) [    ] o.a.s.h.IndexFetcher Slave's version: 0
   [junit4]   2> 556715 INFO  (indexFetcher-1235-thread-1) [    ] o.a.s.h.IndexFetcher New index in Master. Deleting mine...
   [junit4]   2> 556716 INFO  (qtp226801540-3187) [    x:collection1] o.a.s.c.S.Request [collection1]  webapp=/solr path=/select params={q=*:*&sort=id+desc&wt=javabin&version=2} hits=0 status=0 QTime=0
   [junit4]   2> 556717 INFO  (indexFetcher-1235-thread-1) [    ] o.a.s.s.SolrIndexSearcher Opening [Searcher@d2e77e3[collection1] main]
   [junit4]   2> 556718 INFO  (qtp226801540-3185) [    x:collection1] o.a.s.u.p.LogUpdateProcessorFactory [collection1]  webapp=/solr path=/update params={wt=javabin&version=2}{add=[1]} 0 1
   [junit4]   2> 556718 INFO  (searcherExecutor-1231-thread-1) [    ] o.a.s.c.SolrCore [collection1] Registered new searcher Searcher@d2e77e3[collection1] main{ExitableDirectoryReader(UninvertingDirectoryReader())}
   [junit4]   2> 556719 INFO  (qtp226801540-3187) [    x:collection1] o.a.s.u.DirectUpdateHandler2 start commit{,optimize=false,openSearcher=true,waitSearcher=true,expungeDeletes=false,softCommit=false,prepareCommit=false}
   [junit4]   2> 556719 INFO  (qtp226801540-3187) [    x:collection1] o.a.s.u.SolrIndexWriter Calling setCommitData with IW:org.apache.solr.update.SolrIndexWriter@4e6c20ef commitCommandVersion:0
   [junit4]   2> 556721 INFO  (qtp226801540-3187) [    x:collection1] o.a.s.s.SolrIndexSearcher Opening [Searcher@284d1e1b[collection1] main]
   [junit4]   2> 556722 INFO  (qtp226801540-3187) [    x:collection1] o.a.s.u.DirectUpdateHandler2 end_commit_flush
   [junit4]   2> 556723 INFO  (searcherExecutor-1221-thread-1-processing-x:collection1) [    x:collection1] o.a.s.c.SolrCore [collection1] Registered new searcher Searcher@284d1e1b[collection1] main{ExitableDirectoryReader(UninvertingDirectoryReader(Uninverting(_0(8.0.0):C1)))}
   [junit4]   2> 556723 INFO  (qtp226801540-3187) [    x:collection1] o.a.s.u.p.LogUpdateProcessorFactory [collection1]  webapp=/solr path=/update params={commit=true&wt=javabin&version=2}{commit=} 0 4
   [junit4]   2> 556735 WARN  (explicit-fetchindex-cmd) [    ] o.a.s.h.IndexFetcher 'masterUrl' must be specified without the /replication suffix
   [junit4]   2> 556738 INFO  (qtp226801540-3185) [    x:collection1] o.a.s.c.S.Request [collection1]  webapp=/solr path=/replication params={qt=/replication&wt=javabin&version=2&command=indexversion} status=0 QTime=0
   [junit4]   2> 556739 INFO  (explicit-fetchindex-cmd) [    ] o.a.s.h.IndexFetcher Master's generation: 2
   [junit4]   2> 556739 INFO  (explicit-fetchindex-cmd) [    ] o.a.s.h.IndexFetcher Master's version: 1522795226602
   [junit4]   2> 556739 INFO  (explicit-fetchindex-cmd) [    ] o.a.s.h.IndexFetcher Slave's generation: 1
   [junit4]   2> 556739 INFO  (explicit-fetchindex-cmd) [    ] o.a.s.h.IndexFetcher Slave's version: 0
   [junit4]   2> 556739 INFO  (explicit-fetchindex-cmd) [    ] o.a.s.h.IndexFetcher Starting replication process
   [junit4]   2> 556743 INFO  (qtp226801540-3187) [    x:collection1] o.a.s.c.S.Request [collection1]  webapp=/solr path=/replication params={generation=2&qt=/replication&tlogFiles=false&wt=javabin&version=2&command=filelist} status=0 QTime=4
   [junit4]   2> 556743 INFO  (explicit-fetchindex-cmd) [    ] o.a.s.h.IndexFetcher Number of files in latest index in master: 10
   [junit4]   2> 556745 INFO  (explicit-fetchindex-cmd) [    ] o.a.s.u.RandomMergePolicy RandomMergePolicy wrapping class org.apache.lucene.index.LogByteSizeMergePolicy: [LogByteSizeMergePolicy: minMergeSize=1677721, mergeFactor=34, maxMergeSize=2147483648, maxMergeSizeForForcedMerge=9223372036854775807, calibrateSizeByDeletes=true, maxMergeDocs=2147483647, maxCFSSegmentSizeMB=8.796093022207999E12, noCFSRatio=0.8157149450893374]
   [junit4]   2> 556745 INFO  (explicit-fetchindex-cmd) [    ] o.a.s.u.DefaultSolrCoreState New IndexWriter is ready to be used.
   [junit4]   2> 556745 INFO  (explicit-fetchindex-cmd) [    ] o.a.s.h.IndexFetcher Starting download (fullCopy=false) to MockDirectoryWrapper(RAMDirectory@6c7eb3a lockFactory=org.apache.lucene.store.SingleInstanceLockFactory@86a7b71)
   [junit4]   2> 556746 INFO  (qtp226801540-3185) [    x:collection1] o.a.s.c.S.Request [collection1]  webapp=/solr path=/replication params={generation=2&qt=/replication&file=_0.si&checksum=true&wt=filestream&command=filecontent} status=0 QTime=0
   [junit4]   2> 556748 INFO  (qtp226801540-3187) [    x:collection1] o.a.s.c.S.Request [collection1]  webapp=/solr path=/replication params={generation=2&qt=/replication&file=_0_Lucene50_0.doc&checksum=true&wt=filestream&command=filecontent} status=0 QTime=0
   [junit4]   2> 556750 INFO  (qtp226801540-3185) [    x:collection1] o.a.s.c.S.Request [collection1]  webapp=/solr path=/replication params={generation=2&qt=/replication&file=_0_Lucene50_0.tim&checksum=true&wt=filestream&command=filecontent} status=0 QTime=0
   [junit4]   2> 556751 INFO  (qtp226801540-3187) [    x:collection1] o.a.s.c.S.Request [collection1]  webapp=/solr path=/replication params={generation=2&qt=/replication&file=_0.nvd&checksum=true&wt=filestream&command=filecontent} status=0 QTime=0
   [junit4]   2> 556751 INFO  (qtp226801540-3185) [    x:collection1] o.a.s.c.S.Request [collection1]  webapp=/solr path=/replication params={generation=2&qt=/replication&file=_0.fdx&checksum=true&wt=filestream&command=filecontent} status=0 QTime=0
   [junit4]   2> 556767 INFO  (qtp226801540-3187) [    x:collection1] o.a.s.c.S.Request [collection1]  webapp=/solr path=/replication params={generation=2&qt=/replication&file=_0_Lucene50_0.tip&checksum=true&wt=filestream&command=filecontent} status=0 QTime=0
   [junit4]   2> 556769 INFO  (qtp226801540-3185) [    x:collection1] o.a.s.c.S.Request [collection1]  webapp=/solr path=/replication params={generation=2&qt=/replication&file=_0.fdt&checksum=true&wt=filestream&command=filecontent} status=0 QTime=0
   [junit4]   2> 556771 INFO  (qtp226801540-3187) [    x:collection1] o.a.s.c.S.Request [collection1]  webapp=/solr path=/replication params={generation=2&qt=/replication&file=_0.fnm&checksum=true&wt=filestream&command=filecontent} status=0 QTime=1
   [junit4]   2> 556773 INFO  (qtp226801540-3185) [    x:collection1] o.a.s.c.S.Request [collection1]  webapp=/solr path=/replication params={generation=2&qt=/replication&file=_0.nvm&checksum=true&wt=filestream&command=filecontent} status=0 QTime=0
   [junit4]   2> 556774 INFO  (qtp226801540-3187) [    x:collection1] o.a.s.c.S.Request [collection1]  webapp=/solr path=/replication params={generation=2&qt=/replication&file=segments_2&checksum=true&wt=filestream&command=filecontent} status=0 QTime=0
   [junit4]   2> 556774 INFO  (explicit-fetchindex-cmd) [    ] o.a.s.h.IndexFetcher Bytes downloaded: 1652, Bytes skipped downloading: 0
   [junit4]   2> 556774 INFO  (explicit-fetchindex-cmd) [    ] o.a.s.h.IndexFetcher Total time taken for download (fullCopy=false,bytesDownloaded=1652) : 0 secs (null bytes/sec) to MockDirectoryWrapper(RAMDirectory@6c7eb3a lockFactory=org.apache.lucene.store.SingleInstanceLockFactory@86a7b71)
   [junit4]   2> 556778 INFO  (explicit-fetchindex-cmd) [    ] o.a.s.u.RandomMergePolicy RandomMergePolicy wrapping class org.apache.lucene.index.TieredMergePolicy: [TieredMergePolicy: maxMergeAtOnce=24, maxMergeAtOnceExplicit=40, maxMergedSegmentMB=22.3076171875, floorSegmentMB=0.716796875, forceMergeDeletesPctAllowed=29.73019656752536, segmentsPerTier=31.0, maxCFSSegmentSizeMB=8.796093022207999E12, noCFSRatio=0.8831079212491915
   [junit4]   2> 556778 INFO  (explicit-fetchindex-cmd) [    ] o.a.s.u.DefaultSolrCoreState New IndexWriter is ready to be used.
   [junit4]   2> 556778 INFO  (explicit-fetchindex-cmd) [    ] o.a.s.s.SolrIndexSearcher Opening [Searcher@36e0d795[collection1] main]
   [junit4]   2> 556780 INFO  (searcherExecutor-1231-thread-1) [    ] o.a.s.c.SolrCore [collection1] Registered new searcher Searcher@36e0d795[collection1] main{ExitableDirectoryReader(UninvertingDirectoryReader(Uninverting(_0(8.0.0):C1)))}
   [junit4]   2> 556780 INFO  (qtp1700822444-3202) [    x:collection1] o.a.s.c.S.Request [collection1]  webapp=/solr path=/replication params={wait=true&masterUrl=http://127.0.0.1:57172/solr/collection1/replication&command=fetchindex} status=0 QTime=46
   [junit4]   2> 556792 INFO  (qtp1700822444-3206) [    x:collection1] o.a.s.c.S.Request [collection1]  webapp=/solr path=/select params={q=name:empty1&sort=id+desc&wt=javabin&version=2} hits=1 status=0 QTime=0
   [junit4]   2> 556793 INFO  (TEST-TestReplicationHandler.testEmptyCommits-seed#[CD5DAE6ED7143F]) [    ] o.a.s.h.TestReplicationHandler Waited for 0ms and found 1 docs
   [junit4]   2> 556794 INFO  (qtp226801540-3185) [    x:collection1] o.a.s.c.S.Request [collection1]  webapp=/solr path=/replication params={_trace=getDetails&qt=/replication&wt=javabin&version=2&command=details} status=0 QTime=0
   [junit4]   2> 556794 INFO  (qtp226801540-3187) [    x:collection1] o.a.s.c.S.Request [collection1]  webapp=/solr path=/replication params={_trace=getDetails&qt=/replication&wt=javabin&version=2&command=details} status=0 QTime=0
   [junit4]   2> 556796 INFO  (qtp226801540-3185) [    x:collection1] o.a.s.c.S.Request [collection1]  webapp=/solr path=/replication params={slave=false&qt=/replication&wt=javabin&version=2&command=details} status=0 QTime=0
   [junit4]   2> 556796 INFO  (qtp1700822444-3204) [    x:collection1] o.a.s.c.S.Request [collection1]  webapp=/solr path=/replication params={_trace=getDetails&qt=/replication&wt=javabin&version=2&command=details} status=0 QTime=1
   [junit4]   2> 556801 INFO  (qtp226801540-3187) [    x:collection1] o.a.s.c.S.Request [collection1]  webapp=/solr path=/replication params={_trace=assertVersions&qt=/replication&wt=javabin&version=2&command=indexversion} status=0 QTime=0
   [junit4]   2> 556802 INFO  (qtp1700822444-3208) [    x:collection1] o.a.s.c.S.Request [collection1]  webapp=/solr path=/replication params={_trace=assertVersions&qt=/replication&wt=javabin&version=2&command=indexversion} status=0 QTime=0
   [junit4]   2> 556802 INFO  (qtp226801540-3185) [    x:collection1] o.a.s.u.DirectUpdateHandler2 start commit{,optimize=false,openSearcher=true,waitSearcher=true,expungeDeletes=false,softCommit=false,prepareCommit=false}
   [junit4]   2> 556802 INFO  (qtp226801540-3185) [    x:collection1] o.a.s.u.DirectUpdateHandler2 No uncommitted changes. Skipping IW.commit.
   [junit4]   2> 556802 INFO  (qtp226801540-3185) [    x:collection1] o.a.s.u.DirectUpdateHandler2 end_commit_flush
   [junit4]   2> 556803 INFO  (qtp226801540-3185) [    x:collection1] o.a.s.u.p.LogUpdateProcessorFactory [collection1]  webapp=/solr path=/update params={commit=true&wt=javabin&version=2}{commit=} 0 0
   [junit4]   2> 556836 WARN  (explicit-fetchindex-cmd) [    ] o.a.s.h.IndexFetcher 'masterUrl' must be specified without the /replication suffix
   [junit4]   2> 556839 INFO  (qtp226801540-3187) [    x:collection1] o.a.s.c.S.Request [collection1]  webapp=/solr path=/replication params={qt=/replication&wt=javabin&version=2&command=indexversion} status=0 QTime=0
   [junit4]   2> 556839 INFO  (explicit-fetchindex-cmd) [    ] o.a.s.h.IndexFetcher Master's generation: 2
   [junit4]   2> 556839 INFO  (explicit-fetchindex-cmd) [    ] o.a.s.h.IndexFetcher Master's version: 1522795226602
   [junit4]   2> 556839 INFO  (explicit-fetchindex-cmd) [    ] o.a.s.h.IndexFetcher Slave's generation: 2
   [junit4]   2> 556839 INFO  (explicit-fetchindex-cmd) [    ] o.a.s.h.IndexFetcher Slave's version: 1522795226602
   [junit4]   2> 556839 INFO  (explicit-fetchindex-cmd) [    ] o.a.s.h.IndexFetcher Slave in sync with master.
   [junit4]   2> 556839 INFO  (qtp1700822444-3204) [    x:collection1] o.a.s.c.S.Request [collection1]  webapp=/solr path=/replication params={wait=true&masterUrl=http://127.0.0.1:57172/solr/collection1/replication&command=fetchindex} status=0 QTime=3
   [junit4]   2> 556841 INFO  (qtp226801540-3185) [    x:collection1] o.a.s.u.p.LogUpdateProcessorFactory [collection1]  webapp=/solr path=/update params={wt=javabin&version=2}{add=[2]} 0 0
   [junit4]   2> 556842 INFO  (qtp226801540-3185) [    x:collection1] o.a.s.u.DirectUpdateHandler2 start commit{,optimize=false,openSearcher=true,waitSearcher=true,expungeDeletes=false,softCommit=false,prepareCommit=false}
   [junit4]   2> 556842 INFO  (qtp226801540-3185) [    x:collection1] o.a.s.u.SolrIndexWriter Calling setCommitData with IW:org.apache.solr.update.SolrIndexWriter@4e6c20ef commitCommandVersion:0
   [junit4]   2> 556846 INFO  (qtp226801540-3185) [    x:collection1] o.a.s.s.SolrIndexSearcher Opening [Searcher@68fdd996[collection1] main]
   [junit4]   2> 556846 INFO  (qtp226801540-3185) [    x:collection1] o.a.s.u.DirectUpdateHandler2 end_commit_flush
   [junit4]   2> 556847 INFO  (searcherExecutor-1221-thread-1-processing-x:collection1) [    x:collection1] o.a.s.c.SolrCore [collection1] Registered new searcher Searcher@68fdd996[collection1] main{ExitableDirectoryReader(UninvertingDirectoryReader(Uninverting(_0(8.0.0):C1) Uninverting(_1(8.0.0):C1)))}
   [junit4]   2> 556847 INFO  (qtp226801540-3185) [    x:collection1] o.a.s.u.p.LogUpdateProcessorFactory [collection1]  webapp=/solr path=/update params={commit=true&wt=javabin&version=2}{commit=} 0 5
   [junit4]   2> 556849 WARN  (explicit-fetchindex-cmd) [    ] o.a.s.h.IndexFetcher 'masterUrl' must be specified without the /replication suffix
   [junit4]   2> 556850 INFO  (qtp226801540-3187) [    x:collection1] o.a.s.c.S.Request [collection1]  webapp=/solr path=/replication params={qt=/replication&wt=javabin&version=2&command=indexversion} status=0 QTime=0
   [junit4]   2> 556850 INFO  (explicit-fetchindex-cmd) [    ] o.a.s.h.IndexFetcher Master's generation: 3
   [junit4]   2> 556850 INFO  (explicit-fetchindex-cmd) [    ] o.a.s.h.IndexFetcher Master's version: 1522795226725
   [junit4]   2> 556850 INFO  (explicit-fetchindex-cmd) [    ] o.a.s.h.IndexFetcher Slave's generation: 2
   [junit4]   2> 556850 INFO  (explicit-fetchindex-cmd) [    ] o.a.s.h.IndexFetcher Slave's version: 1522795226602
   [junit4]   2> 556850 INFO  (explicit-fetchindex-cmd) [    ] o.a.s.h.IndexFetcher Starting replication process
   [junit4]   2> 556852 INFO  (qtp226801540-3185) [    x:collection1] o.a.s.c.S.Request [collection1]  webapp=/solr path=/replication params={generation=3&qt=/replication&tlogFiles=false&wt=javabin&version=2&command=filelist} status=0 QTime=1
   [junit4]   2> 556852 INFO  (explicit-fetchindex-cmd) [    ] o.a.s.h.IndexFetcher Number of files in latest index in master: 19
   [junit4]   2> 556854 INFO  (explicit-fetchindex-cmd) [    ] o.a.s.u.RandomMergePolicy RandomMergePolicy wrapping class org.apache.lucene.index.LogByteSizeMergePolicy: [LogByteSizeMergePolicy: minMergeSize=1677721, mergeFactor=34, maxMergeSize=2147483648, maxMergeSizeForForcedMerge=9223372036854775807, calibrateSizeByDeletes=true, maxMergeDocs=2147483647, maxCFSSegmentSizeMB=8.796093022207999E12, noCFSRatio=0.8157149450893374]
   [junit4]   2> 556854 INFO  (explicit-fetchindex-cmd) [    ] o.a.s.u.DefaultSolrCoreState New IndexWriter is ready to be used.
   [junit4]   2> 556855 INFO  (explicit-fetchindex-cmd) [    ] o.a.s.h.IndexFetcher Starting download (fullCopy=false) to MockDirectoryWrapper(RAMDirectory@78353d6d lockFactory=org.apache.lucene.store.SingleInstanceLockFactory@2e1474a3)
   [junit4]   2> 556855 INFO  (explicit-fetchindex-cmd) [    ] o.a.s.h.IndexFetcher Skipping download for _0.si because it already exists
   [junit4]   2> 556855 INFO  (explicit-fetchindex-cmd) [    ] o.a.s.h.IndexFetcher Skipping download for _0_Lucene50_0.doc because it already exists
   [junit4]   2> 556855 INFO  (explicit-fetchindex-cmd) [    ] o.a.s.h.IndexFetcher Skipping download for _0_Lucene50_0.tim because it already exists
   [junit4]   2> 556855 INFO  (explicit-fetchindex-cmd) [    ] o.a.s.h.IndexFetcher Skipping download for _0.nvd because it already exists
   [junit4]   2> 556855 INFO  (explicit-fetchindex-cmd) [    ] o.a.s.h.IndexFetcher Skipping download for _0.fdx because it already exists
   [junit4]   2> 556855 INFO  (explicit-fetchindex-cmd) [    ] o.a.s.h.IndexFetcher Skipping download for _0_Lucene50_0.tip because it already exists
   [junit4]   2> 556855 INFO  (explicit-fetchindex-cmd) [    ] o.a.s.h.IndexFetcher Skipping download for _0.fdt because it already exists
   [junit4]   2> 556855 INFO  (explicit-fetchindex-cmd) [    ] o.a.s.h.IndexFetcher Skipping download for _0.fnm because it already exists
   [junit4]   2> 556855 INFO  (explicit-fetchindex-cmd) [    ] o.a.s.h.IndexFetcher Skipping download for _0.nvm because it already exists
   [junit4]   2> 556855 INFO  (qtp226801540-3187) [    x:collection1] o.a.s.c.S.Request [collection1]  webapp=/solr path=/replication params={generation=3&qt=/replication&file=_1_Lucene50_0.doc&checksum=true&wt=filestream&command=filecontent} status=0 QTime=0
   [junit4]   2> 556856 INFO  (qtp226801540-3185) [    x:collection1] o.a.s.c.S.Request [collection1]  webapp=/solr path=/replication params={generation=3&qt=/replication&file=_1_Lucene50_0.tim&checksum=true&wt=filestream&command=filecontent} status=0 QTime=0
   [junit4]   2> 556857 INFO  (qtp226801540-3187) [    x:collection1] o.a.s.c.S.Request [collection1]  webapp=/solr path=/replication params={generation=3&qt=/replication&file=_1.si&checksum=true&wt=filestream&command=filecontent} status=0 QTime=0
   [junit4]   2> 556860 INFO  (qtp226801540-3185) [    x:collection1] o.a.s.c.S.Request [collection1]  webapp=/solr path=/replication params={generation=3&qt=/replication&file=_1.nvd&checksum=true&wt=filestream&command=filecontent} status=0 QTime=0
   [junit4]   2> 556861 INFO  (qtp226801540-3187) [    x:collection1] o.a.s.c.S.Request [collection1]  webapp=/solr path=/replication params={generation=3&qt=/replication&file=_1.fdx&checksum=true&wt=filestream&command=filecontent} status=0 QTime=0
   [junit4]   2> 556862 INFO  (qtp226801540-3185) [    x:collection1] o.a.s.c.S.Request [collection1]  webapp=/solr path=/replication params={generation=3&qt=/replication&file=_1.fnm&checksum=true&wt=filestream&command=filecontent} status=0 QTime=0
   [junit4]   2> 556863 INFO  (qtp226801540-3187) [    x:collection1] o.a.s.c.S.Request [collection1]  webapp=/solr path=/replication params={generation=3&qt=/replication&file=_1.nvm&checksum=true&wt=filestream&command=filecontent} status=0 QTime=0
   [junit4]   2> 556864 INFO  (qtp226801540-3185) [    x:collection1] o.a.s.c.S.Request [collection1]  webapp=/solr path=/replication params={generation=3&qt=/replication&file=_1.fdt&checksum=true&wt=filestream&command=filecontent} status=0 QTime=0
   [junit4]   2> 556865 INFO  (qtp226801540-3187) [    x:collection1] o.a.s.c.S.Request [collection1]  webapp=/solr path=/replication params={generation=3&qt=/replication&file=_1_Lucene50_0.tip&checksum=true&wt=filestream&command=filecontent} status=0 QTime=0
   [junit4]   2> 556866 INFO  (qtp226801540-3185) [    x:collection1] o.a.s.c.S.Request [collection1]  webapp=/solr path=/replication params={generation=3&qt=/replication&file=segments_3&checksum=true&wt=filestream&command=filecontent} status=0 QTime=0
   [junit4]   2> 556866 INFO  (explicit-fetchindex-cmd) [    ] o.a.s.h.IndexFetcher Bytes downloaded: 1713, Bytes skipped downloading: 0
   [junit4]   2> 556866 INFO  (explicit-fetchindex-cmd) [    ] o.a.s.h.IndexFetcher Total time taken for download (fullCopy=false,bytesDownloaded=1713) : 0 secs (null bytes/sec) to MockDirectoryWrapper(RAMDirectory@78353d6d lockFactory=org.apache.lucene.store.SingleInstanceLockFactory@2e1474a3)
   [junit4]   2> 556868 INFO  (explicit-fetchindex-cmd) [    ] o.a.s.u.RandomMergePolicy RandomMergePolicy wrapping class org.apache.lucene.index.TieredMergePolicy: [TieredMergePolicy: maxMergeAtOnce=24, maxMergeAtOnceExplicit=40, maxMergedSegmentMB=22.3076171875, floorSegmentMB=0.716796875, forceMergeDeletesPctAllowed=29.73019656752536, segmentsPerTier=31.0, maxCFSSegmentSizeMB=8.796093022207999E12, noCFSRatio=0.8831079212491915
   [junit4]   2> 556869 INFO  (explicit-fetchindex-cmd) [    ] o.a.s.u.DefaultSolrCoreState New IndexWriter is ready to be used.
   [junit4]   2> 556869 INFO  (explicit-fetchindex-cmd) [    ] o.a.s.s.SolrIndexSearcher Opening [Searcher@49263318[collection1] main]
   [junit4]   2> 556870 INFO  (searcherExecutor-1231-thread-1) [    ] o.a.s.c.SolrCore [collection1] Registered new searcher Searcher@49263318[collection1] main{ExitableDirectoryReader(UninvertingDirectoryReader(Uninverting(_0(8.0.0):C1) Uninverting(_1(8.0.0):C1)))}
   [junit4]   2> 556871 INFO  (qtp1700822444-3208) [    x:collection1] o.a.s.c.S.Request [collection1]  webapp=/solr path=/replication params={wait=true&masterUrl=http://127.0.0.1:57172/solr/collection1/replication&command=fetchindex} status=0 QTime=22
   [junit4]   2> 556872 INFO  (qtp1700822444-3204) [    x:collection1] o.a.s.c.S.Request [collection1]  webapp=/solr path=/select params={q=name:empty2&sort=id+desc&wt=javabin&version=2} hits=1 status=0 QTime=0
   [junit4]   2> 556873 INFO  (TEST-TestReplicationHandler.testEmptyCommits-seed#[CD5DAE6ED7143F]) [    ] o.a.s.h.TestReplicationHandler Waited for 0ms and found 1 docs
   [junit4]   2> 556873 INFO  (qtp226801540-3187) [    x:collection1] o.a.s.c.S.Request [collection1]  webapp=/solr path=/replication params={_trace=getDetails&qt=/replication&wt=javabin&version=2&command=details} status=0 QTime=0
   [junit4]   2> 556874 INFO  (qtp226801540-3185) [    x:collection1] o.a.s.c.S.Request [collection1]  webapp=/solr path=/replication params={_trace=getDetails&qt=/replication&wt=javabin&version=2&command=details} status=0 QTime=0
   [junit4]   2> 556875 INFO  (qtp226801540-3187) [    x:collection1] o.a.s.c.S.Request [collection1]  webapp=/solr path=/replication params={slave=false&qt=/replication&wt=javabin&version=2&command=details} status=0 QTime=0
   [junit4]   2> 556875 INFO  (qtp1700822444-3208) [    x:collection1] o.a.s.c.S.Request [collection1]  webapp=/solr path=/replication params={_trace=getDetails&qt=/replication&wt=javabin&version=2&command=details} status=0 QTime=1
   [junit4]   2> 556876 INFO  (qtp226801540-3185) [    x:collection1] o.a.s.c.S.Request [collection1]  webapp=/solr path=/replication params={_trace=assertVersions&qt=/replication&wt=javabin&version=2&command=indexversion} status=0 QTime=0
   [junit4]   2> 556876 INFO  (qtp1700822444-3204) [    x:collection1] o.a.s.c.S.Request [collection1]  webapp=/solr path=/replication params={_trace=assertVersions&qt=/replication&wt=javabin&version=2&command=indexversion} status=0 QTime=0
   [junit4]   2> 556878 INFO  (qtp226801540-3187) [    x:collection1] o.a.s.u.p.LogUpdateProcessorFactory [collection1]  webapp=/solr path=/update params={wt=javabin&version=2}{add=[3]} 0 0
   [junit4]   2> 556878 INFO  (qtp226801540-3185) [    x:collection1] o.a.s.u.DirectUpdateHandler2 start commit{,optimize=false,openSearcher=false,waitSearcher=true,expungeDeletes=false,softCommit=false,prepareCommit=false}
   [junit4]   2> 556878 INFO  (qtp226801540-3185) [    x:collection1] o.a.s.u.SolrIndexWriter Calling setCommitData with IW:org.apache.solr.update.SolrIndexWriter@4e6c20ef commitCommandVersion:0
   [junit4]   2> 556880 INFO  (qtp226801540-3185) [    x:collection1] o.a.s.s.SolrIndexSearcher Opening [Searcher@6e3139c1[collection1] realtime]
   [junit4]   2> 556881 INFO  (qtp226801540-3185) [    x:collection1] o.a.s.u.DirectUpdateHandler2 end_commit_flush
   [junit4]   2> 556881 INFO  (qtp226801540-3185) [    x:collection1] o.a.s.u.p.LogUpdateProcessorFactory [collection1]  webapp=/solr path=/update params={openSearcher=false&commit=true&wt=javabin&version=2}{commit=} 0 2
   [junit4]   2> 556882 WARN  (explicit-fetchindex-cmd) [    ] o.a.s.h.IndexFetcher 'masterUrl' must be specified without the /replication suffix
   [junit4]   2> 556883 INFO  (qtp226801540-3187) [    x:collection1] o.a.s.c.S.Request [collection1]  webapp=/solr path=/replication params={qt=/replication&wt=javabin&version=2&command=indexversion} status=0 QTime=0
   [junit4]   2> 556883 INFO  (explicit-fetchindex-cmd) [    ] o.a.s.h.IndexFetcher Master's generation: 4
   [junit4]   2> 556883 INFO  (explicit-fetchindex-cmd) [    ] o.a.s.h.IndexFetcher Master's version: 1522795226761
   [junit4]   2> 556883 INFO  (explicit-fetchindex-cmd) [    ] o.a.s.h.IndexFetcher Slave's generation: 3
   [junit4]   2> 556883 INFO  (explicit-fetchindex-cmd) [    ] o.a.s.h.IndexFetcher Slave's version: 1522795226725
   [junit4]   2> 556883 INFO  (explicit-fetchindex-cmd) [    ] o.a.s.h.IndexFetcher Starting replication process
   [junit4]   2> 556885 INFO  (qtp226801540-3185) [    x:collection1] o.a.s.c.S.Request [collection1]  webapp=/solr path=/replication params={generation=4&qt=/replication&tlogFiles=false&wt=javabin&version=2&command=filelist} status=0 QTime=1
   [junit4]   2> 556885 INFO  (explicit-fetchindex-cmd) [    ] o.a.s.h.IndexFetcher Number of files in latest index in master: 28
   [junit4]   2> 556886 INFO  (explicit-fetchindex-cmd) [    ] o.a.s.u.RandomMergePolicy RandomMergePolicy wrapping class org.apache.lucene.index.LogByteSizeMergePolicy: [LogByteSizeMergePolicy: minMergeSize=1677721, mergeFactor=34, maxMergeSize=2147483648, maxMergeSizeForForcedMerge=9223372036854775807, calibrateSizeByDeletes=true, maxMergeDocs=2147483647, maxCFSSegmentSizeMB=8.796093022207999E12, noCFSRatio=0.8157149450893374]
   [junit4]   2> 556887 INFO  (explicit-fetchindex-cmd) [    ] o.a.s.u.DefaultSolrCoreState New IndexWriter is ready to be used.
   [junit4]   2> 556887 INFO  (explicit-fetchindex-cmd) [    ] o.a.s.h.IndexFetcher Found unused file: segments_2
   [junit4]   2> 556887 INFO  (explicit-fetchindex-cmd) [    ] o.a.s.h.IndexFetcher Sleeping for 1000ms to wait for unused lucene index files to be delete-able
   [junit4]   2> 557890 INFO  (explicit-fetchindex-cmd) [    ] o.a.s.h.IndexFetcher Found unused file: segments_2
   [junit4]   2> 557890 INFO  (explicit-fetchindex-cmd) [    ] o.a.s.h.IndexFetcher Sleeping for 1000ms to wait for unused lucene index files to be delete-able
   [junit4]   2> 558891 INFO  (explicit-fetchindex-cmd) [    ] o.a.s.h.IndexFetcher Found unused file: segments_2
   [junit4]   2> 558891 INFO  (explicit-fetchindex-cmd) [    ] o.a.s.h.IndexFetcher Sleeping for 1000ms to wait for unused lucene index files to be delete-able
   [junit4]   2> 559891 INFO  (explicit-fetchindex-cmd) [    ] o.a.s.h.IndexFetcher Found unused file: segments_2
   [junit4]   2> 559891 INFO  (explicit-fetchindex-cmd) [    ] o.a.s.h.IndexFetcher Sleeping for 1000ms to wait for unused lucene index files to be delete-able
   [junit4]   2> 560891 INFO  (explicit-fetchindex-cmd) [    ] o.a.s.h.IndexFetcher Found unused file: segments_2
   [junit4]   2> 560891 INFO  (explicit-fetchindex-cmd) [    ] o.a.s.h.IndexFetcher Sleeping for 1000ms to wait for unused lucene index files to be delete-able
   [junit4]   2> 561892 INFO  (explicit-fetchindex-cmd) [    ] o.a.s.h.IndexFetcher Found unused file: segments_2
   [junit4]   2> 561892 INFO  (explicit-fetchindex-cmd) [    ] o.a.s.h.IndexFetcher Sleeping for 1000ms to wait for unused lucene index files to be delete-able
   [junit4]   2> 562892 INFO  (explicit-fetchindex-cmd) [    ] o.a.s.h.IndexFetcher Found unused file: segments_2
   [junit4]   2> 562892 INFO  (explicit-fetchindex-cmd) [    ] o.a.s.h.IndexFetcher Sleeping for 1000ms to wait for unused lucene index files to be delete-able
   [junit4]   2> 563893 INFO  (explicit-fetchindex-cmd) [    ] o.a.s.h.IndexFetcher Found unused file: segments_2
   [junit4]   2> 563893 INFO  (explicit-fetchindex-cmd) [    ] o.a.s.h.IndexFetcher Sleeping for 1000ms to wait for unused lucene index files to be delete-able
   [junit4]   2> 564893 INFO  (explicit-fetchindex-cmd) [    ] o.a.s.h.IndexFetcher Found unused file: segments_2
   [junit4]   2> 564893 INFO  (explicit-fetchindex-cmd) [    ] o.a.s.h.IndexFetcher Sleeping for 1000ms to wait for unused lucene index files to be delete-able
   [junit4]   2> 565893 INFO  (explicit-fetchindex-cmd) [    ] o.a.s.h.IndexFetcher Found unused file: segments_2
   [junit4]   2> 565893 INFO  (explicit-fetchindex-cmd) [    ] o.a.s.h.IndexFetcher Sleeping for 1000ms to wait for unused lucene index files to be delete-able
   [junit4]   2> 566894 INFO  (explicit-fetchindex-cmd) [    ] o.a.s.h.IndexFetcher Found unused file: segments_2
   [junit4]   2> 566894 INFO  (explicit-fetchindex-cmd) [    ] o.a.s.h.IndexFetcher Sleeping for 1000ms to wait for unused lucene index files to be delete-able
   [junit4]   2> 567894 INFO  (explicit-fetchindex-cmd) [    ] o.a.s.h.IndexFetcher IndexFetcher slept for 11000ms for unused lucene index files to be delete-able
   [junit4]   2> 567894 INFO  (explicit-fetchindex-cmd) [    ] o.a.s.h.IndexFetcher Starting download (fullCopy=false) to MockDirectoryWrapper(RAMDirectory@76eb6da9 lockFactory=org.apache.lucene.store.SingleInstanceLockFactory@1d04b357)
   [junit4]   2> 567894 INFO  (explicit-fetchindex-cmd) [    ] o.a.s.h.IndexFetcher Skipping download for _0.si because it already exists
   [junit4]   2> 567894 INFO  (explicit-fetchindex-cmd) [    ] o.a.s.h.IndexFetcher Skipping download for _0_Lucene50_0.doc because it already exists
   [junit4]   2> 567894 INFO  (explicit-fetchindex-cmd) [    ] o.a.s.h.IndexFetcher Skipping download for _0_Lucene50_0.tim because it already exists
   [junit4]   2> 567894 INFO  (explicit-fetchindex-cmd) [    ] o.a.s.h.IndexFetcher Skipping download for _0.nvd because it already exists
   [junit4]   2> 567894 INFO  (explicit-fetchindex-cmd) [    ] o.a.s.h.IndexFetcher Skipping download for _0.fdx because it already exists
   [junit4]   2> 567894 INFO  (explicit-fetchindex-cmd) [    ] o.a.s.h.IndexFetcher Skipping download for _0_Lucene50_0.tip because it already exists
   [junit4]   2> 567894 INFO  (explicit-fetchindex-cmd) [    ] o.a.s.h.IndexFetcher Skipping download for _0.fdt because it already exists
   [junit4]   2> 567894 INFO  (explicit-fetchindex-cmd) [    ] o.a.s.h.IndexFetcher Skipping download for _0.fnm because it already exists
   [junit4]   2> 567894 INFO  (explicit-fetchindex-cmd) [    ] o.a.s.h.IndexFetcher Skipping download for _0.nvm because it already exists
   [junit4]   2> 567894 INFO  (explicit-fetchindex-cmd) [    ] o.a.s.h.IndexFetcher Skipping download for _1_Lucene50_0.doc because it already exists
   [junit4]   2> 567894 INFO  (explicit-fetchindex-cmd) [    ] o.a.s.h.IndexFetcher Skipping download for _1_Lucene50_0.tim because it already exists
   [junit4]   2> 567894 INFO  (explicit-fetchindex-cmd) [    ] o.a.s.h.IndexFetcher Skipping download for _1.si because it already exists
   [junit4]   2> 567894 INFO  (explicit-fetchindex-cmd) [    ] o.a.s.h.IndexFetcher Skipping download for _1.nvd because it already exists
   [junit4]   2> 567894 INFO  (explicit-fetchindex-cmd) [    ] o.a.s.h.IndexFetcher Skipping download for _1.fdx because it already exists
   [junit4]   2> 567894 INFO  (explicit-fetchindex-cmd) [    ] o.a.s.h.IndexFetcher Skipping download for _1.fnm because it already exists
   [junit4]   2> 567894 INFO  (explicit-fetchindex-cmd) [    ] o.a.s.h.IndexFetcher Skipping download for _1.nvm because it already exists
   [junit4]   2> 567894 INFO  (explicit-fetchindex-cmd) [    ] o.a.s.h.IndexFetcher Skipping download for _1.fdt because it already exists
   [junit4]   2> 567894 INFO  (explicit-fetchindex-cmd) [    ] o.a.s.h.IndexFetcher Skipping download for _1_Lucene50_0.tip because it already exists
   [junit4]   2> 567896 INFO  (qtp226801540-3187) [    x:collection1] o.a.s.c.S.Request [collection1]  webapp=/solr path=/replication params={generation=4&qt=/replication&file=_2.nvd&checksum=true&wt=filestream&command=filecontent} status=0 QTime=0
   [junit4]   2> 567897 INFO  (qtp226801540-3185) [    x:collection1] o.a.s.c.S.Request [collection1]  webapp=/solr path=/replication params={generation=4&qt=/replication&file=_2.si&checksum=true&wt=filestream&command=filecontent} status=0 QTime=0
   [junit4]   2> 567898 INFO  (qtp226801540-3187) [    x:collection1] o.a.s.c.S.Request [collection1]  webapp=/solr path=/replication params={generation=4&qt=/replication&file=_2.fdt&checksum=true&wt=filestream&command=filecontent} status=0 QTime=0
   [junit4]   2> 567898 INFO  (qtp226801540-3185) [    x:collection1] o.a.s.c.S.Request [collection1]  webapp=/solr path=/replication params={generation=4&qt=/replication&file=_2.fnm&checksum=true&wt=filestream&command=filecontent} status=0 QTime=0
   [junit4]   2> 567898 INFO  (qtp226801540-3187) [    x:collection1] o.a.s.c.S.Request [

[...truncated too long message...]

m.SolrMetricManager Closing metric reporters for registry=solr.node, tag=null
   [junit4]   2> 314791 INFO  (TEST-TestReplicationHandler.doTestIndexFetchOnMasterRestart-seed#[CD5DAE6ED7143F]) [    ] o.a.s.m.r.SolrJmxReporter Closing reporter [org.apache.solr.metrics.reporters.SolrJmxReporter@77fa34f1: rootName = null, domain = solr.node, service url = null, agent id = null] for registry solr.node / com.codahale.metrics.MetricRegistry@4f5e921d
   [junit4]   2> 314798 INFO  (TEST-TestReplicationHandler.doTestIndexFetchOnMasterRestart-seed#[CD5DAE6ED7143F]) [    ] o.a.s.m.SolrMetricManager Closing metric reporters for registry=solr.jvm, tag=null
   [junit4]   2> 314798 INFO  (TEST-TestReplicationHandler.doTestIndexFetchOnMasterRestart-seed#[CD5DAE6ED7143F]) [    ] o.a.s.m.r.SolrJmxReporter Closing reporter [org.apache.solr.metrics.reporters.SolrJmxReporter@6dca2f95: rootName = null, domain = solr.jvm, service url = null, agent id = null] for registry solr.jvm / com.codahale.metrics.MetricRegistry@5d5b3281
   [junit4]   2> 314803 INFO  (TEST-TestReplicationHandler.doTestIndexFetchOnMasterRestart-seed#[CD5DAE6ED7143F]) [    ] o.a.s.m.SolrMetricManager Closing metric reporters for registry=solr.jetty, tag=null
   [junit4]   2> 314803 INFO  (TEST-TestReplicationHandler.doTestIndexFetchOnMasterRestart-seed#[CD5DAE6ED7143F]) [    ] o.a.s.m.r.SolrJmxReporter Closing reporter [org.apache.solr.metrics.reporters.SolrJmxReporter@733f44ee: rootName = null, domain = solr.jetty, service url = null, agent id = null] for registry solr.jetty / com.codahale.metrics.MetricRegistry@971de6b
   [junit4]   2> 314804 INFO  (coreCloseExecutor-2172-thread-1) [    x:collection1] o.a.s.c.SolrCore [collection1]  CLOSING SolrCore org.apache.solr.core.SolrCore@56cb3c38
   [junit4]   2> 314804 INFO  (coreCloseExecutor-2172-thread-1) [    x:collection1] o.a.s.m.SolrMetricManager Closing metric reporters for registry=solr.core.collection1, tag=56cb3c38
   [junit4]   2> 314804 INFO  (coreCloseExecutor-2172-thread-1) [    x:collection1] o.a.s.m.r.SolrJmxReporter Closing reporter [org.apache.solr.metrics.reporters.SolrJmxReporter@1931c2aa: rootName = null, domain = solr.core.collection1, service url = null, agent id = null] for registry solr.core.collection1 / com.codahale.metrics.MetricRegistry@6c79a66a
   [junit4]   2> 314816 INFO  (TEST-TestReplicationHandler.doTestIndexFetchOnMasterRestart-seed#[CD5DAE6ED7143F]) [    ] o.e.j.s.h.ContextHandler Stopped o.e.j.s.ServletContextHandler@4788c76{/solr,null,UNAVAILABLE}
   [junit4]   2> 314816 INFO  (TEST-TestReplicationHandler.doTestIndexFetchOnMasterRestart-seed#[CD5DAE6ED7143F]) [    ] o.e.j.s.session Stopped scavenging
   [junit4]   2> 314818 INFO  (TEST-TestReplicationHandler.doTestIndexFetchOnMasterRestart-seed#[CD5DAE6ED7143F]) [    ] o.e.j.s.AbstractConnector Stopped ServerConnector@5155ae90{HTTP/1.1,[http/1.1]}{127.0.0.1:0}
   [junit4]   2> 314819 INFO  (TEST-TestReplicationHandler.doTestIndexFetchOnMasterRestart-seed#[CD5DAE6ED7143F]) [    ] o.a.s.c.CoreContainer Shutting down CoreContainer instance=284849517
   [junit4]   2> 314819 INFO  (TEST-TestReplicationHandler.doTestIndexFetchOnMasterRestart-seed#[CD5DAE6ED7143F]) [    ] o.a.s.m.SolrMetricManager Closing metric reporters for registry=solr.node, tag=null
   [junit4]   2> 314819 INFO  (TEST-TestReplicationHandler.doTestIndexFetchOnMasterRestart-seed#[CD5DAE6ED7143F]) [    ] o.a.s.m.r.SolrJmxReporter Closing reporter [org.apache.solr.metrics.reporters.SolrJmxReporter@50a0c7ff: rootName = null, domain = solr.node, service url = null, agent id = null] for registry solr.node / com.codahale.metrics.MetricRegistry@368a100d
   [junit4]   2> 314820 INFO  (TEST-TestReplicationHandler.doTestIndexFetchOnMasterRestart-seed#[CD5DAE6ED7143F]) [    ] o.a.s.m.SolrMetricManager Closing metric reporters for registry=solr.jvm, tag=null
   [junit4]   2> 314820 INFO  (TEST-TestReplicationHandler.doTestIndexFetchOnMasterRestart-seed#[CD5DAE6ED7143F]) [    ] o.a.s.m.r.SolrJmxReporter Closing reporter [org.apache.solr.metrics.reporters.SolrJmxReporter@739698c3: rootName = null, domain = solr.jvm, service url = null, agent id = null] for registry solr.jvm / com.codahale.metrics.MetricRegistry@5d5b3281
   [junit4]   2> 314821 INFO  (TEST-TestReplicationHandler.doTestIndexFetchOnMasterRestart-seed#[CD5DAE6ED7143F]) [    ] o.a.s.m.SolrMetricManager Closing metric reporters for registry=solr.jetty, tag=null
   [junit4]   2> 314821 INFO  (TEST-TestReplicationHandler.doTestIndexFetchOnMasterRestart-seed#[CD5DAE6ED7143F]) [    ] o.a.s.m.r.SolrJmxReporter Closing reporter [org.apache.solr.metrics.reporters.SolrJmxReporter@46fe97a6: rootName = null, domain = solr.jetty, service url = null, agent id = null] for registry solr.jetty / com.codahale.metrics.MetricRegistry@971de6b
   [junit4]   2> 314825 INFO  (coreCloseExecutor-2174-thread-1) [    x:collection1] o.a.s.c.SolrCore [collection1]  CLOSING SolrCore org.apache.solr.core.SolrCore@37fafadf
   [junit4]   2> 314825 INFO  (coreCloseExecutor-2174-thread-1) [    x:collection1] o.a.s.m.SolrMetricManager Closing metric reporters for registry=solr.core.collection1, tag=37fafadf
   [junit4]   2> 314825 INFO  (coreCloseExecutor-2174-thread-1) [    x:collection1] o.a.s.m.r.SolrJmxReporter Closing reporter [org.apache.solr.metrics.reporters.SolrJmxReporter@7800086b: rootName = null, domain = solr.core.collection1, service url = null, agent id = null] for registry solr.core.collection1 / com.codahale.metrics.MetricRegistry@56ee1198
   [junit4]   2> 314829 INFO  (TEST-TestReplicationHandler.doTestIndexFetchOnMasterRestart-seed#[CD5DAE6ED7143F]) [    ] o.e.j.s.h.ContextHandler Stopped o.e.j.s.ServletContextHandler@373cd0a9{/solr,null,UNAVAILABLE}
   [junit4]   2> 314829 INFO  (TEST-TestReplicationHandler.doTestIndexFetchOnMasterRestart-seed#[CD5DAE6ED7143F]) [    ] o.e.j.s.session Stopped scavenging
   [junit4] OK      7.13s J1 | TestReplicationHandler.doTestIndexFetchOnMasterRestart
   [junit4]   2> NOTE: leaving temporary files on disk at: C:\Users\jenkins\workspace\Lucene-Solr-master-Windows\solr\build\solr-core\test\J1\temp\solr.handler.TestReplicationHandler_CD5DAE6ED7143F-003
   [junit4]   2> NOTE: test params are: codec=Lucene70, sim=Asserting(org.apache.lucene.search.similarities.AssertingSimilarity@cb2482), locale=ro-RO, timezone=ART
   [junit4]   2> NOTE: Windows 10 10.0 amd64/Oracle Corporation 10 (64-bit)/cpus=3,threads=1,free=156582328,total=235929600
   [junit4]   2> NOTE: All tests run in this JVM: [TestReplicationHandler, TestReplicationHandler, TestReplicationHandler]
   [junit4] Completed [5/5 (5!)] on J1 in 81.35s, 16 tests, 1 failure <<< FAILURES!
   [junit4] 
   [junit4] 
   [junit4] Tests with failures [seed: CD5DAE6ED7143F]:
   [junit4]   - org.apache.solr.handler.TestReplicationHandler.doTestStressReplication
   [junit4]   - org.apache.solr.handler.TestReplicationHandler.doTestStressReplication
   [junit4]   - org.apache.solr.handler.TestReplicationHandler.doTestStressReplication
   [junit4]   - org.apache.solr.handler.TestReplicationHandler.doTestStressReplication
   [junit4]   - org.apache.solr.handler.TestReplicationHandler.doTestStressReplication
   [junit4] 
   [junit4] 
   [junit4] JVM J0:     2.69 ..   248.44 =   245.74s
   [junit4] JVM J1:     2.76 ..   316.28 =   313.52s
   [junit4] Execution time total: 5 minutes 16 seconds
   [junit4] Tests summary: 5 suites, 80 tests, 5 failures

BUILD FAILED
C:\Users\jenkins\workspace\Lucene-Solr-master-Windows\lucene\common-build.xml:1568: The following error occurred while executing this line:
C:\Users\jenkins\workspace\Lucene-Solr-master-Windows\lucene\common-build.xml:1092: There were test failures: 5 suites, 80 tests, 5 failures [seed: CD5DAE6ED7143F]

Total time: 5 minutes 21 seconds

[repro] Setting last failure code to 1

[repro] Failures:
[repro]   3/5 failed: org.apache.solr.common.util.TestTimeSource
[repro]   5/5 failed: org.apache.solr.handler.TestReplicationHandler
[repro] Exiting with code 1

C:\Users\jenkins\workspace\Lucene-Solr-master-Windows>IF EXIST lucene\build move /y lucene\build lucene\build.repro 
        1 dir(s) moved.

C:\Users\jenkins\workspace\Lucene-Solr-master-Windows>IF EXIST solr\build move /y solr\build solr\build.repro 
        1 dir(s) moved.

C:\Users\jenkins\workspace\Lucene-Solr-master-Windows>IF EXIST lucene\build.orig move /y lucene\build.orig lucene\build 
        1 dir(s) moved.

C:\Users\jenkins\workspace\Lucene-Solr-master-Windows>IF EXIST solr\build.orig move /y solr\build.orig solr\build 
        1 dir(s) moved.

C:\Users\jenkins\workspace\Lucene-Solr-master-Windows>exit 0 
Archiving artifacts
Setting ANT_1_8_2_HOME=C:\Users\jenkins\tools\hudson.tasks.Ant_AntInstallation\ANT_1.8.2
[WARNINGS] Parsing warnings in console log with parser Java Compiler (javac)
Setting ANT_1_8_2_HOME=C:\Users\jenkins\tools\hudson.tasks.Ant_AntInstallation\ANT_1.8.2
Setting ANT_1_8_2_HOME=C:\Users\jenkins\tools\hudson.tasks.Ant_AntInstallation\ANT_1.8.2
<Git Blamer> Using GitBlamer to create author and commit information for all warnings.
<Git Blamer> GIT_COMMIT=b87cbc2f75deb4e80b2b04fde6015369be6ad9cb, workspace=C:\Users\jenkins\workspace\Lucene-Solr-master-Windows
[WARNINGS] Computing warning deltas based on reference build #7251
Recording test results
Setting ANT_1_8_2_HOME=C:\Users\jenkins\tools\hudson.tasks.Ant_AntInstallation\ANT_1.8.2
Build step 'Publish JUnit test result report' changed build result to UNSTABLE
Email was triggered for: Unstable (Test Failures)
Sending email for trigger: Unstable (Test Failures)
Setting ANT_1_8_2_HOME=C:\Users\jenkins\tools\hudson.tasks.Ant_AntInstallation\ANT_1.8.2
Setting ANT_1_8_2_HOME=C:\Users\jenkins\tools\hudson.tasks.Ant_AntInstallation\ANT_1.8.2
Setting ANT_1_8_2_HOME=C:\Users\jenkins\tools\hudson.tasks.Ant_AntInstallation\ANT_1.8.2
Setting ANT_1_8_2_HOME=C:\Users\jenkins\tools\hudson.tasks.Ant_AntInstallation\ANT_1.8.2

Mime
View raw message