lucene-dev mailing list archives

Site index · List index
Message view « Date » · « Thread »
Top « Date » · « Thread »
From Policeman Jenkins Server <jenk...@thetaphi.de>
Subject [JENKINS] Lucene-Solr-master-Solaris (64bit/jdk1.8.0) - Build # 1797 - Unstable!
Date Thu, 12 Apr 2018 06:29:53 GMT
Build: https://jenkins.thetaphi.de/job/Lucene-Solr-master-Solaris/1797/
Java: 64bit/jdk1.8.0 -XX:-UseCompressedOops -XX:+UseSerialGC

1 tests failed.
FAILED:  org.apache.solr.cloud.autoscaling.NodeAddedTriggerTest.testRestoreState

Error Message:
Did not expect the processor to fire on first run! event={   "id":"8d90b2d2cb8c6T2nblsww315zi81gsxyyiziy3b",   "source":"node_added_trigger",   "eventTime":2490441839458502,   "eventType":"NODEADDED",   "properties":{     "eventTimes":[       2490441839458502,       2490441839462202,       2490441839463669,       2490441839465007],     "nodeNames":[       "127.0.0.1:56960_solr",       "127.0.0.1:58426_solr",       "127.0.0.1:62390_solr",       "127.0.0.1:58377_solr"]}}

Stack Trace:
java.lang.AssertionError: Did not expect the processor to fire on first run! event={
  "id":"8d90b2d2cb8c6T2nblsww315zi81gsxyyiziy3b",
  "source":"node_added_trigger",
  "eventTime":2490441839458502,
  "eventType":"NODEADDED",
  "properties":{
    "eventTimes":[
      2490441839458502,
      2490441839462202,
      2490441839463669,
      2490441839465007],
    "nodeNames":[
      "127.0.0.1:56960_solr",
      "127.0.0.1:58426_solr",
      "127.0.0.1:62390_solr",
      "127.0.0.1:58377_solr"]}}
	at __randomizedtesting.SeedInfo.seed([C0415163DA852853:EEFF5F022BC5045]:0)
	at org.junit.Assert.fail(Assert.java:93)
	at org.apache.solr.cloud.autoscaling.NodeAddedTriggerTest.lambda$new$0(NodeAddedTriggerTest.java:49)
	at org.apache.solr.cloud.autoscaling.NodeAddedTrigger.run(NodeAddedTrigger.java:161)
	at org.apache.solr.cloud.autoscaling.NodeAddedTriggerTest.testRestoreState(NodeAddedTriggerTest.java:257)
	at sun.reflect.NativeMethodAccessorImpl.invoke0(Native Method)
	at sun.reflect.NativeMethodAccessorImpl.invoke(NativeMethodAccessorImpl.java:62)
	at sun.reflect.DelegatingMethodAccessorImpl.invoke(DelegatingMethodAccessorImpl.java:43)
	at java.lang.reflect.Method.invoke(Method.java:498)
	at com.carrotsearch.randomizedtesting.RandomizedRunner.invoke(RandomizedRunner.java:1737)
	at com.carrotsearch.randomizedtesting.RandomizedRunner$8.evaluate(RandomizedRunner.java:934)
	at com.carrotsearch.randomizedtesting.RandomizedRunner$9.evaluate(RandomizedRunner.java:970)
	at com.carrotsearch.randomizedtesting.RandomizedRunner$10.evaluate(RandomizedRunner.java:984)
	at com.carrotsearch.randomizedtesting.rules.SystemPropertiesRestoreRule$1.evaluate(SystemPropertiesRestoreRule.java:57)
	at org.apache.lucene.util.TestRuleSetupTeardownChained$1.evaluate(TestRuleSetupTeardownChained.java:49)
	at org.apache.lucene.util.AbstractBeforeAfterRule$1.evaluate(AbstractBeforeAfterRule.java:45)
	at org.apache.lucene.util.TestRuleThreadAndTestName$1.evaluate(TestRuleThreadAndTestName.java:48)
	at org.apache.lucene.util.TestRuleIgnoreAfterMaxFailures$1.evaluate(TestRuleIgnoreAfterMaxFailures.java:64)
	at org.apache.lucene.util.TestRuleMarkFailure$1.evaluate(TestRuleMarkFailure.java:47)
	at com.carrotsearch.randomizedtesting.rules.StatementAdapter.evaluate(StatementAdapter.java:36)
	at com.carrotsearch.randomizedtesting.ThreadLeakControl$StatementRunner.run(ThreadLeakControl.java:368)
	at com.carrotsearch.randomizedtesting.ThreadLeakControl.forkTimeoutingTask(ThreadLeakControl.java:817)
	at com.carrotsearch.randomizedtesting.ThreadLeakControl$3.evaluate(ThreadLeakControl.java:468)
	at com.carrotsearch.randomizedtesting.RandomizedRunner.runSingleTest(RandomizedRunner.java:943)
	at com.carrotsearch.randomizedtesting.RandomizedRunner$5.evaluate(RandomizedRunner.java:829)
	at com.carrotsearch.randomizedtesting.RandomizedRunner$6.evaluate(RandomizedRunner.java:879)
	at com.carrotsearch.randomizedtesting.RandomizedRunner$7.evaluate(RandomizedRunner.java:890)
	at com.carrotsearch.randomizedtesting.rules.StatementAdapter.evaluate(StatementAdapter.java:36)
	at com.carrotsearch.randomizedtesting.rules.SystemPropertiesRestoreRule$1.evaluate(SystemPropertiesRestoreRule.java:57)
	at org.apache.lucene.util.AbstractBeforeAfterRule$1.evaluate(AbstractBeforeAfterRule.java:45)
	at com.carrotsearch.randomizedtesting.rules.StatementAdapter.evaluate(StatementAdapter.java:36)
	at org.apache.lucene.util.TestRuleStoreClassName$1.evaluate(TestRuleStoreClassName.java:41)
	at com.carrotsearch.randomizedtesting.rules.NoShadowingOrOverridesOnMethodsRule$1.evaluate(NoShadowingOrOverridesOnMethodsRule.java:40)
	at com.carrotsearch.randomizedtesting.rules.NoShadowingOrOverridesOnMethodsRule$1.evaluate(NoShadowingOrOverridesOnMethodsRule.java:40)
	at com.carrotsearch.randomizedtesting.rules.StatementAdapter.evaluate(StatementAdapter.java:36)
	at com.carrotsearch.randomizedtesting.rules.StatementAdapter.evaluate(StatementAdapter.java:36)
	at com.carrotsearch.randomizedtesting.rules.StatementAdapter.evaluate(StatementAdapter.java:36)
	at org.apache.lucene.util.TestRuleAssertionsRequired$1.evaluate(TestRuleAssertionsRequired.java:53)
	at org.apache.lucene.util.TestRuleMarkFailure$1.evaluate(TestRuleMarkFailure.java:47)
	at org.apache.lucene.util.TestRuleIgnoreAfterMaxFailures$1.evaluate(TestRuleIgnoreAfterMaxFailures.java:64)
	at org.apache.lucene.util.TestRuleIgnoreTestSuites$1.evaluate(TestRuleIgnoreTestSuites.java:54)
	at com.carrotsearch.randomizedtesting.rules.StatementAdapter.evaluate(StatementAdapter.java:36)
	at com.carrotsearch.randomizedtesting.ThreadLeakControl$StatementRunner.run(ThreadLeakControl.java:368)
	at java.lang.Thread.run(Thread.java:748)




Build Log:
[...truncated 14253 lines...]
   [junit4] Suite: org.apache.solr.cloud.autoscaling.NodeAddedTriggerTest
   [junit4]   2> Creating dataDir: /export/home/jenkins/workspace/Lucene-Solr-master-Solaris/solr/build/solr-core/test/J1/temp/solr.cloud.autoscaling.NodeAddedTriggerTest_C0415163DA852853-001/init-core-data-001
   [junit4]   2> 2810448 INFO  (SUITE-NodeAddedTriggerTest-seed#[C0415163DA852853]-worker) [    ] o.a.s.c.MiniSolrCloudCluster Starting cluster of 1 servers in /export/home/jenkins/workspace/Lucene-Solr-master-Solaris/solr/build/solr-core/test/J1/temp/solr.cloud.autoscaling.NodeAddedTriggerTest_C0415163DA852853-001/tempDir-001
   [junit4]   2> 2810448 INFO  (SUITE-NodeAddedTriggerTest-seed#[C0415163DA852853]-worker) [    ] o.a.s.c.ZkTestServer STARTING ZK TEST SERVER
   [junit4]   2> 2810448 INFO  (Thread-5681) [    ] o.a.s.c.ZkTestServer client port:0.0.0.0/0.0.0.0:0
   [junit4]   2> 2810448 INFO  (Thread-5681) [    ] o.a.s.c.ZkTestServer Starting server
   [junit4]   2> 2810451 ERROR (Thread-5681) [    ] o.a.z.s.ZooKeeperServer ZKShutdownHandler is not registered, so ZooKeeper server won't take any action on ERROR or SHUTDOWN server state changes
   [junit4]   2> 2810551 INFO  (SUITE-NodeAddedTriggerTest-seed#[C0415163DA852853]-worker) [    ] o.a.s.c.ZkTestServer start zk server on port:48531
   [junit4]   2> 2810554 INFO  (zkConnectionManagerCallback-7833-thread-1) [    ] o.a.s.c.c.ConnectionManager zkClient has connected
   [junit4]   2> 2810559 INFO  (jetty-launcher-7830-thread-1) [    ] o.e.j.s.Server jetty-9.4.8.v20171121, build timestamp: 2017-11-22T00:27:37+03:00, git hash: 82b8fb23f757335bb3329d540ce37a2a2615f0a8
   [junit4]   2> 2810560 INFO  (jetty-launcher-7830-thread-1) [    ] o.e.j.s.session DefaultSessionIdManager workerName=node0
   [junit4]   2> 2810560 INFO  (jetty-launcher-7830-thread-1) [    ] o.e.j.s.session No SessionScavenger set, using defaults
   [junit4]   2> 2810560 INFO  (jetty-launcher-7830-thread-1) [    ] o.e.j.s.session Scavenging every 600000ms
   [junit4]   2> 2810561 INFO  (jetty-launcher-7830-thread-1) [    ] o.e.j.s.h.ContextHandler Started o.e.j.s.ServletContextHandler@1c6888d2{/solr,null,AVAILABLE}
   [junit4]   2> 2810561 INFO  (jetty-launcher-7830-thread-1) [    ] o.e.j.s.AbstractConnector Started ServerConnector@76496796{HTTP/1.1,[http/1.1]}{127.0.0.1:56960}
   [junit4]   2> 2810562 INFO  (jetty-launcher-7830-thread-1) [    ] o.e.j.s.Server Started @2812333ms
   [junit4]   2> 2810562 INFO  (jetty-launcher-7830-thread-1) [    ] o.a.s.c.s.e.JettySolrRunner Jetty properties: {hostContext=/solr, hostPort=56960}
   [junit4]   2> 2810562 ERROR (jetty-launcher-7830-thread-1) [    ] o.a.s.u.StartupLoggingUtils Missing Java Option solr.log.dir. Logging may be missing or incomplete.
   [junit4]   2> 2810562 INFO  (jetty-launcher-7830-thread-1) [    ] o.a.s.s.SolrDispatchFilter Using logger factory org.apache.logging.slf4j.Log4jLoggerFactory
   [junit4]   2> 2810562 INFO  (jetty-launcher-7830-thread-1) [    ] o.a.s.s.SolrDispatchFilter  ___      _       Welcome to Apache Solr™ version 8.0.0
   [junit4]   2> 2810562 INFO  (jetty-launcher-7830-thread-1) [    ] o.a.s.s.SolrDispatchFilter / __| ___| |_ _   Starting in cloud mode on port null
   [junit4]   2> 2810562 INFO  (jetty-launcher-7830-thread-1) [    ] o.a.s.s.SolrDispatchFilter \__ \/ _ \ | '_|  Install dir: null
   [junit4]   2> 2810562 INFO  (jetty-launcher-7830-thread-1) [    ] o.a.s.s.SolrDispatchFilter |___/\___/_|_|    Start time: 2018-04-12T05:56:05.673Z
   [junit4]   2> 2810564 INFO  (zkConnectionManagerCallback-7835-thread-1) [    ] o.a.s.c.c.ConnectionManager zkClient has connected
   [junit4]   2> 2810565 INFO  (jetty-launcher-7830-thread-1) [    ] o.a.s.s.SolrDispatchFilter solr.xml found in ZooKeeper. Loading...
   [junit4]   2> 2810576 INFO  (jetty-launcher-7830-thread-1) [    ] o.a.s.c.ZkContainer Zookeeper client=127.0.0.1:48531/solr
   [junit4]   2> 2810578 INFO  (zkConnectionManagerCallback-7839-thread-1) [    ] o.a.s.c.c.ConnectionManager zkClient has connected
   [junit4]   2> 2810581 INFO  (zkConnectionManagerCallback-7841-thread-1) [    ] o.a.s.c.c.ConnectionManager zkClient has connected
   [junit4]   2> 2810800 INFO  (jetty-launcher-7830-thread-1) [n:127.0.0.1:56960_solr    ] o.a.s.c.Overseer Overseer (id=null) closing
   [junit4]   2> 2810802 INFO  (jetty-launcher-7830-thread-1) [n:127.0.0.1:56960_solr    ] o.a.s.c.OverseerElectionContext I am going to be the leader 127.0.0.1:56960_solr
   [junit4]   2> 2810803 INFO  (jetty-launcher-7830-thread-1) [n:127.0.0.1:56960_solr    ] o.a.s.c.Overseer Overseer (id=72220806521618435-127.0.0.1:56960_solr-n_0000000000) starting
   [junit4]   2> 2810817 INFO  (zkConnectionManagerCallback-7848-thread-1) [    ] o.a.s.c.c.ConnectionManager zkClient has connected
   [junit4]   2> 2810820 INFO  (jetty-launcher-7830-thread-1) [n:127.0.0.1:56960_solr    ] o.a.s.c.s.i.ZkClientClusterStateProvider Cluster at 127.0.0.1:48531/solr ready
   [junit4]   2> 2810821 INFO  (jetty-launcher-7830-thread-1) [n:127.0.0.1:56960_solr    ] o.a.s.c.ZkController Register node as live in ZooKeeper:/live_nodes/127.0.0.1:56960_solr
   [junit4]   2> 2810823 INFO  (zkCallback-7847-thread-1) [    ] o.a.s.c.c.ZkStateReader Updated live nodes from ZooKeeper... (0) -> (1)
   [junit4]   2> 2810824 INFO  (OverseerStateUpdate-72220806521618435-127.0.0.1:56960_solr-n_0000000000) [    ] o.a.s.c.c.ZkStateReader Updated live nodes from ZooKeeper... (0) -> (1)
   [junit4]   2> 2811510 INFO  (jetty-launcher-7830-thread-1) [n:127.0.0.1:56960_solr    ] o.a.s.m.r.SolrJmxReporter JMX monitoring for 'solr_56960.solr.node' (registry 'solr.node') enabled at server: com.sun.jmx.mbeanserver.JmxMBeanServer@13e1f8ce
   [junit4]   2> 2811519 INFO  (jetty-launcher-7830-thread-1) [n:127.0.0.1:56960_solr    ] o.a.s.m.r.SolrJmxReporter JMX monitoring for 'solr_56960.solr.jvm' (registry 'solr.jvm') enabled at server: com.sun.jmx.mbeanserver.JmxMBeanServer@13e1f8ce
   [junit4]   2> 2811519 INFO  (jetty-launcher-7830-thread-1) [n:127.0.0.1:56960_solr    ] o.a.s.m.r.SolrJmxReporter JMX monitoring for 'solr_56960.solr.jetty' (registry 'solr.jetty') enabled at server: com.sun.jmx.mbeanserver.JmxMBeanServer@13e1f8ce
   [junit4]   2> 2811519 INFO  (jetty-launcher-7830-thread-1) [n:127.0.0.1:56960_solr    ] o.a.s.c.CorePropertiesLocator Found 0 core definitions underneath /export/home/jenkins/workspace/Lucene-Solr-master-Solaris/solr/build/solr-core/test/J1/temp/solr.cloud.autoscaling.NodeAddedTriggerTest_C0415163DA852853-001/tempDir-001/node1/.
   [junit4]   2> 2811540 INFO  (zkConnectionManagerCallback-7850-thread-1) [    ] o.a.s.c.c.ConnectionManager zkClient has connected
   [junit4]   2> 2811544 INFO  (zkConnectionManagerCallback-7855-thread-1) [    ] o.a.s.c.c.ConnectionManager zkClient has connected
   [junit4]   2> 2811545 INFO  (SUITE-NodeAddedTriggerTest-seed#[C0415163DA852853]-worker) [    ] o.a.s.c.c.ZkStateReader Updated live nodes from ZooKeeper... (0) -> (1)
   [junit4]   2> 2811547 INFO  (SUITE-NodeAddedTriggerTest-seed#[C0415163DA852853]-worker) [    ] o.a.s.c.s.i.ZkClientClusterStateProvider Cluster at 127.0.0.1:48531/solr ready
   [junit4]   2> 2811567 INFO  (TEST-NodeAddedTriggerTest.testTrigger-seed#[C0415163DA852853]) [    ] o.e.j.s.Server jetty-9.4.8.v20171121, build timestamp: 2017-11-22T00:27:37+03:00, git hash: 82b8fb23f757335bb3329d540ce37a2a2615f0a8
   [junit4]   2> 2811569 INFO  (TEST-NodeAddedTriggerTest.testTrigger-seed#[C0415163DA852853]) [    ] o.e.j.s.session DefaultSessionIdManager workerName=node0
   [junit4]   2> 2811569 INFO  (TEST-NodeAddedTriggerTest.testTrigger-seed#[C0415163DA852853]) [    ] o.e.j.s.session No SessionScavenger set, using defaults
   [junit4]   2> 2811569 INFO  (TEST-NodeAddedTriggerTest.testTrigger-seed#[C0415163DA852853]) [    ] o.e.j.s.session Scavenging every 660000ms
   [junit4]   2> 2811569 INFO  (TEST-NodeAddedTriggerTest.testTrigger-seed#[C0415163DA852853]) [    ] o.e.j.s.h.ContextHandler Started o.e.j.s.ServletContextHandler@27d83075{/solr,null,AVAILABLE}
   [junit4]   2> 2811570 INFO  (TEST-NodeAddedTriggerTest.testTrigger-seed#[C0415163DA852853]) [    ] o.e.j.s.AbstractConnector Started ServerConnector@76d71297{HTTP/1.1,[http/1.1]}{127.0.0.1:58377}
   [junit4]   2> 2811570 INFO  (TEST-NodeAddedTriggerTest.testTrigger-seed#[C0415163DA852853]) [    ] o.e.j.s.Server Started @2813342ms
   [junit4]   2> 2811570 INFO  (TEST-NodeAddedTriggerTest.testTrigger-seed#[C0415163DA852853]) [    ] o.a.s.c.s.e.JettySolrRunner Jetty properties: {hostContext=/solr, hostPort=58377}
   [junit4]   2> 2811570 ERROR (TEST-NodeAddedTriggerTest.testTrigger-seed#[C0415163DA852853]) [    ] o.a.s.u.StartupLoggingUtils Missing Java Option solr.log.dir. Logging may be missing or incomplete.
   [junit4]   2> 2811570 INFO  (TEST-NodeAddedTriggerTest.testTrigger-seed#[C0415163DA852853]) [    ] o.a.s.s.SolrDispatchFilter Using logger factory org.apache.logging.slf4j.Log4jLoggerFactory
   [junit4]   2> 2811570 INFO  (TEST-NodeAddedTriggerTest.testTrigger-seed#[C0415163DA852853]) [    ] o.a.s.s.SolrDispatchFilter  ___      _       Welcome to Apache Solr™ version 8.0.0
   [junit4]   2> 2811570 INFO  (TEST-NodeAddedTriggerTest.testTrigger-seed#[C0415163DA852853]) [    ] o.a.s.s.SolrDispatchFilter / __| ___| |_ _   Starting in cloud mode on port null
   [junit4]   2> 2811570 INFO  (TEST-NodeAddedTriggerTest.testTrigger-seed#[C0415163DA852853]) [    ] o.a.s.s.SolrDispatchFilter \__ \/ _ \ | '_|  Install dir: null
   [junit4]   2> 2811570 INFO  (TEST-NodeAddedTriggerTest.testTrigger-seed#[C0415163DA852853]) [    ] o.a.s.s.SolrDispatchFilter |___/\___/_|_|    Start time: 2018-04-12T05:56:06.681Z
   [junit4]   2> 2811572 INFO  (zkConnectionManagerCallback-7857-thread-1) [    ] o.a.s.c.c.ConnectionManager zkClient has connected
   [junit4]   2> 2811573 INFO  (TEST-NodeAddedTriggerTest.testTrigger-seed#[C0415163DA852853]) [    ] o.a.s.s.SolrDispatchFilter solr.xml found in ZooKeeper. Loading...
   [junit4]   2> 2811582 INFO  (TEST-NodeAddedTriggerTest.testTrigger-seed#[C0415163DA852853]) [    ] o.a.s.c.ZkContainer Zookeeper client=127.0.0.1:48531/solr
   [junit4]   2> 2811584 INFO  (zkConnectionManagerCallback-7861-thread-1) [    ] o.a.s.c.c.ConnectionManager zkClient has connected
   [junit4]   2> 2811587 INFO  (zkConnectionManagerCallback-7863-thread-1) [    ] o.a.s.c.c.ConnectionManager zkClient has connected
   [junit4]   2> 2811601 INFO  (TEST-NodeAddedTriggerTest.testTrigger-seed#[C0415163DA852853]) [n:127.0.0.1:58377_solr    ] o.a.s.c.c.ZkStateReader Updated live nodes from ZooKeeper... (0) -> (1)
   [junit4]   2> 2811605 INFO  (TEST-NodeAddedTriggerTest.testTrigger-seed#[C0415163DA852853]) [n:127.0.0.1:58377_solr    ] o.a.s.c.Overseer Overseer (id=null) closing
   [junit4]   2> 2811608 INFO  (TEST-NodeAddedTriggerTest.testTrigger-seed#[C0415163DA852853]) [n:127.0.0.1:58377_solr    ] o.a.s.c.TransientSolrCoreCacheDefault Allocating transient cache for 2147483647 transient cores
   [junit4]   2> 2811608 INFO  (TEST-NodeAddedTriggerTest.testTrigger-seed#[C0415163DA852853]) [n:127.0.0.1:58377_solr    ] o.a.s.c.ZkController Register node as live in ZooKeeper:/live_nodes/127.0.0.1:58377_solr
   [junit4]   2> 2811610 INFO  (zkCallback-7847-thread-1) [    ] o.a.s.c.c.ZkStateReader Updated live nodes from ZooKeeper... (1) -> (2)
   [junit4]   2> 2811610 INFO  (zkCallback-7854-thread-1) [    ] o.a.s.c.c.ZkStateReader Updated live nodes from ZooKeeper... (1) -> (2)
   [junit4]   2> 2811610 INFO  (zkCallback-7840-thread-1) [    ] o.a.s.c.c.ZkStateReader Updated live nodes from ZooKeeper... (1) -> (2)
   [junit4]   2> 2811611 INFO  (zkCallback-7862-thread-1) [    ] o.a.s.c.c.ZkStateReader Updated live nodes from ZooKeeper... (1) -> (2)
   [junit4]   2> 2812264 INFO  (TEST-NodeAddedTriggerTest.testTrigger-seed#[C0415163DA852853]) [n:127.0.0.1:58377_solr    ] o.a.s.m.r.SolrJmxReporter JMX monitoring for 'solr_58377.solr.node' (registry 'solr.node') enabled at server: com.sun.jmx.mbeanserver.JmxMBeanServer@13e1f8ce
   [junit4]   2> 2812273 INFO  (TEST-NodeAddedTriggerTest.testTrigger-seed#[C0415163DA852853]) [n:127.0.0.1:58377_solr    ] o.a.s.m.r.SolrJmxReporter JMX monitoring for 'solr_58377.solr.jvm' (registry 'solr.jvm') enabled at server: com.sun.jmx.mbeanserver.JmxMBeanServer@13e1f8ce
   [junit4]   2> 2812274 INFO  (TEST-NodeAddedTriggerTest.testTrigger-seed#[C0415163DA852853]) [n:127.0.0.1:58377_solr    ] o.a.s.m.r.SolrJmxReporter JMX monitoring for 'solr_58377.solr.jetty' (registry 'solr.jetty') enabled at server: com.sun.jmx.mbeanserver.JmxMBeanServer@13e1f8ce
   [junit4]   2> 2812275 INFO  (TEST-NodeAddedTriggerTest.testTrigger-seed#[C0415163DA852853]) [n:127.0.0.1:58377_solr    ] o.a.s.c.CorePropertiesLocator Found 0 core definitions underneath /export/home/jenkins/workspace/Lucene-Solr-master-Solaris/solr/build/solr-core/test/J1/temp/solr.cloud.autoscaling.NodeAddedTriggerTest_C0415163DA852853-001/tempDir-001/node2/.
   [junit4]   2> 2812279 INFO  (zkConnectionManagerCallback-7870-thread-1) [    ] o.a.s.c.c.ConnectionManager zkClient has connected
   [junit4]   2> 2812281 INFO  (TEST-NodeAddedTriggerTest.testTrigger-seed#[C0415163DA852853]) [n:127.0.0.1:58377_solr    ] o.a.s.c.c.ZkStateReader Updated live nodes from ZooKeeper... (0) -> (2)
   [junit4]   2> 2812282 INFO  (TEST-NodeAddedTriggerTest.testTrigger-seed#[C0415163DA852853]) [n:127.0.0.1:58377_solr    ] o.a.s.c.s.i.ZkClientClusterStateProvider Cluster at 127.0.0.1:48531/solr ready
   [junit4]   2> 2812337 INFO  (TEST-NodeAddedTriggerTest.testTrigger-seed#[C0415163DA852853]) [    ] o.e.j.s.Server jetty-9.4.8.v20171121, build timestamp: 2017-11-22T00:27:37+03:00, git hash: 82b8fb23f757335bb3329d540ce37a2a2615f0a8
   [junit4]   2> 2812338 INFO  (TEST-NodeAddedTriggerTest.testTrigger-seed#[C0415163DA852853]) [    ] o.e.j.s.session DefaultSessionIdManager workerName=node0
   [junit4]   2> 2812338 INFO  (TEST-NodeAddedTriggerTest.testTrigger-seed#[C0415163DA852853]) [    ] o.e.j.s.session No SessionScavenger set, using defaults
   [junit4]   2> 2812339 INFO  (TEST-NodeAddedTriggerTest.testTrigger-seed#[C0415163DA852853]) [    ] o.e.j.s.session Scavenging every 600000ms
   [junit4]   2> 2812339 INFO  (TEST-NodeAddedTriggerTest.testTrigger-seed#[C0415163DA852853]) [    ] o.e.j.s.h.ContextHandler Started o.e.j.s.ServletContextHandler@fdede9c{/solr,null,AVAILABLE}
   [junit4]   2> 2812339 INFO  (TEST-NodeAddedTriggerTest.testTrigger-seed#[C0415163DA852853]) [    ] o.e.j.s.AbstractConnector Started ServerConnector@394c605e{HTTP/1.1,[http/1.1]}{127.0.0.1:62390}
   [junit4]   2> 2812339 INFO  (TEST-NodeAddedTriggerTest.testTrigger-seed#[C0415163DA852853]) [    ] o.e.j.s.Server Started @2814112ms
   [junit4]   2> 2812339 INFO  (TEST-NodeAddedTriggerTest.testTrigger-seed#[C0415163DA852853]) [    ] o.a.s.c.s.e.JettySolrRunner Jetty properties: {hostContext=/solr, hostPort=62390}
   [junit4]   2> 2812340 ERROR (TEST-NodeAddedTriggerTest.testTrigger-seed#[C0415163DA852853]) [    ] o.a.s.u.StartupLoggingUtils Missing Java Option solr.log.dir. Logging may be missing or incomplete.
   [junit4]   2> 2812340 INFO  (TEST-NodeAddedTriggerTest.testTrigger-seed#[C0415163DA852853]) [    ] o.a.s.s.SolrDispatchFilter Using logger factory org.apache.logging.slf4j.Log4jLoggerFactory
   [junit4]   2> 2812340 INFO  (TEST-NodeAddedTriggerTest.testTrigger-seed#[C0415163DA852853]) [    ] o.a.s.s.SolrDispatchFilter  ___      _       Welcome to Apache Solr™ version 8.0.0
   [junit4]   2> 2812340 INFO  (TEST-NodeAddedTriggerTest.testTrigger-seed#[C0415163DA852853]) [    ] o.a.s.s.SolrDispatchFilter / __| ___| |_ _   Starting in cloud mode on port null
   [junit4]   2> 2812340 INFO  (TEST-NodeAddedTriggerTest.testTrigger-seed#[C0415163DA852853]) [    ] o.a.s.s.SolrDispatchFilter \__ \/ _ \ | '_|  Install dir: null
   [junit4]   2> 2812340 INFO  (TEST-NodeAddedTriggerTest.testTrigger-seed#[C0415163DA852853]) [    ] o.a.s.s.SolrDispatchFilter |___/\___/_|_|    Start time: 2018-04-12T05:56:07.451Z
   [junit4]   2> 2812342 INFO  (zkConnectionManagerCallback-7872-thread-1) [    ] o.a.s.c.c.ConnectionManager zkClient has connected
   [junit4]   2> 2812343 INFO  (TEST-NodeAddedTriggerTest.testTrigger-seed#[C0415163DA852853]) [    ] o.a.s.s.SolrDispatchFilter solr.xml found in ZooKeeper. Loading...
   [junit4]   2> 2812351 INFO  (TEST-NodeAddedTriggerTest.testTrigger-seed#[C0415163DA852853]) [    ] o.a.s.c.ZkContainer Zookeeper client=127.0.0.1:48531/solr
   [junit4]   2> 2812353 INFO  (zkConnectionManagerCallback-7876-thread-1) [    ] o.a.s.c.c.ConnectionManager zkClient has connected
   [junit4]   2> 2812356 INFO  (zkConnectionManagerCallback-7878-thread-1) [    ] o.a.s.c.c.ConnectionManager zkClient has connected
   [junit4]   2> 2812368 INFO  (TEST-NodeAddedTriggerTest.testTrigger-seed#[C0415163DA852853]) [n:127.0.0.1:62390_solr    ] o.a.s.c.c.ZkStateReader Updated live nodes from ZooKeeper... (0) -> (2)
   [junit4]   2> 2812372 INFO  (TEST-NodeAddedTriggerTest.testTrigger-seed#[C0415163DA852853]) [n:127.0.0.1:62390_solr    ] o.a.s.c.Overseer Overseer (id=null) closing
   [junit4]   2> 2812376 INFO  (TEST-NodeAddedTriggerTest.testTrigger-seed#[C0415163DA852853]) [n:127.0.0.1:62390_solr    ] o.a.s.c.TransientSolrCoreCacheDefault Allocating transient cache for 2147483647 transient cores
   [junit4]   2> 2812376 INFO  (TEST-NodeAddedTriggerTest.testTrigger-seed#[C0415163DA852853]) [n:127.0.0.1:62390_solr    ] o.a.s.c.ZkController Register node as live in ZooKeeper:/live_nodes/127.0.0.1:62390_solr
   [junit4]   2> 2812377 INFO  (zkCallback-7840-thread-1) [    ] o.a.s.c.c.ZkStateReader Updated live nodes from ZooKeeper... (2) -> (3)
   [junit4]   2> 2812377 INFO  (zkCallback-7847-thread-1) [    ] o.a.s.c.c.ZkStateReader Updated live nodes from ZooKeeper... (2) -> (3)
   [junit4]   2> 2812377 INFO  (zkCallback-7854-thread-1) [    ] o.a.s.c.c.ZkStateReader Updated live nodes from ZooKeeper... (2) -> (3)
   [junit4]   2> 2812377 INFO  (zkCallback-7862-thread-1) [    ] o.a.s.c.c.ZkStateReader Updated live nodes from ZooKeeper... (2) -> (3)
   [junit4]   2> 2812378 INFO  (zkCallback-7869-thread-1) [    ] o.a.s.c.c.ZkStateReader Updated live nodes from ZooKeeper... (2) -> (3)
   [junit4]   2> 2812378 INFO  (zkCallback-7877-thread-1) [    ] o.a.s.c.c.ZkStateReader Updated live nodes from ZooKeeper... (2) -> (3)
   [junit4]   2> 2813433 INFO  (TEST-NodeAddedTriggerTest.testTrigger-seed#[C0415163DA852853]) [n:127.0.0.1:62390_solr    ] o.a.s.m.r.SolrJmxReporter JMX monitoring for 'solr_62390.solr.node' (registry 'solr.node') enabled at server: com.sun.jmx.mbeanserver.JmxMBeanServer@13e1f8ce
   [junit4]   2> 2813439 INFO  (TEST-NodeAddedTriggerTest.testTrigger-seed#[C0415163DA852853]) [n:127.0.0.1:62390_solr    ] o.a.s.m.r.SolrJmxReporter JMX monitoring for 'solr_62390.solr.jvm' (registry 'solr.jvm') enabled at server: com.sun.jmx.mbeanserver.JmxMBeanServer@13e1f8ce
   [junit4]   2> 2813439 INFO  (TEST-NodeAddedTriggerTest.testTrigger-seed#[C0415163DA852853]) [n:127.0.0.1:62390_solr    ] o.a.s.m.r.SolrJmxReporter JMX monitoring for 'solr_62390.solr.jetty' (registry 'solr.jetty') enabled at server: com.sun.jmx.mbeanserver.JmxMBeanServer@13e1f8ce
   [junit4]   2> 2813439 INFO  (TEST-NodeAddedTriggerTest.testTrigger-seed#[C0415163DA852853]) [n:127.0.0.1:62390_solr    ] o.a.s.c.CorePropertiesLocator Found 0 core definitions underneath /export/home/jenkins/workspace/Lucene-Solr-master-Solaris/solr/build/solr-core/test/J1/temp/solr.cloud.autoscaling.NodeAddedTriggerTest_C0415163DA852853-001/tempDir-001/node3/.
   [junit4]   2> 2813446 INFO  (zkConnectionManagerCallback-7885-thread-1) [    ] o.a.s.c.c.ConnectionManager zkClient has connected
   [junit4]   2> 2813448 INFO  (TEST-NodeAddedTriggerTest.testTrigger-seed#[C0415163DA852853]) [n:127.0.0.1:62390_solr    ] o.a.s.c.c.ZkStateReader Updated live nodes from ZooKeeper... (0) -> (3)
   [junit4]   2> 2813450 INFO  (TEST-NodeAddedTriggerTest.testTrigger-seed#[C0415163DA852853]) [n:127.0.0.1:62390_solr    ] o.a.s.c.s.i.ZkClientClusterStateProvider Cluster at 127.0.0.1:48531/solr ready
   [junit4]   2> 2818488 INFO  (TEST-NodeAddedTriggerTest.testTrigger-seed#[C0415163DA852853]) [    ] o.e.j.s.Server jetty-9.4.8.v20171121, build timestamp: 2017-11-22T00:27:37+03:00, git hash: 82b8fb23f757335bb3329d540ce37a2a2615f0a8
   [junit4]   2> 2818489 INFO  (TEST-NodeAddedTriggerTest.testTrigger-seed#[C0415163DA852853]) [    ] o.e.j.s.session DefaultSessionIdManager workerName=node0
   [junit4]   2> 2818489 INFO  (TEST-NodeAddedTriggerTest.testTrigger-seed#[C0415163DA852853]) [    ] o.e.j.s.session No SessionScavenger set, using defaults
   [junit4]   2> 2818489 INFO  (TEST-NodeAddedTriggerTest.testTrigger-seed#[C0415163DA852853]) [    ] o.e.j.s.session Scavenging every 660000ms
   [junit4]   2> 2818489 INFO  (TEST-NodeAddedTriggerTest.testTrigger-seed#[C0415163DA852853]) [    ] o.e.j.s.h.ContextHandler Started o.e.j.s.ServletContextHandler@563ebfae{/solr,null,AVAILABLE}
   [junit4]   2> 2818490 INFO  (TEST-NodeAddedTriggerTest.testTrigger-seed#[C0415163DA852853]) [    ] o.e.j.s.AbstractConnector Started ServerConnector@510d821{HTTP/1.1,[http/1.1]}{127.0.0.1:36749}
   [junit4]   2> 2818490 INFO  (TEST-NodeAddedTriggerTest.testTrigger-seed#[C0415163DA852853]) [    ] o.e.j.s.Server Started @2820263ms
   [junit4]   2> 2818490 INFO  (TEST-NodeAddedTriggerTest.testTrigger-seed#[C0415163DA852853]) [    ] o.a.s.c.s.e.JettySolrRunner Jetty properties: {hostContext=/solr, hostPort=36749}
   [junit4]   2> 2818490 ERROR (TEST-NodeAddedTriggerTest.testTrigger-seed#[C0415163DA852853]) [    ] o.a.s.u.StartupLoggingUtils Missing Java Option solr.log.dir. Logging may be missing or incomplete.
   [junit4]   2> 2818490 INFO  (TEST-NodeAddedTriggerTest.testTrigger-seed#[C0415163DA852853]) [    ] o.a.s.s.SolrDispatchFilter Using logger factory org.apache.logging.slf4j.Log4jLoggerFactory
   [junit4]   2> 2818490 INFO  (TEST-NodeAddedTriggerTest.testTrigger-seed#[C0415163DA852853]) [    ] o.a.s.s.SolrDispatchFilter  ___      _       Welcome to Apache Solr™ version 8.0.0
   [junit4]   2> 2818490 INFO  (TEST-NodeAddedTriggerTest.testTrigger-seed#[C0415163DA852853]) [    ] o.a.s.s.SolrDispatchFilter / __| ___| |_ _   Starting in cloud mode on port null
   [junit4]   2> 2818490 INFO  (TEST-NodeAddedTriggerTest.testTrigger-seed#[C0415163DA852853]) [    ] o.a.s.s.SolrDispatchFilter \__ \/ _ \ | '_|  Install dir: null
   [junit4]   2> 2818490 INFO  (TEST-NodeAddedTriggerTest.testTrigger-seed#[C0415163DA852853]) [    ] o.a.s.s.SolrDispatchFilter |___/\___/_|_|    Start time: 2018-04-12T05:56:13.601Z
   [junit4]   2> 2818492 INFO  (zkConnectionManagerCallback-7887-thread-1) [    ] o.a.s.c.c.ConnectionManager zkClient has connected
   [junit4]   2> 2818492 INFO  (TEST-NodeAddedTriggerTest.testTrigger-seed#[C0415163DA852853]) [    ] o.a.s.s.SolrDispatchFilter solr.xml found in ZooKeeper. Loading...
   [junit4]   2> 2818499 INFO  (TEST-NodeAddedTriggerTest.testTrigger-seed#[C0415163DA852853]) [    ] o.a.s.c.ZkContainer Zookeeper client=127.0.0.1:48531/solr
   [junit4]   2> 2818500 INFO  (zkConnectionManagerCallback-7891-thread-1) [    ] o.a.s.c.c.ConnectionManager zkClient has connected
   [junit4]   2> 2818503 INFO  (zkConnectionManagerCallback-7893-thread-1) [    ] o.a.s.c.c.ConnectionManager zkClient has connected
   [junit4]   2> 2818515 INFO  (TEST-NodeAddedTriggerTest.testTrigger-seed#[C0415163DA852853]) [n:127.0.0.1:36749_solr    ] o.a.s.c.c.ZkStateReader Updated live nodes from ZooKeeper... (0) -> (3)
   [junit4]   2> 2818518 INFO  (TEST-NodeAddedTriggerTest.testTrigger-seed#[C0415163DA852853]) [n:127.0.0.1:36749_solr    ] o.a.s.c.Overseer Overseer (id=null) closing
   [junit4]   2> 2818522 INFO  (TEST-NodeAddedTriggerTest.testTrigger-seed#[C0415163DA852853]) [n:127.0.0.1:36749_solr    ] o.a.s.c.TransientSolrCoreCacheDefault Allocating transient cache for 2147483647 transient cores
   [junit4]   2> 2818522 INFO  (TEST-NodeAddedTriggerTest.testTrigger-seed#[C0415163DA852853]) [n:127.0.0.1:36749_solr    ] o.a.s.c.ZkController Register node as live in ZooKeeper:/live_nodes/127.0.0.1:36749_solr
   [junit4]   2> 2818523 INFO  (zkCallback-7862-thread-1) [    ] o.a.s.c.c.ZkStateReader Updated live nodes from ZooKeeper... (3) -> (4)
   [junit4]   2> 2818523 INFO  (zkCallback-7869-thread-1) [    ] o.a.s.c.c.ZkStateReader Updated live nodes from ZooKeeper... (3) -> (4)
   [junit4]   2> 2818524 INFO  (zkCallback-7847-thread-1) [    ] o.a.s.c.c.ZkStateReader Updated live nodes from ZooKeeper... (3) -> (4)
   [junit4]   2> 2818524 INFO  (zkCallback-7840-thread-1) [    ] o.a.s.c.c.ZkStateReader Updated live nodes from ZooKeeper... (3) -> (4)
   [junit4]   2> 2818524 INFO  (zkCallback-7854-thread-1) [    ] o.a.s.c.c.ZkStateReader Updated live nodes from ZooKeeper... (3) -> (4)
   [junit4]   2> 2818525 INFO  (zkCallback-7884-thread-1) [    ] o.a.s.c.c.ZkStateReader Updated live nodes from ZooKeeper... (3) -> (4)
   [junit4]   2> 2818525 INFO  (zkCallback-7877-thread-1) [    ] o.a.s.c.c.ZkStateReader Updated live nodes from ZooKeeper... (3) -> (4)
   [junit4]   2> 2818526 INFO  (zkCallback-7892-thread-1) [    ] o.a.s.c.c.ZkStateReader Updated live nodes from ZooKeeper... (3) -> (4)
   [junit4]   2> 2819293 INFO  (TEST-NodeAddedTriggerTest.testTrigger-seed#[C0415163DA852853]) [n:127.0.0.1:36749_solr    ] o.a.s.m.r.SolrJmxReporter JMX monitoring for 'solr_36749.solr.node' (registry 'solr.node') enabled at server: com.sun.jmx.mbeanserver.JmxMBeanServer@13e1f8ce
   [junit4]   2> 2819300 INFO  (TEST-NodeAddedTriggerTest.testTrigger-seed#[C0415163DA852853]) [n:127.0.0.1:36749_solr    ] o.a.s.m.r.SolrJmxReporter JMX monitoring for 'solr_36749.solr.jvm' (registry 'solr.jvm') enabled at server: com.sun.jmx.mbeanserver.JmxMBeanServer@13e1f8ce
   [junit4]   2> 2819300 INFO  (TEST-NodeAddedTriggerTest.testTrigger-seed#[C0415163DA852853]) [n:127.0.0.1:36749_solr    ] o.a.s.m.r.SolrJmxReporter JMX monitoring for 'solr_36749.solr.jetty' (registry 'solr.jetty') enabled at server: com.sun.jmx.mbeanserver.JmxMBeanServer@13e1f8ce
   [junit4]   2> 2819301 INFO  (TEST-NodeAddedTriggerTest.testTrigger-seed#[C0415163DA852853]) [n:127.0.0.1:36749_solr    ] o.a.s.c.CorePropertiesLocator Found 0 core definitions underneath /export/home/jenkins/workspace/Lucene-Solr-master-Solaris/solr/build/solr-core/test/J1/temp/solr.cloud.autoscaling.NodeAddedTriggerTest_C0415163DA852853-001/tempDir-001/node4/.
   [junit4]   2> 2819305 INFO  (zkConnectionManagerCallback-7900-thread-1) [    ] o.a.s.c.c.ConnectionManager zkClient has connected
   [junit4]   2> 2819307 INFO  (TEST-NodeAddedTriggerTest.testTrigger-seed#[C0415163DA852853]) [n:127.0.0.1:36749_solr    ] o.a.s.c.c.ZkStateReader Updated live nodes from ZooKeeper... (0) -> (4)
   [junit4]   2> 2819309 INFO  (TEST-NodeAddedTriggerTest.testTrigger-seed#[C0415163DA852853]) [n:127.0.0.1:36749_solr    ] o.a.s.c.s.i.ZkClientClusterStateProvider Cluster at 127.0.0.1:48531/solr ready
   [junit4]   2> 2819340 INFO  (TEST-NodeAddedTriggerTest.testTrigger-seed#[C0415163DA852853]) [    ] o.e.j.s.AbstractConnector Stopped ServerConnector@510d821{HTTP/1.1,[http/1.1]}{127.0.0.1:0}
   [junit4]   2> 2819340 INFO  (TEST-NodeAddedTriggerTest.testTrigger-seed#[C0415163DA852853]) [    ] o.a.s.c.CoreContainer Shutting down CoreContainer instance=310199505
   [junit4]   2> 2819340 INFO  (TEST-NodeAddedTriggerTest.testTrigger-seed#[C0415163DA852853]) [    ] o.a.s.m.SolrMetricManager Closing metric reporters for registry=solr.node, tag=null
   [junit4]   2> 2819340 INFO  (TEST-NodeAddedTriggerTest.testTrigger-seed#[C0415163DA852853]) [    ] o.a.s.m.r.SolrJmxReporter Closing reporter [org.apache.solr.metrics.reporters.SolrJmxReporter@e7d481: rootName = solr_36749, domain = solr.node, service url = null, agent id = null] for registry solr.node / com.codahale.metrics.MetricRegistry@4023df6b
   [junit4]   2> 2819346 INFO  (TEST-NodeAddedTriggerTest.testTrigger-seed#[C0415163DA852853]) [    ] o.a.s.m.SolrMetricManager Closing metric reporters for registry=solr.jvm, tag=null
   [junit4]   2> 2819346 INFO  (TEST-NodeAddedTriggerTest.testTrigger-seed#[C0415163DA852853]) [    ] o.a.s.m.r.SolrJmxReporter Closing reporter [org.apache.solr.metrics.reporters.SolrJmxReporter@75df4030: rootName = solr_36749, domain = solr.jvm, service url = null, agent id = null] for registry solr.jvm / com.codahale.metrics.MetricRegistry@35a9dbf1
   [junit4]   2> 2819350 INFO  (TEST-NodeAddedTriggerTest.testTrigger-seed#[C0415163DA852853]) [    ] o.a.s.m.SolrMetricManager Closing metric reporters for registry=solr.jetty, tag=null
   [junit4]   2> 2819351 INFO  (TEST-NodeAddedTriggerTest.testTrigger-seed#[C0415163DA852853]) [    ] o.a.s.m.r.SolrJmxReporter Closing reporter [org.apache.solr.metrics.reporters.SolrJmxReporter@7511f199: rootName = solr_36749, domain = solr.jetty, service url = null, agent id = null] for registry solr.jetty / com.codahale.metrics.MetricRegistry@75aa6d42
   [junit4]   2> 2819353 INFO  (TEST-NodeAddedTriggerTest.testTrigger-seed#[C0415163DA852853]) [    ] o.a.s.c.ZkController Remove node as live in ZooKeeper:/live_nodes/127.0.0.1:36749_solr
   [junit4]   2> 2819355 INFO  (zkCallback-7847-thread-1) [    ] o.a.s.c.c.ZkStateReader Updated live nodes from ZooKeeper... (4) -> (3)
   [junit4]   2> 2819355 INFO  (zkCallback-7840-thread-1) [    ] o.a.s.c.c.ZkStateReader Updated live nodes from ZooKeeper... (4) -> (3)
   [junit4]   2> 2819355 INFO  (TEST-NodeAddedTriggerTest.testTrigger-seed#[C0415163DA852853]) [    ] o.a.s.m.SolrMetricManager Closing metric reporters for registry=solr.cluster, tag=null
   [junit4]   2> 2819355 INFO  (zkCallback-7869-thread-1) [    ] o.a.s.c.c.ZkStateReader Updated live nodes from ZooKeeper... (4) -> (3)
   [junit4]   2> 2819355 INFO  (zkCallback-7877-thread-1) [    ] o.a.s.c.c.ZkStateReader Updated live nodes from ZooKeeper... (4) -> (3)
   [junit4]   2> 2819355 INFO  (zkCallback-7854-thread-1) [    ] o.a.s.c.c.ZkStateReader Updated live nodes from ZooKeeper... (4) -> (3)
   [junit4]   2> 2819355 INFO  (zkCallback-7892-thread-1) [    ] o.a.s.c.c.ZkStateReader Updated live nodes from ZooKeeper... (4) -> (3)
   [junit4]   2> 2819355 INFO  (zkCallback-7884-thread-1) [    ] o.a.s.c.c.ZkStateReader Updated live nodes from ZooKeeper... (4) -> (3)
   [junit4]   2> 2819356 INFO  (zkCallback-7862-thread-1) [    ] o.a.s.c.c.ZkStateReader Updated live nodes from ZooKeeper... (4) -> (3)
   [junit4]   2> 2819357 INFO  (zkCallback-7899-thread-1) [    ] o.a.s.c.c.ZkStateReader Updated live nodes from ZooKeeper... (4) -> (3)
   [junit4]   2> 2819359 INFO  (TEST-NodeAddedTriggerTest.testTrigger-seed#[C0415163DA852853]) [    ] o.e.j.s.h.ContextHandler Stopped o.e.j.s.ServletContextHandler@563ebfae{/solr,null,UNAVAILABLE}
   [junit4]   2> 2819359 INFO  (TEST-NodeAddedTriggerTest.testTrigger-seed#[C0415163DA852853]) [    ] o.e.j.s.session Stopped scavenging
   [junit4]   2> 2824482 INFO  (TEST-NodeAddedTriggerTest.testListenerAcceptance-seed#[C0415163DA852853]) [    ] o.e.j.s.Server jetty-9.4.8.v20171121, build timestamp: 2017-11-22T00:27:37+03:00, git hash: 82b8fb23f757335bb3329d540ce37a2a2615f0a8
   [junit4]   2> 2824483 INFO  (TEST-NodeAddedTriggerTest.testListenerAcceptance-seed#[C0415163DA852853]) [    ] o.e.j.s.session DefaultSessionIdManager workerName=node0
   [junit4]   2> 2824483 INFO  (TEST-NodeAddedTriggerTest.testListenerAcceptance-seed#[C0415163DA852853]) [    ] o.e.j.s.session No SessionScavenger set, using defaults
   [junit4]   2> 2824483 INFO  (TEST-NodeAddedTriggerTest.testListenerAcceptance-seed#[C0415163DA852853]) [    ] o.e.j.s.session Scavenging every 660000ms
   [junit4]   2> 2824483 INFO  (TEST-NodeAddedTriggerTest.testListenerAcceptance-seed#[C0415163DA852853]) [    ] o.e.j.s.h.ContextHandler Started o.e.j.s.ServletContextHandler@1fe54e82{/solr,null,AVAILABLE}
   [junit4]   2> 2824483 INFO  (TEST-NodeAddedTriggerTest.testListenerAcceptance-seed#[C0415163DA852853]) [    ] o.e.j.s.AbstractConnector Started ServerConnector@61f5eda8{HTTP/1.1,[http/1.1]}{127.0.0.1:58426}
   [junit4]   2> 2824484 INFO  (TEST-NodeAddedTriggerTest.testListenerAcceptance-seed#[C0415163DA852853]) [    ] o.e.j.s.Server Started @2826259ms
   [junit4]   2> 2824484 INFO  (TEST-NodeAddedTriggerTest.testListenerAcceptance-seed#[C0415163DA852853]) [    ] o.a.s.c.s.e.JettySolrRunner Jetty properties: {hostContext=/solr, hostPort=58426}
   [junit4]   2> 2824484 ERROR (TEST-NodeAddedTriggerTest.testListenerAcceptance-seed#[C0415163DA852853]) [    ] o.a.s.u.StartupLoggingUtils Missing Java Option solr.log.dir. Logging may be missing or incomplete.
   [junit4]   2> 2824484 INFO  (TEST-NodeAddedTriggerTest.testListenerAcceptance-seed#[C0415163DA852853]) [    ] o.a.s.s.SolrDispatchFilter Using logger factory org.apache.logging.slf4j.Log4jLoggerFactory
   [junit4]   2> 2824484 INFO  (TEST-NodeAddedTriggerTest.testListenerAcceptance-seed#[C0415163DA852853]) [    ] o.a.s.s.SolrDispatchFilter  ___      _       Welcome to Apache Solr™ version 8.0.0
   [junit4]   2> 2824484 INFO  (TEST-NodeAddedTriggerTest.testListenerAcceptance-seed#[C0415163DA852853]) [    ] o.a.s.s.SolrDispatchFilter / __| ___| |_ _   Starting in cloud mode on port null
   [junit4]   2> 2824484 INFO  (TEST-NodeAddedTriggerTest.testListenerAcceptance-seed#[C0415163DA852853]) [    ] o.a.s.s.SolrDispatchFilter \__ \/ _ \ | '_|  Install dir: null
   [junit4]   2> 2824484 INFO  (TEST-NodeAddedTriggerTest.testListenerAcceptance-seed#[C0415163DA852853]) [    ] o.a.s.s.SolrDispatchFilter |___/\___/_|_|    Start time: 2018-04-12T05:56:19.595Z
   [junit4]   2> 2824487 INFO  (zkConnectionManagerCallback-7902-thread-1) [    ] o.a.s.c.c.ConnectionManager zkClient has connected
   [junit4]   2> 2824488 INFO  (TEST-NodeAddedTriggerTest.testListenerAcceptance-seed#[C0415163DA852853]) [    ] o.a.s.s.SolrDispatchFilter solr.xml found in ZooKeeper. Loading...
   [junit4]   2> 2824502 INFO  (TEST-NodeAddedTriggerTest.testListenerAcceptance-seed#[C0415163DA852853]) [    ] o.a.s.c.ZkContainer Zookeeper client=127.0.0.1:48531/solr
   [junit4]   2> 2824530 INFO  (zkConnectionManagerCallback-7906-thread-1) [    ] o.a.s.c.c.ConnectionManager zkClient has connected
   [junit4]   2> 2824535 INFO  (zkConnectionManagerCallback-7908-thread-1) [    ] o.a.s.c.c.ConnectionManager zkClient has connected
   [junit4]   2> 2824564 INFO  (TEST-NodeAddedTriggerTest.testListenerAcceptance-seed#[C0415163DA852853]) [n:127.0.0.1:58426_solr    ] o.a.s.c.c.ZkStateReader Updated live nodes from ZooKeeper... (0) -> (3)
   [junit4]   2> 2824574 INFO  (TEST-NodeAddedTriggerTest.testListenerAcceptance-seed#[C0415163DA852853]) [n:127.0.0.1:58426_solr    ] o.a.s.c.Overseer Overseer (id=null) closing
   [junit4]   2> 2824577 INFO  (TEST-NodeAddedTriggerTest.testListenerAcceptance-seed#[C0415163DA852853]) [n:127.0.0.1:58426_solr    ] o.a.s.c.TransientSolrCoreCacheDefault Allocating transient cache for 2147483647 transient cores
   [junit4]   2> 2824577 INFO  (TEST-NodeAddedTriggerTest.testListenerAcceptance-seed#[C0415163DA852853]) [n:127.0.0.1:58426_solr    ] o.a.s.c.ZkController Register node as live in ZooKeeper:/live_nodes/127.0.0.1:58426_solr
   [junit4]   2> 2824587 INFO  (zkCallback-7907-thread-1) [    ] o.a.s.c.c.ZkStateReader Updated live nodes from ZooKeeper... (3) -> (4)
   [junit4]   2> 2824587 INFO  (zkCallback-7862-thread-1) [    ] o.a.s.c.c.ZkStateReader Updated live nodes from ZooKeeper... (3) -> (4)
   [junit4]   2> 2824587 INFO  (zkCallback-7877-thread-1) [    ] o.a.s.c.c.ZkStateReader Updated live nodes from ZooKeeper... (3) -> (4)
   [junit4]   2> 2824588 INFO  (zkCallback-7854-thread-1) [    ] o.a.s.c.c.ZkStateReader Updated live nodes from ZooKeeper... (3) -> (4)
   [junit4]   2> 2824588 INFO  (zkCallback-7869-thread-1) [    ] o.a.s.c.c.ZkStateReader Updated live nodes from ZooKeeper... (3) -> (4)
   [junit4]   2> 2824588 INFO  (zkCallback-7847-thread-1) [    ] o.a.s.c.c.ZkStateReader Updated live nodes from ZooKeeper... (3) -> (4)
   [junit4]   2> 2824588 INFO  (zkCallback-7884-thread-1) [    ] o.a.s.c.c.ZkStateReader Updated live nodes from ZooKeeper... (3) -> (4)
   [junit4]   2> 2824589 INFO  (zkCallback-7840-thread-2) [    ] o.a.s.c.c.ZkStateReader Updated live nodes from ZooKeeper... (3) -> (4)
   [junit4]   2> 2827039 INFO  (TEST-NodeAddedTriggerTest.testListenerAcceptance-seed#[C0415163DA852853]) [n:127.0.0.1:58426_solr    ] o.a.s.m.r.SolrJmxReporter JMX monitoring for 'solr_58426.solr.node' (registry 'solr.node') enabled at server: com.sun.jmx.mbeanserver.JmxMBeanServer@13e1f8ce
   [junit4]   2> 2827050 INFO  (TEST-NodeAddedTriggerTest.testListenerAcceptance-seed#[C0415163DA852853]) [n:127.0.0.1:58426_solr    ] o.a.s.m.r.SolrJmxReporter JMX monitoring for 'solr_58426.solr.jvm' (registry 'solr.jvm') enabled at server: com.sun.jmx.mbeanserver.JmxMBeanServer@13e1f8ce
   [junit4]   2> 2827051 INFO  (TEST-NodeAddedTriggerTest.testListenerAcceptance-seed#[C0415163DA852853]) [n:127.0.0.1:58426_solr    ] o.a.s.m.r.SolrJmxReporter JMX monitoring for 'solr_58426.solr.jetty' (registry 'solr.jetty') enabled at server: com.sun.jmx.mbeanserver.JmxMBeanServer@13e1f8ce
   [junit4]   2> 2827052 INFO  (TEST-NodeAddedTriggerTest.testListenerAcceptance-seed#[C0415163DA852853]) [n:127.0.0.1:58426_solr    ] o.a.s.c.CorePropertiesLocator Found 0 core definitions underneath /export/home/jenkins/workspace/Lucene-Solr-master-Solaris/solr/build/solr-core/test/J1/temp/solr.cloud.autoscaling.NodeAddedTriggerTest_C0415163DA852853-001/tempDir-001/node5/.
   [junit4]   2> 2827088 INFO  (zkConnectionManagerCallback-7915-thread-1) [    ] o.a.s.c.c.ConnectionManager zkClient has connected
   [junit4]   2> 2827090 INFO  (TEST-NodeAddedTriggerTest.testListenerAcceptance-seed#[C0415163DA852853]) [n:127.0.0.1:58426_solr    ] o.a.s.c.c.ZkStateReader Updated live nodes from ZooKeeper... (0) -> (4)
   [junit4]   2> 2827113 INFO  (TEST-NodeAddedTriggerTest.testListenerAcceptance-seed#[C0415163DA852853]) [n:127.0.0.1:58426_solr    ] o.a.s.c.s.i.ZkClientClusterStateProvider Cluster at 127.0.0.1:48531/solr ready
   [junit4]   2> 2827424 INFO  (TEST-NodeAddedTriggerTest.testRestoreState-seed#[C0415163DA852853]) [    ] o.e.j.s.Server jetty-9.4.8.v20171121, build timestamp: 2017-11-22T00:27:37+03:00, git hash: 82b8fb23f757335bb3329d540ce37a2a2615f0a8
   [junit4]   2> 2827429 INFO  (TEST-NodeAddedTriggerTest.testRestoreState-seed#[C0415163DA852853]) [    ] o.e.j.s.session DefaultSessionIdManager workerName=node0
   [junit4]   2> 2827429 INFO  (TEST-NodeAddedTriggerTest.testRestoreState-seed#[C0415163DA852853]) [    ] o.e.j.s.session No SessionScavenger set, using defaults
   [junit4]   2> 2827429 INFO  (TEST-NodeAddedTriggerTest.testRestoreState-seed#[C0415163DA852853]) [    ] o.e.j.s.session Scavenging every 660000ms
   [junit4]   2> 2827431 INFO  (TEST-NodeAddedTriggerTest.testRestoreState-seed#[C0415163DA852853]) [    ] o.e.j.s.h.ContextHandler Started o.e.j.s.ServletContextHandler@51f056da{/solr,null,AVAILABLE}
   [junit4]   2> 2827431 INFO  (TEST-NodeAddedTriggerTest.testRestoreState-seed#[C0415163DA852853]) [    ] o.e.j.s.AbstractConnector Started ServerConnector@99c918c{HTTP/1.1,[http/1.1]}{127.0.0.1:37544}
   [junit4]   2> 2827431 INFO  (TEST-NodeAddedTriggerTest.testRestoreState-seed#[C0415163DA852853]) [    ] o.e.j.s.Server Started @2829207ms
   [junit4]   2> 2827431 INFO  (TEST-NodeAddedTriggerTest.testRestoreState-seed#[C0415163DA852853]) [    ] o.a.s.c.s.e.JettySolrRunner Jetty properties: {hostContext=/solr, hostPort=37544}
   [junit4]   2> 2827433 ERROR (TEST-NodeAddedTriggerTest.testRestoreState-seed#[C0415163DA852853]) [    ] o.a.s.u.StartupLoggingUtils Missing Java Option solr.log.dir. Logging may be missing or incomplete.
   [junit4]   2> 2827433 INFO  (TEST-NodeAddedTriggerTest.testRestoreState-seed#[C0415163DA852853]) [    ] o.a.s.s.SolrDispatchFilter Using logger factory org.apache.logging.slf4j.Log4jLoggerFactory
   [junit4]   2> 2827434 INFO  (TEST-NodeAddedTriggerTest.testRestoreState-seed#[C0415163DA852853]) [    ] o.a.s.s.SolrDispatchFilter  ___      _       Welcome to Apache Solr™ version 8.0.0
   [junit4]   2> 2827434 INFO  (TEST-NodeAddedTriggerTest.testRestoreState-seed#[C0415163DA852853]) [    ] o.a.s.s.SolrDispatchFilter / __| ___| |_ _   Starting in cloud mode on port null
   [junit4]   2> 2827434 INFO  (TEST-NodeAddedTriggerTest.testRestoreState-seed#[C0415163DA852853]) [    ] o.a.s.s.SolrDispatchFilter \__ \/ _ \ | '_|  Install dir: null
   [junit4]   2> 2827434 INFO  (TEST-NodeAddedTriggerTest.testRestoreState-seed#[C0415163DA852853]) [    ] o.a.s.s.SolrDispatchFilter |___/\___/_|_|    Start time: 2018-04-12T05:56:22.545Z
   [junit4]   2> 2827447 INFO  (zkConnectionManagerCallback-7917-thread-1) [    ] o.a.s.c.c.ConnectionManager zkClient has connected
   [junit4]   2> 2827450 INFO  (TEST-NodeAddedTriggerTest.testRestoreState-seed#[C0415163DA852853]) [    ] o.a.s.s.SolrDispatchFilter solr.xml found in ZooKeeper. Loading...
   [junit4]   2> 2827461 INFO  (TEST-NodeAddedTriggerTest.testRestoreState-seed#[C0415163DA852853]) [    ] o.a.s.c.ZkContainer Zookeeper client=127.0.0.1:48531/solr
   [junit4]   2> 2827466 INFO  (zkConnectionManagerCallback-7921-thread-1) [    ] o.a.s.c.c.ConnectionManager zkClient has connected
   [junit4]   2> 2827469 INFO  (zkConnectionManagerCallback-7923-thread-1) [    ] o.a.s.c.c.ConnectionManager zkClient has connected
   [junit4]   2> 2827490 INFO  (TEST-NodeAddedTriggerTest.testRestoreState-seed#[C0415163DA852853]) [n:127.0.0.1:37544_solr    ] o.a.s.c.c.ZkStateReader Updated live nodes from ZooKeeper... (0) -> (4)
   [junit4]   2> 2827493 INFO  (TEST-NodeAddedTriggerTest.testRestoreState-seed#[C0415163DA852853]) [n:127.0.0.1:37544_solr    ] o.a.s.c.Overseer Overseer (id=null) closing
   [junit4]   2> 2827496 INFO  (TEST-NodeAddedTriggerTest.testRestoreState-seed#[C0415163DA852853]) [n:127.0.0.1:37544_solr    ] o.a.s.c.TransientSolrCoreCacheDefault Allocating transient cache for 2147483647 transient cores
   [junit4]   2> 2827496 INFO  (TEST-NodeAddedTriggerTest.testRestoreState-seed#[C0415163DA852853]) [n:127.0.0.1:37544_solr    ] o.a.s.c.ZkController Register node as live in ZooKeeper:/live_nodes/127.0.0.1:37544_solr
   [junit4]   2> 2827501 INFO  (zkCallback-7854-thread-1) [    ] o.a.s.c.c.ZkStateReader Updated live nodes from ZooKeeper... (4) -> (5)
   [junit4]   2> 2827508 INFO  (zkCallback-7877-thread-1) [    ] o.a.s.c.c.ZkStateReader Updated live nodes from ZooKeeper... (4) -> (5)
   [junit4]   2> 2827508 INFO  (zkCallback-7847-thread-1) [    ] o.a.s.c.c.ZkStateReader Updated live nodes from ZooKeeper... (4) -> (5)
   [junit4]   2> 2827508 INFO  (zkCallback-7907-thread-1) [    ] o.a.s.c.c.ZkStateReader Updated live nodes from ZooKeeper... (4) -> (5)
   [junit4]   2> 2827509 INFO  (zkCallback-7914-thread-1) [    ] o.a.s.c.c.ZkStateReader Updated live nodes from ZooKeeper... (4) -> (5)
   [junit4]   2> 2827509 INFO  (zkCallback-7884-thread-1) [    ] o.a.s.c.c.ZkStateReader Updated live nodes from ZooKeeper... (4) -> (5)
   [junit4]   2> 2827509 INFO  (zkCallback-7869-thread-1) [    ] o.a.s.c.c.ZkStateReader Updated live nodes from ZooKeeper... (4) -> (5)
   [junit4]   2> 2827509 INFO  (zkCallback-7862-thread-1) [    ] o.a.s.c.c.ZkStateReader Updated live nodes from ZooKeeper... (4) -> (5)
   [junit4]   2> 2827509 INFO  (zkCallback-7922-thread-1) [    ] o.a.s.c.c.ZkStateReader Updated live nodes from ZooKeeper... (4) -> (5)
   [junit4]   2> 2827510 INFO  (zkCallback-7840-thread-1) [    ] o.a.s.c.c.ZkStateReader Updated live nodes from ZooKeeper... (4) -> (5)
   [junit4]   2> 2829571 INFO  (TEST-NodeAddedTriggerTest.testRestoreState-seed#[C0415163DA852853]) [n:127.0.0.1:37544_solr    ] o.a.s.m.r.SolrJmxReporter JMX monitoring for 'solr_37544.solr.node' (registry 'solr.node') enabled at server: com.sun.jmx.mbeanserver.JmxMBeanServer@13e1f8ce
   [junit4]   2> 2829584 INFO  (TEST-NodeAddedTriggerTest.testRestoreState-seed#[C0415163DA852853]) [n:127.0.0.1:37544_solr    ] o.a.s.m.r.SolrJmxReporter JMX monitoring for 'solr_37544.solr.jvm' (registry 'solr.jvm') enabled at server: com.sun.jmx.mbeanserver.JmxMBeanServer@13e1f8ce
   [junit4]   2> 2829584 INFO  (TEST-NodeAddedTriggerTest.testRestoreState-seed#[C0415163DA852853]) [n:127.0.0.1:37544_solr    ] o.a.s.m.r.SolrJmxReporter JMX monitoring for 'solr_37544.solr.jetty' (registry 'solr.jetty') enabled at server: com.sun.jmx.mbeanserver.JmxMBeanServer@13e1f8ce
   [junit4]   2> 2829586 INFO  (TEST-NodeAddedTriggerTest.testRestoreState-seed#[C0415163DA852853]) [n:127.0.0.1:37544_solr    ] o.a.s.c.CorePropertiesLocator Found 0 core definitions underneath /export/home/jenkins/workspace/Lucene-Solr-master-Solaris/solr/build/solr-core/test/J1/temp/solr.cloud.autoscaling.NodeAddedTriggerTest_C0415163DA852853-001/tempDir-001/node6/.
   [junit4]   2> 2829596 INFO  (zkConnectionManagerCallback-7930-thread-1) [    ] o.a.s.c.c.ConnectionManager zkClient has connected
   [junit4]   2> 2829607 INFO  (TEST-NodeAddedTriggerTest.testRestoreState-seed#[C0415163DA852853]) [n:127.0.0.1:37544_solr    ] o.a.s.c.c.ZkStateReader Updated live nodes from ZooKeeper... (0) -> (5)
   [junit4]   2> 2829623 INFO  (TEST-NodeAddedTriggerTest.testRestoreState-seed#[C0415163DA852853]) [n:127.0.0.1:37544_solr    ] o.a.s.c.s.i.ZkClientClusterStateProvider Cluster at 127.0.0.1:48531/solr ready
   [junit4]   2> NOTE: reproduce with: ant test  -Dtestcase=NodeAddedTriggerTest -Dtests.method=testRestoreState -Dtests.seed=C0415163DA852853 -Dtests.slow=true -Dtests.locale=ar-LB -Dtests.timezone=JST -Dtests.asserts=true -Dtests.file.encoding=UTF-8
   [junit4] FAILURE 2.60s J1 | NodeAddedTriggerTest.testRestoreState <<<
   [junit4]    > Throwable #1: java.lang.AssertionError: Did not expect the processor to fire on first run! event={
   [junit4]    >   "id":"8d90b2d2cb8c6T2nblsww315zi81gsxyyiziy3b",
   [junit4]    >   "source":"node_added_trigger",
   [junit4]    >   "eventTime":2490441839458502,
   [junit4]    >   "eventType":"NODEADDED",
   [junit4]    >   "properties":{
   [junit4]    >     "eventTimes":[
   [junit4]    >       2490441839458502,
   [junit4]    >       2490441839462202,
   [junit4]    >       2490441839463669,
   [junit4]    >       2490441839465007],
   [junit4]    >     "nodeNames":[
   [junit4]    >       "127.0.0.1:56960_solr",
   [junit4]    >       "127.0.0.1:58426_solr",
   [junit4]    >       "127.0.0.1:62390_solr",
   [junit4]    >       "127.0.0.1:58377_solr"]}}
   [junit4]    > 	at __randomizedtesting.SeedInfo.seed([C0415163DA852853:EEFF5F022BC5045]:0)
   [junit4]    > 	at org.apache.solr.cloud.autoscaling.NodeAddedTriggerTest.lambda$new$0(NodeAddedTriggerTest.java:49)
   [junit4]    > 	at org.apache.solr.cloud.autoscaling.NodeAddedTrigger.run(NodeAddedTrigger.java:161)
   [junit4]    > 	at org.apache.solr.cloud.autoscaling.NodeAddedTriggerTest.testRestoreState(NodeAddedTriggerTest.java:257)
   [junit4]    > 	at java.lang.Thread.run(Thread.java:748)
   [junit4]   2> 2829896 INFO  (jetty-closer-7831-thread-1) [    ] o.e.j.s.AbstractConnector Stopped ServerConnector@76496796{HTTP/1.1,[http/1.1]}{127.0.0.1:0}
   [junit4]   2> 2829897 INFO  (jetty-closer-7831-thread-2) [    ] o.e.j.s.AbstractConnector Stopped ServerConnector@76d71297{HTTP/1.1,[http/1.1]}{127.0.0.1:0}
   [junit4]   2> 2829899 INFO  (jetty-closer-7831-thread-6) [    ] o.e.j.s.AbstractConnector Stopped ServerConnector@99c918c{HTTP/1.1,[http/1.1]}{127.0.0.1:0}
   [junit4]   2> 2829923 INFO  (jetty-closer-7831-thread-1) [    ] o.a.s.c.CoreContainer Shutting down CoreContainer instance=1855427561
   [junit4]   2> 2829923 INFO  (jetty-closer-7831-thread-3) [    ] o.e.j.s.AbstractConnector Stopped ServerConnector@394c605e{HTTP/1.1,[http/1.1]}{127.0.0.1:0}
   [junit4]   2> 2829924 INFO  (jetty-closer-7831-thread-1) [    ] o.a.s.m.SolrMetricManager Closing metric reporters for registry=solr.node, tag=null
   [junit4]   2> 2829924 INFO  (jetty-closer-7831-thread-1) [    ] o.a.s.m.r.SolrJmxReporter Closing reporter [org.apache.solr.metrics.reporters.SolrJmxReporter@2790aa65: rootName = solr_56960, domain = solr.node, service url = null, agent id = null] for registry solr.node / com.codahale.metrics.MetricRegistry@20ccbbdf
   [junit4]   2> 2829930 INFO  (jetty-closer-7831-thread-1) [    ] o.a.s.m.SolrMetricManager Closing metric reporters for registry=solr.jvm, tag=null
   [junit4]   2> 2829930 INFO  (jetty-closer-7831-thread-1) [    ] o.a.s.m.r.SolrJmxReporter Closing reporter [org.apache.solr.metrics.reporters.SolrJmxReporter@7422be3f: rootName = solr_56960, domain = solr.jvm, service url = null, agent id = null] for registry solr.jvm / com.codahale.metrics.MetricRegistry@35a9dbf1
   [junit4]   2> 2829933 INFO  (jetty-closer-7831-thread-1) [    ] o.a.s.m.SolrMetricManager Closing metric reporters for registry=solr.jetty, tag=null
   [junit4]   2> 2829933 INFO  (jetty-closer-7831-thread-1) [    ] o.a.s.m.r.SolrJmxReporter Closing reporter [org.apache.solr.metrics.reporters.SolrJmxReporter@2cb4230: rootName = solr_56960, domain = solr.jetty, service url = null, agent id = null] for registry solr.jetty / com.codahale.metrics.MetricRegistry@75aa6d42
   [junit4]   2> 2829945 INFO  (jetty-closer-7831-thread-5) [    ] o.e.j.s.AbstractConnector Stopped ServerConnector@61f5eda8{HTTP/1.1,[http/1.1]}{127.0.0.1:0}
   [junit4]   2> 2829946 INFO  (jetty-closer-7831-thread-2) [    ] o.a.s.c.CoreContainer Shutting down CoreContainer instance=19525289
   [junit4]   2> 2829947 INFO  (jetty-closer-7831-thread-1) [    ] o.a.s.c.ZkController Remove node as live in ZooKeeper:/live_nodes/127.0.0.1:56960_solr
   [junit4]   2> 2829954 INFO  (jetty-closer-7831-thread-6) [    ] o.a.s.c.CoreContainer Shutting down CoreContainer instance=872114951
   [junit4]   2> 2829954 INFO  (jetty-closer-7831-thread-6) [    ] o.a.s.m.SolrMetricManager Closing metric reporters for registry=solr.node, tag=null
   [junit4]   2> 2829954 INFO  (jetty-closer-7831-thread-6) [    ] o.a.s.m.r.SolrJmxReporter Closing reporter [org.apache.solr.metrics.reporters.SolrJmxReporter@148ac73c: rootName = solr_37544, domain = solr.node, service url = null, agent id = null] for registry solr.node / com.codahale.metrics.MetricRegistry@3e4fadd7
   [junit4]   2> 2829960 INFO  (jetty-closer-7831-thread-6) [    ] o.a.s.m.SolrMetricManager Closing metric reporters for registry=solr.jvm, tag=null
   [junit4]   2> 2829960 INFO  (jetty-closer-7831-thread-6) [    ] o.a.s.m.r.SolrJmxReporter Closing reporter [org.apache.solr.metrics.reporters.SolrJmxReporter@147238c9: rootName = solr_37544, domain = solr.jvm, service url = null, agent id = null] for registry solr.jvm / com.codahale.metrics.MetricRegistry@35a9dbf1
   [junit4]   2> 2829963 INFO  (jetty-closer-7831-thread-6) [    ] o.a.s.m.SolrMetricManager Closing metric reporters for registry=solr.jetty, tag=null
   [junit4]   2> 2829963 INFO  (jetty-closer-7831-thread-6) [    ] o.a.s.m.r.SolrJmxReporter Closing reporter [org.apache.solr.metrics.reporters.SolrJmxReporter@4760099e: rootName = solr_37544, domain = solr.jetty, service url = null, agent id = null] for registry solr.jetty / com.codahale.metrics.MetricRegistry@75aa6d42
   [junit4]   2> 2829965 INFO  (jetty-closer-7831-thread-2) [    ] o.a.s.m.SolrMetricManager Closing metric reporters for registry=solr.node, tag=null
   [junit4]   2> 2829965 INFO  (jetty-closer-7831-thread-2) [    ] o.a.s.m.r.SolrJmxReporter Closing reporter [org.apache.solr.metrics.reporters.SolrJmxReporter@5e841505: rootName = solr_58377, domain = solr.node, service url = null, agent id = null] for registry solr.node / com.codahale.metrics.MetricRegistry@303ccf4d
   [junit4]   2> 2829966 INFO  (jetty-closer-7831-thread-1) [    ] o.a.s.m.SolrMetricManager Closing metric reporters for registry=solr.cluster, tag=null
   [junit4]   2> 2829967 INFO  (jetty-closer-7831-thread-1) [    ] o.a.s.c.TransientSolrCoreCacheDefault Allocating transient cache for 2147483647 transient cores
   [junit4]   2> 2829967 INFO  (jetty-closer-7831-thread-1) [    ] o.a.s.c.Overseer Overseer (id=72220806521618435-127.0.0.1:56960_solr-n_0000000000) closing
   [junit4]   2> 2829967 INFO  (OverseerStateUpdate-72220806521618435-127.0.0.1:56960_solr-n_0000000000) [    ] o.a.s.c.Overseer Overseer Loop exiting : 127.0.0.1:56960_solr
   [junit4]   2> 2829968 WARN  (OverseerAutoScalingTriggerThread-72220806521618435-127.0.0.1:56960_solr-n_0000000000) [    ] o.a.s.c.a.OverseerTriggerThread OverseerTriggerThread woken up but we are closed, exiting.
   [junit4]   2> 2829978 INFO  (jetty-closer-7831-thread-3) [    ] o.a.s.c.CoreContainer Shutting down CoreContainer instance=950495315
   [junit4]   2> 2830010 INFO  (jetty-closer-7831-thread-5) [    ] o.a.s.c.CoreContainer Shutting down CoreContainer instance=1241054505
   [junit4]   2> 2830015 INFO  (zkCallback-7869-thread-1) [    ] o.a.s.c.c.ZkStateReader Updated live nodes from ZooKeeper... (5) -> (4)
   [junit4]   2> 2830015 INFO  (zkCallback-7877-thread-1) [    ] o.a.s.c.c.ZkStateReader Updated live nodes from ZooKeeper... (5) -> (4)
   [junit4]   2> 2830015 INFO  (zkCallback-7907-thread-1) [    ] o.a.s.c.c.ZkStateReader Updated live nodes from ZooKeeper... (5) -> (4)
   [junit4]   2> 2830015 INFO  (zkCallback-7914-thread-1) [    ] o.a.s.c.c.ZkStateReader Updated live nodes from ZooKeeper... (5) -> (4)
   [junit4]   2> 2830015 INFO  (zkCallback-7884-thread-1) [    ] o.a.s.c.c.ZkStateReader Updated live nodes from ZooKeeper... (5) -> (4)
   [junit4]   2> 2830016 INFO  (zkCallback-7847-thread-1) [    ] o.a.s.c.c.ZkStateReader Updated live nodes from ZooKeeper... (5) -> (4)
   [junit4]   2> 2830016 INFO  (zkCallback-7922-thread-1) [    ] o.a.s.c.c.ZkStateReader Updated live nodes from ZooKeeper... (5) -> (4)
   [junit4]   2> 2830018 INFO  (jetty-closer-7831-thread-2) [    ] o.a.s.m.SolrMetricManager Closing metric reporters for registry=solr.jvm, tag=null
   [junit4]   2> 2830019 INFO  (jetty-closer-7831-thread-2) [    ] o.a.s.m.r.SolrJmxReporter Closing reporter [org.apache.solr.metrics.reporters.SolrJmxReporter@20e292e0: rootName = solr_58377, domain = solr.jvm, service url = null, agent id = null] for registry solr.jvm / com.codahale.metrics.MetricRegistry@35a9dbf1
   [junit4]   2> 2830021 INFO  (jetty-closer-7831-thread-2) [    ] o.a.s.m.SolrMetricManager Closing metric reporters for registry=solr.jetty, tag=null
   [junit4]   2> 2830021 INFO  (jetty-closer-7831-thread-2) [    ] o.a.s.m.r.SolrJmxReporter Closing reporter [org.apache.solr.metrics.reporters.SolrJmxReporter@66df31d2: rootName = solr_58377, domain = solr.jetty, service url = null, agent id = null] for registry solr.jetty / com.codahale.metrics.MetricRegistry@75aa6d42
   [junit4]   2> 2830022 INFO  (zkCallback-7840-thread-1) [    ] o.a.s.c.c.ZkStateReader Updated live nodes from ZooKeeper... (5) -> (4)
   [junit4]   2> 2830023 INFO  (jetty-closer-7831-thread-2) [    ] o.a.s.c.ZkController Remove node as live in ZooKeeper:/live_nodes/127.0.0.1:58377_solr
   [junit4]   2> 2830025 INFO  (zkCallback-7877-thread-1) [    ] o.a.s.c.c.ZkStateReader Updated live nodes from ZooKeeper... (4) -> (3)
   [junit4]   2> 2830026 INFO  (zkCallback-7847-thread-1) [    ] o.a.s.c.c.ZkStateReader Updated live nodes from ZooKeeper... (4) -> (3)
   [junit4]   2> 2830026 INFO  (zkCallback-7862-thread-1) [    ] o.a.s.c.c.ZkStateReader Updated live nodes from ZooKeeper... (5) -> (4)
   [junit4]   2> 2830026 INFO  (zkCallback-7914-thread-1) [    ] o.a.s.c.c.ZkStateReader Updated live nodes from ZooKeeper... (4) -> (3)
   [junit4]   2> 2830027 INFO  (jetty-closer-7831-thread-2) [    ] o.a.s.m.SolrMetricManager Closing metric reporters for registry=solr.cluster, tag=null
   [junit4]   2> 2830027 INFO  (zkCallback-7840-thread-1) [    ] o.a.s.c.c.ZkStateReader Updated live nodes from ZooKeeper... (4) -> (3)
   [junit4]   2> 2830028 INFO  (zkCallback-7884-thread-1) [    ] o.a.s.c.c.ZkStateReader Updated live nodes from ZooKeeper... (4) -> (3)
   [junit4]   2> 2830028 INFO  (zkCallback-7907-thread-1) [    ] o.a.s.c.c.ZkStateReader Updated live nodes from ZooKeeper... (4) -> (3)
   [junit4]   2> 2830029 INFO  (zkCallback-7869-thread-1) [    ] o.a.s.c.c.ZkStateReader Updated live nodes from ZooKeeper... (4) -> (3)
   [junit4]   2> 2830030 INFO  (jetty-closer-7831-thread-5) [    ] o.a.s.m.SolrMetricManager Closing metric reporters for registry=solr.node, tag=null
   [junit4]   2> 2830030 INFO  (jetty-closer-7831-thread-5) [    ] o.a.s.m.r.SolrJmxReporter Closing reporter [org.apache.solr.metrics.reporters.SolrJmxReporter@70271a87: rootName = solr_58426, domain = solr.node, service url = null, agent id = null] for registry solr.node / com.codahale.metrics.MetricRegistry@67aa0323
   [junit4]   2> 2830034 INFO  (jetty-closer-7831-thread-3) [    ] o.a.s.m.SolrMetricManager Closing metric reporters for registry=solr.node, tag=null
   [junit4]   2> 2830035 INFO  (jetty-closer-7831-thread-3) [    ] o.a.s.m.r.SolrJmxReporter Closing reporter [org.apache.solr.metrics.reporters.SolrJmxReporter@16ef6b71: rootName = solr_62390, domain = solr.node, service url = null, agent id = null] for registry solr.node / com.codahale.metrics.MetricRegistry@281d11b9
   [junit4]   2> 2830038 INFO  (zkCallback-7862-thread-2) [    ] o.a.s.c.c.ZkStateReader Updated live nodes from ZooKeeper... (4) -> (3)
   [junit4]   2> 2830039 INFO  (zkCallback-7929-thread-1) [    ] o.a.s.c.c.ZkStateReader Updated live nodes from ZooKeeper... (5) -> (3)
   [junit4]   2> 2830039 INFO  (zkCallback-7922-thread-2) [    ] o.a.s.c.c.ZkStateReader Updated live nodes from ZooKeeper... (4) -> (3)
   [junit4]   2> 2830040 INFO  (jetty-closer-7831-thread-6) [    ] o.a.s.c.ZkController Remove node as live in ZooKeeper:/live_nodes/127.0.0.1:37544_solr
   [junit4]   2> 2830043 INFO  (zkCallback-7884-thread-1) [    ] o.a.s.c.c.ZkStateReader Updated live nodes from ZooKeeper... (3) -> (2)
   [junit4]   2> 2830043 INFO  (zkCallback-7877-thread-2) [    ] o.a.s.c.c.ZkStateReader Updated live nodes from ZooKeeper... (3) -> (2)
   [junit4]   2> 2830043 INFO  (zkCallback-7914-thread-1) [    ] o.a.s.c.c.ZkStateReader Updated live nodes from ZooKeeper... (3) -> (2)
   [junit4]   2> 2830044 INFO  (zkCallback-7907-thread-1) [    ] o.a.s.c.c.ZkStateReader Updated live nodes from ZooKeeper... (3) -> (2)
   [junit4]   2> 2830044 INFO  (zkCallback-7847-thread-1) [    ] o.a.s.c.c.ZkStateReader Updated live nodes from ZooKeeper... (3) -> (2)
   [junit4]   2> 2830044 INFO  (zkCallback-7922-thread-2) [    ] o.a.s.c.c.ZkStateReader Updated live nodes from ZooKeeper... (3) -> (2)
   [junit4]   2> 2830045 INFO  (jetty-closer-7831-thread-6) [    ] o.a.s.m.SolrMetricManager Closing metric reporters for registry=solr.cluster, tag=null
   [junit4]   2> 2830045 INFO  (jetty-closer-7831-thread-2) [    ] o.e.j.s.h.ContextHandler Stopped o.e.j.s.ServletContextHandler@27d83075{/solr,null,UNAVAILABLE}
   [junit4]   2> 2830047 INFO  (jetty-closer-7831-thread-2) [    ] o.e.j.s.session Stopped scavenging
   [junit4]   2> 2830048 INFO  (zkCallback-7929-thread-1) [    ] o.a.s.c.c.ZkStateReader Updated live nodes from ZooKeeper... (3) -> (2)
   [junit4]   2> 2830050 INFO  (zkCallback-7877-thread-2) [    ] o.a.s.c.OverseerElectionContext I am going to be the leader 127.0.0.1:62390_solr
   [junit4]   2> 2830052 INFO  (jetty-closer-7831-thread-6) [    ] o.e.j.s.h.ContextHandler Stopped o.e.j.s.ServletContextHandler@51f056da{/solr,null,UNAVAILABLE}
   [junit4]   2> 2830054 INFO  (jetty-closer-7831-thread-6) [    ] o.e.j.s.session Stopped scavenging
   [junit4]   2> 2830054 INFO  (jetty-closer-7831-thread-3) [    ] o.a.s.m.SolrMetricManager Closing metric reporters for registry=solr.jvm, tag=null
   [junit4]   2> 2830054 INFO  (jetty-closer-7831-thread-3) [    ] o.a.s.m.r.SolrJmxReporter Closing reporter [org.apache.solr.metrics.reporters.SolrJmxReporter@5612288d: rootName = solr_62390, domain = solr.jvm, service url = null, agent id = null] for registry solr.jvm / com.codahale.metrics.MetricRegistry@35a9dbf1
   [junit4]   2> 2830061 INFO  (jetty-closer-7831-thread-3) [    ] o.a.s.m.SolrMetricManager Closing metric reporters for registry=solr.jetty, tag=null
   [junit4]   2> 2830061 INFO  (jetty-closer-7831-thread-3) [    ] o.a.s.m.r.SolrJmxReporter Closing reporter [org.apache.solr.metrics.reporters.SolrJmxReporter@1b834d9c: rootName = solr_62390, domain = solr.jetty, service url = null, agent id = null] for registry solr.jetty / com.codahale.metrics.MetricRegistry@75aa6d42
   [junit4]   2> 2830063 INFO  (jetty-closer-7831-thread-3) [    ] o.a.s.c.ZkController Remove node as live in ZooKeeper:/live_nodes/127.0.0.1:62390_solr
   [junit4]   2> 2830063 INFO  (jetty-closer-7831-thread-5) [    ] o.a.s.m.SolrMetricManager Closing metric reporters for registry=solr.jvm, tag=null
   [junit4]   2> 2830063 INFO  (jetty-closer-7831-thread-5) [    ] o.a.s.m.r.SolrJmxReporter Closing reporter [org.apache.solr.metrics.reporters.SolrJmxReporter@6cb7cb6e: rootName = solr_58426, domain = solr.jvm, service url = null, agent id = null] for registry solr.jvm / com.codahale.metrics.MetricRegistry@35a9dbf1
   [junit4]   2> 2830064 INFO  (jetty-closer-7831-thread-3) [    ] o.a.s.m.SolrMetricManager Closing metric reporters for registry=solr.cluster, tag=null
   [junit4]   2> 2830064 INFO  (zkCallback-7877-thread-2) [    ] o.a.s.c.c.ZkStateReader Updated live nodes from ZooKeeper... (2) -> (1)
   [junit4]   2> 2830064 INFO  (zkCallback-7907-thread-1) [    ] o.a.s.c.c.ZkStateReader Updated live nodes from ZooKeeper... (2) -> (1)
   [junit4]   2> 2830064 INFO  (zkCallback-7914-thread-1) [    ] o.a.s.c.c.ZkStateReader Updated live nodes from ZooKeeper... (2) -> (1)
   [junit4]   2> 2830065 INFO  (zkCallback-7884-thread-1) [    ] o.a.s.c.c.ZkStateReader Updated live nodes from ZooKeeper... (2) -> (1)
   [junit4]   2> 2830068 INFO  (jetty-closer-7831-thread-5) [    ] o.a.s.m.SolrMetricManager Closing metric reporters for registry=solr.jetty, tag=null
   [junit4]   2> 2830068 INFO  (jetty-closer-7831-thread-5) [    ] o.a.s.m.r.SolrJmxReporter Closing reporter [org.apache.solr.metrics.reporters.SolrJmxReporter@2300971b: rootName = solr_58426, domain = solr.jetty, service url = null, agent id = null] for registry solr.jetty / com.codahale.metrics.MetricRegistry@75aa6d42
   [junit4]   2> 2830070 INFO  (jetty-closer-7831-thread-3) [    ] o.e.j.s.h.ContextHandler Stopped o.e.j.s.ServletContextHandler@fdede9c{/solr,null,UNAVAILABLE}
   [junit4]   2> 2830070 INFO  (zkCallback-7907-thread-1) [    ] o.a.s.c.OverseerElectionContext I am going to be the leader 127.0.0.1:58426_solr
   [junit4]   2> 2830071 INFO  (jetty-closer-7831-thread-3) [    ] o.e.j.s.session Stopped scavenging
   [junit4]   2> 2830072 INFO  (jetty-closer-7831-thread-5) [    ] o.a.s.c.ZkController Remove node as live in ZooKeeper:/live_nodes/127.0.0.1:58426_solr
   [junit4]   2> 2830073 INFO  (jetty-closer-7831-thread-5) [    ] o.a.s.m.SolrMetricManager Closing metric reporters for registry=solr.cluster, tag=null
   [junit4]   2> 2830073 INFO  (zkCallback-7914-thread-1) [    ] o.a.s.c.c.ZkStateReader Updated live nodes from ZooKeeper... (1) -> (0)
   [junit4]   2> 2830083 INFO  (zkCallback-7907-thread-2) [    ] o.a.s.c.c.ZkStateReader Updated live nodes from ZooKeeper... (1) -> (0)
   [junit4]   2> 2830085 INFO  (jetty-closer-7831-thread-5) [    ] o.e.j.s.h.ContextHandler Stopped o.e.j.s.ServletContextHandler@1fe54e82{/solr,null,UNAVAILABLE}
   [junit4]   2> 2830085 INFO  (jetty-closer-7831-thread-5) [    ] o.e.j.s.session Stopped scavenging
   [junit4]   2> 2831559 WARN  (zkCallback-7840-thread-1) [    ] o.a.s.c.c.ZkStateReader ZooKeeper watch triggered, but Solr cannot talk to ZK: [KeeperErrorCode = Session expired for /live_nodes]
   [junit4]   2> 2831559 INFO  (jetty-closer-7831-thread-1) [    ] o.e.j.s.h.ContextHandler Stopped o.e.j.s.ServletContextHandler@1c6888d2{/solr,null,UNAVAILABLE}
   [junit4]   2> 2831560 INFO  (jetty-closer-7831-thread-1) [    ] o.e.j.s.session Stopped scavenging
   [junit4]   2> 2831561 ERROR (SUITE-NodeAddedTriggerTest-seed#[C0415163DA852853]-worker) [    ] o.a.z.s.ZooKeeperServer ZKShutdownHandler is not registered, so ZooKeeper server won't take any action on ERROR or SHUTDOWN server state changes
   [junit4]   2> 2831562 INFO  (SUITE-NodeAddedTriggerTest-seed#[C0415163DA852853]-worker) [    ] o.a.s.c.ZkTestServer connecting to 127.0.0.1:48531 48531
   [junit4]   2> 2831639 INFO  (Thread-5681) [    ] o.a.s.c.ZkTestServer connecting to 127.0.0.1:48531 48531
   [junit4]   2> 2831639 WARN  (Thread-5681) [    ] o.a.s.c.ZkTestServer Watch limit violations: 
   [junit4]   2> Maximum concurrent create/delete watches above limit:
   [junit4]   2> 
   [junit4]   2> 	13	/solr/aliases.json
   [junit4]   2> 	13	/solr/clusterprops.json
   [junit4]   2> 	6	/solr/security.json
   [junit4]   2> 
   [junit4]   2> Maximum concurrent data watches above limit:
   [junit4]   2> 
   [junit4]   2> 	13	/solr/clusterstate.json
   [junit4]   2> 	2	/solr/overseer_elect/election/72220806521618445-127.0.0.1:62390_solr-n_0000000002
   [junit4]   2> 	2	/solr/overseer_elect/election/72220806521618435-127.0.0.1:56960_solr-n_0000000000
   [junit4]   2> 
   [junit4]   2> Maximum concurrent children watches above limit:
   [junit4]   2> 
   [junit4]   2> 	13	/solr/live_nodes
   [junit4]   2> 	13	/solr/collections
   [junit4]   2> 
   [junit4]   2> NOTE: leaving temporary files on disk at: /export/home/jenkins/workspace/Lucene-Solr-master-Solaris/solr/build/solr-core/test/J1/temp/solr.cloud.autoscaling.NodeAddedTriggerTest_C0415163DA852853-001
   [junit4]   2> NOTE: test params are: codec=Asserting(Lucene70): {}, docValues:{}, maxPointsInLeafNode=1949, maxMBSortInHeap=6.426581768405033, sim=Asserting(org.apache.lucene.search.similarities.AssertingSimilarity@75ea8ecf), locale=ar-LB, timezone=JST
   [junit4]   2> NOTE: SunOS 5.11 amd64/Oracle Corporation 1.8.0_162 (64-bit)/cpus=3,threads=1,free=122454160,total=518979584
   [junit4]   2> NOTE: All tests run in this JVM: [TestStreamBody, TestSchemaManager, TestExactSharedStatsCache, TestSolr4Spatial2, HLLUtilTest, ComputePlanActionTest, ChaosMonkeySafeLeaderTest, TestClusterProperties, RecoveryAfterSoftCommitTest, TestLegacyField, CoreAdminOperationTest, SolrCloudReportersTest, TestCryptoKeys, TestSolrCLIRunExample, TestFieldCacheWithThreads, SyncSliceTest, TestSolrXml, TestReversedWildcardFilterFactory, RuleEngineTest, ConjunctionSolrSpellCheckerTest, TestSlowCompositeReaderWrapper, TestFastWriter, TestRandomDVFaceting, TestWriterPerf, SolrMetricsIntegrationTest, CdcrReplicationHandlerTest, TestSearchPerf, DistributedSuggestComponentTest, TestStressInPlaceUpdates, TestSimpleTrackingShardHandler, TokenizerChainTest, EchoParamsTest, TestUninvertingReader, TestInPlaceUpdatesDistrib, TestRTGBase, TestCollapseQParserPlugin, TestConfig, TestConfigSetProperties, SolrJmxReporterTest, DistributedFacetPivotSmallTest, PrimitiveFieldTypeTest, DocValuesMultiTest, TestNodeLostTrigger, SimpleMLTQParserTest, TestManagedStopFilterFactory, TestManagedSchema, JsonLoaderTest, QueryResultKeyTest, NodeLostTriggerTest, TestExecutePlanAction, TestRawTransformer, TestManagedSynonymGraphFilterFactory, TestComputePlanAction, TestSolrDeletionPolicy2, TestCloudConsistency, DistributedQueueTest, SpellCheckCollatorTest, SuggestComponentContextFilterQueryTest, TestFieldCacheSortRandom, InfixSuggestersTest, TestDownShardTolerantSearch, TestLargeCluster, MinimalSchemaTest, NotRequiredUniqueKeyTest, TestStressRecovery, TestAnalyzedSuggestions, TestMaxScoreQueryParser, TestNumericRangeQuery64, RequestHandlersTest, TestAnalyzeInfixSuggestions, DisMaxRequestHandlerTest, LeaderVoteWaitTimeoutTest, MetricsHandlerTest, TestMultiWordSynonyms, RegexBoostProcessorTest, UUIDFieldTest, ClassificationUpdateProcessorIntegrationTest, FieldAnalysisRequestHandlerTest, ConnectionReuseTest, TestScoreJoinQPNoScore, SpellCheckComponentTest, TestManagedResourceStorage, SpatialRPTFieldTypeTest, SpellPossibilityIteratorTest, IgnoreCommitOptimizeUpdateProcessorFactoryTest, AddSchemaFieldsUpdateProcessorFactoryTest, IndexBasedSpellCheckerTest, VMParamsZkACLAndCredentialsProvidersTest, DeleteReplicaTest, TestCloudNestedDocsSort, TemplateUpdateProcessorTest, TestSimpleQParserPlugin, ConcurrentDeleteAndCreateCollectionTest, TimeZoneUtilsTest, TestManagedSchemaThreadSafety, TestObjectReleaseTracker, TestRandomFaceting, DocValuesMissingTest, TestLMDirichletSimilarityFactory, TestSolrCloudWithDelegationTokens, SliceStateTest, TestDirectoryFactory, FileBasedSpellCheckerTest, TestIndexingPerformance, TestCloudManagedSchema, SolrCLIZkUtilsTest, TestDFRSimilarityFactory, TestComplexPhraseQParserPlugin, ChaosMonkeyNothingIsSafeTest, TestConfigSetsAPIExclusivity, TestSizeLimitedDistributedMap, QueryParsingTest, TestSort, NumberUtilsTest, DistanceFunctionTest, MetricUtilsTest, LoggingHandlerTest, TestRandomRequestDistribution, RollingRestartTest, TestComponentsName, TestDynamicFieldCollectionResource, SortSpecParsingTest, SearchRateTriggerIntegrationTest, HdfsWriteToMultipleCollectionsTest, SolrCmdDistributorTest, AutoscalingHistoryHandlerTest, TestSolrCoreSnapshots, MultiThreadedOCPTest, IndexSizeTriggerTest, TestAtomicUpdateErrorCases, TestExtendedDismaxParser, WrapperMergePolicyFactoryTest, DistributedFacetSimpleRefinementLongTailTest, DOMUtilTest, TestDelegationWithHadoopAuth, BaseCdcrDistributedZkTest, DebugComponentTest, CoreSorterTest, TestRuleBasedAuthorizationPlugin, ShardRoutingTest, TestUseDocValuesAsStored2, TestSortByMinMaxFunction, TestDefaultStatsCache, TestStressReorder, PrimUtilsTest, TestConfigOverlay, CurrencyFieldTypeTest, SolrXmlInZkTest, HdfsTlogReplayBufferedWhileIndexingTest, CSVRequestHandlerTest, HighlighterConfigTest, JSONWriterTest, DistributedSpellCheckComponentTest, AtomicUpdatesTest, AnalysisErrorHandlingTest, TestBulkSchemaAPI, ReturnFieldsTest, TestCollectionsAPIViaSolrCloudCluster, LeaderFailoverAfterPartitionTest, BigEndianAscendingWordDeserializerTest, ExitableDirectoryReaderTest, TestOverriddenPrefixQueryForCustomFieldType, TestRandomCollapseQParserPlugin, TestStressLucene, TestCrossCoreJoin, TestMinMaxOnMultiValuedField, TestJsonRequest, TestMacroExpander, TestSolrCloudWithSecureImpersonation, TestPayloadScoreQParserPlugin, TestDocSet, TestSolr4Spatial, BooleanFieldTest, TestMiniSolrCloudClusterSSL, HdfsCollectionsAPIDistributedZkTest, TestImplicitCoreProperties, OverseerRolesTest, ShufflingReplicaListTransformerTest, IndexSchemaTest, TestStressVersions, TestReloadAndDeleteDocs, TestTrackingShardHandlerFactory, AddReplicaTest, BlockJoinFacetSimpleTest, ScheduledTriggerIntegrationTest, CollectionStateFormat2Test, TestCSVLoader, HdfsRecoveryZkTest, TestDocumentBuilder, BadComponentTest, TestDistribDocBasedVersion, TestLeaderElectionWithEmptyReplica, TestPerFieldSimilarityWithDefaultOverride, ShowFileRequestHandlerTest, TestSolrQueryResponse, TestLRUStatsCache, AssignBackwardCompatibilityTest, BasicDistributedZk2Test, OpenCloseCoreStressTest, OverseerTest, RecoveryZkTest, FullSolrCloudDistribCmdsTest, ClusterStateUpdateTest, LeaderElectionTest, ZkSolrClientTest, TestZkChroot, TestDistributedSearch, TestDistributedGrouping, TestHashPartitioner, TermVectorComponentDistributedTest, ZkControllerTest, DistributedTermsComponentTest, TestRangeQuery, SimpleFacetsTest, StatsComponentTest, TestGroupingSearch, PeerSyncTest, BadIndexSchemaTest, TestFiltering, TestFunctionQuery, BasicFunctionalityTest, DirectUpdateHandlerTest, TestBadConfig, HighlighterTest, SoftAutoCommitTest, TestQuerySenderListener, UpdateParamsTest, TestSolrIndexConfig, TestQuerySenderNoQuery, ResponseLogComponentTest, NumericFieldsTest, TestElisionMultitermQuery, TestFuzzyAnalyzedSuggestions, TestSolrCoreProperties, TestLuceneMatchVersion, TestCharFilters, TestCodecSupport, TestFastOutputStream, URLClassifyProcessorTest, TestFastLRUCache, PreAnalyzedFieldTest, TestSolrJ, TestLRUCache, ZkNodePropsTest, SystemInfoHandlerTest, CursorPagingTest, TestEmbeddedSolrServerAdminHandler, TestEmbeddedSolrServerConstructors, TestEmbeddedSolrServerSchemaAPI, ActionThrottleTest, AliasIntegrationTest, ChaosMonkeySafeLeaderWithPullReplicasTest, CloudExitableDirectoryReaderTest, CollectionPropsTest, ConcurrentCreateRoutedAliasTest, ConfigSetsAPITest, CreateCollectionCleanupTest, DeleteInactiveReplicaTest, DeleteStatusTest, DistribDocExpirationUpdateProcessorTest, DistributedVersionInfoTest, HealthCheckHandlerTest, HttpPartitionTest, LIROnShardRestartTest, LIRRollingUpdatesTest, MissingSegmentRecoveryTest, MoveReplicaHDFSFailoverTest, OutOfBoxZkACLAndCredentialsProvidersTest, OverriddenZkACLAndCredentialsProvidersTest, OverseerCollectionConfigSetProcessorTest, OverseerStatusTest, RemoteQueryErrorTest, ReplaceNodeNoTargetTest, ReplicationFactorTest, RestartWhileUpdatingTest, SSLMigrationTest, SaslZkACLProviderTest, TestCloudDeleteByQuery, TestCloudInspectUtil, TestCloudPivotFacet, TestDistributedMap, TestExclusionRuleCollectionAccess, TestLeaderElectionZkExpiry, TestLeaderInitiatedRecoveryThread, TestPrepRecovery, TestPullReplicaErrorHandling, TestTlogReplica, CollectionReloadTest, CollectionTooManyReplicasTest, CustomCollectionTest, ShardSplitTest, TestLocalFSCloudBackupRestore, TestReplicaProperties, AutoAddReplicasPlanActionTest, ExecutePlanActionTest, MetricTriggerTest, NodeAddedTriggerTest]
   [junit4] Completed [606/802 (1!)] on J1 in 21.22s, 4 tests, 1 failure <<< FAILURES!

[...truncated 49837 lines...]
[asciidoctor:convert] asciidoctor: ERROR: about-this-guide.adoc: line 1: invalid part, must have at least one section (e.g., chapter, appendix, etc.)
[asciidoctor:convert] asciidoctor: ERROR: solr-glossary.adoc: line 1: invalid part, must have at least one section (e.g., chapter, appendix, etc.)
     [java] Processed 2198 links (1753 relative) to 3011 anchors in 244 files
     [echo] Validated Links & Anchors via: /export/home/jenkins/workspace/Lucene-Solr-master-Solaris/solr/build/solr-ref-guide/bare-bones-html/

-documentation-lint:
    [jtidy] Checking for broken html (such as invalid tags)...
   [delete] Deleting directory /export/home/jenkins/workspace/Lucene-Solr-master-Solaris/lucene/build/jtidy_tmp
     [echo] Checking for broken links...
     [exec] 
     [exec] Crawl/parse...
     [exec] 
     [exec] Verify...
     [echo] Checking for malformed docs...

jar-checksums:

resolve:

ivy-availability-check:
[loadresource] Do not set property disallowed.ivy.jars.list as its length is 0.

-ivy-fail-disallowed-ivy-version:

ivy-fail:

ivy-configure:
[ivy:configure] :: loading settings :: file = /export/home/jenkins/workspace/Lucene-Solr-master-Solaris/lucene/top-level-ivy-settings.xml

resolve:

ivy-availability-check:
[loadresource] Do not set property disallowed.ivy.jars.list as its length is 0.

-ivy-fail-disallowed-ivy-version:

ivy-fail:

ivy-configure:
[ivy:configure] :: loading settings :: file = /export/home/jenkins/workspace/Lucene-Solr-master-Solaris/lucene/top-level-ivy-settings.xml

resolve:

resolve:

ivy-availability-check:
[loadresource] Do not set property disallowed.ivy.jars.list as its length is 0.

-ivy-fail-disallowed-ivy-version:

ivy-fail:

ivy-configure:
[ivy:configure] :: loading settings :: file = /export/home/jenkins/workspace/Lucene-Solr-master-Solaris/lucene/top-level-ivy-settings.xml

resolve:

ivy-availability-check:
[loadresource] Do not set property disallowed.ivy.jars.list as its length is 0.

-ivy-fail-disallowed-ivy-version:

ivy-fail:

ivy-configure:
[ivy:configure] :: loading settings :: file = /export/home/jenkins/workspace/Lucene-Solr-master-Solaris/lucene/top-level-ivy-settings.xml

resolve:

ivy-availability-check:
[loadresource] Do not set property disallowed.ivy.jars.list as its length is 0.

-ivy-fail-disallowed-ivy-version:

ivy-fail:

ivy-configure:
[ivy:configure] :: loading settings :: file = /export/home/jenkins/workspace/Lucene-Solr-master-Solaris/lucene/top-level-ivy-settings.xml

resolve:

ivy-availability-check:
[loadresource] Do not set property disallowed.ivy.jars.list as its length is 0.

-ivy-fail-disallowed-ivy-version:

ivy-fail:

ivy-configure:
[ivy:configure] :: loading settings :: file = /export/home/jenkins/workspace/Lucene-Solr-master-Solaris/lucene/top-level-ivy-settings.xml

resolve:

ivy-availability-check:
[loadresource] Do not set property disallowed.ivy.jars.list as its length is 0.

-ivy-fail-disallowed-ivy-version:

ivy-fail:

ivy-configure:
[ivy:configure] :: loading settings :: file = /export/home/jenkins/workspace/Lucene-Solr-master-Solaris/lucene/top-level-ivy-settings.xml

resolve:

ivy-availability-check:
[loadresource] Do not set property disallowed.ivy.jars.list as its length is 0.

-ivy-fail-disallowed-ivy-version:

ivy-fail:

ivy-configure:
[ivy:configure] :: loading settings :: file = /export/home/jenkins/workspace/Lucene-Solr-master-Solaris/lucene/top-level-ivy-settings.xml

resolve:

ivy-availability-check:
[loadresource] Do not set property disallowed.ivy.jars.list as its length is 0.

-ivy-fail-disallowed-ivy-version:

ivy-fail:

ivy-configure:
[ivy:configure] :: loading settings :: file = /export/home/jenkins/workspace/Lucene-Solr-master-Solaris/lucene/top-level-ivy-settings.xml

resolve:

ivy-availability-check:
[loadresource] Do not set property disallowed.ivy.jars.list as its length is 0.

-ivy-fail-disallowed-ivy-version:

ivy-fail:

ivy-configure:
[ivy:configure] :: loading settings :: file = /export/home/jenkins/workspace/Lucene-Solr-master-Solaris/lucene/top-level-ivy-settings.xml

resolve:

ivy-availability-check:
[loadresource] Do not set property disallowed.ivy.jars.list as its length is 0.

-ivy-fail-disallowed-ivy-version:

ivy-fail:

ivy-configure:
[ivy:configure] :: loading settings :: file = /export/home/jenkins/workspace/Lucene-Solr-master-Solaris/lucene/top-level-ivy-settings.xml

resolve:

ivy-availability-check:
[loadresource] Do not set property disallowed.ivy.jars.list as its length is 0.

-ivy-fail-disallowed-ivy-version:

ivy-fail:

ivy-configure:
[ivy:configure] :: loading settings :: file = /export/home/jenkins/workspace/Lucene-Solr-master-Solaris/lucene/top-level-ivy-settings.xml

resolve:

ivy-availability-check:
[loadresource] Do not set property disallowed.ivy.jars.list as its length is 0.

-ivy-fail-disallowed-ivy-version:

ivy-fail:

ivy-configure:
[ivy:configure] :: loading settings :: file = /export/home/jenkins/workspace/Lucene-Solr-master-Solaris/lucene/top-level-ivy-settings.xml

resolve:

ivy-availability-check:
[loadresource] Do not set property disallowed.ivy.jars.list as its length is 0.

-ivy-fail-disallowed-ivy-version:

ivy-fail:

ivy-configure:
[ivy:configure] :: loading settings :: file = /export/home/jenkins/workspace/Lucene-Solr-master-Solaris/lucene/top-level-ivy-settings.xml

resolve:

ivy-availability-check:
[loadresource] Do not set property disallowed.ivy.jars.list as its length is 0.

-ivy-fail-disallowed-ivy-version:

ivy-fail:

ivy-configure:
[ivy:configure] :: loading settings :: file = /export/home/jenkins/workspace/Lucene-Solr-master-Solaris/lucene/top-level-ivy-settings.xml

resolve:

ivy-availability-check:
[loadresource] Do not set property disallowed.ivy.jars.list as its length is 0.

-ivy-fail-disallowed-ivy-version:

ivy-fail:

ivy-configure:
[ivy:configure] :: loading settings :: file = /export/home/jenkins/workspace/Lucene-Solr-master-Solaris/lucene/top-level-ivy-settings.xml

resolve:

ivy-availability-check:
[loadresource] Do not set property disallowed.ivy.jars.list as its length is 0.

-ivy-fail-disallowed-ivy-version:

ivy-fail:

ivy-configure:
[ivy:configure] :: loading settings :: file = /export/home/jenkins/workspace/Lucene-Solr-master-Solaris/lucene/top-level-ivy-settings.xml

resolve:

ivy-availability-check:
[loadresource] Do not set property disallowed.ivy.jars.list as its length is 0.

-ivy-fail-disallowed-ivy-version:

ivy-fail:

ivy-configure:
[ivy:configure] :: loading settings :: file = /export/home/jenkins/workspace/Lucene-Solr-master-Solaris/lucene/top-level-ivy-settings.xml

resolve:

ivy-availability-check:
[loadresource] Do not set property disallowed.ivy.jars.list as its length is 0.

-ivy-fail-disallowed-ivy-version:

ivy-fail:

ivy-configure:
[ivy:configure] :: loading settings :: file = /export/home/jenkins/workspace/Lucene-Solr-master-Solaris/lucene/top-level-ivy-settings.xml

resolve:

ivy-availability-check:
[loadresource] Do not set property disallowed.ivy.jars.list as its length is 0.

-ivy-fail-disallowed-ivy-version:

ivy-fail:

ivy-configure:
[ivy:configure] :: loading settings :: file = /export/home/jenkins/workspace/Lucene-Solr-master-Solaris/lucene/top-level-ivy-settings.xml

resolve:

ivy-availability-check:
[loadresource] Do not set property disallowed.ivy.jars.list as its length is 0.

-ivy-fail-disallowed-ivy-version:

ivy-fail:

ivy-configure:
[ivy:configure] :: loading settings :: file = /export/home/jenkins/workspace/Lucene-Solr-master-Solaris/lucene/top-level-ivy-settings.xml

resolve:

ivy-availability-check:
[loadresource] Do not set property disallowed.ivy.jars.list as its length is 0.

-ivy-fail-disallowed-ivy-version:

ivy-fail:

ivy-configure:
[ivy:configure] :: loading settings :: file = /export/home/jenkins/workspace/Lucene-Solr-master-Solaris/lucene/top-level-ivy-settings.xml

resolve:

ivy-availability-check:
[loadresource] Do not set property disallowed.ivy.jars.list as its length is 0.

-ivy-fail-disallowed-ivy-version:

ivy-fail:

ivy-configure:
[ivy:configure] :: loading settings :: file = /export/home/jenkins/workspace/Lucene-Solr-master-Solaris/lucene/top-level-ivy-settings.xml

resolve:

ivy-availability-check:
[loadresource] Do not set property disallowed.ivy.jars.list as its length is 0.

-ivy-fail-disallowed-ivy-version:

ivy-fail:

ivy-configure:
[ivy:configure] :: loading settings :: file = /export/home/jenkins/workspace/Lucene-Solr-master-Solaris/lucene/top-level-ivy-settings.xml

resolve:

ivy-availability-check:
[loadresource] Do not set property disallowed.ivy.jars.list as its length is 0.

-ivy-fail-disallowed-ivy-version:

ivy-fail:

ivy-configure:
[ivy:configure] :: loading settings :: file = /export/home/jenkins/workspace/Lucene-Solr-master-Solaris/lucene/top-level-ivy-settings.xml

resolve:

ivy-availability-check:
[loadresource] Do not set property disallowed.ivy.jars.list as its length is 0.

-ivy-fail-disallowed-ivy-version:

ivy-fail:

ivy-configure:
[ivy:configure] :: loading settings :: file = /export/home/jenkins/workspace/Lucene-Solr-master-Solaris/lucene/top-level-ivy-settings.xml

common.resolve:

resolve:

ivy-availability-check:
[loadresource] Do not set property disallowed.ivy.jars.list as its length is 0.

-ivy-fail-disallowed-ivy-version:

ivy-fail:

ivy-configure:
[ivy:configure] :: loading settings :: file = /export/home/jenkins/workspace/Lucene-Solr-master-Solaris/lucene/top-level-ivy-settings.xml

resolve:

ivy-availability-check:
[loadresource] Do not set property disallowed.ivy.jars.list as its length is 0.

-ivy-fail-disallowed-ivy-version:

ivy-fail:

ivy-configure:
[ivy:configure] :: loading settings :: file = /export/home/jenkins/workspace/Lucene-Solr-master-Solaris/lucene/top-level-ivy-settings.xml

resolve:

ivy-availability-check:
[loadresource] Do not set property disallowed.ivy.jars.list as its length is 0.

-ivy-fail-disallowed-ivy-version:

ivy-fail:

ivy-configure:
[ivy:configure] :: loading settings :: file = /export/home/jenkins/workspace/Lucene-Solr-master-Solaris/lucene/top-level-ivy-settings.xml

resolve:

ivy-availability-check:
[loadresource] Do not set property disallowed.ivy.jars.list as its length is 0.

-ivy-fail-disallowed-ivy-version:

ivy-fail:

ivy-configure:
[ivy:configure] :: loading settings :: file = /export/home/jenkins/workspace/Lucene-Solr-master-Solaris/lucene/top-level-ivy-settings.xml

resolve:

ivy-availability-check:
[loadresource] Do not set property disallowed.ivy.jars.list as its length is 0.

-ivy-fail-disallowed-ivy-version:

ivy-fail:

ivy-configure:
[ivy:configure] :: loading settings :: file = /export/home/jenkins/workspace/Lucene-Solr-master-Solaris/lucene/top-level-ivy-settings.xml

resolve:

jar-checksums:
    [mkdir] Created dir: /export/home/jenkins/workspace/Lucene-Solr-master-Solaris/lucene/null1444163195
     [copy] Copying 40 files to /export/home/jenkins/workspace/Lucene-Solr-master-Solaris/lucene/null1444163195
   [delete] Deleting directory /export/home/jenkins/workspace/Lucene-Solr-master-Solaris/lucene/null1444163195

resolve-example:

ivy-availability-check:


[...truncated too long message...]

jenkins/workspace/Lucene-Solr-master-Solaris/lucene/top-level-ivy-settings.xml

install-junit4-taskdef:

ivy-availability-check:
[loadresource] Do not set property disallowed.ivy.jars.list as its length is 0.

-ivy-fail-disallowed-ivy-version:

ivy-fail:

resolve-groovy:
[ivy:cachepath] :: resolving dependencies :: org.codehaus.groovy#groovy-all-caller;working
[ivy:cachepath] 	confs: [default]
[ivy:cachepath] 	found org.codehaus.groovy#groovy-all;2.4.15 in public
[ivy:cachepath] :: resolution report :: resolve 15ms :: artifacts dl 1ms
	---------------------------------------------------------------------
	|                  |            modules            ||   artifacts   |
	|       conf       | number| search|dwnlded|evicted|| number|dwnlded|
	---------------------------------------------------------------------
	|      default     |   1   |   0   |   0   |   0   ||   1   |   0   |
	---------------------------------------------------------------------

-init-totals:

-test:
    [mkdir] Created dir: /export/home/jenkins/workspace/Lucene-Solr-master-Solaris/solr/build/solr-core/test
[junit4:pickseed] Seed property 'tests.seed' already defined: C0415163DA852853
    [mkdir] Created dir: /export/home/jenkins/workspace/Lucene-Solr-master-Solaris/solr/build/solr-core/test/temp
   [junit4] <JUnit4> says jolly good day! Master seed: C0415163DA852853
   [junit4] Executing 5 suites with 2 JVMs.
   [junit4] 
   [junit4] Started J0 PID(25555@serv1-vm3).
   [junit4] Started J1 PID(25554@serv1-vm3).
   [junit4] Suite: org.apache.solr.cloud.autoscaling.NodeAddedTriggerTest
   [junit4] OK      11.5s J1 | NodeAddedTriggerTest.testTrigger
   [junit4] OK      1.15s J1 | NodeAddedTriggerTest.testListenerAcceptance
   [junit4] OK      3.50s J1 | NodeAddedTriggerTest.testRestoreState
   [junit4] OK      0.04s J1 | NodeAddedTriggerTest.testActionLifecycle
   [junit4] Completed [1/5] on J1 in 22.97s, 4 tests
   [junit4] 
   [junit4] Suite: org.apache.solr.cloud.autoscaling.NodeAddedTriggerTest
   [junit4] OK      12.7s J0 | NodeAddedTriggerTest.testTrigger
   [junit4] OK      0.67s J0 | NodeAddedTriggerTest.testListenerAcceptance
   [junit4] OK      3.45s J0 | NodeAddedTriggerTest.testRestoreState
   [junit4] OK      0.04s J0 | NodeAddedTriggerTest.testActionLifecycle
   [junit4] Completed [2/5] on J0 in 25.09s, 4 tests
   [junit4] 
   [junit4] Duplicate suite name used with XML reports: org.apache.solr.cloud.autoscaling.NodeAddedTriggerTest. This may confuse tools that process XML reports. Set 'ignoreDuplicateSuites' to true to skip this message.
   [junit4] Suite: org.apache.solr.cloud.autoscaling.NodeAddedTriggerTest
   [junit4] OK      11.7s J1 | NodeAddedTriggerTest.testTrigger
   [junit4] OK      0.32s J1 | NodeAddedTriggerTest.testListenerAcceptance
   [junit4] OK      3.29s J1 | NodeAddedTriggerTest.testRestoreState
   [junit4] OK      0.04s J1 | NodeAddedTriggerTest.testActionLifecycle
   [junit4] Completed [3/5] on J1 in 17.76s, 4 tests
   [junit4] 
   [junit4] Suite: org.apache.solr.cloud.autoscaling.NodeAddedTriggerTest
   [junit4] OK      14.0s J0 | NodeAddedTriggerTest.testTrigger
   [junit4] OK      0.58s J0 | NodeAddedTriggerTest.testListenerAcceptance
   [junit4] OK      3.33s J0 | NodeAddedTriggerTest.testRestoreState
   [junit4] OK      0.03s J0 | NodeAddedTriggerTest.testActionLifecycle
   [junit4] Completed [4/5] on J0 in 20.90s, 4 tests
   [junit4] 
   [junit4] Suite: org.apache.solr.cloud.autoscaling.NodeAddedTriggerTest
   [junit4] OK      12.9s J1 | NodeAddedTriggerTest.testTrigger
   [junit4] OK      1.45s J1 | NodeAddedTriggerTest.testListenerAcceptance
   [junit4] OK      3.59s J1 | NodeAddedTriggerTest.testRestoreState
   [junit4] OK      0.04s J1 | NodeAddedTriggerTest.testActionLifecycle
   [junit4] Completed [5/5] on J1 in 19.58s, 4 tests
   [junit4] 
   [junit4] JVM J0:     0.71 ..    47.27 =    46.56s
   [junit4] JVM J1:     0.72 ..    62.24 =    61.52s
   [junit4] Execution time total: 1 minute 2 seconds
   [junit4] Tests summary: 5 suites, 20 tests
   [junit4] Could not remove temporary path: /export/home/jenkins/workspace/Lucene-Solr-master-Solaris/solr/build/solr-core/test/J0 (java.nio.file.DirectoryNotEmptyException: Remaining files: [/export/home/jenkins/workspace/Lucene-Solr-master-Solaris/solr/build/solr-core/test/J0/temp])
   [junit4] Could not remove temporary path: /export/home/jenkins/workspace/Lucene-Solr-master-Solaris/solr/build/solr-core/test/J1 (java.nio.file.DirectoryNotEmptyException: Remaining files: [/export/home/jenkins/workspace/Lucene-Solr-master-Solaris/solr/build/solr-core/test/J1/temp])
     [echo] 5 slowest tests:
[junit4:tophints] 133.67s | org.apache.solr.cloud.autoscaling.IndexSizeTriggerTest
[junit4:tophints] 116.64s | org.apache.solr.update.SoftAutoCommitTest
[junit4:tophints] 113.50s | org.apache.solr.cloud.ZkFailoverTest
[junit4:tophints] 106.63s | org.apache.solr.cloud.TestTlogReplica
[junit4:tophints]  99.46s | org.apache.solr.cloud.api.collections.CollectionsAPIDistributedZkTest

-check-totals:

test-nocompile:

BUILD SUCCESSFUL
Total time: 1 minute 7 seconds
[repro] Failures:
[repro]   0/5 failed: org.apache.solr.cloud.autoscaling.NodeAddedTriggerTest
[repro] Exiting with code 0
+ mv lucene/build lucene/build.repro
+ mv solr/build solr/build.repro
+ mv lucene/build.orig lucene/build
+ mv solr/build.orig solr/build
Archiving artifacts
Setting ANT_1_8_2_HOME=/export/home/jenkins/tools/hudson.tasks.Ant_AntInstallation/ANT_1.8.2
java.lang.InterruptedException: no matches found within 10000
	at hudson.FilePath$34.hasMatch(FilePath.java:2639)
	at hudson.FilePath$34.invoke(FilePath.java:2518)
	at hudson.FilePath$34.invoke(FilePath.java:2508)
	at hudson.FilePath$FileCallableWrapper.call(FilePath.java:2879)
Also:   hudson.remoting.Channel$CallSiteStackTrace: Remote call to Solaris VBOX
		at hudson.remoting.Channel.attachCallSiteStackTrace(Channel.java:1741)
		at hudson.remoting.UserRequest$ExceptionResponse.retrieve(UserRequest.java:357)
		at hudson.remoting.Channel.call(Channel.java:955)
		at hudson.FilePath.act(FilePath.java:998)
		at hudson.FilePath.act(FilePath.java:987)
		at hudson.FilePath.validateAntFileMask(FilePath.java:2508)
		at hudson.tasks.ArtifactArchiver.perform(ArtifactArchiver.java:243)
		at hudson.tasks.BuildStepCompatibilityLayer.perform(BuildStepCompatibilityLayer.java:81)
		at hudson.tasks.BuildStepMonitor$1.perform(BuildStepMonitor.java:20)
		at hudson.model.AbstractBuild$AbstractBuildExecution.perform(AbstractBuild.java:744)
		at hudson.model.AbstractBuild$AbstractBuildExecution.performAllBuildSteps(AbstractBuild.java:690)
		at hudson.model.Build$BuildExecution.post2(Build.java:186)
		at hudson.model.AbstractBuild$AbstractBuildExecution.post(AbstractBuild.java:635)
		at hudson.model.Run.execute(Run.java:1752)
		at hudson.model.FreeStyleBuild.run(FreeStyleBuild.java:43)
		at hudson.model.ResourceController.execute(ResourceController.java:97)
		at hudson.model.Executor.run(Executor.java:429)
Caused: hudson.FilePath$TunneledInterruptedException
	at hudson.FilePath$FileCallableWrapper.call(FilePath.java:2881)
	at hudson.remoting.UserRequest.perform(UserRequest.java:212)
	at hudson.remoting.UserRequest.perform(UserRequest.java:54)
	at hudson.remoting.Request$2.run(Request.java:369)
	at hudson.remoting.InterceptingExecutorService$1.call(InterceptingExecutorService.java:72)
	at java.util.concurrent.FutureTask.run(FutureTask.java:266)
	at java.util.concurrent.ThreadPoolExecutor.runWorker(ThreadPoolExecutor.java:1149)
	at java.util.concurrent.ThreadPoolExecutor$Worker.run(ThreadPoolExecutor.java:624)
	at java.lang.Thread.run(Thread.java:748)
Caused: java.lang.InterruptedException: java.lang.InterruptedException: no matches found within 10000
	at hudson.FilePath.act(FilePath.java:1000)
	at hudson.FilePath.act(FilePath.java:987)
	at hudson.FilePath.validateAntFileMask(FilePath.java:2508)
	at hudson.tasks.ArtifactArchiver.perform(ArtifactArchiver.java:243)
	at hudson.tasks.BuildStepCompatibilityLayer.perform(BuildStepCompatibilityLayer.java:81)
	at hudson.tasks.BuildStepMonitor$1.perform(BuildStepMonitor.java:20)
	at hudson.model.AbstractBuild$AbstractBuildExecution.perform(AbstractBuild.java:744)
	at hudson.model.AbstractBuild$AbstractBuildExecution.performAllBuildSteps(AbstractBuild.java:690)
	at hudson.model.Build$BuildExecution.post2(Build.java:186)
	at hudson.model.AbstractBuild$AbstractBuildExecution.post(AbstractBuild.java:635)
	at hudson.model.Run.execute(Run.java:1752)
	at hudson.model.FreeStyleBuild.run(FreeStyleBuild.java:43)
	at hudson.model.ResourceController.execute(ResourceController.java:97)
	at hudson.model.Executor.run(Executor.java:429)
No artifacts found that match the file pattern "**/*.events,heapdumps/**,**/*_pid*.log". Configuration error?
[WARNINGS] Parsing warnings in console log with parser Java Compiler (javac)
Setting ANT_1_8_2_HOME=/export/home/jenkins/tools/hudson.tasks.Ant_AntInstallation/ANT_1.8.2
Setting ANT_1_8_2_HOME=/export/home/jenkins/tools/hudson.tasks.Ant_AntInstallation/ANT_1.8.2
<Git Blamer> Using GitBlamer to create author and commit information for all warnings.
<Git Blamer> GIT_COMMIT=8d20fc575bab2c4d0353bb34c6dc66566290f094, workspace=/export/home/jenkins/workspace/Lucene-Solr-master-Solaris
[WARNINGS] Computing warning deltas based on reference build #1796
Recording test results
Setting ANT_1_8_2_HOME=/export/home/jenkins/tools/hudson.tasks.Ant_AntInstallation/ANT_1.8.2
Build step 'Publish JUnit test result report' changed build result to UNSTABLE
Email was triggered for: Unstable (Test Failures)
Sending email for trigger: Unstable (Test Failures)
Setting ANT_1_8_2_HOME=/export/home/jenkins/tools/hudson.tasks.Ant_AntInstallation/ANT_1.8.2
Setting ANT_1_8_2_HOME=/export/home/jenkins/tools/hudson.tasks.Ant_AntInstallation/ANT_1.8.2
Setting ANT_1_8_2_HOME=/export/home/jenkins/tools/hudson.tasks.Ant_AntInstallation/ANT_1.8.2
Setting ANT_1_8_2_HOME=/export/home/jenkins/tools/hudson.tasks.Ant_AntInstallation/ANT_1.8.2

Mime
View raw message