lucene-dev mailing list archives

Site index · List index
Message view « Date » · « Thread »
Top « Date » · « Thread »
From Apache Jenkins Server <jenk...@builds.apache.org>
Subject [JENKINS] Lucene-Solr-BadApples-Tests-7.x - Build # 9 - Failure
Date Fri, 09 Mar 2018 17:57:22 GMT
Build: https://builds.apache.org/job/Lucene-Solr-BadApples-Tests-7.x/9/

5 tests failed.
FAILED:  org.apache.solr.update.processor.AtomicUpdateProcessorFactoryTest.testMultipleThreads

Error Message:
Exception during query

Stack Trace:
java.lang.RuntimeException: Exception during query
	at __randomizedtesting.SeedInfo.seed([4EBC20BAFFC6E5D3:628E573773029357]:0)
	at org.apache.solr.SolrTestCaseJ4.assertQ(SolrTestCaseJ4.java:904)
	at org.apache.solr.update.processor.AtomicUpdateProcessorFactoryTest.testMultipleThreads(AtomicUpdateProcessorFactoryTest.java:260)
	at sun.reflect.NativeMethodAccessorImpl.invoke0(Native Method)
	at sun.reflect.NativeMethodAccessorImpl.invoke(NativeMethodAccessorImpl.java:62)
	at sun.reflect.DelegatingMethodAccessorImpl.invoke(DelegatingMethodAccessorImpl.java:43)
	at java.lang.reflect.Method.invoke(Method.java:498)
	at com.carrotsearch.randomizedtesting.RandomizedRunner.invoke(RandomizedRunner.java:1737)
	at com.carrotsearch.randomizedtesting.RandomizedRunner$8.evaluate(RandomizedRunner.java:934)
	at com.carrotsearch.randomizedtesting.RandomizedRunner$9.evaluate(RandomizedRunner.java:970)
	at com.carrotsearch.randomizedtesting.RandomizedRunner$10.evaluate(RandomizedRunner.java:984)
	at com.carrotsearch.randomizedtesting.rules.SystemPropertiesRestoreRule$1.evaluate(SystemPropertiesRestoreRule.java:57)
	at org.apache.lucene.util.TestRuleSetupTeardownChained$1.evaluate(TestRuleSetupTeardownChained.java:49)
	at org.apache.lucene.util.AbstractBeforeAfterRule$1.evaluate(AbstractBeforeAfterRule.java:45)
	at org.apache.lucene.util.TestRuleThreadAndTestName$1.evaluate(TestRuleThreadAndTestName.java:48)
	at org.apache.lucene.util.TestRuleIgnoreAfterMaxFailures$1.evaluate(TestRuleIgnoreAfterMaxFailures.java:64)
	at org.apache.lucene.util.TestRuleMarkFailure$1.evaluate(TestRuleMarkFailure.java:47)
	at com.carrotsearch.randomizedtesting.rules.StatementAdapter.evaluate(StatementAdapter.java:36)
	at com.carrotsearch.randomizedtesting.ThreadLeakControl$StatementRunner.run(ThreadLeakControl.java:368)
	at com.carrotsearch.randomizedtesting.ThreadLeakControl.forkTimeoutingTask(ThreadLeakControl.java:817)
	at com.carrotsearch.randomizedtesting.ThreadLeakControl$3.evaluate(ThreadLeakControl.java:468)
	at com.carrotsearch.randomizedtesting.RandomizedRunner.runSingleTest(RandomizedRunner.java:943)
	at com.carrotsearch.randomizedtesting.RandomizedRunner$5.evaluate(RandomizedRunner.java:829)
	at com.carrotsearch.randomizedtesting.RandomizedRunner$6.evaluate(RandomizedRunner.java:879)
	at com.carrotsearch.randomizedtesting.RandomizedRunner$7.evaluate(RandomizedRunner.java:890)
	at com.carrotsearch.randomizedtesting.rules.StatementAdapter.evaluate(StatementAdapter.java:36)
	at com.carrotsearch.randomizedtesting.rules.SystemPropertiesRestoreRule$1.evaluate(SystemPropertiesRestoreRule.java:57)
	at org.apache.lucene.util.AbstractBeforeAfterRule$1.evaluate(AbstractBeforeAfterRule.java:45)
	at com.carrotsearch.randomizedtesting.rules.StatementAdapter.evaluate(StatementAdapter.java:36)
	at org.apache.lucene.util.TestRuleStoreClassName$1.evaluate(TestRuleStoreClassName.java:41)
	at com.carrotsearch.randomizedtesting.rules.NoShadowingOrOverridesOnMethodsRule$1.evaluate(NoShadowingOrOverridesOnMethodsRule.java:40)
	at com.carrotsearch.randomizedtesting.rules.NoShadowingOrOverridesOnMethodsRule$1.evaluate(NoShadowingOrOverridesOnMethodsRule.java:40)
	at com.carrotsearch.randomizedtesting.rules.StatementAdapter.evaluate(StatementAdapter.java:36)
	at com.carrotsearch.randomizedtesting.rules.StatementAdapter.evaluate(StatementAdapter.java:36)
	at com.carrotsearch.randomizedtesting.rules.StatementAdapter.evaluate(StatementAdapter.java:36)
	at org.apache.lucene.util.TestRuleAssertionsRequired$1.evaluate(TestRuleAssertionsRequired.java:53)
	at org.apache.lucene.util.TestRuleMarkFailure$1.evaluate(TestRuleMarkFailure.java:47)
	at org.apache.lucene.util.TestRuleIgnoreAfterMaxFailures$1.evaluate(TestRuleIgnoreAfterMaxFailures.java:64)
	at org.apache.lucene.util.TestRuleIgnoreTestSuites$1.evaluate(TestRuleIgnoreTestSuites.java:54)
	at com.carrotsearch.randomizedtesting.rules.StatementAdapter.evaluate(StatementAdapter.java:36)
	at com.carrotsearch.randomizedtesting.ThreadLeakControl$StatementRunner.run(ThreadLeakControl.java:368)
	at java.lang.Thread.run(Thread.java:748)
Caused by: java.lang.RuntimeException: REQUEST FAILED: xpath=//result[@numFound=1]
	xml response was: <?xml version="1.0" encoding="UTF-8"?>
<response>
<lst name="responseHeader"><int name="status">0</int><int name="QTime">0</int></lst><result name="response" numFound="0" start="0"></result>
</response>

	request was:q=int_i:18&wt=xml
	at org.apache.solr.SolrTestCaseJ4.assertQ(SolrTestCaseJ4.java:897)
	... 40 more


FAILED:  org.apache.solr.handler.admin.AutoscalingHistoryHandlerTest.testHistory

Error Message:
replica never fully recovered

Stack Trace:
java.lang.AssertionError: replica never fully recovered
	at __randomizedtesting.SeedInfo.seed([4EBC20BAFFC6E5D3:23408447458E1AD4]:0)
	at org.junit.Assert.fail(Assert.java:93)
	at org.junit.Assert.assertTrue(Assert.java:43)
	at org.apache.solr.handler.admin.AutoscalingHistoryHandlerTest.waitForRecovery(AutoscalingHistoryHandlerTest.java:405)
	at org.apache.solr.handler.admin.AutoscalingHistoryHandlerTest.testHistory(AutoscalingHistoryHandlerTest.java:341)
	at sun.reflect.NativeMethodAccessorImpl.invoke0(Native Method)
	at sun.reflect.NativeMethodAccessorImpl.invoke(NativeMethodAccessorImpl.java:62)
	at sun.reflect.DelegatingMethodAccessorImpl.invoke(DelegatingMethodAccessorImpl.java:43)
	at java.lang.reflect.Method.invoke(Method.java:498)
	at com.carrotsearch.randomizedtesting.RandomizedRunner.invoke(RandomizedRunner.java:1737)
	at com.carrotsearch.randomizedtesting.RandomizedRunner$8.evaluate(RandomizedRunner.java:934)
	at com.carrotsearch.randomizedtesting.RandomizedRunner$9.evaluate(RandomizedRunner.java:970)
	at com.carrotsearch.randomizedtesting.RandomizedRunner$10.evaluate(RandomizedRunner.java:984)
	at com.carrotsearch.randomizedtesting.rules.SystemPropertiesRestoreRule$1.evaluate(SystemPropertiesRestoreRule.java:57)
	at org.apache.lucene.util.TestRuleSetupTeardownChained$1.evaluate(TestRuleSetupTeardownChained.java:49)
	at org.apache.lucene.util.AbstractBeforeAfterRule$1.evaluate(AbstractBeforeAfterRule.java:45)
	at org.apache.lucene.util.TestRuleThreadAndTestName$1.evaluate(TestRuleThreadAndTestName.java:48)
	at org.apache.lucene.util.TestRuleIgnoreAfterMaxFailures$1.evaluate(TestRuleIgnoreAfterMaxFailures.java:64)
	at org.apache.lucene.util.TestRuleMarkFailure$1.evaluate(TestRuleMarkFailure.java:47)
	at com.carrotsearch.randomizedtesting.rules.StatementAdapter.evaluate(StatementAdapter.java:36)
	at com.carrotsearch.randomizedtesting.ThreadLeakControl$StatementRunner.run(ThreadLeakControl.java:368)
	at com.carrotsearch.randomizedtesting.ThreadLeakControl.forkTimeoutingTask(ThreadLeakControl.java:817)
	at com.carrotsearch.randomizedtesting.ThreadLeakControl$3.evaluate(ThreadLeakControl.java:468)
	at com.carrotsearch.randomizedtesting.RandomizedRunner.runSingleTest(RandomizedRunner.java:943)
	at com.carrotsearch.randomizedtesting.RandomizedRunner$5.evaluate(RandomizedRunner.java:829)
	at com.carrotsearch.randomizedtesting.RandomizedRunner$6.evaluate(RandomizedRunner.java:879)
	at com.carrotsearch.randomizedtesting.RandomizedRunner$7.evaluate(RandomizedRunner.java:890)
	at com.carrotsearch.randomizedtesting.rules.StatementAdapter.evaluate(StatementAdapter.java:36)
	at com.carrotsearch.randomizedtesting.rules.SystemPropertiesRestoreRule$1.evaluate(SystemPropertiesRestoreRule.java:57)
	at org.apache.lucene.util.AbstractBeforeAfterRule$1.evaluate(AbstractBeforeAfterRule.java:45)
	at com.carrotsearch.randomizedtesting.rules.StatementAdapter.evaluate(StatementAdapter.java:36)
	at org.apache.lucene.util.TestRuleStoreClassName$1.evaluate(TestRuleStoreClassName.java:41)
	at com.carrotsearch.randomizedtesting.rules.NoShadowingOrOverridesOnMethodsRule$1.evaluate(NoShadowingOrOverridesOnMethodsRule.java:40)
	at com.carrotsearch.randomizedtesting.rules.NoShadowingOrOverridesOnMethodsRule$1.evaluate(NoShadowingOrOverridesOnMethodsRule.java:40)
	at com.carrotsearch.randomizedtesting.rules.StatementAdapter.evaluate(StatementAdapter.java:36)
	at com.carrotsearch.randomizedtesting.rules.StatementAdapter.evaluate(StatementAdapter.java:36)
	at com.carrotsearch.randomizedtesting.rules.StatementAdapter.evaluate(StatementAdapter.java:36)
	at org.apache.lucene.util.TestRuleAssertionsRequired$1.evaluate(TestRuleAssertionsRequired.java:53)
	at org.apache.lucene.util.TestRuleMarkFailure$1.evaluate(TestRuleMarkFailure.java:47)
	at org.apache.lucene.util.TestRuleIgnoreAfterMaxFailures$1.evaluate(TestRuleIgnoreAfterMaxFailures.java:64)
	at org.apache.lucene.util.TestRuleIgnoreTestSuites$1.evaluate(TestRuleIgnoreTestSuites.java:54)
	at com.carrotsearch.randomizedtesting.rules.StatementAdapter.evaluate(StatementAdapter.java:36)
	at com.carrotsearch.randomizedtesting.ThreadLeakControl$StatementRunner.run(ThreadLeakControl.java:368)
	at java.lang.Thread.run(Thread.java:748)


FAILED:  org.apache.solr.ltr.TestLTRReRankingPipeline.testDifferentTopN

Error Message:
expected:<1.0> but was:<0.0>

Stack Trace:
java.lang.AssertionError: expected:<1.0> but was:<0.0>
	at __randomizedtesting.SeedInfo.seed([37D341CF1E648CBE:C672339F2BDF462C]:0)
	at org.junit.Assert.fail(Assert.java:93)
	at org.junit.Assert.failNotEquals(Assert.java:647)
	at org.junit.Assert.assertEquals(Assert.java:443)
	at org.junit.Assert.assertEquals(Assert.java:512)
	at org.apache.solr.ltr.TestLTRReRankingPipeline.testDifferentTopN(TestLTRReRankingPipeline.java:255)
	at sun.reflect.NativeMethodAccessorImpl.invoke0(Native Method)
	at sun.reflect.NativeMethodAccessorImpl.invoke(NativeMethodAccessorImpl.java:62)
	at sun.reflect.DelegatingMethodAccessorImpl.invoke(DelegatingMethodAccessorImpl.java:43)
	at java.lang.reflect.Method.invoke(Method.java:498)
	at com.carrotsearch.randomizedtesting.RandomizedRunner.invoke(RandomizedRunner.java:1737)
	at com.carrotsearch.randomizedtesting.RandomizedRunner$8.evaluate(RandomizedRunner.java:934)
	at com.carrotsearch.randomizedtesting.RandomizedRunner$9.evaluate(RandomizedRunner.java:970)
	at com.carrotsearch.randomizedtesting.RandomizedRunner$10.evaluate(RandomizedRunner.java:984)
	at org.apache.lucene.util.TestRuleSetupTeardownChained$1.evaluate(TestRuleSetupTeardownChained.java:49)
	at org.apache.lucene.util.AbstractBeforeAfterRule$1.evaluate(AbstractBeforeAfterRule.java:45)
	at org.apache.lucene.util.TestRuleThreadAndTestName$1.evaluate(TestRuleThreadAndTestName.java:48)
	at org.apache.lucene.util.TestRuleIgnoreAfterMaxFailures$1.evaluate(TestRuleIgnoreAfterMaxFailures.java:64)
	at org.apache.lucene.util.TestRuleMarkFailure$1.evaluate(TestRuleMarkFailure.java:47)
	at com.carrotsearch.randomizedtesting.rules.StatementAdapter.evaluate(StatementAdapter.java:36)
	at com.carrotsearch.randomizedtesting.ThreadLeakControl$StatementRunner.run(ThreadLeakControl.java:368)
	at com.carrotsearch.randomizedtesting.ThreadLeakControl.forkTimeoutingTask(ThreadLeakControl.java:817)
	at com.carrotsearch.randomizedtesting.ThreadLeakControl$3.evaluate(ThreadLeakControl.java:468)
	at com.carrotsearch.randomizedtesting.RandomizedRunner.runSingleTest(RandomizedRunner.java:943)
	at com.carrotsearch.randomizedtesting.RandomizedRunner$5.evaluate(RandomizedRunner.java:829)
	at com.carrotsearch.randomizedtesting.RandomizedRunner$6.evaluate(RandomizedRunner.java:879)
	at com.carrotsearch.randomizedtesting.RandomizedRunner$7.evaluate(RandomizedRunner.java:890)
	at org.apache.lucene.util.AbstractBeforeAfterRule$1.evaluate(AbstractBeforeAfterRule.java:45)
	at com.carrotsearch.randomizedtesting.rules.StatementAdapter.evaluate(StatementAdapter.java:36)
	at org.apache.lucene.util.TestRuleStoreClassName$1.evaluate(TestRuleStoreClassName.java:41)
	at com.carrotsearch.randomizedtesting.rules.NoShadowingOrOverridesOnMethodsRule$1.evaluate(NoShadowingOrOverridesOnMethodsRule.java:40)
	at com.carrotsearch.randomizedtesting.rules.NoShadowingOrOverridesOnMethodsRule$1.evaluate(NoShadowingOrOverridesOnMethodsRule.java:40)
	at com.carrotsearch.randomizedtesting.rules.StatementAdapter.evaluate(StatementAdapter.java:36)
	at com.carrotsearch.randomizedtesting.rules.StatementAdapter.evaluate(StatementAdapter.java:36)
	at com.carrotsearch.randomizedtesting.rules.StatementAdapter.evaluate(StatementAdapter.java:36)
	at org.apache.lucene.util.TestRuleAssertionsRequired$1.evaluate(TestRuleAssertionsRequired.java:53)
	at org.apache.lucene.util.TestRuleMarkFailure$1.evaluate(TestRuleMarkFailure.java:47)
	at org.apache.lucene.util.TestRuleIgnoreAfterMaxFailures$1.evaluate(TestRuleIgnoreAfterMaxFailures.java:64)
	at org.apache.lucene.util.TestRuleIgnoreTestSuites$1.evaluate(TestRuleIgnoreTestSuites.java:54)
	at com.carrotsearch.randomizedtesting.rules.StatementAdapter.evaluate(StatementAdapter.java:36)
	at com.carrotsearch.randomizedtesting.ThreadLeakControl$StatementRunner.run(ThreadLeakControl.java:368)
	at java.lang.Thread.run(Thread.java:748)


FAILED:  org.apache.solr.core.TestJmxIntegration.testJmxOnCoreReload

Error Message:
Number of registered MBeans is not the same as info registry size expected:<108> but was:<0>

Stack Trace:
java.lang.AssertionError: Number of registered MBeans is not the same as info registry size expected:<108> but was:<0>
	at __randomizedtesting.SeedInfo.seed([4EBC20BAFFC6E5D3:4C05FBD68C85391E]:0)
	at org.junit.Assert.fail(Assert.java:93)
	at org.junit.Assert.failNotEquals(Assert.java:647)
	at org.junit.Assert.assertEquals(Assert.java:128)
	at org.junit.Assert.assertEquals(Assert.java:472)
	at org.apache.solr.core.TestJmxIntegration.testJmxOnCoreReload(TestJmxIntegration.java:180)
	at sun.reflect.NativeMethodAccessorImpl.invoke0(Native Method)
	at sun.reflect.NativeMethodAccessorImpl.invoke(NativeMethodAccessorImpl.java:62)
	at sun.reflect.DelegatingMethodAccessorImpl.invoke(DelegatingMethodAccessorImpl.java:43)
	at java.lang.reflect.Method.invoke(Method.java:498)
	at com.carrotsearch.randomizedtesting.RandomizedRunner.invoke(RandomizedRunner.java:1737)
	at com.carrotsearch.randomizedtesting.RandomizedRunner$8.evaluate(RandomizedRunner.java:934)
	at com.carrotsearch.randomizedtesting.RandomizedRunner$9.evaluate(RandomizedRunner.java:970)
	at com.carrotsearch.randomizedtesting.RandomizedRunner$10.evaluate(RandomizedRunner.java:984)
	at com.carrotsearch.randomizedtesting.rules.SystemPropertiesRestoreRule$1.evaluate(SystemPropertiesRestoreRule.java:57)
	at org.apache.lucene.util.TestRuleSetupTeardownChained$1.evaluate(TestRuleSetupTeardownChained.java:49)
	at org.apache.lucene.util.AbstractBeforeAfterRule$1.evaluate(AbstractBeforeAfterRule.java:45)
	at org.apache.lucene.util.TestRuleThreadAndTestName$1.evaluate(TestRuleThreadAndTestName.java:48)
	at org.apache.lucene.util.TestRuleIgnoreAfterMaxFailures$1.evaluate(TestRuleIgnoreAfterMaxFailures.java:64)
	at org.apache.lucene.util.TestRuleMarkFailure$1.evaluate(TestRuleMarkFailure.java:47)
	at com.carrotsearch.randomizedtesting.rules.StatementAdapter.evaluate(StatementAdapter.java:36)
	at com.carrotsearch.randomizedtesting.ThreadLeakControl$StatementRunner.run(ThreadLeakControl.java:368)
	at com.carrotsearch.randomizedtesting.ThreadLeakControl.forkTimeoutingTask(ThreadLeakControl.java:817)
	at com.carrotsearch.randomizedtesting.ThreadLeakControl$3.evaluate(ThreadLeakControl.java:468)
	at com.carrotsearch.randomizedtesting.RandomizedRunner.runSingleTest(RandomizedRunner.java:943)
	at com.carrotsearch.randomizedtesting.RandomizedRunner$5.evaluate(RandomizedRunner.java:829)
	at com.carrotsearch.randomizedtesting.RandomizedRunner$6.evaluate(RandomizedRunner.java:879)
	at com.carrotsearch.randomizedtesting.RandomizedRunner$7.evaluate(RandomizedRunner.java:890)
	at com.carrotsearch.randomizedtesting.rules.StatementAdapter.evaluate(StatementAdapter.java:36)
	at com.carrotsearch.randomizedtesting.rules.SystemPropertiesRestoreRule$1.evaluate(SystemPropertiesRestoreRule.java:57)
	at org.apache.lucene.util.AbstractBeforeAfterRule$1.evaluate(AbstractBeforeAfterRule.java:45)
	at com.carrotsearch.randomizedtesting.rules.StatementAdapter.evaluate(StatementAdapter.java:36)
	at org.apache.lucene.util.TestRuleStoreClassName$1.evaluate(TestRuleStoreClassName.java:41)
	at com.carrotsearch.randomizedtesting.rules.NoShadowingOrOverridesOnMethodsRule$1.evaluate(NoShadowingOrOverridesOnMethodsRule.java:40)
	at com.carrotsearch.randomizedtesting.rules.NoShadowingOrOverridesOnMethodsRule$1.evaluate(NoShadowingOrOverridesOnMethodsRule.java:40)
	at com.carrotsearch.randomizedtesting.rules.StatementAdapter.evaluate(StatementAdapter.java:36)
	at com.carrotsearch.randomizedtesting.rules.StatementAdapter.evaluate(StatementAdapter.java:36)
	at com.carrotsearch.randomizedtesting.rules.StatementAdapter.evaluate(StatementAdapter.java:36)
	at org.apache.lucene.util.TestRuleAssertionsRequired$1.evaluate(TestRuleAssertionsRequired.java:53)
	at org.apache.lucene.util.TestRuleMarkFailure$1.evaluate(TestRuleMarkFailure.java:47)
	at org.apache.lucene.util.TestRuleIgnoreAfterMaxFailures$1.evaluate(TestRuleIgnoreAfterMaxFailures.java:64)
	at org.apache.lucene.util.TestRuleIgnoreTestSuites$1.evaluate(TestRuleIgnoreTestSuites.java:54)
	at com.carrotsearch.randomizedtesting.rules.StatementAdapter.evaluate(StatementAdapter.java:36)
	at com.carrotsearch.randomizedtesting.ThreadLeakControl$StatementRunner.run(ThreadLeakControl.java:368)
	at java.lang.Thread.run(Thread.java:748)


FAILED:  org.apache.solr.handler.TestReplicationHandler.doTestIndexFetchOnMasterRestart

Error Message:
IOException occured when talking to server at: http://127.0.0.1:40425/solr/collection1

Stack Trace:
org.apache.solr.client.solrj.SolrServerException: IOException occured when talking to server at: http://127.0.0.1:40425/solr/collection1
	at __randomizedtesting.SeedInfo.seed([4EBC20BAFFC6E5D3:964BE45E541D278F]:0)
	at org.apache.solr.client.solrj.impl.HttpSolrClient.executeMethod(HttpSolrClient.java:657)
	at org.apache.solr.client.solrj.impl.HttpSolrClient.request(HttpSolrClient.java:255)
	at org.apache.solr.client.solrj.impl.HttpSolrClient.request(HttpSolrClient.java:244)
	at org.apache.solr.client.solrj.SolrRequest.process(SolrRequest.java:194)
	at org.apache.solr.client.solrj.SolrClient.add(SolrClient.java:173)
	at org.apache.solr.client.solrj.SolrClient.add(SolrClient.java:138)
	at org.apache.solr.client.solrj.SolrClient.add(SolrClient.java:152)
	at org.apache.solr.handler.TestReplicationHandler.index(TestReplicationHandler.java:180)
	at org.apache.solr.handler.TestReplicationHandler.doTestIndexFetchOnMasterRestart(TestReplicationHandler.java:643)
	at sun.reflect.NativeMethodAccessorImpl.invoke0(Native Method)
	at sun.reflect.NativeMethodAccessorImpl.invoke(NativeMethodAccessorImpl.java:62)
	at sun.reflect.DelegatingMethodAccessorImpl.invoke(DelegatingMethodAccessorImpl.java:43)
	at java.lang.reflect.Method.invoke(Method.java:498)
	at com.carrotsearch.randomizedtesting.RandomizedRunner.invoke(RandomizedRunner.java:1737)
	at com.carrotsearch.randomizedtesting.RandomizedRunner$8.evaluate(RandomizedRunner.java:934)
	at com.carrotsearch.randomizedtesting.RandomizedRunner$9.evaluate(RandomizedRunner.java:970)
	at com.carrotsearch.randomizedtesting.RandomizedRunner$10.evaluate(RandomizedRunner.java:984)
	at com.carrotsearch.randomizedtesting.rules.SystemPropertiesRestoreRule$1.evaluate(SystemPropertiesRestoreRule.java:57)
	at org.apache.lucene.util.TestRuleSetupTeardownChained$1.evaluate(TestRuleSetupTeardownChained.java:49)
	at org.apache.lucene.util.AbstractBeforeAfterRule$1.evaluate(AbstractBeforeAfterRule.java:45)
	at org.apache.lucene.util.TestRuleThreadAndTestName$1.evaluate(TestRuleThreadAndTestName.java:48)
	at org.apache.lucene.util.TestRuleIgnoreAfterMaxFailures$1.evaluate(TestRuleIgnoreAfterMaxFailures.java:64)
	at org.apache.lucene.util.TestRuleMarkFailure$1.evaluate(TestRuleMarkFailure.java:47)
	at com.carrotsearch.randomizedtesting.rules.StatementAdapter.evaluate(StatementAdapter.java:36)
	at com.carrotsearch.randomizedtesting.ThreadLeakControl$StatementRunner.run(ThreadLeakControl.java:368)
	at com.carrotsearch.randomizedtesting.ThreadLeakControl.forkTimeoutingTask(ThreadLeakControl.java:817)
	at com.carrotsearch.randomizedtesting.ThreadLeakControl$3.evaluate(ThreadLeakControl.java:468)
	at com.carrotsearch.randomizedtesting.RandomizedRunner.runSingleTest(RandomizedRunner.java:943)
	at com.carrotsearch.randomizedtesting.RandomizedRunner$5.evaluate(RandomizedRunner.java:829)
	at com.carrotsearch.randomizedtesting.RandomizedRunner$6.evaluate(RandomizedRunner.java:879)
	at com.carrotsearch.randomizedtesting.RandomizedRunner$7.evaluate(RandomizedRunner.java:890)
	at com.carrotsearch.randomizedtesting.rules.StatementAdapter.evaluate(StatementAdapter.java:36)
	at com.carrotsearch.randomizedtesting.rules.SystemPropertiesRestoreRule$1.evaluate(SystemPropertiesRestoreRule.java:57)
	at org.apache.lucene.util.AbstractBeforeAfterRule$1.evaluate(AbstractBeforeAfterRule.java:45)
	at com.carrotsearch.randomizedtesting.rules.StatementAdapter.evaluate(StatementAdapter.java:36)
	at org.apache.lucene.util.TestRuleStoreClassName$1.evaluate(TestRuleStoreClassName.java:41)
	at com.carrotsearch.randomizedtesting.rules.NoShadowingOrOverridesOnMethodsRule$1.evaluate(NoShadowingOrOverridesOnMethodsRule.java:40)
	at com.carrotsearch.randomizedtesting.rules.NoShadowingOrOverridesOnMethodsRule$1.evaluate(NoShadowingOrOverridesOnMethodsRule.java:40)
	at com.carrotsearch.randomizedtesting.rules.StatementAdapter.evaluate(StatementAdapter.java:36)
	at com.carrotsearch.randomizedtesting.rules.StatementAdapter.evaluate(StatementAdapter.java:36)
	at com.carrotsearch.randomizedtesting.rules.StatementAdapter.evaluate(StatementAdapter.java:36)
	at org.apache.lucene.util.TestRuleAssertionsRequired$1.evaluate(TestRuleAssertionsRequired.java:53)
	at org.apache.lucene.util.TestRuleMarkFailure$1.evaluate(TestRuleMarkFailure.java:47)
	at org.apache.lucene.util.TestRuleIgnoreAfterMaxFailures$1.evaluate(TestRuleIgnoreAfterMaxFailures.java:64)
	at org.apache.lucene.util.TestRuleIgnoreTestSuites$1.evaluate(TestRuleIgnoreTestSuites.java:54)
	at com.carrotsearch.randomizedtesting.rules.StatementAdapter.evaluate(StatementAdapter.java:36)
	at com.carrotsearch.randomizedtesting.ThreadLeakControl$StatementRunner.run(ThreadLeakControl.java:368)
	at java.lang.Thread.run(Thread.java:748)
Caused by: org.apache.http.NoHttpResponseException: 127.0.0.1:40425 failed to respond
	at org.apache.http.impl.conn.DefaultHttpResponseParser.parseHead(DefaultHttpResponseParser.java:141)
	at org.apache.http.impl.conn.DefaultHttpResponseParser.parseHead(DefaultHttpResponseParser.java:56)
	at org.apache.http.impl.io.AbstractMessageParser.parse(AbstractMessageParser.java:259)
	at org.apache.http.impl.DefaultBHttpClientConnection.receiveResponseHeader(DefaultBHttpClientConnection.java:163)
	at org.apache.http.impl.conn.CPoolProxy.receiveResponseHeader(CPoolProxy.java:165)
	at org.apache.http.protocol.HttpRequestExecutor.doReceiveResponse(HttpRequestExecutor.java:273)
	at org.apache.http.protocol.HttpRequestExecutor.execute(HttpRequestExecutor.java:125)
	at org.apache.http.impl.execchain.MainClientExec.execute(MainClientExec.java:272)
	at org.apache.http.impl.execchain.ProtocolExec.execute(ProtocolExec.java:185)
	at org.apache.http.impl.execchain.RetryExec.execute(RetryExec.java:89)
	at org.apache.http.impl.execchain.RedirectExec.execute(RedirectExec.java:111)
	at org.apache.http.impl.client.InternalHttpClient.doExecute(InternalHttpClient.java:185)
	at org.apache.http.impl.client.CloseableHttpClient.execute(CloseableHttpClient.java:83)
	at org.apache.http.impl.client.CloseableHttpClient.execute(CloseableHttpClient.java:56)
	at org.apache.solr.client.solrj.impl.HttpSolrClient.executeMethod(HttpSolrClient.java:542)
	... 47 more




Build Log:
[...truncated 13080 lines...]
   [junit4] Suite: org.apache.solr.handler.TestReplicationHandler
   [junit4]   2> Creating dataDir: /x1/jenkins/jenkins-slave/workspace/Lucene-Solr-BadApples-Tests-7.x/solr/build/solr-core/test/J2/temp/solr.handler.TestReplicationHandler_4EBC20BAFFC6E5D3-001/init-core-data-001
   [junit4]   2> 1602509 WARN  (SUITE-TestReplicationHandler-seed#[4EBC20BAFFC6E5D3]-worker) [    ] o.a.s.SolrTestCaseJ4 startTrackingSearchers: numOpens=10 numCloses=10
   [junit4]   2> 1602509 INFO  (SUITE-TestReplicationHandler-seed#[4EBC20BAFFC6E5D3]-worker) [    ] o.a.s.SolrTestCaseJ4 Using PointFields (NUMERIC_POINTS_SYSPROP=true) w/NUMERIC_DOCVALUES_SYSPROP=false
   [junit4]   2> 1602511 INFO  (SUITE-TestReplicationHandler-seed#[4EBC20BAFFC6E5D3]-worker) [    ] o.a.s.SolrTestCaseJ4 Randomized ssl (false) and clientAuth (false) via: @org.apache.solr.SolrTestCaseJ4$SuppressSSL(bugUrl=None)
   [junit4]   2> 1602511 INFO  (SUITE-TestReplicationHandler-seed#[4EBC20BAFFC6E5D3]-worker) [    ] o.a.s.SolrTestCaseJ4 SecureRandom sanity checks: test.solr.allowed.securerandom=null & java.security.egd=file:/dev/./urandom
   [junit4]   2> 1602513 INFO  (TEST-TestReplicationHandler.testRateLimitedReplication-seed#[4EBC20BAFFC6E5D3]) [    ] o.a.s.SolrTestCaseJ4 ###Starting testRateLimitedReplication
   [junit4]   2> 1602513 INFO  (TEST-TestReplicationHandler.testRateLimitedReplication-seed#[4EBC20BAFFC6E5D3]) [    ] o.a.s.SolrTestCaseJ4 Writing core.properties file to /x1/jenkins/jenkins-slave/workspace/Lucene-Solr-BadApples-Tests-7.x/solr/build/solr-core/test/J2/temp/solr.handler.TestReplicationHandler_4EBC20BAFFC6E5D3-001/solr-instance-001/collection1
   [junit4]   2> 1602517 INFO  (TEST-TestReplicationHandler.testRateLimitedReplication-seed#[4EBC20BAFFC6E5D3]) [    ] o.e.j.s.Server jetty-9.4.8.v20171121, build timestamp: 2017-11-21T23:27:37+02:00, git hash: 82b8fb23f757335bb3329d540ce37a2a2615f0a8
   [junit4]   2> 1602518 INFO  (TEST-TestReplicationHandler.testRateLimitedReplication-seed#[4EBC20BAFFC6E5D3]) [    ] o.e.j.s.session DefaultSessionIdManager workerName=node0
   [junit4]   2> 1602518 INFO  (TEST-TestReplicationHandler.testRateLimitedReplication-seed#[4EBC20BAFFC6E5D3]) [    ] o.e.j.s.session No SessionScavenger set, using defaults
   [junit4]   2> 1602518 INFO  (TEST-TestReplicationHandler.testRateLimitedReplication-seed#[4EBC20BAFFC6E5D3]) [    ] o.e.j.s.session Scavenging every 660000ms
   [junit4]   2> 1602519 INFO  (TEST-TestReplicationHandler.testRateLimitedReplication-seed#[4EBC20BAFFC6E5D3]) [    ] o.e.j.s.h.ContextHandler Started o.e.j.s.ServletContextHandler@9ce9b0{/solr,null,AVAILABLE}
   [junit4]   2> 1602521 INFO  (TEST-TestReplicationHandler.testRateLimitedReplication-seed#[4EBC20BAFFC6E5D3]) [    ] o.e.j.s.AbstractConnector Started ServerConnector@517d5f40{HTTP/1.1,[http/1.1]}{127.0.0.1:56840}
   [junit4]   2> 1602521 INFO  (TEST-TestReplicationHandler.testRateLimitedReplication-seed#[4EBC20BAFFC6E5D3]) [    ] o.e.j.s.Server Started @1605540ms
   [junit4]   2> 1602521 INFO  (TEST-TestReplicationHandler.testRateLimitedReplication-seed#[4EBC20BAFFC6E5D3]) [    ] o.a.s.c.s.e.JettySolrRunner Jetty properties: {solr.data.dir=/x1/jenkins/jenkins-slave/workspace/Lucene-Solr-BadApples-Tests-7.x/solr/build/solr-core/test/J2/temp/solr.handler.TestReplicationHandler_4EBC20BAFFC6E5D3-001/solr-instance-001/collection1/data, hostContext=/solr, hostPort=56840}
   [junit4]   2> 1602521 ERROR (TEST-TestReplicationHandler.testRateLimitedReplication-seed#[4EBC20BAFFC6E5D3]) [    ] o.a.s.u.StartupLoggingUtils Missing Java Option solr.log.dir. Logging may be missing or incomplete.
   [junit4]   2> 1602521 INFO  (TEST-TestReplicationHandler.testRateLimitedReplication-seed#[4EBC20BAFFC6E5D3]) [    ] o.a.s.s.SolrDispatchFilter  ___      _       Welcome to Apache Solr™ version 7.3.0
   [junit4]   2> 1602522 INFO  (TEST-TestReplicationHandler.testRateLimitedReplication-seed#[4EBC20BAFFC6E5D3]) [    ] o.a.s.s.SolrDispatchFilter / __| ___| |_ _   Starting in standalone mode on port null
   [junit4]   2> 1602522 INFO  (TEST-TestReplicationHandler.testRateLimitedReplication-seed#[4EBC20BAFFC6E5D3]) [    ] o.a.s.s.SolrDispatchFilter \__ \/ _ \ | '_|  Install dir: null
   [junit4]   2> 1602522 INFO  (TEST-TestReplicationHandler.testRateLimitedReplication-seed#[4EBC20BAFFC6E5D3]) [    ] o.a.s.s.SolrDispatchFilter |___/\___/_|_|    Start time: 2018-03-09T17:12:29.532Z
   [junit4]   2> 1602522 INFO  (TEST-TestReplicationHandler.testRateLimitedReplication-seed#[4EBC20BAFFC6E5D3]) [    ] o.a.s.c.SolrXmlConfig Loading container configuration from /x1/jenkins/jenkins-slave/workspace/Lucene-Solr-BadApples-Tests-7.x/solr/build/solr-core/test/J2/temp/solr.handler.TestReplicationHandler_4EBC20BAFFC6E5D3-001/solr-instance-001/solr.xml
   [junit4]   2> 1602527 INFO  (TEST-TestReplicationHandler.testRateLimitedReplication-seed#[4EBC20BAFFC6E5D3]) [    ] o.a.s.c.SolrXmlConfig Configuration parameter autoReplicaFailoverWorkLoopDelay is ignored
   [junit4]   2> 1602527 INFO  (TEST-TestReplicationHandler.testRateLimitedReplication-seed#[4EBC20BAFFC6E5D3]) [    ] o.a.s.c.SolrXmlConfig Configuration parameter autoReplicaFailoverBadNodeExpiration is ignored
   [junit4]   2> 1602529 INFO  (TEST-TestReplicationHandler.testRateLimitedReplication-seed#[4EBC20BAFFC6E5D3]) [    ] o.a.s.c.SolrXmlConfig MBean server found: com.sun.jmx.mbeanserver.JmxMBeanServer@7dd61eac, but no JMX reporters were configured - adding default JMX reporter.
   [junit4]   2> 1602581 INFO  (TEST-TestReplicationHandler.testRateLimitedReplication-seed#[4EBC20BAFFC6E5D3]) [    ] o.a.s.m.r.SolrJmxReporter JMX monitoring for 'solr.node' (registry 'solr.node') enabled at server: com.sun.jmx.mbeanserver.JmxMBeanServer@7dd61eac
   [junit4]   2> 1602599 INFO  (TEST-TestReplicationHandler.testRateLimitedReplication-seed#[4EBC20BAFFC6E5D3]) [    ] o.a.s.m.r.SolrJmxReporter JMX monitoring for 'solr.jvm' (registry 'solr.jvm') enabled at server: com.sun.jmx.mbeanserver.JmxMBeanServer@7dd61eac
   [junit4]   2> 1602599 INFO  (TEST-TestReplicationHandler.testRateLimitedReplication-seed#[4EBC20BAFFC6E5D3]) [    ] o.a.s.m.r.SolrJmxReporter JMX monitoring for 'solr.jetty' (registry 'solr.jetty') enabled at server: com.sun.jmx.mbeanserver.JmxMBeanServer@7dd61eac
   [junit4]   2> 1602603 INFO  (TEST-TestReplicationHandler.testRateLimitedReplication-seed#[4EBC20BAFFC6E5D3]) [    ] o.a.s.c.CorePropertiesLocator Found 1 core definitions underneath /x1/jenkins/jenkins-slave/workspace/Lucene-Solr-BadApples-Tests-7.x/solr/build/solr-core/test/J2/temp/solr.handler.TestReplicationHandler_4EBC20BAFFC6E5D3-001/solr-instance-001/.
   [junit4]   2> 1602603 INFO  (TEST-TestReplicationHandler.testRateLimitedReplication-seed#[4EBC20BAFFC6E5D3]) [    ] o.a.s.c.CorePropertiesLocator Cores are: [collection1]
   [junit4]   2> 1602603 INFO  (coreLoadExecutor-6010-thread-1) [    ] o.a.s.c.TransientSolrCoreCacheDefault Allocating transient cache for 4 transient cores
   [junit4]   2> 1602617 INFO  (coreLoadExecutor-6010-thread-1) [    x:collection1] o.a.s.c.SolrConfig Using Lucene MatchVersion: 7.3.0
   [junit4]   2> 1602629 INFO  (coreLoadExecutor-6010-thread-1) [    x:collection1] o.a.s.s.IndexSchema [collection1] Schema name=test
   [junit4]   2> 1602634 INFO  (coreLoadExecutor-6010-thread-1) [    x:collection1] o.a.s.s.IndexSchema Loaded schema test/1.2 with uniqueid field id
   [junit4]   2> 1602635 INFO  (coreLoadExecutor-6010-thread-1) [    x:collection1] o.a.s.c.CoreContainer Creating SolrCore 'collection1' using configuration from instancedir /x1/jenkins/jenkins-slave/workspace/Lucene-Solr-BadApples-Tests-7.x/solr/build/solr-core/test/J2/temp/solr.handler.TestReplicationHandler_4EBC20BAFFC6E5D3-001/solr-instance-001/./collection1, trusted=true
   [junit4]   2> 1602635 INFO  (coreLoadExecutor-6010-thread-1) [    x:collection1] o.a.s.m.r.SolrJmxReporter JMX monitoring for 'solr.core.collection1' (registry 'solr.core.collection1') enabled at server: com.sun.jmx.mbeanserver.JmxMBeanServer@7dd61eac
   [junit4]   2> 1602635 INFO  (coreLoadExecutor-6010-thread-1) [    x:collection1] o.a.s.c.SolrCore solr.RecoveryStrategy.Builder
   [junit4]   2> 1602635 INFO  (coreLoadExecutor-6010-thread-1) [    x:collection1] o.a.s.c.SolrCore [[collection1] ] Opening new SolrCore at [/x1/jenkins/jenkins-slave/workspace/Lucene-Solr-BadApples-Tests-7.x/solr/build/solr-core/test/J2/temp/solr.handler.TestReplicationHandler_4EBC20BAFFC6E5D3-001/solr-instance-001/collection1], dataDir=[/x1/jenkins/jenkins-slave/workspace/Lucene-Solr-BadApples-Tests-7.x/solr/build/solr-core/test/J2/temp/solr.handler.TestReplicationHandler_4EBC20BAFFC6E5D3-001/solr-instance-001/./collection1/data/]
   [junit4]   2> 1602640 INFO  (coreLoadExecutor-6010-thread-1) [    x:collection1] o.a.s.u.RandomMergePolicy RandomMergePolicy wrapping class org.apache.lucene.index.TieredMergePolicy: [TieredMergePolicy: maxMergeAtOnce=16, maxMergeAtOnceExplicit=15, maxMergedSegmentMB=22.7734375, floorSegmentMB=0.9365234375, forceMergeDeletesPctAllowed=9.153386186502388, segmentsPerTier=29.0, maxCFSSegmentSizeMB=8.796093022207999E12, noCFSRatio=0.5421126507668307
   [junit4]   2> 1602707 INFO  (coreLoadExecutor-6010-thread-1) [    x:collection1] o.a.s.u.CommitTracker Hard AutoCommit: disabled
   [junit4]   2> 1602707 INFO  (coreLoadExecutor-6010-thread-1) [    x:collection1] o.a.s.u.CommitTracker Soft AutoCommit: disabled
   [junit4]   2> 1602709 INFO  (coreLoadExecutor-6010-thread-1) [    x:collection1] o.a.s.u.RandomMergePolicy RandomMergePolicy wrapping class org.apache.lucene.index.LogDocMergePolicy: [LogDocMergePolicy: minMergeSize=1000, mergeFactor=39, maxMergeSize=9223372036854775807, maxMergeSizeForForcedMerge=9223372036854775807, calibrateSizeByDeletes=true, maxMergeDocs=2147483647, maxCFSSegmentSizeMB=8.796093022207999E12, noCFSRatio=0.7835176340132552]
   [junit4]   2> 1602711 INFO  (coreLoadExecutor-6010-thread-1) [    x:collection1] o.a.s.s.SolrIndexSearcher Opening [Searcher@7efb400a[collection1] main]
   [junit4]   2> 1602712 INFO  (coreLoadExecutor-6010-thread-1) [    x:collection1] o.a.s.r.ManagedResourceStorage File-based storage initialized to use dir: /x1/jenkins/jenkins-slave/workspace/Lucene-Solr-BadApples-Tests-7.x/solr/build/solr-core/test/J2/temp/solr.handler.TestReplicationHandler_4EBC20BAFFC6E5D3-001/solr-instance-001/collection1/conf
   [junit4]   2> 1602713 INFO  (coreLoadExecutor-6010-thread-1) [    x:collection1] o.a.s.h.ReplicationHandler Replication enabled for following config files: schema.xml,xslt/dummy.xsl
   [junit4]   2> 1602713 INFO  (coreLoadExecutor-6010-thread-1) [    x:collection1] o.a.s.h.ReplicationHandler Commits will be reserved for 10000ms.
   [junit4]   2> 1602714 INFO  (searcherExecutor-6011-thread-1-processing-x:collection1) [    x:collection1] o.a.s.c.SolrCore [collection1] Registered new searcher Searcher@7efb400a[collection1] main{ExitableDirectoryReader(UninvertingDirectoryReader())}
   [junit4]   2> 1602719 INFO  (TEST-TestReplicationHandler.testRateLimitedReplication-seed#[4EBC20BAFFC6E5D3]) [    ] o.a.s.SolrTestCaseJ4 Writing core.properties file to /x1/jenkins/jenkins-slave/workspace/Lucene-Solr-BadApples-Tests-7.x/solr/build/solr-core/test/J2/temp/solr.handler.TestReplicationHandler_4EBC20BAFFC6E5D3-001/solr-instance-002/collection1
   [junit4]   2> 1602724 INFO  (TEST-TestReplicationHandler.testRateLimitedReplication-seed#[4EBC20BAFFC6E5D3]) [    ] o.e.j.s.Server jetty-9.4.8.v20171121, build timestamp: 2017-11-21T23:27:37+02:00, git hash: 82b8fb23f757335bb3329d540ce37a2a2615f0a8
   [junit4]   2> 1602725 INFO  (TEST-TestReplicationHandler.testRateLimitedReplication-seed#[4EBC20BAFFC6E5D3]) [    ] o.e.j.s.session DefaultSessionIdManager workerName=node0
   [junit4]   2> 1602725 INFO  (TEST-TestReplicationHandler.testRateLimitedReplication-seed#[4EBC20BAFFC6E5D3]) [    ] o.e.j.s.session No SessionScavenger set, using defaults
   [junit4]   2> 1602726 INFO  (TEST-TestReplicationHandler.testRateLimitedReplication-seed#[4EBC20BAFFC6E5D3]) [    ] o.e.j.s.session Scavenging every 660000ms
   [junit4]   2> 1602726 INFO  (TEST-TestReplicationHandler.testRateLimitedReplication-seed#[4EBC20BAFFC6E5D3]) [    ] o.e.j.s.h.ContextHandler Started o.e.j.s.ServletContextHandler@2da2e8d5{/solr,null,AVAILABLE}
   [junit4]   2> 1602726 INFO  (TEST-TestReplicationHandler.testRateLimitedReplication-seed#[4EBC20BAFFC6E5D3]) [    ] o.e.j.s.AbstractConnector Started ServerConnector@7423084f{HTTP/1.1,[http/1.1]}{127.0.0.1:33511}
   [junit4]   2> 1602727 INFO  (TEST-TestReplicationHandler.testRateLimitedReplication-seed#[4EBC20BAFFC6E5D3]) [    ] o.e.j.s.Server Started @1605745ms
   [junit4]   2> 1602727 INFO  (TEST-TestReplicationHandler.testRateLimitedReplication-seed#[4EBC20BAFFC6E5D3]) [    ] o.a.s.c.s.e.JettySolrRunner Jetty properties: {solr.data.dir=/x1/jenkins/jenkins-slave/workspace/Lucene-Solr-BadApples-Tests-7.x/solr/build/solr-core/test/J2/temp/solr.handler.TestReplicationHandler_4EBC20BAFFC6E5D3-001/solr-instance-002/collection1/data, hostContext=/solr, hostPort=33511}
   [junit4]   2> 1602727 ERROR (TEST-TestReplicationHandler.testRateLimitedReplication-seed#[4EBC20BAFFC6E5D3]) [    ] o.a.s.u.StartupLoggingUtils Missing Java Option solr.log.dir. Logging may be missing or incomplete.
   [junit4]   2> 1602727 INFO  (TEST-TestReplicationHandler.testRateLimitedReplication-seed#[4EBC20BAFFC6E5D3]) [    ] o.a.s.s.SolrDispatchFilter  ___      _       Welcome to Apache Solr™ version 7.3.0
   [junit4]   2> 1602727 INFO  (TEST-TestReplicationHandler.testRateLimitedReplication-seed#[4EBC20BAFFC6E5D3]) [    ] o.a.s.s.SolrDispatchFilter / __| ___| |_ _   Starting in standalone mode on port null
   [junit4]   2> 1602727 INFO  (TEST-TestReplicationHandler.testRateLimitedReplication-seed#[4EBC20BAFFC6E5D3]) [    ] o.a.s.s.SolrDispatchFilter \__ \/ _ \ | '_|  Install dir: null
   [junit4]   2> 1602727 INFO  (TEST-TestReplicationHandler.testRateLimitedReplication-seed#[4EBC20BAFFC6E5D3]) [    ] o.a.s.s.SolrDispatchFilter |___/\___/_|_|    Start time: 2018-03-09T17:12:29.737Z
   [junit4]   2> 1602728 INFO  (TEST-TestReplicationHandler.testRateLimitedReplication-seed#[4EBC20BAFFC6E5D3]) [    ] o.a.s.c.SolrXmlConfig Loading container configuration from /x1/jenkins/jenkins-slave/workspace/Lucene-Solr-BadApples-Tests-7.x/solr/build/solr-core/test/J2/temp/solr.handler.TestReplicationHandler_4EBC20BAFFC6E5D3-001/solr-instance-002/solr.xml
   [junit4]   2> 1602733 INFO  (TEST-TestReplicationHandler.testRateLimitedReplication-seed#[4EBC20BAFFC6E5D3]) [    ] o.a.s.c.SolrXmlConfig Configuration parameter autoReplicaFailoverWorkLoopDelay is ignored
   [junit4]   2> 1602733 INFO  (TEST-TestReplicationHandler.testRateLimitedReplication-seed#[4EBC20BAFFC6E5D3]) [    ] o.a.s.c.SolrXmlConfig Configuration parameter autoReplicaFailoverBadNodeExpiration is ignored
   [junit4]   2> 1602735 INFO  (TEST-TestReplicationHandler.testRateLimitedReplication-seed#[4EBC20BAFFC6E5D3]) [    ] o.a.s.c.SolrXmlConfig MBean server found: com.sun.jmx.mbeanserver.JmxMBeanServer@7dd61eac, but no JMX reporters were configured - adding default JMX reporter.
   [junit4]   2> 1602792 INFO  (TEST-TestReplicationHandler.testRateLimitedReplication-seed#[4EBC20BAFFC6E5D3]) [    ] o.a.s.m.r.SolrJmxReporter JMX monitoring for 'solr.node' (registry 'solr.node') enabled at server: com.sun.jmx.mbeanserver.JmxMBeanServer@7dd61eac
   [junit4]   2> 1602813 INFO  (TEST-TestReplicationHandler.testRateLimitedReplication-seed#[4EBC20BAFFC6E5D3]) [    ] o.a.s.m.r.SolrJmxReporter JMX monitoring for 'solr.jvm' (registry 'solr.jvm') enabled at server: com.sun.jmx.mbeanserver.JmxMBeanServer@7dd61eac
   [junit4]   2> 1602814 INFO  (TEST-TestReplicationHandler.testRateLimitedReplication-seed#[4EBC20BAFFC6E5D3]) [    ] o.a.s.m.r.SolrJmxReporter JMX monitoring for 'solr.jetty' (registry 'solr.jetty') enabled at server: com.sun.jmx.mbeanserver.JmxMBeanServer@7dd61eac
   [junit4]   2> 1602817 INFO  (TEST-TestReplicationHandler.testRateLimitedReplication-seed#[4EBC20BAFFC6E5D3]) [    ] o.a.s.c.CorePropertiesLocator Found 1 core definitions underneath /x1/jenkins/jenkins-slave/workspace/Lucene-Solr-BadApples-Tests-7.x/solr/build/solr-core/test/J2/temp/solr.handler.TestReplicationHandler_4EBC20BAFFC6E5D3-001/solr-instance-002/.
   [junit4]   2> 1602818 INFO  (TEST-TestReplicationHandler.testRateLimitedReplication-seed#[4EBC20BAFFC6E5D3]) [    ] o.a.s.c.CorePropertiesLocator Cores are: [collection1]
   [junit4]   2> 1602818 INFO  (coreLoadExecutor-6020-thread-1) [    ] o.a.s.c.TransientSolrCoreCacheDefault Allocating transient cache for 4 transient cores
   [junit4]   2> 1602832 INFO  (coreLoadExecutor-6020-thread-1) [    x:collection1] o.a.s.c.SolrConfig Using Lucene MatchVersion: 7.3.0
   [junit4]   2> 1602852 INFO  (coreLoadExecutor-6020-thread-1) [    x:collection1] o.a.s.s.IndexSchema [collection1] Schema name=test
   [junit4]   2> 1602855 INFO  (coreLoadExecutor-6020-thread-1) [    x:collection1] o.a.s.s.IndexSchema Loaded schema test/1.2 with uniqueid field id
   [junit4]   2> 1602855 INFO  (coreLoadExecutor-6020-thread-1) [    x:collection1] o.a.s.c.CoreContainer Creating SolrCore 'collection1' using configuration from instancedir /x1/jenkins/jenkins-slave/workspace/Lucene-Solr-BadApples-Tests-7.x/solr/build/solr-core/test/J2/temp/solr.handler.TestReplicationHandler_4EBC20BAFFC6E5D3-001/solr-instance-002/./collection1, trusted=true
   [junit4]   2> 1602855 INFO  (coreLoadExecutor-6020-thread-1) [    x:collection1] o.a.s.m.r.SolrJmxReporter JMX monitoring for 'solr.core.collection1' (registry 'solr.core.collection1') enabled at server: com.sun.jmx.mbeanserver.JmxMBeanServer@7dd61eac
   [junit4]   2> 1602856 INFO  (coreLoadExecutor-6020-thread-1) [    x:collection1] o.a.s.c.SolrCore solr.RecoveryStrategy.Builder
   [junit4]   2> 1602856 INFO  (coreLoadExecutor-6020-thread-1) [    x:collection1] o.a.s.c.SolrCore [[collection1] ] Opening new SolrCore at [/x1/jenkins/jenkins-slave/workspace/Lucene-Solr-BadApples-Tests-7.x/solr/build/solr-core/test/J2/temp/solr.handler.TestReplicationHandler_4EBC20BAFFC6E5D3-001/solr-instance-002/collection1], dataDir=[/x1/jenkins/jenkins-slave/workspace/Lucene-Solr-BadApples-Tests-7.x/solr/build/solr-core/test/J2/temp/solr.handler.TestReplicationHandler_4EBC20BAFFC6E5D3-001/solr-instance-002/./collection1/data/]
   [junit4]   2> 1602859 INFO  (coreLoadExecutor-6020-thread-1) [    x:collection1] o.a.s.u.RandomMergePolicy RandomMergePolicy wrapping class org.apache.lucene.index.TieredMergePolicy: [TieredMergePolicy: maxMergeAtOnce=16, maxMergeAtOnceExplicit=15, maxMergedSegmentMB=22.7734375, floorSegmentMB=0.9365234375, forceMergeDeletesPctAllowed=9.153386186502388, segmentsPerTier=29.0, maxCFSSegmentSizeMB=8.796093022207999E12, noCFSRatio=0.5421126507668307
   [junit4]   2> 1602929 INFO  (coreLoadExecutor-6020-thread-1) [    x:collection1] o.a.s.u.CommitTracker Hard AutoCommit: disabled
   [junit4]   2> 1602930 INFO  (coreLoadExecutor-6020-thread-1) [    x:collection1] o.a.s.u.CommitTracker Soft AutoCommit: disabled
   [junit4]   2> 1602931 INFO  (coreLoadExecutor-6020-thread-1) [    x:collection1] o.a.s.u.RandomMergePolicy RandomMergePolicy wrapping class org.apache.lucene.index.LogDocMergePolicy: [LogDocMergePolicy: minMergeSize=1000, mergeFactor=39, maxMergeSize=9223372036854775807, maxMergeSizeForForcedMerge=9223372036854775807, calibrateSizeByDeletes=true, maxMergeDocs=2147483647, maxCFSSegmentSizeMB=8.796093022207999E12, noCFSRatio=0.7835176340132552]
   [junit4]   2> 1602933 INFO  (coreLoadExecutor-6020-thread-1) [    x:collection1] o.a.s.s.SolrIndexSearcher Opening [Searcher@23c19ba[collection1] main]
   [junit4]   2> 1602933 INFO  (coreLoadExecutor-6020-thread-1) [    x:collection1] o.a.s.r.ManagedResourceStorage File-based storage initialized to use dir: /x1/jenkins/jenkins-slave/workspace/Lucene-Solr-BadApples-Tests-7.x/solr/build/solr-core/test/J2/temp/solr.handler.TestReplicationHandler_4EBC20BAFFC6E5D3-001/solr-instance-002/collection1/conf
   [junit4]   2> 1602935 INFO  (coreLoadExecutor-6020-thread-1) [    x:collection1] o.a.s.h.ReplicationHandler Poll scheduled at an interval of 1000ms
   [junit4]   2> 1602936 INFO  (coreLoadExecutor-6020-thread-1) [    x:collection1] o.a.s.h.ReplicationHandler Commits will be reserved for 10000ms.
   [junit4]   2> 1602937 INFO  (searcherExecutor-6021-thread-1-processing-x:collection1) [    x:collection1] o.a.s.c.SolrCore [collection1] Registered new searcher Searcher@23c19ba[collection1] main{ExitableDirectoryReader(UninvertingDirectoryReader())}
   [junit4]   2> 1602939 INFO  (qtp1224378009-18221) [    x:collection1] o.a.s.c.S.Request [collection1]  webapp=/solr path=/replication params={qt=/replication&wt=javabin&version=2&command=indexversion} status=0 QTime=0
   [junit4]   2> 1602939 INFO  (qtp1224378009-18223) [    x:collection1] o.a.s.u.DirectUpdateHandler2 [collection1] REMOVING ALL DOCUMENTS FROM INDEX
   [junit4]   2> 1602939 INFO  (qtp1224378009-18223) [    x:collection1] o.a.s.u.p.LogUpdateProcessorFactory [collection1]  webapp=/solr path=/update params={wt=javabin&version=2}{deleteByQuery=*:*} 0 0
   [junit4]   2> 1602939 INFO  (indexFetcher-6025-thread-1) [    x:collection1] o.a.s.h.IndexFetcher Master's generation: 1
   [junit4]   2> 1602939 INFO  (indexFetcher-6025-thread-1) [    x:collection1] o.a.s.h.IndexFetcher Master's version: 0
   [junit4]   2> 1602939 INFO  (indexFetcher-6025-thread-1) [    x:collection1] o.a.s.h.IndexFetcher Slave's generation: 1
   [junit4]   2> 1602939 INFO  (indexFetcher-6025-thread-1) [    x:collection1] o.a.s.h.IndexFetcher Slave's version: 0
   [junit4]   2> 1602939 INFO  (indexFetcher-6025-thread-1) [    x:collection1] o.a.s.h.IndexFetcher New index in Master. Deleting mine...
   [junit4]   2> 1602939 INFO  (indexFetcher-6025-thread-1) [    x:collection1] o.a.s.u.DirectUpdateHandler2 start commit{,optimize=false,openSearcher=true,waitSearcher=true,expungeDeletes=false,softCommit=false,prepareCommit=false}
   [junit4]   2> 1602940 INFO  (indexFetcher-6025-thread-1) [    x:collection1] o.a.s.u.SolrIndexWriter Calling setCommitData with IW:org.apache.solr.update.SolrIndexWriter@35e1aa01 commitCommandVersion:0
   [junit4]   2> 1602940 INFO  (qtp38624888-18238) [    x:collection1] o.a.s.u.DirectUpdateHandler2 [collection1] REMOVING ALL DOCUMENTS FROM INDEX
   [junit4]   2> 1602942 INFO  (qtp38624888-18238) [    x:collection1] o.a.s.u.p.LogUpdateProcessorFactory [collection1]  webapp=/solr path=/update params={wt=javabin&version=2}{deleteByQuery=*:*} 0 1
   [junit4]   2> 1602943 INFO  (indexFetcher-6025-thread-1) [    x:collection1] o.a.s.s.SolrIndexSearcher Opening [Searcher@32e47f37[collection1] main]
   [junit4]   2> 1602943 INFO  (indexFetcher-6025-thread-1) [    x:collection1] o.a.s.u.DirectUpdateHandler2 end_commit_flush
   [junit4]   2> 1602943 INFO  (qtp1224378009-18220) [    x:collection1] o.a.s.u.DirectUpdateHandler2 start commit{,optimize=false,openSearcher=true,waitSearcher=true,expungeDeletes=false,softCommit=false,prepareCommit=false}
   [junit4]   2> 1602943 INFO  (qtp1224378009-18220) [    x:collection1] o.a.s.u.SolrIndexWriter Calling setCommitData with IW:org.apache.solr.update.SolrIndexWriter@4727ab9a commitCommandVersion:0
   [junit4]   2> 1602945 INFO  (qtp1224378009-18220) [    x:collection1] o.a.s.s.SolrIndexSearcher Opening [Searcher@78728886[collection1] main]
   [junit4]   2> 1602945 INFO  (searcherExecutor-6021-thread-1-processing-x:collection1) [    x:collection1] o.a.s.c.SolrCore [collection1] Registered new searcher Searcher@32e47f37[collection1] main{ExitableDirectoryReader(UninvertingDirectoryReader())}
   [junit4]   2> 1602946 INFO  (qtp1224378009-18220) [    x:collection1] o.a.s.u.DirectUpdateHandler2 end_commit_flush
   [junit4]   2> 1602947 INFO  (searcherExecutor-6011-thread-1-processing-x:collection1) [    x:collection1] o.a.s.c.SolrCore [collection1] Registered new searcher Searcher@78728886[collection1] main{ExitableDirectoryReader(UninvertingDirectoryReader())}
   [junit4]   2> 1602947 INFO  (qtp1224378009-18220) [    x:collection1] o.a.s.u.p.LogUpdateProcessorFactory [collection1]  webapp=/solr path=/update params={waitSearcher=true&commit=true&softCommit=false&wt=javabin&version=2}{commit=} 0 4
   [junit4]   2> 1602948 INFO  (qtp38624888-18240) [    x:collection1] o.a.s.u.DirectUpdateHandler2 start commit{,optimize=false,openSearcher=true,waitSearcher=true,expungeDeletes=false,softCommit=false,prepareCommit=false}
   [junit4]   2> 1602948 INFO  (qtp38624888-18240) [    x:collection1] o.a.s.u.SolrIndexWriter Calling setCommitData with IW:org.apache.solr.update.SolrIndexWriter@35e1aa01 commitCommandVersion:0
   [junit4]   2> 1602949 INFO  (qtp38624888-18240) [    x:collection1] o.a.s.s.SolrIndexSearcher Opening [Searcher@bc149ea[collection1] main]
   [junit4]   2> 1602950 INFO  (qtp38624888-18240) [    x:collection1] o.a.s.u.DirectUpdateHandler2 end_commit_flush
   [junit4]   2> 1602952 INFO  (searcherExecutor-6021-thread-1-processing-x:collection1) [    x:collection1] o.a.s.c.SolrCore [collection1] Registered new searcher Searcher@bc149ea[collection1] main{ExitableDirectoryReader(UninvertingDirectoryReader())}
   [junit4]   2> 1602952 INFO  (qtp38624888-18240) [    x:collection1] o.a.s.u.p.LogUpdateProcessorFactory [collection1]  webapp=/solr path=/update params={waitSearcher=true&commit=true&softCommit=false&wt=javabin&version=2}{commit=} 0 4
   [junit4]   2> 1602953 INFO  (TEST-TestReplicationHandler.testRateLimitedReplication-seed#[4EBC20BAFFC6E5D3]) [    ] o.e.j.s.AbstractConnector Stopped ServerConnector@517d5f40{HTTP/1.1,[http/1.1]}{127.0.0.1:0}
   [junit4]   2> 1602953 INFO  (TEST-TestReplicationHandler.testRateLimitedReplication-seed#[4EBC20BAFFC6E5D3]) [    ] o.a.s.c.CoreContainer Shutting down CoreContainer instance=162184314
   [junit4]   2> 1602954 INFO  (TEST-TestReplicationHandler.testRateLimitedReplication-seed#[4EBC20BAFFC6E5D3]) [    ] o.a.s.m.SolrMetricManager Closing metric reporters for registry=solr.node, tag=null
   [junit4]   2> 1602954 INFO  (TEST-TestReplicationHandler.testRateLimitedReplication-seed#[4EBC20BAFFC6E5D3]) [    ] o.a.s.m.r.SolrJmxReporter Closing reporter [org.apache.solr.metrics.reporters.SolrJmxReporter@3554e175: rootName = null, domain = solr.node, service url = null, agent id = null] for registry solr.node / com.codahale.metrics.MetricRegistry@39e9134
   [junit4]   2> 1602961 INFO  (TEST-TestReplicationHandler.testRateLimitedReplication-seed#[4EBC20BAFFC6E5D3]) [    ] o.a.s.m.SolrMetricManager Closing metric reporters for registry=solr.jvm, tag=null
   [junit4]   2> 1602961 INFO  (TEST-TestReplicationHandler.testRateLimitedReplication-seed#[4EBC20BAFFC6E5D3]) [    ] o.a.s.m.r.SolrJmxReporter Closing reporter [org.apache.solr.metrics.reporters.SolrJmxReporter@1bde7e9a: rootName = null, domain = solr.jvm, service url = null, agent id = null] for registry solr.jvm / com.codahale.metrics.MetricRegistry@3ce2733c
   [junit4]   2> 1602966 INFO  (TEST-TestReplicationHandler.testRateLimitedReplication-seed#[4EBC20BAFFC6E5D3]) [    ] o.a.s.m.SolrMetricManager Closing metric reporters for registry=solr.jetty, tag=null
   [junit4]   2> 1602966 INFO  (TEST-TestReplicationHandler.testRateLimitedReplication-seed#[4EBC20BAFFC6E5D3]) [    ] o.a.s.m.r.SolrJmxReporter Closing reporter [org.apache.solr.metrics.reporters.SolrJmxReporter@18f79f4c: rootName = null, domain = solr.jetty, service url = null, agent id = null] for registry solr.jetty / com.codahale.metrics.MetricRegistry@38dde078
   [junit4]   2> 1602967 INFO  (coreCloseExecutor-6026-thread-1) [    x:collection1] o.a.s.c.SolrCore [collection1]  CLOSING SolrCore org.apache.solr.core.SolrCore@2ac99945
   [junit4]   2> 1602967 INFO  (coreCloseExecutor-6026-thread-1) [    x:collection1] o.a.s.m.SolrMetricManager Closing metric reporters for registry=solr.core.collection1, tag=717855045
   [junit4]   2> 1602967 INFO  (coreCloseExecutor-6026-thread-1) [    x:collection1] o.a.s.m.r.SolrJmxReporter Closing reporter [org.apache.solr.metrics.reporters.SolrJmxReporter@54091385: rootName = null, domain = solr.core.collection1, service url = null, agent id = null] for registry solr.core.collection1 / com.codahale.metrics.MetricRegistry@3c0504cd
   [junit4]   2> 1602977 INFO  (TEST-TestReplicationHandler.testRateLimitedReplication-seed#[4EBC20BAFFC6E5D3]) [    ] o.e.j.s.h.ContextHandler Stopped o.e.j.s.ServletContextHandler@9ce9b0{/solr,null,UNAVAILABLE}
   [junit4]   2> 1602977 INFO  (TEST-TestReplicationHandler.testRateLimitedReplication-seed#[4EBC20BAFFC6E5D3]) [    ] o.e.j.s.session Stopped scavenging
   [junit4]   2> 1602978 INFO  (TEST-TestReplicationHandler.testRateLimitedReplication-seed#[4EBC20BAFFC6E5D3]) [    ] o.e.j.s.AbstractConnector Stopped ServerConnector@7423084f{HTTP/1.1,[http/1.1]}{127.0.0.1:0}
   [junit4]   2> 1602978 INFO  (TEST-TestReplicationHandler.testRateLimitedReplication-seed#[4EBC20BAFFC6E5D3]) [    ] o.a.s.c.CoreContainer Shutting down CoreContainer instance=77247823
   [junit4]   2> 1602979 INFO  (TEST-TestReplicationHandler.testRateLimitedReplication-seed#[4EBC20BAFFC6E5D3]) [    ] o.a.s.m.SolrMetricManager Closing metric reporters for registry=solr.node, tag=null
   [junit4]   2> 1602979 INFO  (TEST-TestReplicationHandler.testRateLimitedReplication-seed#[4EBC20BAFFC6E5D3]) [    ] o.a.s.m.r.SolrJmxReporter Closing reporter [org.apache.solr.metrics.reporters.SolrJmxReporter@312c27d0: rootName = null, domain = solr.node, service url = null, agent id = null] for registry solr.node / com.codahale.metrics.MetricRegistry@54d484ae
   [junit4]   2> 1602989 INFO  (TEST-TestReplicationHandler.testRateLimitedReplication-seed#[4EBC20BAFFC6E5D3]) [    ] o.a.s.m.SolrMetricManager Closing metric reporters for registry=solr.jvm, tag=null
   [junit4]   2> 1602989 INFO  (TEST-TestReplicationHandler.testRateLimitedReplication-seed#[4EBC20BAFFC6E5D3]) [    ] o.a.s.m.r.SolrJmxReporter Closing reporter [org.apache.solr.metrics.reporters.SolrJmxReporter@4f84bf0d: rootName = null, domain = solr.jvm, service url = null, agent id = null] for registry solr.jvm / com.codahale.metrics.MetricRegistry@3ce2733c
   [junit4]   2> 1602996 INFO  (TEST-TestReplicationHandler.testRateLimitedReplication-seed#[4EBC20BAFFC6E5D3]) [    ] o.a.s.m.SolrMetricManager Closing metric reporters for registry=solr.jetty, tag=null
   [junit4]   2> 1602997 INFO  (TEST-TestReplicationHandler.testRateLimitedReplication-seed#[4EBC20BAFFC6E5D3]) [    ] o.a.s.m.r.SolrJmxReporter Closing reporter [org.apache.solr.metrics.reporters.SolrJmxReporter@175b8788: rootName = null, domain = solr.jetty, service url = null, agent id = null] for registry solr.jetty / com.codahale.metrics.MetricRegistry@38dde078
   [junit4]   2> 1602997 INFO  (coreCloseExecutor-6028-thread-1) [    x:collection1] o.a.s.c.SolrCore [collection1]  CLOSING SolrCore org.apache.solr.core.SolrCore@374a5c8e
   [junit4]   2> 1602997 INFO  (coreCloseExecutor-6028-thread-1) [    x:collection1] o.a.s.m.SolrMetricManager Closing metric reporters for registry=solr.core.collection1, tag=927620238
   [junit4]   2> 1602997 INFO  (coreCloseExecutor-6028-thread-1) [    x:collection1] o.a.s.m.r.SolrJmxReporter Closing reporter [org.apache.solr.metrics.reporters.SolrJmxReporter@4a39fb8b: rootName = null, domain = solr.core.collection1, service url = null, agent id = null] for registry solr.core.collection1 / com.codahale.metrics.MetricRegistry@130a5b4
   [junit4]   2> 1603011 INFO  (TEST-TestReplicationHandler.testRateLimitedReplication-seed#[4EBC20BAFFC6E5D3]) [    ] o.e.j.s.h.ContextHandler Stopped o.e.j.s.ServletContextHandler@2da2e8d5{/solr,null,UNAVAILABLE}
   [junit4]   2> 1603012 INFO  (TEST-TestReplicationHandler.testRateLimitedReplication-seed#[4EBC20BAFFC6E5D3]) [    ] o.e.j.s.session Stopped scavenging
   [junit4]   2> 1603014 INFO  (TEST-TestReplicationHandler.testRateLimitedReplication-seed#[4EBC20BAFFC6E5D3]) [    ] o.e.j.s.Server jetty-9.4.8.v20171121, build timestamp: 2017-11-21T23:27:37+02:00, git hash: 82b8fb23f757335bb3329d540ce37a2a2615f0a8
   [junit4]   2> 1603015 INFO  (TEST-TestReplicationHandler.testRateLimitedReplication-seed#[4EBC20BAFFC6E5D3]) [    ] o.e.j.s.session DefaultSessionIdManager workerName=node0
   [junit4]   2> 1603015 INFO  (TEST-TestReplicationHandler.testRateLimitedReplication-seed#[4EBC20BAFFC6E5D3]) [    ] o.e.j.s.session No SessionScavenger set, using defaults
   [junit4]   2> 1603015 INFO  (TEST-TestReplicationHandler.testRateLimitedReplication-seed#[4EBC20BAFFC6E5D3]) [    ] o.e.j.s.session Scavenging every 600000ms
   [junit4]   2> 1603016 INFO  (TEST-TestReplicationHandler.testRateLimitedReplication-seed#[4EBC20BAFFC6E5D3]) [    ] o.e.j.s.h.ContextHandler Started o.e.j.s.ServletContextHandler@553bfbf2{/solr,null,AVAILABLE}
   [junit4]   2> 1603016 INFO  (TEST-TestReplicationHandler.testRateLimitedReplication-seed#[4EBC20BAFFC6E5D3]) [    ] o.e.j.s.AbstractConnector Started ServerConnector@10572b6c{HTTP/1.1,[http/1.1]}{127.0.0.1:34304}
   [junit4]   2> 1603016 INFO  (TEST-TestReplicationHandler.testRateLimitedReplication-seed#[4EBC20BAFFC6E5D3]) [    ] o.e.j.s.Server Started @1606035ms
   [junit4]   2> 1603017 INFO  (TEST-TestReplicationHandler.testRateLimitedReplication-seed#[4EBC20BAFFC6E5D3]) [    ] o.a.s.c.s.e.JettySolrRunner Jetty properties: {solr.data.dir=/x1/jenkins/jenkins-slave/workspace/Lucene-Solr-BadApples-Tests-7.x/solr/build/solr-core/test/J2/temp/solr.handler.TestReplicationHandler_4EBC20BAFFC6E5D3-001/solr-instance-001/collection1/data, hostContext=/solr, hostPort=34304}
   [junit4]   2> 1603017 ERROR (TEST-TestReplicationHandler.testRateLimitedReplication-seed#[4EBC20BAFFC6E5D3]) [    ] o.a.s.u.StartupLoggingUtils Missing Java Option solr.log.dir. Logging may be missing or incomplete.
   [junit4]   2> 1603017 INFO  (TEST-TestReplicationHandler.testRateLimitedReplication-seed#[4EBC20BAFFC6E5D3]) [    ] o.a.s.s.SolrDispatchFilter  ___      _       Welcome to Apache Solr™ version 7.3.0
   [junit4]   2> 1603017 INFO  (TEST-TestReplicationHandler.testRateLimitedReplication-seed#[4EBC20BAFFC6E5D3]) [    ] o.a.s.s.SolrDispatchFilter / __| ___| |_ _   Starting in standalone mode on port null
   [junit4]   2> 1603017 INFO  (TEST-TestReplicationHandler.testRateLimitedReplication-seed#[4EBC20BAFFC6E5D3]) [    ] o.a.s.s.SolrDispatchFilter \__ \/ _ \ | '_|  Install dir: null
   [junit4]   2> 1603017 INFO  (TEST-TestReplicationHandler.testRateLimitedReplication-seed#[4EBC20BAFFC6E5D3]) [    ] o.a.s.s.SolrDispatchFilter |___/\___/_|_|    Start time: 2018-03-09T17:12:30.027Z
   [junit4]   2> 1603018 INFO  (TEST-TestReplicationHandler.testRateLimitedReplication-seed#[4EBC20BAFFC6E5D3]) [    ] o.a.s.c.SolrXmlConfig Loading container configuration from /x1/jenkins/jenkins-slave/workspace/Lucene-Solr-BadApples-Tests-7.x/solr/build/solr-core/test/J2/temp/solr.handler.TestReplicationHandler_4EBC20BAFFC6E5D3-001/solr-instance-001/solr.xml
   [junit4]   2> 1603023 INFO  (TEST-TestReplicationHandler.testRateLimitedReplication-seed#[4EBC20BAFFC6E5D3]) [    ] o.a.s.c.SolrXmlConfig Configuration parameter autoReplicaFailoverWorkLoopDelay is ignored
   [junit4]   2> 1603023 INFO  (TEST-TestReplicationHandler.testRateLimitedReplication-seed#[4EBC20BAFFC6E5D3]) [    ] o.a.s.c.SolrXmlConfig Configuration parameter autoReplicaFailoverBadNodeExpiration is ignored
   [junit4]   2> 1603024 INFO  (TEST-TestReplicationHandler.testRateLimitedReplication-seed#[4EBC20BAFFC6E5D3]) [    ] o.a.s.c.SolrXmlConfig MBean server found: com.sun.jmx.mbeanserver.JmxMBeanServer@7dd61eac, but no JMX reporters were configured - adding default JMX reporter.
   [junit4]   2> 1603076 INFO  (TEST-TestReplicationHandler.testRateLimitedReplication-seed#[4EBC20BAFFC6E5D3]) [    ] o.a.s.m.r.SolrJmxReporter JMX monitoring for 'solr.node' (registry 'solr.node') enabled at server: com.sun.jmx.mbeanserver.JmxMBeanServer@7dd61eac
   [junit4]   2> 1603095 INFO  (TEST-TestReplicationHandler.testRateLimitedReplication-seed#[4EBC20BAFFC6E5D3]) [    ] o.a.s.m.r.SolrJmxReporter JMX monitoring for 'solr.jvm' (registry 'solr.jvm') enabled at server: com.sun.jmx.mbeanserver.JmxMBeanServer@7dd61eac
   [junit4]   2> 1603095 INFO  (TEST-TestReplicationHandler.testRateLimitedReplication-seed#[4EBC20BAFFC6E5D3]) [    ] o.a.s.m.r.SolrJmxReporter JMX monitoring for 'solr.jetty' (registry 'solr.jetty') enabled at server: com.sun.jmx.mbeanserver.JmxMBeanServer@7dd61eac
   [junit4]   2> 1603099 INFO  (TEST-TestReplicationHandler.testRateLimitedReplication-seed#[4EBC20BAFFC6E5D3]) [    ] o.a.s.c.CorePropertiesLocator Found 1 core definitions underneath /x1/jenkins/jenkins-slave/workspace/Lucene-Solr-BadApples-Tests-7.x/solr/build/solr-core/test/J2/temp/solr.handler.TestReplicationHandler_4EBC20BAFFC6E5D3-001/solr-instance-001/.
   [junit4]   2> 1603099 INFO  (TEST-TestReplicationHandler.testRateLimitedReplication-seed#[4EBC20BAFFC6E5D3]) [    ] o.a.s.c.CorePropertiesLocator Cores are: [collection1]
   [junit4]   2> 1603099 INFO  (coreLoadExecutor-6035-thread-1) [    ] o.a.s.c.TransientSolrCoreCacheDefault Allocating transient cache for 4 transient cores
   [junit4]   2> 1603113 INFO  (coreLoadExecutor-6035-thread-1) [    x:collection1] o.a.s.c.SolrConfig Using Lucene MatchVersion: 7.3.0
   [junit4]   2> 1603123 INFO  (coreLoadExecutor-6035-thread-1) [    x:collection1] o.a.s.s.IndexSchema [collection1] Schema name=test
   [junit4]   2> 1603126 INFO  (coreLoadExecutor-6035-thread-1) [    x:collection1] o.a.s.s.IndexSchema Loaded schema test/1.2 with uniqueid field id
   [junit4]   2> 1603126 INFO  (coreLoadExecutor-6035-thread-1) [    x:collection1] o.a.s.c.CoreContainer Creating SolrCore 'collection1' using configuration from instancedir /x1/jenkins/jenkins-slave/workspace/Lucene-Solr-BadApples-Tests-7.x/solr/build/solr-core/test/J2/temp/solr.handler.TestReplicationHandler_4EBC20BAFFC6E5D3-001/solr-instance-001/./collection1, trusted=true
   [junit4]   2> 1603126 INFO  (coreLoadExecutor-6035-thread-1) [    x:collection1] o.a.s.m.r.SolrJmxReporter JMX monitoring for 'solr.core.collection1' (registry 'solr.core.collection1') enabled at server: com.sun.jmx.mbeanserver.JmxMBeanServer@7dd61eac
   [junit4]   2> 1603126 INFO  (coreLoadExecutor-6035-thread-1) [    x:collection1] o.a.s.c.SolrCore solr.RecoveryStrategy.Builder
   [junit4]   2> 1603126 INFO  (coreLoadExecutor-6035-thread-1) [    x:collection1] o.a.s.c.SolrCore [[collection1] ] Opening new SolrCore at [/x1/jenkins/jenkins-slave/workspace/Lucene-Solr-BadApples-Tests-7.x/solr/build/solr-core/test/J2/temp/solr.handler.TestReplicationHandler_4EBC20BAFFC6E5D3-001/solr-instance-001/collection1], dataDir=[/x1/jenkins/jenkins-slave/workspace/Lucene-Solr-BadApples-Tests-7.x/solr/build/solr-core/test/J2/temp/solr.handler.TestReplicationHandler_4EBC20BAFFC6E5D3-001/solr-instance-001/./collection1/data/]
   [junit4]   2> 1603129 INFO  (coreLoadExecutor-6035-thread-1) [    x:collection1] o.a.s.u.RandomMergePolicy RandomMergePolicy wrapping class org.apache.lucene.index.LogByteSizeMergePolicy: [LogByteSizeMergePolicy: minMergeSize=1677721, mergeFactor=33, maxMergeSize=2147483648, maxMergeSizeForForcedMerge=9223372036854775807, calibrateSizeByDeletes=true, maxMergeDocs=2147483647, maxCFSSegmentSizeMB=8.796093022207999E12, noCFSRatio=0.8141532996924532]
   [junit4]   2> 1603198 INFO  (coreLoadExecutor-6035-thread-1) [    x:collection1] o.a.s.u.CommitTracker Hard AutoCommit: disabled
   [junit4]   2> 1603198 INFO  (coreLoadExecutor-6035-thread-1) [    x:collection1] o.a.s.u.CommitTracker Soft AutoCommit: disabled
   [junit4]   2> 1603200 INFO  (coreLoadExecutor-6035-thread-1) [    x:collection1] o.a.s.u.RandomMergePolicy RandomMergePolicy wrapping class org.apache.lucene.index.LogDocMergePolicy: [LogDocMergePolicy: minMergeSize=1000, mergeFactor=16, maxMergeSize=9223372036854775807, maxMergeSizeForForcedMerge=9223372036854775807, calibrateSizeByDeletes=true, maxMergeDocs=2147483647, maxCFSSegmentSizeMB=8.796093022207999E12, noCFSRatio=1.0]
   [junit4]   2> 1603200 INFO  (coreLoadExecutor-6035-thread-1) [    x:collection1] o.a.s.s.SolrIndexSearcher Opening [Searcher@188f7c[collection1] main]
   [junit4]   2> 1603201 INFO  (coreLoadExecutor-6035-thread-1) [    x:collection1] o.a.s.r.ManagedResourceStorage File-based storage initialized to use dir: /x1/jenkins/jenkins-slave/workspace/Lucene-Solr-BadApples-Tests-7.x/solr/build/solr-core/test/J2/temp/solr.handler.TestReplicationHandler_4EBC20BAFFC6E5D3-001/solr-instance-001/collection1/conf
   [junit4]   2> 1603201 INFO  (coreLoadExecutor-6035-thread-1) [    x:collection1] o.a.s.h.ReplicationHandler Commits will be reserved for 10000ms.
   [junit4]   2> 1603203 INFO  (searcherExecutor-6036-thread-1-processing-x:collection1) [    x:collection1] o.a.s.c.SolrCore [collection1] Registered new searcher Searcher@188f7c[collection1] main{ExitableDirectoryReader(UninvertingDirectoryReader())}
   [junit4]   2> 1603205 INFO  (qtp1840561118-18264) [    x:collection1] o.a.s.u.p.LogUpdateProcessorFactory [collection1]  webapp=/solr path=/update params={wt=javabin&version=2}{add=[0]} 0 0
   [junit4]   2> 1603206 INFO  (qtp1840561118-18266) [    x:collection1] o.a.s.u.p.LogUpdateProcessorFactory [collection1]  webapp=/solr path=/update params={wt=javabin&version=2}{add=[1]} 0 0
   [junit4]   2> 1603207 INFO  (qtp1840561118-18268) [    x:collection1] o.a.s.u.p.LogUpdateProcessorFactory [collection1]  webapp=/solr path=/update params={wt=javabin&version=2}{add=[2]} 0 0
   [junit4]   2> 1603207 INFO  (qtp1840561118-18266) [    x:collection1] o.a.s.u.p.LogUpdateProcessorFactory [collection1]  webapp=/solr path=/update params={wt=javabin&version=2}{add=[3]} 0 0
   [junit4]   2> 1603208 INFO  (qtp1840561118-18268) [    x:collection1] o.a.s.u.p.LogUpdateProcessorFactory [collection1]  webapp=/solr path=/update params={wt=javabin&version=2}{add=[4]} 0 0
   [junit4]   2> 1603209 INFO  (qtp1840561118-18266) [    x:collection1] o.a.s.u.p.LogUpdateProcessorFactory [collection1]  webapp=/solr path=/update params={wt=javabin&version=2}{add=[5]} 0 0
   [junit4]   2> 1603210 INFO  (qtp1840561118-18268) [    x:collection1] o.a.s.u.p.LogUpdateProcessorFactory [collection1]  webapp=/solr path=/update params={wt=javabin&version=2}{add=[6]} 0 0
   [junit4]   2> 1603211 INFO  (qtp1840561118-18266) [    x:collection1] o.a.s.u.p.LogUpdateProcessorFactory [collection1]  webapp=/solr path=/update params={wt=javabin&version=2}{add=[7]} 0 0
   [junit4]   2> 1603211 INFO  (qtp1840561118-18268) [    x:collection1] o.a.s.u.p.LogUpdateProcessorFactory [collection1]  webapp=/solr path=/update params={wt=javabin&version=2}{add=[8]} 0 0
   [junit4]   2> 1603212 INFO  (qtp1840561118-18266) [    x:collection1] o.a.s.u.p.LogUpdateProcessorFactory [collection1]  webapp=/solr path=/update params={wt=javabin&version=2}{add=[9]} 0 0
   [junit4]   2> 1603212 INFO  (qtp1840561118-18268) [    x:collection1] o.a.s.u.p.LogUpdateProcessorFactory [collection1]  webapp=/solr path=/update params={wt=javabin&version=2}{add=[10]} 0 0
   [junit4]   2> 1603214 INFO  (qtp1840561118-18266) [    x:collection1] o.a.s.u.p.LogUpdateProcessorFactory [collection1]  webapp=/solr path=/update params={wt=javabin&version=2}{add=[11]} 0 0
   [junit4]   2> 1603214 INFO  (qtp1840561118-18268) [    x:collection1] o.a.s.u.p.LogUpdateProcessorFactory [collection1]  webapp=/solr path=/update params={wt=javabin&version=2}{add=[12]} 0 0
   [junit4]   2> 1603215 INFO  (qtp1840561118-18266) [    x:collection1] o.a.s.u.p.LogUpdateProcessorFactory [collection1]  webapp=/solr path=/update params={wt=javabin&version=2}{add=[13]} 0 0
   [junit4]   2> 1603215 INFO  (qtp1840561118-18268) [    x:collection1] o.a.s.u.p.LogUpdateProcessorFactory [collection1]  webapp=/solr path=/update params={wt=javabin&version=2}{add=[14]} 0 0
   [junit4]   2> 1603216 INFO  (qtp1840561118-18266) [    x:collection1] o.a.s.u.p.LogUpdateProcessorFactory [collection1]  webapp=/solr path=/update params={wt=javabin&version=2}{add=[15]} 0 0
   [junit4]   2> 1603217 INFO  (qtp1840561118-18268) [    x:collection1] o.a.s.u.p.LogUpdateProcessorFactory [collection1]  webapp=/solr path=/update params={wt=javabin&version=2}{add=[16]} 0 0
   [junit4]   2> 1603218 INFO  (qtp1840561118-18266) [    x:collection1] o.a.s.u.p.LogUpdateProcessorFactory [collection1]  webapp=/solr path=/update params={wt=javabin&version=2}{add=[17]} 0 0
   [junit4]   2> 1603219 INFO  (qtp1840561118-18268) [    x:collection1] o.a.s.u.p.LogUpdateProcessorFactory [collection1]  webapp=/solr path=/update params={wt=javabin&version=2}{add=[18]} 0 0
   [junit4]   2> 1603220 INFO  (qtp1840561118-18266) [    x:collection1] o.a.s.u.p.LogUpdateProcessorFactory [collection1]  webapp=/solr path=/update params={wt=javabin&version=2}{add=[19]} 0 0
   [junit4]   2> 1603221 INFO  (qtp1840561118-18268) [    x:collection1] o.a.s.u.p.LogUpdateProcessorFactory [collection1]  webapp=/solr path=/update params={wt=javabin&version=2}{add=[20]} 0 0
   [junit4]   2> 1603221 INFO  (qtp1840561118-18266) [    x:collection1] o.a.s.u.p.LogUpdateProcessorFactory [collection1]  webapp=/solr path=/update params={wt=javabin&version=2}{add=[21]} 0 0
   [junit4]   2> 1603222 INFO  (qtp1840561118-18268) [    x:collection1] o.a.s.u.p.LogUpdateProcessorFactory [collection1]  webapp=/solr path=/update params={wt=javabin&version=2}{add=[22]} 0 0
   [junit4]   2> 1603223 INFO  (qtp1840561118-18266) [    x:collection1] o.a.s.u.p.LogUpdateProcessorFactory [collection1]  webapp=/solr path=/update params={wt=javabin&version=2}{add=[23]} 0 0
   [junit4]   2> 1603224 INFO  (qtp1840561118-18268) [    x:collection1] o.a.s.u.p.LogUpdateProcessorFactory [collection1]  webapp=/solr path=/update params={wt=javabin&version=2}{add=[24]} 0 0
   [junit4]   2> 1603225 INFO  (qtp1840561118-18266) [    x:collection1] o.a.s.u.p.LogUpdateProcessorFactory [collection1]  webapp=/solr path=/update params={wt=javabin&version=2}{add=[25]} 0 0
   [junit4]   2> 1603225 INFO  (qtp1840561118-18268) [    x:collection1] o.a.s.u.p.LogUpdateProcessorFactory [collection1]  webapp=/solr path=/update params={wt=javabin&version=2}{add=[26]} 0 0
   [junit4]   2> 1603226 INFO  (qtp1840561118-18266) [    x:collection1] o.a.s.u.p.LogUpdateProcessorFactory [collection1]  webapp=/solr path=/update params={wt=javabin&version=2}{add=[27]} 0 0
   [junit4]   2> 1603227 INFO  (qtp1840561118-18268) [    x:collection1] o.a.s.u.p.LogUpdateProcessorFactory [collection1]  webapp=/solr path=/update params={wt=javabin&version=2}{add=[28]} 0 0
   [junit4]   2> 1603228 INFO  (qtp1840561118-18266) [    x:collection1] o.a.s.u.p.LogUpdateProcessorFactory [collection1]  webapp=/solr path=/update params={wt=javabin&version=2}{add=[29]} 0 0
   [junit4]   2> 1603229 INFO  (qtp1840561118-18268) [    x:collection1] o.a.s.u.p.LogUpdateProcessorFactory [collection1]  webapp=/solr path=/update params={wt=javabin&version=2}{add=[30]} 0 0
   [junit4]   2> 1603229 INFO  (qtp1840561118-18266) [    x:collection1] o.a.s.u.p.LogUpdateProcessorFactory [collection1]  webapp=/solr path=/update params={wt=javabin&version=2}{add=[31]} 0 0
   [junit4]   2> 1603230 INFO  (qtp1840561118-18268) [    x:collection1] o.a.s.u.p.LogUpdateProcessorFactory [collection1]  webapp=/solr path=/update params={wt=javabin&version=2}{add=[32]} 0 0
   [junit4]   2> 1603230 INFO  (qtp1840561118-18266) [    x:collection1] o.a.s.u.p.LogUpdateProcessorFactory [collection1]  webapp=/solr path=/update params={wt=javabin&version=2}{add=[33]} 0 0
   [junit4]   2> 1603232 INFO  (qtp1840561118-18268) [    x:collection1] o.a.s.u.p.LogUpdateProcessorFactory [collection1]  webapp=/solr path=/update params={wt=javabin&version=2}{add=[34]} 0 0
   [junit4]   2> 1603232 INFO  (qtp1840561118-18266) [    x:collection1] o.a.s.u.p.LogUpdateProcessorFactory [collection1]  webapp=/solr path=/update params={wt=javabin&version=2}{add=[35]} 0 0
   [junit4]   2> 1603233 INFO  (qtp1840561118-18268) [    x:collection1] o.a.s.u.p.LogUpdateProcessorFactory [collection1]  webapp=/solr path=/update params={wt=javabin&version=2}{add=[36]} 0 0
   [junit4]   2> 1603233 INFO  (qtp1840561118-18266) [    x:collection1] o.a.s.u.p.LogUpdateProcessorFactory [collection1]  webapp=/solr path=/update params={wt=javabin&version=2}{add=[37]} 0 0
   [junit4]   2> 1603234 INFO  (qtp1840561118-18268) [    x:collection1] o.a.s.u.p.LogUpdateProcessorFactory [collection1]  webapp=/solr path=/update params={wt=javabin&version=2}{add=[38]} 0 0
   [junit4]   2> 1603235 INFO  (qtp1840561118-18266) [    x:collection1] o.a.s.u.p.LogUpdateProcessorFactory [collection1]  webapp=/solr path=/update params={wt=javabin&version=2}{add=[39]} 0 0
   [junit4]   2> 1603236 INFO  (qtp1840561118-18268) [    x:collection1] o.a.s.u.p.LogUpdateProcessorFactory [collection1]  webapp=/solr path=/update params={wt=javabin&version=2}{add=[40]} 0 0
   [junit4]   2> 1603236 INFO  (qtp1840561118-18266) [    x:collection1] o.a.s.u.p.LogUpdateProcessorFactory [collection1]  webapp=/solr path=/update params={wt=javabin&version=2}{add=[41]} 0 0
   [junit4]   2> 1603237 INFO  (qtp1840561118-18268) [    x:collection1] o.a.s.u.p.LogUpdateProcessorFactory [collection1]  webapp=/solr path=/update params={wt=javabin&version=2}{add=[42]} 0 0
   [junit4]   2> 1603237 INFO  (qtp1840561118-18266) [    x:collection1] o.a.s.u.p.LogUpdateProcessorFactory [collection1]  webapp=/solr path=/update params={wt=javabin&version=2}{add=[43]} 0 0
   [junit4]   2> 1603238 INFO  (qtp1840561118-18268) [    x:collection1] o.a.s.u.p.LogUpdateProcessorFactory [collection1]  webapp=/solr path=/update params={wt=javabin&version=2}{add=[44]} 0 0
   [junit4]   2> 1603239 INFO  (qtp1840561118-18266) [    x:collection1] o.a.s.u.p.LogUpdateProcessorFactory [collection1]  webapp=/solr path=/update params={wt=javabin&version=2}{add=[45]} 0 0
   [junit4]   2> 1603240 INFO  (qtp1840561118-18268) [    x:collection1] o.a.s.u.p.LogUpdateProcessorFactory [collection1]  webapp=/solr path=/update params={wt=javabin&version=2}{add=[46]} 0 0
   [junit4]   2> 1603240 INFO  (qtp1840561118-18266) [    x:collection1] o.a.s.u.p.LogUpdateProcessorFactory [collection1]  webapp=/solr path=/update params={wt=javabin&version=2}{add=[47]} 0 0
   [junit4]   2> 1603241 INFO  (qtp1840561118-18268) [    x:collection1] o.a.s.u.p.LogUpdateProcessorFactory [collection1]  webapp=/solr path=/update params={wt=javabin&version=2}{add=[48]} 0 0
   [junit4]   2> 1603242 INFO  (qtp1840561118-18266) [    x:collection1] o.a.s.u.p.LogUpdateProcessorFactory [collection1]  webapp=/solr path=/update params={wt=javabin&version=2}{add=[49]} 0 0
   [junit4]   2> 1603242 INFO  (qtp1840561118-18268) [    x:collection1] o.a.s.u.p.LogUpdateProcessorFactory [collection1]  webapp=/solr path=/update params={wt=javabin&version=2}{add=[50]} 0 0
   [junit4]   2> 1603243 INFO  (qtp1840561118-18266) [    x:collection1] o.a.s.u.p.LogUpdateProcessorFactory [collection1]  webapp=/solr path=/update params={wt=javabin&version=2}{add=[51]} 0 0
   [junit4]   2> 1603243 INFO  (qtp1840561118-18268) [    x:collection1] o.a.s.u.p.LogUpdateProcessorFactory [collection1]  webapp=/solr path=/update params={wt=javabin&version=2}{add=[52]} 0 0
   [junit4]   2> 1603245 INFO  (qtp1840561118-18266) [    x:collection1] o.a.s.u.p.LogUpdateProcessorFactory [collection1]  webapp=/solr path=/update params={wt=javabin&version=2}{add=[53]} 0 0
   [junit4]   2> 1603245 INFO  (qtp1840561118-18268) [    x:collection1] o.a.s.u.p.LogUpdateProcessorFactory [collection1]  webapp=/solr path=/update params={wt=javabin&version=2}{add=[54]} 0 0
   [junit4]   2> 1603246 INFO  (qtp1840561118-18266) [    x:collection1] o.a.s.u.p.LogUpdateProcessorFactory [collection1]  webapp=/solr path=/update params={wt=javabin&version=2}{add=[55]} 0 0
   [junit4]   2> 1603246 INFO  (qtp1840561118-18268) [    x:collection1] o.a.s.u.p.LogUpdateProcessorFactory [collection1]  webapp=/solr path=/update params={wt=javabin&version=2}{add=[56]} 0 0
   [junit4]   2> 1603247 INFO  (qtp1840561118-18266) [    x:collection1] o.a.s.u.p.LogUpdateProcessorFactory [collection1]  webapp=/solr path=/update params={wt=javabin&version=2}{add=[57]} 0 0
   [junit4]   2> 1603248 INFO  (qtp1840561118-18268) [    x:collection1] o.a.s.u.p.LogUpdateProcessorFactory [collection1]  webapp=/solr path=/update params={wt=javabin&version=2}{add=[58]} 0 0
   [junit4]   2> 1603249 INFO  (qtp1840561118-18266) [    x:collection1] o.a.s.u.p.LogUpdateProcessorFactory [collection1]  webapp=/solr path=/update params={wt=javabin&version=2}{add=[59]} 0 0
   [junit4]   2> 1603250 INFO  (qtp1840561118-18268) [    x:collection1] o.a.s.u.p.LogUpdateProcessorFactory [collection1]  webapp=/solr path=/update params={wt=javabin&version=2}{add=[60]} 0 0
   [junit4]   2> 1603250 INFO  (qtp1840561118-18266) [    x:collection1] o.a.s.u.p.LogUpdateProcessorFactory [collection1]  webapp=/solr path=/update params={wt=javabin&version=2}{add=[61]} 0 0
   [junit4]   2> 1603251 INFO  (qtp1840561118-18268) [    x:collection1] o.a.s.u.p.LogUpdateProcessorFactory [collection1]  webapp=/solr path=/update params={wt=javabin&version=2}{add=[62]} 0 0
   [junit4]   2> 1603252 INFO  (qtp1840561118-18266) [    x:collection1] o.a.s.u.p.LogUpdateProcessorFactory [collection1]  webapp=/solr path=/update params={wt=javabin&version=2}{add=[63]} 0 0
   [junit4]   2> 1603253 INFO  (qtp1840561118-18268) [    x:collection1] o.a.s.u.p.LogUpdateProcessorFactory [collection1]  webapp=/solr path=/update params={wt=javabin&version=2}{add=[64]} 0 0
   [junit4]   2> 1603254 INFO  (qtp1840561118-18266) [    x:collection1] o.a.s.u.p.LogUpdateProcessorFactory [collection1]  webapp=/solr path=/update params={wt=javabin&version=2}{add=[65]} 0 0
   [junit4]   2> 1603254 INFO  (qtp1840561118-18268) [    x:collection1] o.a.s.u.p.LogUpdateProcessorFactory [collection1]  webapp=/solr path=/update params={wt=javabin&version=2}{add=[66]} 0 0
   [junit4]   2> 1603255 INFO  (qtp1840561118-18266) [    x:collection1] o.a.s.u.p.LogUpdateProcessorFactory [collection1]  webapp=/solr path=/update params={wt=javabin&version=2}{add=[67]} 0 0
   [junit4]   2> 1603255 INFO  (qtp1840561118-18268) [    x:collection1] o.a.s.u.p.LogUpdateProcessorFactory [collection1]  webapp=/solr path=/update params={wt=javabin&version=2}{add=[68]} 0 0
   [junit4]   2> 1603257 INFO  (qtp1840561118-18266) [    x:collection1] o.a.s.u.p.LogUpdateProcessorFactory [collection1]  webapp=/solr path=/update params={wt=javabin&version=2}{add=[69]} 0 0
   [junit4]   2> 1603257 INFO  (qtp1840561118-18268) [    x:collection1] o.a.s.u.p.LogUpdateProcessorFactory [collection1]  webapp=/solr path=/update params={wt=javabin&version=2}{add=[70]} 0 0
   [junit4]   2> 1603258 INFO  (qtp1840561118-18266) [    x:collection1] o.a.s.u.p.LogUpdateProcessorFactory [collection1]  webapp=/solr path=/update params={wt=javabin&version=2}{add=[71]} 0 0
   [junit4]   2> 1603258 INFO  (qtp1840561118-18268) [    x:collection1] o.a.s.u.p.LogUpdateProcessorFactory [collection1]  webapp=/solr path=/update params={wt=javabin&version=2}{add=[72]} 0 0
   [junit4]   2> 1603259 INFO  (qtp1840561118-18266) [    x:collection1] o.a.s.u.p.LogUpdateProcessorFactory [collection1]  webapp=/solr path=/update params={wt=javabin&version=2}{add=[73]} 0 0
   [junit4]   2> 1603259 INFO  (qtp1840561118-18268) [    x:collection1] o.a.s.u.p.LogUpdateProcessorFactory [collection1]  webapp=/solr path=/update params={wt=javabin&version=2}{add=[74]} 0 0
   [junit4]   2> 1603260 INFO  (qtp1840561118-18266) [    x:collection1] o.a.s.u.p.LogUpdateProcessorFactory [collection1]  webapp=/solr path=/update params={wt=javabin&version=2}{add=[75]} 0 0
   [junit4]   2> 1603261 INFO  (qtp1840561118-18268) [    x:collection1] o.a.s.u.p.LogUpdateProcessorFactory [collection1]  webapp=/solr path=/update params={wt=javabin&version=2}{add=[76]} 0 0
   [junit4]   2> 1603261 INFO  (qtp1840561118-18266) [    x:collection1] o.a.s.u.p.LogUpdateProcessorFactory [collection1]  webapp=/solr path=/update params={wt=javabin&version=2}{add=[77]} 0 0
   [junit4]   2> 1603262 INFO  (qtp1840561118-18268) [    x:collection1] o.a.s.u.p.LogUpdateProcessorFactory [collection1]  webapp=/solr path=/update params={wt=javabin&version=2}{add=[78]} 0 0
   [junit4]   2> 1603262 INFO  (qtp1840561118-18266) [    x:collection1] o.a.s.u.p.LogUpdateProcessorFactory [collection1]  webapp=/solr path=/update params={wt=javabin&version=2}{add=[79]} 0 0
   [junit4]   2> 1603263 INFO  (qtp1840561118-18268) [    x:collection1] o.a.s.u.p.LogUpdateProcessorFactory [collection1]  webapp=/solr path=/update params={wt=javabin&version=2}{add=[80]} 0 0
   [junit4]   2> 1603264 INFO  (qtp1840561118-18266) [    x:collection1] o.a.s.u.p.LogUpdateProcessorFactory [collection1]  webapp=/solr path=/update params={wt=javabin&version=2}{add=[81]} 0 0
   [junit4]   2> 1603265 INFO  (qtp1840561118-18268) [    x:collection1] o.a.s.u.p.LogUpdateProcessorFactory [collection1]  webapp=/solr path=/update params={wt=javabin&version=2}{add=[82]} 0 0
   [junit4]   2> 1603265 INFO  (qtp1840561118-18266) [    x:collection1] o.a.s.u.p.LogUpdateProcessorFactory [collection1]  webapp=/solr path=/update params={wt=javabin&version=2}{add=[83]} 0 0
   [junit4]   2> 1603266 INFO  (qtp1840561118-18268) [    x:collection1] o.a.s.u.p.LogUpdateProcessorFactory [collection1]  webapp=/solr path=/update params={wt=javabin&version=2}{add=[84]} 0 0
   [junit4]   2> 1603266 INFO  (qtp1840561118-18266) [    x:collection1] o.a.s.u.p.LogUpdateProcessorFactory [collection1]  webapp=/solr path=/update params={wt=javabin&version=2}{add=[85]} 0 0
   [junit4]   2> 1603267 INFO  (qtp1840561118-18268) [    x:collection1] o.a.s.u.p.LogUpdateProcessorFactory [collection1]  webapp=/solr path=/update params={wt=javabin&version=2}{add=[86]} 0 0
   [junit4]   2> 1603267 INFO  (qtp1840561118-18266) [    x:collection1] o.a.s.u.p.LogUpdateProcessorFactory [collection1]  webapp=/solr path=/update params={wt=javabin&version=2}{add=[87]} 0 0
   [junit4]   2> 1603269 INFO  (qtp1840561118-18268) [    x:collection1] o.a.s.u.p.LogUpdateProcessorFactory [collection1]  webapp=/solr path=/update params={wt=javabin&version=2}{add=[88]} 0 0
   [junit4]   2> 1603269 INFO  (qtp1840561118-18266) [    x:collection1] o.a.s.u.p.LogUpdateProcessorFactory [collection1]  webapp=/solr path=/update params={wt=javabin&version=2}{add=[89]} 0 0
   [junit4]   2> 1603270 INFO  (qtp1840561118-18268) [    x:collection1] o.a.s.u.p.LogUpdateProcessorFactory [collection1]  webapp=/solr path=/update params={wt=javabin&version=2}{add=[90]} 0 0
   [junit4]   2> 1603270 INFO  (qtp1840561118-18266) [    x:collection1] o.a.s.u.p.LogUpdateProcessorFactory [collection1]  webapp=/solr path=/update params={wt=javabin&version=2}{add=[91]} 0 0
   [junit4]   2> 1603271 INFO  (qtp1840561118-18268) [    x:collection1] o.a.s.u.p.LogUpdateProcessorFactory [collection1]  webapp=/solr path=/update params={wt=javabin&version=2}{add=[92]} 0 0
   [junit4]   2> 1603272 INFO  (qtp1840561118-18266) [    x:collection1] o.a.s.u.p.LogUpdateProcessorFactory [collection1]  webapp=/solr path=/update params={wt=javabin&version=2}{add=[93]} 0 0
   [junit4]   2> 1603273 INFO  (qtp1840561118-18268) [    x:collection1] o.a.s.u.p.LogUpdateProcessorFactory [collection1]  webapp=/solr path=/update params={wt=javabin&version=2}{add=[94]} 0 0
   [junit4]   2> 1603273 INFO  (qtp1840561118-18266) [    x:collection1] o.a.s.u.p.LogUpdateProcessorFactory [collection1]  webapp=/solr path=/update params={wt=javabin&version=2}{add=[95]} 0 0
   [junit4]   2> 1603274 INFO  (qtp1840561118-18268) [    x:collection1] o.a.s.u.p.LogUpdateProcessorFactory [collection1]  webapp=/solr path=/update params={wt=javabin&version=2}{add=[96]} 0 0
   [junit4]   2> 1603274 INFO  (qtp1840561118-18266) [    x:collection1] o.a.s.u.DirectUpdateHandler2 start commit{,optimize=false,openSearcher=true,waitSearcher=true,expungeDeletes=false,softCommit=false,prepareCommit=false}
   [junit4]   2> 1603274 INFO  (qtp1840561118-18266) [    x:collection1] o.a.s.u.SolrIndexWriter Calling setCommitData with IW:org.apache.solr.update.SolrIndexWriter@5b0a7cff commitCommandVersion:0
   [junit4]   2> 1603497 INFO  (qtp1840561118-18266) [    x:collection1] o.a.s.s.SolrIndexSearcher Opening [Searcher@709164ec[collection1] main]
   [junit4]   2> 1603498 INFO  (qtp1840561118-18266) [    x:collection1] o.a.s.u.DirectUpdateHandler2 end_commit_flush
   [junit4]   2> 1603500 INFO  (searcherExecutor-6036-thread-1-processing-x:collection1) [    x:collection1] o.a.s.c.SolrCore [collection1] Registered new searcher Searcher@709164ec[collection1] main{ExitableDirectoryReader(UninvertingDirectoryReader(Uninverting(_0(7.3.0):C97)))}
   [junit4]   2> 1603500 INFO  (qtp1840561118-18266) [    x:collection1] o.a.s.u.p.LogUpdateProcessorFactory [collection1]  webapp=/solr path=/update params={waitSearcher=true&commit=true&softCommit=false&wt=javabin&version=2}{commit=} 0 225
   [junit4]   2> 1603501 INFO  (TEST-TestReplicationHandler.testRateLimitedReplication-seed#[4EBC20BAFFC6E5D3]) [    ] o.e.j.s.AbstractConnector Stopped ServerConnector@10572b6c{HTTP/1.1,[http/1.1]}{127.0.0.1:0}
   [junit4]   2> 1603501 INFO  (TEST-TestReplicationHandler.testRateLimitedReplication-seed#[4EBC20BAFFC6E5D3]) [    ] o.a.s.c.CoreContainer Shutting down CoreContainer instance=1449689585
   [junit4]   2> 1603502 INFO  (TEST-TestReplicationHandler.testRateLimitedReplication-seed#[4EBC20BAFFC6E5D3]) [    ] o.a.s.m.SolrMetricManager Closing metric reporters for registry=solr.node, tag=null
   [junit4]   2> 1603502 INFO  (TEST-TestReplicationHandler.testRateLimitedReplication-seed#[4EBC20BAFFC6E5D3]) [    ] o.a.s.m.r.SolrJmxReporter Closing reporter [org.apache.solr.metrics.reporters.SolrJmxReporter@7e9c6593: rootName = null, domain = solr.node, service url = null, agent id = null] for registry solr.node / com.codahale.metrics.MetricRegistry@7f6bcbe3
   [junit4]   2> 1603512 INFO  (TEST-TestReplicationHandler.testRateLimitedReplication-seed#[4EBC20BAFFC6E5D3]) [    ] o.a.s.m.SolrMetricManager Closing metric reporters for registry=solr.jvm, tag=null
   [junit4]   2> 1603512 INFO  (TEST-TestReplicationHandler.testRateLimitedReplication-seed#[4EBC20BAFFC6E5D3]) [    ] o.a.s.m.r.SolrJmxReporter Closing reporter [org.apache.solr.metrics.reporters.SolrJmxReporter@14f4a066: rootName = null, domain = solr.jvm, service url = null, agent id = null] for registry solr.jvm / com.codahale.metrics.MetricRegistry@3ce2733c
   [junit4]   2> 1603520 INFO  (TEST-TestReplicationHandler.testRateLimitedReplication-seed#[4EBC20BAFFC6E5D3]) [    ] o.a.s.m.SolrMetricManager Closing metric reporters for registry=solr.jetty, tag=null
   [junit4]   2> 1603520 INFO  (TEST-TestReplicationHandler.testRateLimitedReplication-seed#[4EBC20BAFFC6E5D3]) [    ] o.a.s.m.r.SolrJmxReporter Closing reporter [org.apache.solr.metrics.reporters.SolrJmxReporter@50c49268: rootName = null, domain = solr.jetty, service url = null, agent id = null] for registry solr.jetty / com.codahale.metrics.MetricRegistry@38dde078
   [junit4]   2> 1603521 INFO  (coreCloseExecutor-6040-thread-1) [    x:collection1] o.a.s.c.SolrCore [collection1]  CLOSING SolrCore org.apache.solr.core.SolrCore@48fcd09f
   [junit4]   2> 1603521 INFO  (coreCloseExecutor-6040-thread-1) [    x:collection1] o.a.s.m.SolrMetricManager Closing metric reporters for registry=solr.core.collection1, tag=1224528031
   [junit4]   2> 1603521 INFO  (coreCloseExecutor-6040-thread-1) [    x:collection1] o.a.s.m.r.SolrJmxReporter Closing reporter [org.apache.solr.metrics.reporters.SolrJmxReporter@7eedea20: rootName = null, domain = solr.core.collection1, service url = null, agent id = null] for registry solr.core.collection1 / com.codahale.metrics.MetricRegistry@69c5945c
   [junit4]   2> 1603536 INFO  (TEST-TestReplicationHandler.testRateLimitedReplication-seed#[4EBC20BAFFC6E5D3]) [    ] o.e.j.s.h.ContextHandler Stopped o.e.j.s.ServletContextHandler@553bfbf2{/solr,null,UNAVAILABLE}
   [junit4]   2> 1603536 INFO  (TEST-TestReplicationHandler.testRateLimitedReplication-seed#[4EBC20BAFFC6E5D3]) [    ] o.e.j.s.session Stopped scavenging
   [junit4]   2> 1603538 INFO  (TEST-TestReplicationHandler.testRateLimitedReplication-seed#[4EBC20BAFFC6E5D3]) [    ] o.e.j.s.Server jetty-9.4.8.v20171121, build timestamp: 2017-11-21T23:27:37+02:00, git hash: 82b8fb23f757335bb3329d540ce37a2a2615f0a8
   [junit4]   2> 1603539 INFO  (TEST-TestReplicationHandler.testRateLimitedReplication-seed#[4EBC20BAFFC6E5D3]) [    ] o.e.j.s.session DefaultSessionIdManager workerName=node0
   [junit4]   2> 1603540 INFO  (TEST-TestReplicationHandler.testRateLimitedReplication-seed#[4EBC20BAFFC6E5D3]) [    ] o.e.j.s.session No SessionScavenger set, using defaults
   [junit4]   2> 1603540 INFO  (TEST-TestReplicationHandler.testRateLimitedReplication-seed#[4EBC20BAFFC6E5D3]) [    ] o.e.j.s.session Scavenging every 660000ms
   [junit4]   2> 1603540 INFO  (TEST-TestReplicationHandler.testRateLimitedReplication-seed#[4EBC20BAFFC6E5D3]) [    ] o.e.j.s.h.ContextHandler Started o.e.j.s.ServletContextHandler@7df62987{/solr,null,AVAILABLE}
   [junit4]   2> 1603541 INFO  (TEST-TestReplicationHandler.testRateLimitedReplication-seed#[4EBC20BAFFC6E5D3]) [    ] o.e.j.s.AbstractConnector Started ServerConnector@480d6fae{HTTP/1.1,[http/1.1]}{127.0.0.1:39596}
   [junit4]   2> 1603541 INFO  (TEST-TestReplicationHandler.testRateLimitedReplication-seed#[4EBC20BAFFC6E5D3]) [    ] o.e.j.s.Server Started @1606560ms
   [junit4]   2> 1603541 INFO  (TEST-TestReplicationHandler.testRateLimitedReplication-seed#[4EBC20BAFFC6E5D3]) [    ] o.a.s.c.s.e.JettySolrRunner Jetty properties: {solr.data.dir=/x1/jenkins/jenkins-slave/workspace/Lucene-Solr-BadApples-Tests-7.x/solr/build/solr-core/test/J2/temp/solr.handler.TestReplicationHandler_4EBC20BAFFC6E5D3-001/solr-instance-001/collection1/data, hostContext=/solr, hostPort=39596}
   [junit4]   2> 1603541 ERROR (TEST-TestReplicationHandler.testRateLimite

[...truncated too long message...]

ed#[4EBC20BAFFC6E5D3]-worker) [    ] o.a.s.m.r.SolrJmxReporter Closing reporter [org.apache.solr.metrics.reporters.SolrJmxReporter@1814589e: rootName = null, domain = solr.jetty, service url = null, agent id = null] for registry solr.jetty / com.codahale.metrics.MetricRegistry@22abbf73
   [junit4]   2> 2434125 INFO  (coreCloseExecutor-4844-thread-1) [    x:collection1] o.a.s.c.SolrCore [collection1]  CLOSING SolrCore org.apache.solr.core.SolrCore@2ce85c20
   [junit4]   2> 2434125 INFO  (coreCloseExecutor-4844-thread-1) [    x:collection1] o.a.s.m.SolrMetricManager Closing metric reporters for registry=solr.core.collection1, tag=753425440
   [junit4]   2> 2434125 INFO  (coreCloseExecutor-4844-thread-1) [    x:collection1] o.a.s.m.r.SolrJmxReporter Closing reporter [org.apache.solr.metrics.reporters.SolrJmxReporter@29671855: rootName = null, domain = solr.core.collection1, service url = null, agent id = null] for registry solr.core.collection1 / com.codahale.metrics.MetricRegistry@11770554
   [junit4]   2> NOTE: leaving temporary files on disk at: /x1/jenkins/jenkins-slave/workspace/Lucene-Solr-BadApples-Tests-7.x/solr/build/solr-core/test/J0/temp/solr.update.processor.AtomicUpdateProcessorFactoryTest_4EBC20BAFFC6E5D3-001
   [junit4]   2> NOTE: test params are: codec=Asserting(Lucene70): {name_s=PostingsFormat(name=Memory), title_stringNoNorms=Lucene50(blocksize=128), title_stemmed=PostingsFormat(name=MockRandom), multiDefault=Lucene50(blocksize=128), cat=Lucene50(blocksize=128), id=PostingsFormat(name=Memory), text=Lucene50(blocksize=128), title=PostingsFormat(name=MockRandom), title_lettertok=PostingsFormat(name=Memory)}, docValues:{int_i=DocValuesFormat(name=Memory), range_facet_l_dv=DocValuesFormat(name=Lucene70), _version_=DocValuesFormat(name=Lucene70), intDefault=DocValuesFormat(name=Lucene70), id_i1=DocValuesFormat(name=Lucene70), range_facet_i_dv=DocValuesFormat(name=Asserting), intDvoDefault=DocValuesFormat(name=Lucene70), count_i=DocValuesFormat(name=Memory), range_facet_l=DocValuesFormat(name=Asserting), timestamp=DocValuesFormat(name=Asserting)}, maxPointsInLeafNode=1183, maxMBSortInHeap=5.8795879935314606, sim=RandomSimilarity(queryNorm=true): {}, locale=es-PY, timezone=America/Winnipeg
   [junit4]   2> NOTE: Linux 3.13.0-88-generic amd64/Oracle Corporation 1.8.0_144 (64-bit)/cpus=4,threads=1,free=128853424,total=529530880
   [junit4]   2> NOTE: All tests run in this JVM: [ZkShardTermsTest, TestCSVResponseWriter, TestChildDocTransformer, CoreMergeIndexesAdminHandlerTest, RequestHandlersTest, TestExclusionRuleCollectionAccess, ConfigSetsAPITest, BadIndexSchemaTest, TestSolrDeletionPolicy1, TestGroupingSearch, SolrIndexMetricsTest, ExternalFileFieldSortTest, TestComplexPhraseLeadingWildcard, TestRuleBasedAuthorizationPlugin, HttpPartitionTest, ChaosMonkeyNothingIsSafeTest, TestRebalanceLeaders, LeaderElectionContextKeyTest, SolrIndexSplitterTest, CreateRoutedAliasTest, TestStressLiveNodes, TestRandomFaceting, TestSolrFieldCacheBean, ZkCLITest, TestConfig, TestHdfsUpdateLog, FullSolrCloudDistribCmdsTest, TestInfoStreamLogging, TestPayloadScoreQParserPlugin, TestFileDictionaryLookup, FieldAnalysisRequestHandlerTest, TestRestManager, TestStressLucene, TokenizerChainTest, TestLegacyTerms, CdcrBootstrapTest, TestCrossCoreJoin, PKIAuthenticationIntegrationTest, ZkNodePropsTest, TestJsonRequest, MetricUtilsTest, TestLegacyFieldCache, BasicDistributedZkTest, TestPullReplicaErrorHandling, TestCoreBackup, TestReqParamsAPI, BJQParserTest, TestConfigOverlay, TestClusterProperties, TestLuceneMatchVersion, SolrPluginUtilsTest, TestMaxTokenLenTokenizer, TestJoin, TestMaxScoreQueryParser, TestWordDelimiterFilterFactory, ExecutePlanActionTest, IndexBasedSpellCheckerTest, CdcrRequestHandlerTest, TestReloadAndDeleteDocs, UUIDUpdateProcessorFallbackTest, HdfsChaosMonkeySafeLeaderTest, TestIndexSearcher, OutOfBoxZkACLAndCredentialsProvidersTest, TestManagedSchemaAPI, BlockCacheTest, DistributedFacetSimpleRefinementLongTailTest, DistributedDebugComponentTest, DistributedQueryComponentOptimizationTest, TestSchemaManager, TestNamedUpdateProcessors, SolrIndexConfigTest, CollectionStateFormat2Test, SpellCheckCollatorTest, TestSolrCloudWithSecureImpersonation, TestHashPartitioner, MoveReplicaTest, TestSkipOverseerOperations, TestSQLHandlerNonCloud, HdfsThreadLeakTest, SolrMetricManagerTest, TestUninvertingReader, CoreSorterTest, SortSpecParsingTest, TestDynamicFieldCollectionResource, SolrShardReporterTest, AutoscalingHistoryHandlerTest, TestOnReconnectListenerSupport, TestWriterPerf, TestPolicyCloud, ScheduledTriggerTest, CleanupOldIndexTest, TestSolrCoreSnapshots, MissingSegmentRecoveryTest, TestFieldResource, TestDistribDocBasedVersion, SearchHandlerTest, HLLSerializationTest, SpellingQueryConverterTest, SolrGangliaReporterTest, ConnectionReuseTest, TestHighlightDedupGrouping, DistributedFacetPivotSmallTest, DocumentAnalysisRequestHandlerTest, TestPHPSerializedResponseWriter, DocValuesNotIndexedTest, TestReplicaProperties, TestCloudPseudoReturnFields, SolrRequestParserTest, LargeFieldTest, TestLeaderInitiatedRecoveryThread, UninvertDocValuesMergePolicyTest, TestGenericDistributedQueue, TestHashQParserPlugin, DocExpirationUpdateProcessorFactoryTest, TestOmitPositions, DistributedQueryElevationComponentTest, TestSort, TestNoOpRegenerator, EchoParamsTest, ClassificationUpdateProcessorIntegrationTest, LeaderVoteWaitTimeoutTest, TriLevelCompositeIdRoutingTest, TestSolrQueryParser, BlockJoinFacetSimpleTest, DirectUpdateHandlerTest, TestRawTransformer, AtomicUpdateProcessorFactoryTest]
   [junit4] Completed [556/782 (4!)] on J0 in 0.85s, 4 tests, 1 error <<< FAILURES!

[...truncated 8335 lines...]
   [junit4] Suite: org.apache.solr.ltr.TestLTRReRankingPipeline
   [junit4]   2> 22039 INFO  (TEST-TestLTRReRankingPipeline.testDifferentTopN-seed#[37D341CF1E648CBE]) [    ] o.a.s.l.TestLTRReRankingPipeline rerank 1 documents 
   [junit4]   2> 22041 INFO  (TEST-TestLTRReRankingPipeline.testDifferentTopN-seed#[37D341CF1E648CBE]) [    ] o.a.s.l.TestLTRReRankingPipeline doc 0 in pos 0
   [junit4]   2> NOTE: reproduce with: ant test  -Dtestcase=TestLTRReRankingPipeline -Dtests.method=testDifferentTopN -Dtests.seed=37D341CF1E648CBE -Dtests.multiplier=2 -Dtests.slow=true -Dtests.badapples=true -Dtests.locale=id -Dtests.timezone=MST7MDT -Dtests.asserts=true -Dtests.file.encoding=UTF-8
   [junit4] FAILURE 0.13s J1 | TestLTRReRankingPipeline.testDifferentTopN <<<
   [junit4]    > Throwable #1: java.lang.AssertionError: expected:<1.0> but was:<0.0>
   [junit4]    > 	at __randomizedtesting.SeedInfo.seed([37D341CF1E648CBE:C672339F2BDF462C]:0)
   [junit4]    > 	at org.apache.solr.ltr.TestLTRReRankingPipeline.testDifferentTopN(TestLTRReRankingPipeline.java:255)
   [junit4]    > 	at java.lang.Thread.run(Thread.java:748)
   [junit4]   2> NOTE: test params are: codec=Asserting(Lucene70), sim=RandomSimilarity(queryNorm=true): {field=IB LL-L2}, locale=id, timezone=MST7MDT
   [junit4]   2> NOTE: Linux 3.13.0-88-generic amd64/Oracle Corporation 1.8.0_144 (64-bit)/cpus=4,threads=1,free=311724912,total=353370112
   [junit4]   2> NOTE: All tests run in this JVM: [TestWrapperModel, TestLTRQParserExplain, TestFeatureExtractionFromMultipleSegments, TestManagedFeatureStore, TestEdisMaxSolrFeature, TestValueFeature, TestLTRReRankingPipeline]
   [junit4] Completed [19/37 (1!)] on J1 in 0.26s, 3 tests, 1 failure <<< FAILURES!

[...truncated 38516 lines...]
-ecj-javadoc-lint-tests:
    [mkdir] Created dir: /tmp/ecj189865125
 [ecj-lint] Compiling 874 source files to /tmp/ecj189865125
 [ecj-lint] invalid Class-Path header in manifest of jar file: /x1/jenkins/.ivy2/cache/org.restlet.jee/org.restlet/jars/org.restlet-2.3.0.jar
 [ecj-lint] invalid Class-Path header in manifest of jar file: /x1/jenkins/.ivy2/cache/org.restlet.jee/org.restlet.ext.servlet/jars/org.restlet.ext.servlet-2.3.0.jar
 [ecj-lint] ----------
 [ecj-lint] 1. WARNING in /x1/jenkins/jenkins-slave/workspace/Lucene-Solr-BadApples-Tests-7.x/solr/core/src/test/org/apache/solr/analysis/TokenizerChainTest.java (at line 37)
 [ecj-lint] 	TokenizerChain tokenizerChain = new TokenizerChain(
 [ecj-lint] 	               ^^^^^^^^^^^^^^
 [ecj-lint] Resource leak: 'tokenizerChain' is never closed
 [ecj-lint] ----------
 [ecj-lint] ----------
 [ecj-lint] 2. ERROR in /x1/jenkins/jenkins-slave/workspace/Lucene-Solr-BadApples-Tests-7.x/solr/core/src/test/org/apache/solr/cloud/TestCloudConsistency.java (at line 23)
 [ecj-lint] 	import java.net.URL;
 [ecj-lint] 	       ^^^^^^^^^^^^
 [ecj-lint] The import java.net.URL is never used
 [ecj-lint] ----------
 [ecj-lint] 3. ERROR in /x1/jenkins/jenkins-slave/workspace/Lucene-Solr-BadApples-Tests-7.x/solr/core/src/test/org/apache/solr/cloud/TestCloudConsistency.java (at line 39)
 [ecj-lint] 	import org.apache.solr.common.cloud.ZkStateReader;
 [ecj-lint] 	       ^^^^^^^^^^^^^^^^^^^^^^^^^^^^^^^^^^^^^^^^^^
 [ecj-lint] The import org.apache.solr.common.cloud.ZkStateReader is never used
 [ecj-lint] ----------
 [ecj-lint] 3 problems (2 errors, 1 warning)

BUILD FAILED
/x1/jenkins/jenkins-slave/workspace/Lucene-Solr-BadApples-Tests-7.x/build.xml:627: The following error occurred while executing this line:
/x1/jenkins/jenkins-slave/workspace/Lucene-Solr-BadApples-Tests-7.x/build.xml:101: The following error occurred while executing this line:
/x1/jenkins/jenkins-slave/workspace/Lucene-Solr-BadApples-Tests-7.x/solr/build.xml:682: The following error occurred while executing this line:
/x1/jenkins/jenkins-slave/workspace/Lucene-Solr-BadApples-Tests-7.x/lucene/common-build.xml:2088: The following error occurred while executing this line:
/x1/jenkins/jenkins-slave/workspace/Lucene-Solr-BadApples-Tests-7.x/lucene/common-build.xml:2121: Compile failed; see the compiler error output for details.

Total time: 106 minutes 57 seconds
Build step 'Invoke Ant' marked build as failure
Archiving artifacts
Recording test results
Email was triggered for: Failure - Any
Sending email for trigger: Failure - Any

Mime
View raw message