lucene-dev mailing list archives

Site index · List index
Message view « Date » · « Thread »
Top « Date » · « Thread »
From Apache Jenkins Server <jenk...@builds.apache.org>
Subject [JENKINS] Lucene-Solr-NightlyTests-7.x - Build # 168 - Still Unstable
Date Wed, 07 Mar 2018 19:43:50 GMT
Build: https://builds.apache.org/job/Lucene-Solr-NightlyTests-7.x/168/

2 tests failed.
FAILED:  org.apache.solr.core.HdfsDirectoryFactoryTest.testInitArgsOrSysPropConfig

Error Message:
The max direct memory is likely too low.  Either increase it (by adding -XX:MaxDirectMemorySize=<size>g -XX:+UseLargePages to your containers startup args) or disable direct allocation using solr.hdfs.blockcache.direct.memory.allocation=false in solrconfig.xml. If you are putting the block cache on the heap, your java heap size might not be large enough. Failed allocating ~134.217728 MB.

Stack Trace:
java.lang.RuntimeException: The max direct memory is likely too low.  Either increase it (by adding -XX:MaxDirectMemorySize=<size>g -XX:+UseLargePages to your containers startup args) or disable direct allocation using solr.hdfs.blockcache.direct.memory.allocation=false in solrconfig.xml. If you are putting the block cache on the heap, your java heap size might not be large enough. Failed allocating ~134.217728 MB.
	at __randomizedtesting.SeedInfo.seed([815806029902533F:76F7CF29648BB914]:0)
	at org.apache.solr.core.HdfsDirectoryFactory.createBlockCache(HdfsDirectoryFactory.java:314)
	at org.apache.solr.core.HdfsDirectoryFactory.getBlockDirectoryCache(HdfsDirectoryFactory.java:290)
	at org.apache.solr.core.HdfsDirectoryFactory.create(HdfsDirectoryFactory.java:230)
	at org.apache.solr.core.HdfsDirectoryFactoryTest.testInitArgsOrSysPropConfig(HdfsDirectoryFactoryTest.java:111)
	at sun.reflect.NativeMethodAccessorImpl.invoke0(Native Method)
	at sun.reflect.NativeMethodAccessorImpl.invoke(NativeMethodAccessorImpl.java:62)
	at sun.reflect.DelegatingMethodAccessorImpl.invoke(DelegatingMethodAccessorImpl.java:43)
	at java.lang.reflect.Method.invoke(Method.java:498)
	at com.carrotsearch.randomizedtesting.RandomizedRunner.invoke(RandomizedRunner.java:1737)
	at com.carrotsearch.randomizedtesting.RandomizedRunner$8.evaluate(RandomizedRunner.java:934)
	at com.carrotsearch.randomizedtesting.RandomizedRunner$9.evaluate(RandomizedRunner.java:970)
	at com.carrotsearch.randomizedtesting.RandomizedRunner$10.evaluate(RandomizedRunner.java:984)
	at com.carrotsearch.randomizedtesting.rules.SystemPropertiesRestoreRule$1.evaluate(SystemPropertiesRestoreRule.java:57)
	at org.apache.lucene.util.TestRuleSetupTeardownChained$1.evaluate(TestRuleSetupTeardownChained.java:49)
	at org.apache.lucene.util.AbstractBeforeAfterRule$1.evaluate(AbstractBeforeAfterRule.java:45)
	at org.apache.lucene.util.TestRuleThreadAndTestName$1.evaluate(TestRuleThreadAndTestName.java:48)
	at org.apache.lucene.util.TestRuleIgnoreAfterMaxFailures$1.evaluate(TestRuleIgnoreAfterMaxFailures.java:64)
	at org.apache.lucene.util.TestRuleMarkFailure$1.evaluate(TestRuleMarkFailure.java:47)
	at com.carrotsearch.randomizedtesting.rules.StatementAdapter.evaluate(StatementAdapter.java:36)
	at com.carrotsearch.randomizedtesting.ThreadLeakControl$StatementRunner.run(ThreadLeakControl.java:368)
	at com.carrotsearch.randomizedtesting.ThreadLeakControl.forkTimeoutingTask(ThreadLeakControl.java:817)
	at com.carrotsearch.randomizedtesting.ThreadLeakControl$3.evaluate(ThreadLeakControl.java:468)
	at com.carrotsearch.randomizedtesting.RandomizedRunner.runSingleTest(RandomizedRunner.java:943)
	at com.carrotsearch.randomizedtesting.RandomizedRunner$5.evaluate(RandomizedRunner.java:829)
	at com.carrotsearch.randomizedtesting.RandomizedRunner$6.evaluate(RandomizedRunner.java:879)
	at com.carrotsearch.randomizedtesting.RandomizedRunner$7.evaluate(RandomizedRunner.java:890)
	at com.carrotsearch.randomizedtesting.rules.StatementAdapter.evaluate(StatementAdapter.java:36)
	at com.carrotsearch.randomizedtesting.rules.SystemPropertiesRestoreRule$1.evaluate(SystemPropertiesRestoreRule.java:57)
	at org.apache.lucene.util.AbstractBeforeAfterRule$1.evaluate(AbstractBeforeAfterRule.java:45)
	at com.carrotsearch.randomizedtesting.rules.StatementAdapter.evaluate(StatementAdapter.java:36)
	at org.apache.lucene.util.TestRuleStoreClassName$1.evaluate(TestRuleStoreClassName.java:41)
	at com.carrotsearch.randomizedtesting.rules.NoShadowingOrOverridesOnMethodsRule$1.evaluate(NoShadowingOrOverridesOnMethodsRule.java:40)
	at com.carrotsearch.randomizedtesting.rules.NoShadowingOrOverridesOnMethodsRule$1.evaluate(NoShadowingOrOverridesOnMethodsRule.java:40)
	at com.carrotsearch.randomizedtesting.rules.StatementAdapter.evaluate(StatementAdapter.java:36)
	at com.carrotsearch.randomizedtesting.rules.StatementAdapter.evaluate(StatementAdapter.java:36)
	at com.carrotsearch.randomizedtesting.rules.StatementAdapter.evaluate(StatementAdapter.java:36)
	at org.apache.lucene.util.TestRuleAssertionsRequired$1.evaluate(TestRuleAssertionsRequired.java:53)
	at org.apache.lucene.util.TestRuleMarkFailure$1.evaluate(TestRuleMarkFailure.java:47)
	at org.apache.lucene.util.TestRuleIgnoreAfterMaxFailures$1.evaluate(TestRuleIgnoreAfterMaxFailures.java:64)
	at org.apache.lucene.util.TestRuleIgnoreTestSuites$1.evaluate(TestRuleIgnoreTestSuites.java:54)
	at com.carrotsearch.randomizedtesting.rules.StatementAdapter.evaluate(StatementAdapter.java:36)
	at com.carrotsearch.randomizedtesting.ThreadLeakControl$StatementRunner.run(ThreadLeakControl.java:368)
	at java.lang.Thread.run(Thread.java:748)
Caused by: java.lang.OutOfMemoryError: Direct buffer memory
	at java.nio.Bits.reserveMemory(Bits.java:694)
	at java.nio.DirectByteBuffer.<init>(DirectByteBuffer.java:123)
	at java.nio.ByteBuffer.allocateDirect(ByteBuffer.java:311)
	at org.apache.solr.store.blockcache.BlockCache.<init>(BlockCache.java:71)
	at org.apache.solr.core.HdfsDirectoryFactory.createBlockCache(HdfsDirectoryFactory.java:312)
	... 42 more


FAILED:  org.apache.solr.handler.TestReplicationHandler.doTestReplicateAfterCoreReload

Error Message:
expected:<[{indexVersion=1520447172966,generation=2,filelist=[_0.fdt, _0.fdx, _0.fnm, _0.nvd, _0.nvm, _0.si, _0_Lucene50_0.doc, _0_Lucene50_0.tim, _0_Lucene50_0.tip, _1.fdt, _1.fdx, _1.fnm, _1.nvd, _1.nvm, _1.si, _1_Lucene50_0.doc, _1_Lucene50_0.tim, _1_Lucene50_0.tip, _2.fdt, _2.fdx, _2.fnm, _2.nvd, _2.nvm, _2.si, _2_Lucene50_0.doc, _2_Lucene50_0.tim, _2_Lucene50_0.tip, _3.fdt, _3.fdx, _3.fnm, _3.nvd, _3.nvm, _3.si, _3_Lucene50_0.doc, _3_Lucene50_0.tim, _3_Lucene50_0.tip, _4.fdt, _4.fdx, _4.fnm, _4.nvd, _4.nvm, _4.si, _4_Lucene50_0.doc, _4_Lucene50_0.tim, _4_Lucene50_0.tip, _5.fdt, _5.fdx, _5.fnm, _5.nvd, _5.nvm, _5.si, _5_Lucene50_0.doc, _5_Lucene50_0.tim, _5_Lucene50_0.tip, segments_2]}]> but was:<[{indexVersion=1520447172966,generation=2,filelist=[_0.fdt, _0.fdx, _0.fnm, _0.nvd, _0.nvm, _0.si, _0_Lucene50_0.doc, _0_Lucene50_0.tim, _0_Lucene50_0.tip, _1.fdt, _1.fdx, _1.fnm, _1.nvd, _1.nvm, _1.si, _1_Lucene50_0.doc, _1_Lucene50_0.tim, _1_Lucene50_0.tip, _2.fdt, _2.fdx, _2.fnm, _2.nvd, _2.nvm, _2.si, _2_Lucene50_0.doc, _2_Lucene50_0.tim, _2_Lucene50_0.tip, _3.fdt, _3.fdx, _3.fnm, _3.nvd, _3.nvm, _3.si, _3_Lucene50_0.doc, _3_Lucene50_0.tim, _3_Lucene50_0.tip, _4.fdt, _4.fdx, _4.fnm, _4.nvd, _4.nvm, _4.si, _4_Lucene50_0.doc, _4_Lucene50_0.tim, _4_Lucene50_0.tip, _5.fdt, _5.fdx, _5.fnm, _5.nvd, _5.nvm, _5.si, _5_Lucene50_0.doc, _5_Lucene50_0.tim, _5_Lucene50_0.tip, segments_2]}, {indexVersion=1520447172966,generation=3,filelist=[_3.fdt, _3.fdx, _3.fnm, _3.nvd, _3.nvm, _3.si, _3_Lucene50_0.doc, _3_Lucene50_0.tim, _3_Lucene50_0.tip, _5.fdt, _5.fdx, _5.fnm, _5.nvd, _5.nvm, _5.si, _5_Lucene50_0.doc, _5_Lucene50_0.tim, _5_Lucene50_0.tip, _6.cfe, _6.cfs, _6.si, segments_3]}]>

Stack Trace:
java.lang.AssertionError: expected:<[{indexVersion=1520447172966,generation=2,filelist=[_0.fdt, _0.fdx, _0.fnm, _0.nvd, _0.nvm, _0.si, _0_Lucene50_0.doc, _0_Lucene50_0.tim, _0_Lucene50_0.tip, _1.fdt, _1.fdx, _1.fnm, _1.nvd, _1.nvm, _1.si, _1_Lucene50_0.doc, _1_Lucene50_0.tim, _1_Lucene50_0.tip, _2.fdt, _2.fdx, _2.fnm, _2.nvd, _2.nvm, _2.si, _2_Lucene50_0.doc, _2_Lucene50_0.tim, _2_Lucene50_0.tip, _3.fdt, _3.fdx, _3.fnm, _3.nvd, _3.nvm, _3.si, _3_Lucene50_0.doc, _3_Lucene50_0.tim, _3_Lucene50_0.tip, _4.fdt, _4.fdx, _4.fnm, _4.nvd, _4.nvm, _4.si, _4_Lucene50_0.doc, _4_Lucene50_0.tim, _4_Lucene50_0.tip, _5.fdt, _5.fdx, _5.fnm, _5.nvd, _5.nvm, _5.si, _5_Lucene50_0.doc, _5_Lucene50_0.tim, _5_Lucene50_0.tip, segments_2]}]> but was:<[{indexVersion=1520447172966,generation=2,filelist=[_0.fdt, _0.fdx, _0.fnm, _0.nvd, _0.nvm, _0.si, _0_Lucene50_0.doc, _0_Lucene50_0.tim, _0_Lucene50_0.tip, _1.fdt, _1.fdx, _1.fnm, _1.nvd, _1.nvm, _1.si, _1_Lucene50_0.doc, _1_Lucene50_0.tim, _1_Lucene50_0.tip, _2.fdt, _2.fdx, _2.fnm, _2.nvd, _2.nvm, _2.si, _2_Lucene50_0.doc, _2_Lucene50_0.tim, _2_Lucene50_0.tip, _3.fdt, _3.fdx, _3.fnm, _3.nvd, _3.nvm, _3.si, _3_Lucene50_0.doc, _3_Lucene50_0.tim, _3_Lucene50_0.tip, _4.fdt, _4.fdx, _4.fnm, _4.nvd, _4.nvm, _4.si, _4_Lucene50_0.doc, _4_Lucene50_0.tim, _4_Lucene50_0.tip, _5.fdt, _5.fdx, _5.fnm, _5.nvd, _5.nvm, _5.si, _5_Lucene50_0.doc, _5_Lucene50_0.tim, _5_Lucene50_0.tip, segments_2]}, {indexVersion=1520447172966,generation=3,filelist=[_3.fdt, _3.fdx, _3.fnm, _3.nvd, _3.nvm, _3.si, _3_Lucene50_0.doc, _3_Lucene50_0.tim, _3_Lucene50_0.tip, _5.fdt, _5.fdx, _5.fnm, _5.nvd, _5.nvm, _5.si, _5_Lucene50_0.doc, _5_Lucene50_0.tim, _5_Lucene50_0.tip, _6.cfe, _6.cfs, _6.si, segments_3]}]>
	at __randomizedtesting.SeedInfo.seed([815806029902533F:A48F1D32E94A5D3C]:0)
	at org.junit.Assert.fail(Assert.java:93)
	at org.junit.Assert.failNotEquals(Assert.java:647)
	at org.junit.Assert.assertEquals(Assert.java:128)
	at org.junit.Assert.assertEquals(Assert.java:147)
	at org.apache.solr.handler.TestReplicationHandler.doTestReplicateAfterCoreReload(TestReplicationHandler.java:1280)
	at sun.reflect.NativeMethodAccessorImpl.invoke0(Native Method)
	at sun.reflect.NativeMethodAccessorImpl.invoke(NativeMethodAccessorImpl.java:62)
	at sun.reflect.DelegatingMethodAccessorImpl.invoke(DelegatingMethodAccessorImpl.java:43)
	at java.lang.reflect.Method.invoke(Method.java:498)
	at com.carrotsearch.randomizedtesting.RandomizedRunner.invoke(RandomizedRunner.java:1737)
	at com.carrotsearch.randomizedtesting.RandomizedRunner$8.evaluate(RandomizedRunner.java:934)
	at com.carrotsearch.randomizedtesting.RandomizedRunner$9.evaluate(RandomizedRunner.java:970)
	at com.carrotsearch.randomizedtesting.RandomizedRunner$10.evaluate(RandomizedRunner.java:984)
	at com.carrotsearch.randomizedtesting.rules.SystemPropertiesRestoreRule$1.evaluate(SystemPropertiesRestoreRule.java:57)
	at org.apache.lucene.util.TestRuleSetupTeardownChained$1.evaluate(TestRuleSetupTeardownChained.java:49)
	at org.apache.lucene.util.AbstractBeforeAfterRule$1.evaluate(AbstractBeforeAfterRule.java:45)
	at org.apache.lucene.util.TestRuleThreadAndTestName$1.evaluate(TestRuleThreadAndTestName.java:48)
	at org.apache.lucene.util.TestRuleIgnoreAfterMaxFailures$1.evaluate(TestRuleIgnoreAfterMaxFailures.java:64)
	at org.apache.lucene.util.TestRuleMarkFailure$1.evaluate(TestRuleMarkFailure.java:47)
	at com.carrotsearch.randomizedtesting.rules.StatementAdapter.evaluate(StatementAdapter.java:36)
	at com.carrotsearch.randomizedtesting.ThreadLeakControl$StatementRunner.run(ThreadLeakControl.java:368)
	at com.carrotsearch.randomizedtesting.ThreadLeakControl.forkTimeoutingTask(ThreadLeakControl.java:817)
	at com.carrotsearch.randomizedtesting.ThreadLeakControl$3.evaluate(ThreadLeakControl.java:468)
	at com.carrotsearch.randomizedtesting.RandomizedRunner.runSingleTest(RandomizedRunner.java:943)
	at com.carrotsearch.randomizedtesting.RandomizedRunner$5.evaluate(RandomizedRunner.java:829)
	at com.carrotsearch.randomizedtesting.RandomizedRunner$6.evaluate(RandomizedRunner.java:879)
	at com.carrotsearch.randomizedtesting.RandomizedRunner$7.evaluate(RandomizedRunner.java:890)
	at com.carrotsearch.randomizedtesting.rules.StatementAdapter.evaluate(StatementAdapter.java:36)
	at com.carrotsearch.randomizedtesting.rules.SystemPropertiesRestoreRule$1.evaluate(SystemPropertiesRestoreRule.java:57)
	at org.apache.lucene.util.AbstractBeforeAfterRule$1.evaluate(AbstractBeforeAfterRule.java:45)
	at com.carrotsearch.randomizedtesting.rules.StatementAdapter.evaluate(StatementAdapter.java:36)
	at org.apache.lucene.util.TestRuleStoreClassName$1.evaluate(TestRuleStoreClassName.java:41)
	at com.carrotsearch.randomizedtesting.rules.NoShadowingOrOverridesOnMethodsRule$1.evaluate(NoShadowingOrOverridesOnMethodsRule.java:40)
	at com.carrotsearch.randomizedtesting.rules.NoShadowingOrOverridesOnMethodsRule$1.evaluate(NoShadowingOrOverridesOnMethodsRule.java:40)
	at com.carrotsearch.randomizedtesting.rules.StatementAdapter.evaluate(StatementAdapter.java:36)
	at com.carrotsearch.randomizedtesting.rules.StatementAdapter.evaluate(StatementAdapter.java:36)
	at com.carrotsearch.randomizedtesting.rules.StatementAdapter.evaluate(StatementAdapter.java:36)
	at org.apache.lucene.util.TestRuleAssertionsRequired$1.evaluate(TestRuleAssertionsRequired.java:53)
	at org.apache.lucene.util.TestRuleMarkFailure$1.evaluate(TestRuleMarkFailure.java:47)
	at org.apache.lucene.util.TestRuleIgnoreAfterMaxFailures$1.evaluate(TestRuleIgnoreAfterMaxFailures.java:64)
	at org.apache.lucene.util.TestRuleIgnoreTestSuites$1.evaluate(TestRuleIgnoreTestSuites.java:54)
	at com.carrotsearch.randomizedtesting.rules.StatementAdapter.evaluate(StatementAdapter.java:36)
	at com.carrotsearch.randomizedtesting.ThreadLeakControl$StatementRunner.run(ThreadLeakControl.java:368)
	at java.lang.Thread.run(Thread.java:748)




Build Log:
[...truncated 13605 lines...]
   [junit4] Suite: org.apache.solr.handler.TestReplicationHandler
   [junit4]   2> Creating dataDir: /x1/jenkins/jenkins-slave/workspace/Lucene-Solr-NightlyTests-7.x/checkout/solr/build/solr-core/test/J1/temp/solr.handler.TestReplicationHandler_815806029902533F-001/init-core-data-001
   [junit4]   2> 1083862 WARN  (SUITE-TestReplicationHandler-seed#[815806029902533F]-worker) [    ] o.a.s.SolrTestCaseJ4 startTrackingSearchers: numOpens=8 numCloses=8
   [junit4]   2> 1083862 INFO  (SUITE-TestReplicationHandler-seed#[815806029902533F]-worker) [    ] o.a.s.SolrTestCaseJ4 Using PointFields (NUMERIC_POINTS_SYSPROP=true) w/NUMERIC_DOCVALUES_SYSPROP=false
   [junit4]   2> 1083863 INFO  (SUITE-TestReplicationHandler-seed#[815806029902533F]-worker) [    ] o.a.s.SolrTestCaseJ4 Randomized ssl (false) and clientAuth (false) via: @org.apache.solr.SolrTestCaseJ4$SuppressSSL(bugUrl=None)
   [junit4]   2> 1083864 INFO  (SUITE-TestReplicationHandler-seed#[815806029902533F]-worker) [    ] o.a.s.SolrTestCaseJ4 SecureRandom sanity checks: test.solr.allowed.securerandom=null & java.security.egd=file:/dev/./urandom
   [junit4]   2> 1083865 INFO  (TEST-TestReplicationHandler.doTestIllegalFilePaths-seed#[815806029902533F]) [    ] o.a.s.SolrTestCaseJ4 ###Starting doTestIllegalFilePaths
   [junit4]   2> 1083865 INFO  (TEST-TestReplicationHandler.doTestIllegalFilePaths-seed#[815806029902533F]) [    ] o.a.s.SolrTestCaseJ4 Writing core.properties file to /x1/jenkins/jenkins-slave/workspace/Lucene-Solr-NightlyTests-7.x/checkout/solr/build/solr-core/test/J1/temp/solr.handler.TestReplicationHandler_815806029902533F-001/solr-instance-001/collection1
   [junit4]   2> 1083869 INFO  (TEST-TestReplicationHandler.doTestIllegalFilePaths-seed#[815806029902533F]) [    ] o.e.j.s.Server jetty-9.4.8.v20171121, build timestamp: 2017-11-22T00:27:37+03:00, git hash: 82b8fb23f757335bb3329d540ce37a2a2615f0a8
   [junit4]   2> 1083877 INFO  (TEST-TestReplicationHandler.doTestIllegalFilePaths-seed#[815806029902533F]) [    ] o.e.j.s.session DefaultSessionIdManager workerName=node0
   [junit4]   2> 1083877 INFO  (TEST-TestReplicationHandler.doTestIllegalFilePaths-seed#[815806029902533F]) [    ] o.e.j.s.session No SessionScavenger set, using defaults
   [junit4]   2> 1083877 INFO  (TEST-TestReplicationHandler.doTestIllegalFilePaths-seed#[815806029902533F]) [    ] o.e.j.s.session Scavenging every 600000ms
   [junit4]   2> 1083878 INFO  (TEST-TestReplicationHandler.doTestIllegalFilePaths-seed#[815806029902533F]) [    ] o.e.j.s.h.ContextHandler Started o.e.j.s.ServletContextHandler@401dfe74{/solr,null,AVAILABLE}
   [junit4]   2> 1083879 INFO  (TEST-TestReplicationHandler.doTestIllegalFilePaths-seed#[815806029902533F]) [    ] o.e.j.s.AbstractConnector Started ServerConnector@747ce196{HTTP/1.1,[http/1.1]}{127.0.0.1:46453}
   [junit4]   2> 1083879 INFO  (TEST-TestReplicationHandler.doTestIllegalFilePaths-seed#[815806029902533F]) [    ] o.e.j.s.Server Started @1087200ms
   [junit4]   2> 1083879 INFO  (TEST-TestReplicationHandler.doTestIllegalFilePaths-seed#[815806029902533F]) [    ] o.a.s.c.s.e.JettySolrRunner Jetty properties: {solr.data.dir=/x1/jenkins/jenkins-slave/workspace/Lucene-Solr-NightlyTests-7.x/checkout/solr/build/solr-core/test/J1/temp/solr.handler.TestReplicationHandler_815806029902533F-001/solr-instance-001/collection1/data, hostContext=/solr, hostPort=46453}
   [junit4]   2> 1083879 ERROR (TEST-TestReplicationHandler.doTestIllegalFilePaths-seed#[815806029902533F]) [    ] o.a.s.u.StartupLoggingUtils Missing Java Option solr.log.dir. Logging may be missing or incomplete.
   [junit4]   2> 1083879 INFO  (TEST-TestReplicationHandler.doTestIllegalFilePaths-seed#[815806029902533F]) [    ] o.a.s.s.SolrDispatchFilter  ___      _       Welcome to Apache Solr? version 7.3.0
   [junit4]   2> 1083879 INFO  (TEST-TestReplicationHandler.doTestIllegalFilePaths-seed#[815806029902533F]) [    ] o.a.s.s.SolrDispatchFilter / __| ___| |_ _   Starting in standalone mode on port null
   [junit4]   2> 1083880 INFO  (TEST-TestReplicationHandler.doTestIllegalFilePaths-seed#[815806029902533F]) [    ] o.a.s.s.SolrDispatchFilter \__ \/ _ \ | '_|  Install dir: null
   [junit4]   2> 1083880 INFO  (TEST-TestReplicationHandler.doTestIllegalFilePaths-seed#[815806029902533F]) [    ] o.a.s.s.SolrDispatchFilter |___/\___/_|_|    Start time: 2018-03-07T18:22:08.522Z
   [junit4]   2> 1083880 INFO  (TEST-TestReplicationHandler.doTestIllegalFilePaths-seed#[815806029902533F]) [    ] o.a.s.c.SolrXmlConfig Loading container configuration from /x1/jenkins/jenkins-slave/workspace/Lucene-Solr-NightlyTests-7.x/checkout/solr/build/solr-core/test/J1/temp/solr.handler.TestReplicationHandler_815806029902533F-001/solr-instance-001/solr.xml
   [junit4]   2> 1083884 INFO  (TEST-TestReplicationHandler.doTestIllegalFilePaths-seed#[815806029902533F]) [    ] o.a.s.c.SolrXmlConfig Configuration parameter autoReplicaFailoverWorkLoopDelay is ignored
   [junit4]   2> 1083884 INFO  (TEST-TestReplicationHandler.doTestIllegalFilePaths-seed#[815806029902533F]) [    ] o.a.s.c.SolrXmlConfig Configuration parameter autoReplicaFailoverBadNodeExpiration is ignored
   [junit4]   2> 1083886 INFO  (TEST-TestReplicationHandler.doTestIllegalFilePaths-seed#[815806029902533F]) [    ] o.a.s.c.SolrXmlConfig MBean server found: com.sun.jmx.mbeanserver.JmxMBeanServer@21de7e02, but no JMX reporters were configured - adding default JMX reporter.
   [junit4]   2> 1083934 INFO  (TEST-TestReplicationHandler.doTestIllegalFilePaths-seed#[815806029902533F]) [    ] o.a.s.m.r.SolrJmxReporter JMX monitoring for 'solr.node' (registry 'solr.node') enabled at server: com.sun.jmx.mbeanserver.JmxMBeanServer@21de7e02
   [junit4]   2> 1083949 INFO  (TEST-TestReplicationHandler.doTestIllegalFilePaths-seed#[815806029902533F]) [    ] o.a.s.m.r.SolrJmxReporter JMX monitoring for 'solr.jvm' (registry 'solr.jvm') enabled at server: com.sun.jmx.mbeanserver.JmxMBeanServer@21de7e02
   [junit4]   2> 1083949 INFO  (TEST-TestReplicationHandler.doTestIllegalFilePaths-seed#[815806029902533F]) [    ] o.a.s.m.r.SolrJmxReporter JMX monitoring for 'solr.jetty' (registry 'solr.jetty') enabled at server: com.sun.jmx.mbeanserver.JmxMBeanServer@21de7e02
   [junit4]   2> 1083952 INFO  (TEST-TestReplicationHandler.doTestIllegalFilePaths-seed#[815806029902533F]) [    ] o.a.s.c.CorePropertiesLocator Found 1 core definitions underneath /x1/jenkins/jenkins-slave/workspace/Lucene-Solr-NightlyTests-7.x/checkout/solr/build/solr-core/test/J1/temp/solr.handler.TestReplicationHandler_815806029902533F-001/solr-instance-001/.
   [junit4]   2> 1083952 INFO  (TEST-TestReplicationHandler.doTestIllegalFilePaths-seed#[815806029902533F]) [    ] o.a.s.c.CorePropertiesLocator Cores are: [collection1]
   [junit4]   2> 1083952 INFO  (coreLoadExecutor-5525-thread-1) [    ] o.a.s.c.TransientSolrCoreCacheDefault Allocating transient cache for 4 transient cores
   [junit4]   2> 1083964 INFO  (coreLoadExecutor-5525-thread-1) [    x:collection1] o.a.s.c.SolrConfig Using Lucene MatchVersion: 7.3.0
   [junit4]   2> 1083997 INFO  (coreLoadExecutor-5525-thread-1) [    x:collection1] o.a.s.s.IndexSchema [collection1] Schema name=test
   [junit4]   2> 1083999 INFO  (coreLoadExecutor-5525-thread-1) [    x:collection1] o.a.s.s.IndexSchema Loaded schema test/1.2 with uniqueid field id
   [junit4]   2> 1083999 INFO  (coreLoadExecutor-5525-thread-1) [    x:collection1] o.a.s.c.CoreContainer Creating SolrCore 'collection1' using configuration from instancedir /x1/jenkins/jenkins-slave/workspace/Lucene-Solr-NightlyTests-7.x/checkout/solr/build/solr-core/test/J1/temp/solr.handler.TestReplicationHandler_815806029902533F-001/solr-instance-001/./collection1, trusted=true
   [junit4]   2> 1083999 INFO  (coreLoadExecutor-5525-thread-1) [    x:collection1] o.a.s.m.r.SolrJmxReporter JMX monitoring for 'solr.core.collection1' (registry 'solr.core.collection1') enabled at server: com.sun.jmx.mbeanserver.JmxMBeanServer@21de7e02
   [junit4]   2> 1084000 INFO  (coreLoadExecutor-5525-thread-1) [    x:collection1] o.a.s.c.SolrCore solr.RecoveryStrategy.Builder
   [junit4]   2> 1084000 INFO  (coreLoadExecutor-5525-thread-1) [    x:collection1] o.a.s.c.SolrCore [[collection1] ] Opening new SolrCore at [/x1/jenkins/jenkins-slave/workspace/Lucene-Solr-NightlyTests-7.x/checkout/solr/build/solr-core/test/J1/temp/solr.handler.TestReplicationHandler_815806029902533F-001/solr-instance-001/collection1], dataDir=[/x1/jenkins/jenkins-slave/workspace/Lucene-Solr-NightlyTests-7.x/checkout/solr/build/solr-core/test/J1/temp/solr.handler.TestReplicationHandler_815806029902533F-001/solr-instance-001/./collection1/data/]
   [junit4]   2> 1084004 INFO  (coreLoadExecutor-5525-thread-1) [    x:collection1] o.a.s.u.RandomMergePolicy RandomMergePolicy wrapping class org.apache.lucene.index.TieredMergePolicy: [TieredMergePolicy: maxMergeAtOnce=44, maxMergeAtOnceExplicit=31, maxMergedSegmentMB=51.9248046875, floorSegmentMB=0.9326171875, forceMergeDeletesPctAllowed=26.222047216310823, segmentsPerTier=43.0, maxCFSSegmentSizeMB=8.796093022207999E12, noCFSRatio=0.5394515258443326
   [junit4]   2> 1084069 INFO  (coreLoadExecutor-5525-thread-1) [    x:collection1] o.a.s.u.CommitTracker Hard AutoCommit: disabled
   [junit4]   2> 1084069 INFO  (coreLoadExecutor-5525-thread-1) [    x:collection1] o.a.s.u.CommitTracker Soft AutoCommit: disabled
   [junit4]   2> 1084070 INFO  (coreLoadExecutor-5525-thread-1) [    x:collection1] o.a.s.u.RandomMergePolicy RandomMergePolicy wrapping class org.apache.lucene.index.MockRandomMergePolicy: org.apache.lucene.index.MockRandomMergePolicy@56413863
   [junit4]   2> 1084070 INFO  (coreLoadExecutor-5525-thread-1) [    x:collection1] o.a.s.s.SolrIndexSearcher Opening [Searcher@3834dab4[collection1] main]
   [junit4]   2> 1084071 INFO  (coreLoadExecutor-5525-thread-1) [    x:collection1] o.a.s.r.ManagedResourceStorage File-based storage initialized to use dir: /x1/jenkins/jenkins-slave/workspace/Lucene-Solr-NightlyTests-7.x/checkout/solr/build/solr-core/test/J1/temp/solr.handler.TestReplicationHandler_815806029902533F-001/solr-instance-001/collection1/conf
   [junit4]   2> 1084072 INFO  (coreLoadExecutor-5525-thread-1) [    x:collection1] o.a.s.h.ReplicationHandler Replication enabled for following config files: schema.xml,xslt/dummy.xsl
   [junit4]   2> 1084072 INFO  (coreLoadExecutor-5525-thread-1) [    x:collection1] o.a.s.h.ReplicationHandler Commits will be reserved for 10000ms.
   [junit4]   2> 1084073 INFO  (searcherExecutor-5526-thread-1-processing-x:collection1) [    x:collection1] o.a.s.c.SolrCore [collection1] Registered new searcher Searcher@3834dab4[collection1] main{ExitableDirectoryReader(UninvertingDirectoryReader())}
   [junit4]   2> 1084574 INFO  (TEST-TestReplicationHandler.doTestIllegalFilePaths-seed#[815806029902533F]) [    ] o.a.s.SolrTestCaseJ4 Writing core.properties file to /x1/jenkins/jenkins-slave/workspace/Lucene-Solr-NightlyTests-7.x/checkout/solr/build/solr-core/test/J1/temp/solr.handler.TestReplicationHandler_815806029902533F-001/solr-instance-002/collection1
   [junit4]   2> 1084577 INFO  (TEST-TestReplicationHandler.doTestIllegalFilePaths-seed#[815806029902533F]) [    ] o.e.j.s.Server jetty-9.4.8.v20171121, build timestamp: 2017-11-22T00:27:37+03:00, git hash: 82b8fb23f757335bb3329d540ce37a2a2615f0a8
   [junit4]   2> 1084580 INFO  (TEST-TestReplicationHandler.doTestIllegalFilePaths-seed#[815806029902533F]) [    ] o.e.j.s.session DefaultSessionIdManager workerName=node0
   [junit4]   2> 1084581 INFO  (TEST-TestReplicationHandler.doTestIllegalFilePaths-seed#[815806029902533F]) [    ] o.e.j.s.session No SessionScavenger set, using defaults
   [junit4]   2> 1084581 INFO  (TEST-TestReplicationHandler.doTestIllegalFilePaths-seed#[815806029902533F]) [    ] o.e.j.s.session Scavenging every 600000ms
   [junit4]   2> 1084585 INFO  (TEST-TestReplicationHandler.doTestIllegalFilePaths-seed#[815806029902533F]) [    ] o.e.j.s.h.ContextHandler Started o.e.j.s.ServletContextHandler@3caba9dd{/solr,null,AVAILABLE}
   [junit4]   2> 1084585 INFO  (TEST-TestReplicationHandler.doTestIllegalFilePaths-seed#[815806029902533F]) [    ] o.e.j.s.AbstractConnector Started ServerConnector@1e30b07e{HTTP/1.1,[http/1.1]}{127.0.0.1:56702}
   [junit4]   2> 1084585 INFO  (TEST-TestReplicationHandler.doTestIllegalFilePaths-seed#[815806029902533F]) [    ] o.e.j.s.Server Started @1087906ms
   [junit4]   2> 1084585 INFO  (TEST-TestReplicationHandler.doTestIllegalFilePaths-seed#[815806029902533F]) [    ] o.a.s.c.s.e.JettySolrRunner Jetty properties: {solr.data.dir=/x1/jenkins/jenkins-slave/workspace/Lucene-Solr-NightlyTests-7.x/checkout/solr/build/solr-core/test/J1/temp/solr.handler.TestReplicationHandler_815806029902533F-001/solr-instance-002/collection1/data, hostContext=/solr, hostPort=56702}
   [junit4]   2> 1084586 ERROR (TEST-TestReplicationHandler.doTestIllegalFilePaths-seed#[815806029902533F]) [    ] o.a.s.u.StartupLoggingUtils Missing Java Option solr.log.dir. Logging may be missing or incomplete.
   [junit4]   2> 1084586 INFO  (TEST-TestReplicationHandler.doTestIllegalFilePaths-seed#[815806029902533F]) [    ] o.a.s.s.SolrDispatchFilter  ___      _       Welcome to Apache Solr? version 7.3.0
   [junit4]   2> 1084586 INFO  (TEST-TestReplicationHandler.doTestIllegalFilePaths-seed#[815806029902533F]) [    ] o.a.s.s.SolrDispatchFilter / __| ___| |_ _   Starting in standalone mode on port null
   [junit4]   2> 1084586 INFO  (TEST-TestReplicationHandler.doTestIllegalFilePaths-seed#[815806029902533F]) [    ] o.a.s.s.SolrDispatchFilter \__ \/ _ \ | '_|  Install dir: null
   [junit4]   2> 1084586 INFO  (TEST-TestReplicationHandler.doTestIllegalFilePaths-seed#[815806029902533F]) [    ] o.a.s.s.SolrDispatchFilter |___/\___/_|_|    Start time: 2018-03-07T18:22:09.228Z
   [junit4]   2> 1084586 INFO  (TEST-TestReplicationHandler.doTestIllegalFilePaths-seed#[815806029902533F]) [    ] o.a.s.c.SolrXmlConfig Loading container configuration from /x1/jenkins/jenkins-slave/workspace/Lucene-Solr-NightlyTests-7.x/checkout/solr/build/solr-core/test/J1/temp/solr.handler.TestReplicationHandler_815806029902533F-001/solr-instance-002/solr.xml
   [junit4]   2> 1084591 INFO  (TEST-TestReplicationHandler.doTestIllegalFilePaths-seed#[815806029902533F]) [    ] o.a.s.c.SolrXmlConfig Configuration parameter autoReplicaFailoverWorkLoopDelay is ignored
   [junit4]   2> 1084591 INFO  (TEST-TestReplicationHandler.doTestIllegalFilePaths-seed#[815806029902533F]) [    ] o.a.s.c.SolrXmlConfig Configuration parameter autoReplicaFailoverBadNodeExpiration is ignored
   [junit4]   2> 1084592 INFO  (TEST-TestReplicationHandler.doTestIllegalFilePaths-seed#[815806029902533F]) [    ] o.a.s.c.SolrXmlConfig MBean server found: com.sun.jmx.mbeanserver.JmxMBeanServer@21de7e02, but no JMX reporters were configured - adding default JMX reporter.
   [junit4]   2> 1084639 INFO  (TEST-TestReplicationHandler.doTestIllegalFilePaths-seed#[815806029902533F]) [    ] o.a.s.m.r.SolrJmxReporter JMX monitoring for 'solr.node' (registry 'solr.node') enabled at server: com.sun.jmx.mbeanserver.JmxMBeanServer@21de7e02
   [junit4]   2> 1084656 INFO  (TEST-TestReplicationHandler.doTestIllegalFilePaths-seed#[815806029902533F]) [    ] o.a.s.m.r.SolrJmxReporter JMX monitoring for 'solr.jvm' (registry 'solr.jvm') enabled at server: com.sun.jmx.mbeanserver.JmxMBeanServer@21de7e02
   [junit4]   2> 1084656 INFO  (TEST-TestReplicationHandler.doTestIllegalFilePaths-seed#[815806029902533F]) [    ] o.a.s.m.r.SolrJmxReporter JMX monitoring for 'solr.jetty' (registry 'solr.jetty') enabled at server: com.sun.jmx.mbeanserver.JmxMBeanServer@21de7e02
   [junit4]   2> 1084659 INFO  (TEST-TestReplicationHandler.doTestIllegalFilePaths-seed#[815806029902533F]) [    ] o.a.s.c.CorePropertiesLocator Found 1 core definitions underneath /x1/jenkins/jenkins-slave/workspace/Lucene-Solr-NightlyTests-7.x/checkout/solr/build/solr-core/test/J1/temp/solr.handler.TestReplicationHandler_815806029902533F-001/solr-instance-002/.
   [junit4]   2> 1084660 INFO  (TEST-TestReplicationHandler.doTestIllegalFilePaths-seed#[815806029902533F]) [    ] o.a.s.c.CorePropertiesLocator Cores are: [collection1]
   [junit4]   2> 1084661 INFO  (coreLoadExecutor-5535-thread-1) [    ] o.a.s.c.TransientSolrCoreCacheDefault Allocating transient cache for 4 transient cores
   [junit4]   2> 1084688 INFO  (coreLoadExecutor-5535-thread-1) [    x:collection1] o.a.s.c.SolrConfig Using Lucene MatchVersion: 7.3.0
   [junit4]   2> 1084705 INFO  (coreLoadExecutor-5535-thread-1) [    x:collection1] o.a.s.s.IndexSchema [collection1] Schema name=test
   [junit4]   2> 1084712 INFO  (coreLoadExecutor-5535-thread-1) [    x:collection1] o.a.s.s.IndexSchema Loaded schema test/1.2 with uniqueid field id
   [junit4]   2> 1084713 INFO  (coreLoadExecutor-5535-thread-1) [    x:collection1] o.a.s.c.CoreContainer Creating SolrCore 'collection1' using configuration from instancedir /x1/jenkins/jenkins-slave/workspace/Lucene-Solr-NightlyTests-7.x/checkout/solr/build/solr-core/test/J1/temp/solr.handler.TestReplicationHandler_815806029902533F-001/solr-instance-002/./collection1, trusted=true
   [junit4]   2> 1084714 INFO  (coreLoadExecutor-5535-thread-1) [    x:collection1] o.a.s.m.r.SolrJmxReporter JMX monitoring for 'solr.core.collection1' (registry 'solr.core.collection1') enabled at server: com.sun.jmx.mbeanserver.JmxMBeanServer@21de7e02
   [junit4]   2> 1084714 INFO  (coreLoadExecutor-5535-thread-1) [    x:collection1] o.a.s.c.SolrCore solr.RecoveryStrategy.Builder
   [junit4]   2> 1084714 INFO  (coreLoadExecutor-5535-thread-1) [    x:collection1] o.a.s.c.SolrCore [[collection1] ] Opening new SolrCore at [/x1/jenkins/jenkins-slave/workspace/Lucene-Solr-NightlyTests-7.x/checkout/solr/build/solr-core/test/J1/temp/solr.handler.TestReplicationHandler_815806029902533F-001/solr-instance-002/collection1], dataDir=[/x1/jenkins/jenkins-slave/workspace/Lucene-Solr-NightlyTests-7.x/checkout/solr/build/solr-core/test/J1/temp/solr.handler.TestReplicationHandler_815806029902533F-001/solr-instance-002/./collection1/data/]
   [junit4]   2> 1084719 INFO  (coreLoadExecutor-5535-thread-1) [    x:collection1] o.a.s.u.RandomMergePolicy RandomMergePolicy wrapping class org.apache.lucene.index.TieredMergePolicy: [TieredMergePolicy: maxMergeAtOnce=44, maxMergeAtOnceExplicit=31, maxMergedSegmentMB=51.9248046875, floorSegmentMB=0.9326171875, forceMergeDeletesPctAllowed=26.222047216310823, segmentsPerTier=43.0, maxCFSSegmentSizeMB=8.796093022207999E12, noCFSRatio=0.5394515258443326
   [junit4]   2> 1084777 INFO  (coreLoadExecutor-5535-thread-1) [    x:collection1] o.a.s.u.CommitTracker Hard AutoCommit: disabled
   [junit4]   2> 1084777 INFO  (coreLoadExecutor-5535-thread-1) [    x:collection1] o.a.s.u.CommitTracker Soft AutoCommit: disabled
   [junit4]   2> 1084778 INFO  (coreLoadExecutor-5535-thread-1) [    x:collection1] o.a.s.u.RandomMergePolicy RandomMergePolicy wrapping class org.apache.lucene.index.MockRandomMergePolicy: org.apache.lucene.index.MockRandomMergePolicy@2ffca6e6
   [junit4]   2> 1084778 INFO  (coreLoadExecutor-5535-thread-1) [    x:collection1] o.a.s.s.SolrIndexSearcher Opening [Searcher@679e9fd2[collection1] main]
   [junit4]   2> 1084779 INFO  (coreLoadExecutor-5535-thread-1) [    x:collection1] o.a.s.r.ManagedResourceStorage File-based storage initialized to use dir: /x1/jenkins/jenkins-slave/workspace/Lucene-Solr-NightlyTests-7.x/checkout/solr/build/solr-core/test/J1/temp/solr.handler.TestReplicationHandler_815806029902533F-001/solr-instance-002/collection1/conf
   [junit4]   2> 1084781 INFO  (coreLoadExecutor-5535-thread-1) [    x:collection1] o.a.s.h.ReplicationHandler Poll scheduled at an interval of 1000ms
   [junit4]   2> 1084781 INFO  (coreLoadExecutor-5535-thread-1) [    x:collection1] o.a.s.h.ReplicationHandler Commits will be reserved for 10000ms.
   [junit4]   2> 1084786 ERROR (qtp1175069728-15731) [    x:collection1] o.a.s.h.RequestHandlerBase org.apache.solr.common.SolrException: File name must be relative
   [junit4]   2> 	at org.apache.solr.handler.ReplicationHandler$DirectoryFileStream.validateFilenameOrError(ReplicationHandler.java:1496)
   [junit4]   2> 	at org.apache.solr.handler.ReplicationHandler$DirectoryFileStream.<init>(ReplicationHandler.java:1469)
   [junit4]   2> 	at org.apache.solr.handler.ReplicationHandler.getFileStream(ReplicationHandler.java:593)
   [junit4]   2> 	at org.apache.solr.handler.ReplicationHandler.handleRequestBody(ReplicationHandler.java:276)
   [junit4]   2> 	at org.apache.solr.handler.RequestHandlerBase.handleRequest(RequestHandlerBase.java:195)
   [junit4]   2> 	at org.apache.solr.core.SolrCore.execute(SolrCore.java:2503)
   [junit4]   2> 	at org.apache.solr.servlet.HttpSolrCall.execute(HttpSolrCall.java:711)
   [junit4]   2> 	at org.apache.solr.servlet.HttpSolrCall.call(HttpSolrCall.java:517)
   [junit4]   2> 	at org.apache.solr.servlet.SolrDispatchFilter.doFilter(SolrDispatchFilter.java:384)
   [junit4]   2> 	at org.apache.solr.servlet.SolrDispatchFilter.doFilter(SolrDispatchFilter.java:330)
   [junit4]   2> 	at org.eclipse.jetty.servlet.ServletHandler$CachedChain.doFilter(ServletHandler.java:1637)
   [junit4]   2> 	at org.apache.solr.client.solrj.embedded.JettySolrRunner$DebugFilter.doFilter(JettySolrRunner.java:139)
   [junit4]   2> 	at org.eclipse.jetty.servlet.ServletHandler$CachedChain.doFilter(ServletHandler.java:1637)
   [junit4]   2> 	at org.eclipse.jetty.servlet.ServletHandler.doHandle(ServletHandler.java:533)
   [junit4]   2> 	at org.eclipse.jetty.server.handler.ScopedHandler.nextHandle(ScopedHandler.java:188)
   [junit4]   2> 	at org.eclipse.jetty.server.session.SessionHandler.doHandle(SessionHandler.java:1595)
   [junit4]   2> 	at org.eclipse.jetty.server.handler.ScopedHandler.nextHandle(ScopedHandler.java:188)
   [junit4]   2> 	at org.eclipse.jetty.server.handler.ContextHandler.doHandle(ContextHandler.java:1253)
   [junit4]   2> 	at org.eclipse.jetty.server.handler.ScopedHandler.nextScope(ScopedHandler.java:168)
   [junit4]   2> 	at org.eclipse.jetty.servlet.ServletHandler.doScope(ServletHandler.java:473)
   [junit4]   2> 	at org.eclipse.jetty.server.session.SessionHandler.doScope(SessionHandler.java:1564)
   [junit4]   2> 	at org.eclipse.jetty.server.handler.ScopedHandler.nextScope(ScopedHandler.java:166)
   [junit4]   2> 	at org.eclipse.jetty.server.handler.ContextHandler.doScope(ContextHandler.java:1155)
   [junit4]   2> 	at org.eclipse.jetty.server.handler.ScopedHandler.handle(ScopedHandler.java:141)
   [junit4]   2> 	at org.eclipse.jetty.server.handler.gzip.GzipHandler.handle(GzipHandler.java:527)
   [junit4]   2> 	at org.eclipse.jetty.server.handler.HandlerWrapper.handle(HandlerWrapper.java:132)
   [junit4]   2> 	at org.eclipse.jetty.server.Server.handle(Server.java:530)
   [junit4]   2> 	at org.eclipse.jetty.server.HttpChannel.handle(HttpChannel.java:347)
   [junit4]   2> 	at org.eclipse.jetty.server.HttpConnection.onFillable(HttpConnection.java:256)
   [junit4]   2> 	at org.eclipse.jetty.io.AbstractConnection$ReadCallback.succeeded(AbstractConnection.java:279)
   [junit4]   2> 	at org.eclipse.jetty.io.FillInterest.fillable(FillInterest.java:102)
   [junit4]   2> 	at org.eclipse.jetty.io.ChannelEndPoint$2.run(ChannelEndPoint.java:124)
   [junit4]   2> 	at org.eclipse.jetty.util.thread.strategy.EatWhatYouKill.doProduce(EatWhatYouKill.java:247)
   [junit4]   2> 	at org.eclipse.jetty.util.thread.strategy.EatWhatYouKill.produce(EatWhatYouKill.java:140)
   [junit4]   2> 	at org.eclipse.jetty.util.thread.QueuedThreadPool.runJob(QueuedThreadPool.java:708)
   [junit4]   2> 	at org.eclipse.jetty.util.thread.QueuedThreadPool$2.run(QueuedThreadPool.java:626)
   [junit4]   2> 	at java.lang.Thread.run(Thread.java:748)
   [junit4]   2> 
   [junit4]   2> 1084787 INFO  (qtp1175069728-15731) [    x:collection1] o.a.s.c.S.Request [collection1]  webapp=/solr path=/replication params={file=/x1/jenkins/jenkins-slave/workspace/Lucene-Solr-NightlyTests-7.x/checkout/solr/build/solr-core/test/J1/foo&command=filecontent} status=403 QTime=0
   [junit4]   2> 1084788 INFO  (searcherExecutor-5536-thread-1-processing-x:collection1) [    x:collection1] o.a.s.c.SolrCore [collection1] Registered new searcher Searcher@679e9fd2[collection1] main{ExitableDirectoryReader(UninvertingDirectoryReader())}
   [junit4]   2> 1084789 INFO  (qtp1175069728-15734) [    x:collection1] o.a.s.c.S.Request [collection1]  webapp=/solr path=/replication params={qt=/replication&wt=javabin&version=2&command=indexversion} status=0 QTime=0
   [junit4]   2> 1084789 INFO  (indexFetcher-5540-thread-1) [    x:collection1] o.a.s.h.IndexFetcher Master's generation: 1
   [junit4]   2> 1084789 INFO  (indexFetcher-5540-thread-1) [    x:collection1] o.a.s.h.IndexFetcher Master's version: 0
   [junit4]   2> 1084789 INFO  (indexFetcher-5540-thread-1) [    x:collection1] o.a.s.h.IndexFetcher Slave's generation: 1
   [junit4]   2> 1084789 ERROR (qtp1175069728-15730) [    x:collection1] o.a.s.h.RequestHandlerBase org.apache.solr.common.SolrException: File name cannot contain ..
   [junit4]   2> 	at org.apache.solr.handler.ReplicationHandler$DirectoryFileStream.lambda$validateFilenameOrError$0(ReplicationHandler.java:1492)
   [junit4]   2> 	at java.lang.Iterable.forEach(Iterable.java:75)
   [junit4]   2> 	at org.apache.solr.handler.ReplicationHandler$DirectoryFileStream.validateFilenameOrError(ReplicationHandler.java:1490)
   [junit4]   2> 	at org.apache.solr.handler.ReplicationHandler$DirectoryFileStream.<init>(ReplicationHandler.java:1469)
   [junit4]   2> 	at org.apache.solr.handler.ReplicationHandler.getFileStream(ReplicationHandler.java:593)
   [junit4]   2> 	at org.apache.solr.handler.ReplicationHandler.handleRequestBody(ReplicationHandler.java:276)
   [junit4]   2> 	at org.apache.solr.handler.RequestHandlerBase.handleRequest(RequestHandlerBase.java:195)
   [junit4]   2> 	at org.apache.solr.core.SolrCore.execute(SolrCore.java:2503)
   [junit4]   2> 	at org.apache.solr.servlet.HttpSolrCall.execute(HttpSolrCall.java:711)
   [junit4]   2> 	at org.apache.solr.servlet.HttpSolrCall.call(HttpSolrCall.java:517)
   [junit4]   2> 	at org.apache.solr.servlet.SolrDispatchFilter.doFilter(SolrDispatchFilter.java:384)
   [junit4]   2> 	at org.apache.solr.servlet.SolrDispatchFilter.doFilter(SolrDispatchFilter.java:330)
   [junit4]   2> 	at org.eclipse.jetty.servlet.ServletHandler$CachedChain.doFilter(ServletHandler.java:1637)
   [junit4]   2> 	at org.apache.solr.client.solrj.embedded.JettySolrRunner$DebugFilter.doFilter(JettySolrRunner.java:139)
   [junit4]   2> 	at org.eclipse.jetty.servlet.ServletHandler$CachedChain.doFilter(ServletHandler.java:1637)
   [junit4]   2> 	at org.eclipse.jetty.servlet.ServletHandler.doHandle(ServletHandler.java:533)
   [junit4]   2> 	at org.eclipse.jetty.server.handler.ScopedHandler.nextHandle(ScopedHandler.java:188)
   [junit4]   2> 	at org.eclipse.jetty.server.session.SessionHandler.doHandle(SessionHandler.java:1595)
   [junit4]   2> 	at org.eclipse.jetty.server.handler.ScopedHandler.nextHandle(ScopedHandler.java:188)
   [junit4]   2> 	at org.eclipse.jetty.server.handler.ContextHandler.doHandle(ContextHandler.java:1253)
   [junit4]   2> 	at org.eclipse.jetty.server.handler.ScopedHandler.nextScope(ScopedHandler.java:168)
   [junit4]   2> 	at org.eclipse.jetty.servlet.ServletHandler.doScope(ServletHandler.java:473)
   [junit4]   2> 	at org.eclipse.jetty.server.session.SessionHandler.doScope(SessionHandler.java:1564)
   [junit4]   2> 	at org.eclipse.jetty.server.handler.ScopedHandler.nextScope(ScopedHandler.java:166)
   [junit4]   2> 	at org.eclipse.jetty.server.handler.ContextHandler.doScope(ContextHandler.java:1155)
   [junit4]   2> 	at org.eclipse.jetty.server.handler.ScopedHandler.handle(ScopedHandler.java:141)
   [junit4]   2> 	at org.eclipse.jetty.server.handler.gzip.GzipHandler.handle(GzipHandler.java:527)
   [junit4]   2> 	at org.eclipse.jetty.server.handler.HandlerWrapper.handle(HandlerWrapper.java:132)
   [junit4]   2> 	at org.eclipse.jetty.server.Server.handle(Server.java:530)
   [junit4]   2> 	at org.eclipse.jetty.server.HttpChannel.handle(HttpChannel.java:347)
   [junit4]   2> 	at org.eclipse.jetty.server.HttpConnection.onFillable(HttpConnection.java:256)
   [junit4]   2> 	at org.eclipse.jetty.io.AbstractConnection$ReadCallback.succeeded(AbstractConnection.java:279)
   [junit4]   2> 	at org.eclipse.jetty.io.FillInterest.fillable(FillInterest.java:102)
   [junit4]   2> 	at org.eclipse.jetty.io.ChannelEndPoint$2.run(ChannelEndPoint.java:124)
   [junit4]   2> 	at org.eclipse.jetty.util.thread.strategy.EatWhatYouKill.doProduce(EatWhatYouKill.java:247)
   [junit4]   2> 	at org.eclipse.jetty.util.thread.strategy.EatWhatYouKill.produce(EatWhatYouKill.java:140)
   [junit4]   2> 	at org.eclipse.jetty.util.thread.strategy.EatWhatYouKill.run(EatWhatYouKill.java:131)
   [junit4]   2> 	at org.eclipse.jetty.util.thread.ReservedThreadExecutor$ReservedThread.run(ReservedThreadExecutor.java:382)
   [junit4]   2> 	at org.eclipse.jetty.util.thread.QueuedThreadPool.runJob(QueuedThreadPool.java:708)
   [junit4]   2> 	at org.eclipse.jetty.util.thread.QueuedThreadPool$2.run(QueuedThreadPool.java:626)
   [junit4]   2> 	at java.lang.Thread.run(Thread.java:748)
   [junit4]   2> 
   [junit4]   2> 1084790 INFO  (qtp1175069728-15730) [    x:collection1] o.a.s.c.S.Request [collection1]  webapp=/solr path=/replication params={file=../dir/traversal&command=filecontent} status=403 QTime=0
   [junit4]   2> 1084789 INFO  (indexFetcher-5540-thread-1) [    x:collection1] o.a.s.h.IndexFetcher Slave's version: 0
   [junit4]   2> 1084790 INFO  (indexFetcher-5540-thread-1) [    x:collection1] o.a.s.h.IndexFetcher New index in Master. Deleting mine...
   [junit4]   2> 1084790 INFO  (indexFetcher-5540-thread-1) [    x:collection1] o.a.s.u.DirectUpdateHandler2 start commit{,optimize=false,openSearcher=true,waitSearcher=true,expungeDeletes=false,softCommit=false,prepareCommit=false}
   [junit4]   2> 1084790 INFO  (indexFetcher-5540-thread-1) [    x:collection1] o.a.s.u.SolrIndexWriter Calling setCommitData with IW:org.apache.solr.update.SolrIndexWriter@7e1f9fe1 commitCommandVersion:0
   [junit4]   2> 1084796 INFO  (indexFetcher-5540-thread-1) [    x:collection1] o.a.s.s.SolrIndexSearcher Opening [Searcher@3f2295da[collection1] main]
   [junit4]   2> 1084796 INFO  (indexFetcher-5540-thread-1) [    x:collection1] o.a.s.u.DirectUpdateHandler2 end_commit_flush
   [junit4]   2> 1084797 ERROR (qtp1175069728-15737) [    x:collection1] o.a.s.h.RequestHandlerBase org.apache.solr.common.SolrException: File name must be relative
   [junit4]   2> 	at org.apache.solr.handler.ReplicationHandler$DirectoryFileStream.validateFilenameOrError(ReplicationHandler.java:1496)
   [junit4]   2> 	at org.apache.solr.handler.ReplicationHandler$DirectoryFileStream.<init>(ReplicationHandler.java:1470)
   [junit4]   2> 	at org.apache.solr.handler.ReplicationHandler$LocalFsFileStream.<init>(ReplicationHandler.java:1615)
   [junit4]   2> 	at org.apache.solr.handler.ReplicationHandler$LocalFsConfFileStream.<init>(ReplicationHandler.java:1681)
   [junit4]   2> 	at org.apache.solr.handler.ReplicationHandler.getFileStream(ReplicationHandler.java:589)
   [junit4]   2> 	at org.apache.solr.handler.ReplicationHandler.handleRequestBody(ReplicationHandler.java:276)
   [junit4]   2> 	at org.apache.solr.handler.RequestHandlerBase.handleRequest(RequestHandlerBase.java:195)
   [junit4]   2> 	at org.apache.solr.core.SolrCore.execute(SolrCore.java:2503)
   [junit4]   2> 	at org.apache.solr.servlet.HttpSolrCall.execute(HttpSolrCall.java:711)
   [junit4]   2> 	at org.apache.solr.servlet.HttpSolrCall.call(HttpSolrCall.java:517)
   [junit4]   2> 	at org.apache.solr.servlet.SolrDispatchFilter.doFilter(SolrDispatchFilter.java:384)
   [junit4]   2> 	at org.apache.solr.servlet.SolrDispatchFilter.doFilter(SolrDispatchFilter.java:330)
   [junit4]   2> 	at org.eclipse.jetty.servlet.ServletHandler$CachedChain.doFilter(ServletHandler.java:1637)
   [junit4]   2> 	at org.apache.solr.client.solrj.embedded.JettySolrRunner$DebugFilter.doFilter(JettySolrRunner.java:139)
   [junit4]   2> 	at org.eclipse.jetty.servlet.ServletHandler$CachedChain.doFilter(ServletHandler.java:1637)
   [junit4]   2> 	at org.eclipse.jetty.servlet.ServletHandler.doHandle(ServletHandler.java:533)
   [junit4]   2> 	at org.eclipse.jetty.server.handler.ScopedHandler.nextHandle(ScopedHandler.java:188)
   [junit4]   2> 	at org.eclipse.jetty.server.session.SessionHandler.doHandle(SessionHandler.java:1595)
   [junit4]   2> 	at org.eclipse.jetty.server.handler.ScopedHandler.nextHandle(ScopedHandler.java:188)
   [junit4]   2> 	at org.eclipse.jetty.server.handler.ContextHandler.doHandle(ContextHandler.java:1253)
   [junit4]   2> 	at org.eclipse.jetty.server.handler.ScopedHandler.nextScope(ScopedHandler.java:168)
   [junit4]   2> 	at org.eclipse.jetty.servlet.ServletHandler.doScope(ServletHandler.java:473)
   [junit4]   2> 	at org.eclipse.jetty.server.session.SessionHandler.doScope(SessionHandler.java:1564)
   [junit4]   2> 	at org.eclipse.jetty.server.handler.ScopedHandler.nextScope(ScopedHandler.java:166)
   [junit4]   2> 	at org.eclipse.jetty.server.handler.ContextHandler.doScope(ContextHandler.java:1155)
   [junit4]   2> 	at org.eclipse.jetty.server.handler.ScopedHandler.handle(ScopedHandler.java:141)
   [junit4]   2> 	at org.eclipse.jetty.server.handler.gzip.GzipHandler.handle(GzipHandler.java:527)
   [junit4]   2> 	at org.eclipse.jetty.server.handler.HandlerWrapper.handle(HandlerWrapper.java:132)
   [junit4]   2> 	at org.eclipse.jetty.server.Server.handle(Server.java:530)
   [junit4]   2> 	at org.eclipse.jetty.server.HttpChannel.handle(HttpChannel.java:347)
   [junit4]   2> 	at org.eclipse.jetty.server.HttpConnection.onFillable(HttpConnection.java:256)
   [junit4]   2> 	at org.eclipse.jetty.io.AbstractConnection$ReadCallback.succeeded(AbstractConnection.java:279)
   [junit4]   2> 	at org.eclipse.jetty.io.FillInterest.fillable(FillInterest.java:102)
   [junit4]   2> 	at org.eclipse.jetty.io.ChannelEndPoint$2.run(ChannelEndPoint.java:124)
   [junit4]   2> 	at org.eclipse.jetty.util.thread.strategy.EatWhatYouKill.doProduce(EatWhatYouKill.java:247)
   [junit4]   2> 	at org.eclipse.jetty.util.thread.strategy.EatWhatYouKill.produce(EatWhatYouKill.java:140)
   [junit4]   2> 	at org.eclipse.jetty.util.thread.strategy.EatWhatYouKill.run(EatWhatYouKill.java:131)
   [junit4]   2> 	at org.eclipse.jetty.util.thread.ReservedThreadExecutor$ReservedThread.run(ReservedThreadExecutor.java:382)
   [junit4]   2> 	at org.eclipse.jetty.util.thread.QueuedThreadPool.runJob(QueuedThreadPool.java:708)
   [junit4]   2> 	at org.eclipse.jetty.util.thread.QueuedThreadPool$2.run(QueuedThreadPool.java:626)
   [junit4]   2> 	at java.lang.Thread.run(Thread.java:748)
   [junit4]   2> 
   [junit4]   2> 1084797 INFO  (qtp1175069728-15737) [    x:collection1] o.a.s.c.S.Request [collection1]  webapp=/solr path=/replication params={cf=/x1/jenkins/jenkins-slave/workspace/Lucene-Solr-NightlyTests-7.x/checkout/solr/build/solr-core/test/J1/foo&command=filecontent} status=403 QTime=3
   [junit4]   2> 1084799 ERROR (qtp1175069728-15737) [    x:collection1] o.a.s.h.RequestHandlerBase org.apache.solr.common.SolrException: File name cannot contain ..
   [junit4]   2> 	at org.apache.solr.handler.ReplicationHandler$DirectoryFileStream.lambda$validateFilenameOrError$0(ReplicationHandler.java:1492)
   [junit4]   2> 	at java.lang.Iterable.forEach(Iterable.java:75)
   [junit4]   2> 	at org.apache.solr.handler.ReplicationHandler$DirectoryFileStream.validateFilenameOrError(ReplicationHandler.java:1490)
   [junit4]   2> 	at org.apache.solr.handler.ReplicationHandler$DirectoryFileStream.<init>(ReplicationHandler.java:1470)
   [junit4]   2> 	at org.apache.solr.handler.ReplicationHandler$LocalFsFileStream.<init>(ReplicationHandler.java:1615)
   [junit4]   2> 	at org.apache.solr.handler.ReplicationHandler$LocalFsConfFileStream.<init>(ReplicationHandler.java:1681)
   [junit4]   2> 	at org.apache.solr.handler.ReplicationHandler.getFileStream(ReplicationHandler.java:589)
   [junit4]   2> 	at org.apache.solr.handler.ReplicationHandler.handleRequestBody(ReplicationHandler.java:276)
   [junit4]   2> 	at org.apache.solr.handler.RequestHandlerBase.handleRequest(RequestHandlerBase.java:195)
   [junit4]   2> 	at org.apache.solr.core.SolrCore.execute(SolrCore.java:2503)
   [junit4]   2> 	at org.apache.solr.servlet.HttpSolrCall.execute(HttpSolrCall.java:711)
   [junit4]   2> 	at org.apache.solr.servlet.HttpSolrCall.call(HttpSolrCall.java:517)
   [junit4]   2> 	at org.apache.solr.servlet.SolrDispatchFilter.doFilter(SolrDispatchFilter.java:384)
   [junit4]   2> 	at org.apache.solr.servlet.SolrDispatchFilter.doFilter(SolrDispatchFilter.java:330)
   [junit4]   2> 	at org.eclipse.jetty.servlet.ServletHandler$CachedChain.doFilter(ServletHandler.java:1637)
   [junit4]   2> 	at org.apache.solr.client.solrj.embedded.JettySolrRunner$DebugFilter.doFilter(JettySolrRunner.java:139)
   [junit4]   2> 	at org.eclipse.jetty.servlet.ServletHandler$CachedChain.doFilter(ServletHandler.java:1637)
   [junit4]   2> 	at org.eclipse.jetty.servlet.ServletHandler.doHandle(ServletHandler.java:533)
   [junit4]   2> 	at org.eclipse.jetty.server.handler.ScopedHandler.nextHandle(ScopedHandler.java:188)
   [junit4]   2> 	at org.eclipse.jetty.server.session.SessionHandler.doHandle(SessionHandler.java:1595)
   [junit4]   2> 	at org.eclipse.jetty.server.handler.ScopedHandler.nextHandle(ScopedHandler.java:188)
   [junit4]   2> 	at org.eclipse.jetty.server.handler.ContextHandler.doHandle(ContextHandler.java:1253)
   [junit4]   2> 	at org.eclipse.jetty.server.handler.ScopedHandler.nextScope(ScopedHandler.java:168)
   [junit4]   2> 	at org.eclipse.jetty.servlet.ServletHandler.doScope(ServletHandler.java:473)
   [junit4]   2> 	at org.eclipse.jetty.server.session.SessionHandler.doScope(SessionHandler.java:1564)
   [junit4]   2> 	at org.eclipse.jetty.server.handler.ScopedHandler.nextScope(ScopedHandler.java:166)
   [junit4]   2> 	at org.eclipse.jetty.server.handler.ContextHandler.doScope(ContextHandler.java:1155)
   [junit4]   2> 	at org.eclipse.jetty.server.handler.ScopedHandler.handle(ScopedHandler.java:141)
   [junit4]   2> 	at org.eclipse.jetty.server.handler.gzip.GzipHandler.handle(GzipHandler.java:527)
   [junit4]   2> 	at org.eclipse.jetty.server.handler.HandlerWrapper.handle(HandlerWrapper.java:132)
   [junit4]   2> 	at org.eclipse.jetty.server.Server.handle(Server.java:530)
   [junit4]   2> 	at org.eclipse.jetty.server.HttpChannel.handle(HttpChannel.java:347)
   [junit4]   2> 	at org.eclipse.jetty.server.HttpConnection.onFillable(HttpConnection.java:256)
   [junit4]   2> 	at org.eclipse.jetty.io.AbstractConnection$ReadCallback.succeeded(AbstractConnection.java:279)
   [junit4]   2> 	at org.eclipse.jetty.io.FillInterest.fillable(FillInterest.java:102)
   [junit4]   2> 	at org.eclipse.jetty.io.ChannelEndPoint$2.run(ChannelEndPoint.java:124)
   [junit4]   2> 	at org.eclipse.jetty.util.thread.strategy.EatWhatYouKill.doProduce(EatWhatYouKill.java:247)
   [junit4]   2> 	at org.eclipse.jetty.util.thread.strategy.EatWhatYouKill.produce(EatWhatYouKill.java:140)
   [junit4]   2> 	at org.eclipse.jetty.util.thread.strategy.EatWhatYouKill.run(EatWhatYouKill.java:131)
   [junit4]   2> 	at org.eclipse.jetty.util.thread.ReservedThreadExecutor$ReservedThread.run(ReservedThreadExecutor.java:382)
   [junit4]   2> 	at org.eclipse.jetty.util.thread.QueuedThreadPool.runJob(QueuedThreadPool.java:708)
   [junit4]   2> 	at org.eclipse.jetty.util.thread.QueuedThreadPool$2.run(QueuedThreadPool.java:626)
   [junit4]   2> 	at java.lang.Thread.run(Thread.java:748)
   [junit4]   2> 
   [junit4]   2> 1084799 INFO  (qtp1175069728-15737) [    x:collection1] o.a.s.c.S.Request [collection1]  webapp=/solr path=/replication params={cf=../dir/traversal&command=filecontent} status=403 QTime=0
   [junit4]   2> 1084799 INFO  (searcherExecutor-5536-thread-1-processing-x:collection1) [    x:collection1] o.a.s.c.SolrCore [collection1] Registered new searcher Searcher@3f2295da[collection1] main{ExitableDirectoryReader(UninvertingDirectoryReader())}
   [junit4]   2> 1084802 ERROR (qtp1175069728-15733) [    x:collection1] o.a.s.h.RequestHandlerBase org.apache.solr.common.SolrException: File name must be relative
   [junit4]   2> 	at org.apache.solr.handler.ReplicationHandler$DirectoryFileStream.validateFilenameOrError(ReplicationHandler.java:1496)
   [junit4]   2> 	at org.apache.solr.handler.ReplicationHandler$DirectoryFileStream.<init>(ReplicationHandler.java:1471)
   [junit4]   2> 	at org.apache.solr.handler.ReplicationHandler$LocalFsFileStream.<init>(ReplicationHandler.java:1615)
   [junit4]   2> 	at org.apache.solr.handler.ReplicationHandler$LocalFsTlogFileStream.<init>(ReplicationHandler.java:1668)
   [junit4]   2> 	at org.apache.solr.handler.ReplicationHandler.getFileStream(ReplicationHandler.java:591)
   [junit4]   2> 	at org.apache.solr.handler.ReplicationHandler.handleRequestBody(ReplicationHandler.java:276)
   [junit4]   2> 	at org.apache.solr.handler.RequestHandlerBase.handleRequest(RequestHandlerBase.java:195)
   [junit4]   2> 	at org.apache.solr.core.SolrCore.execute(SolrCore.java:2503)
   [junit4]   2> 	at org.apache.solr.servlet.HttpSolrCall.execute(HttpSolrCall.java:711)
   [junit4]   2> 	at org.apache.solr.servlet.HttpSolrCall.call(HttpSolrCall.java:517)
   [junit4]   2> 	at org.apache.solr.servlet.SolrDispatchFilter.doFilter(SolrDispatchFilter.java:384)
   [junit4]   2> 	at org.apache.solr.servlet.SolrDispatchFilter.doFilter(SolrDispatchFilter.java:330)
   [junit4]   2> 	at org.eclipse.jetty.servlet.ServletHandler$CachedChain.doFilter(ServletHandler.java:1637)
   [junit4]   2> 	at org.apache.solr.client.solrj.embedded.JettySolrRunner$DebugFilter.doFilter(JettySolrRunner.java:139)
   [junit4]   2> 	at org.eclipse.jetty.servlet.ServletHandler$CachedChain.doFilter(ServletHandler.java:1637)
   [junit4]   2> 	at org.eclipse.jetty.servlet.ServletHandler.doHandle(ServletHandler.java:533)
   [junit4]   2> 	at org.eclipse.jetty.server.handler.ScopedHandler.nextHandle(ScopedHandler.java:188)
   [junit4]   2> 	at org.eclipse.jetty.server.session.SessionHandler.doHandle(SessionHandler.java:1595)
   [junit4]   2> 	at org.eclipse.jetty.server.handler.ScopedHandler.nextHandle(ScopedHandler.java:188)
   [junit4]   2> 	at org.eclipse.jetty.server.handler.ContextHandler.doHandle(ContextHandler.java:1253)
   [junit4]   2> 	at org.eclipse.jetty.server.handler.ScopedHandler.nextScope(ScopedHandler.java:168)
   [junit4]   2> 	at org.eclipse.jetty.servlet.ServletHandler.doScope(ServletHandler.java:473)
   [junit4]   2> 	at org.eclipse.jetty.server.session.SessionHandler.doScope(SessionHandler.java:1564)
   [junit4]   2> 	at org.eclipse.jetty.server.handler.ScopedHandler.nextScope(ScopedHandler.java:166)
   [junit4]   2> 	at org.eclipse.jetty.server.handler.ContextHandler.doScope(ContextHandler.java:1155)
   [junit4]   2> 	at org.eclipse.jetty.server.handler.ScopedHandler.handle(ScopedHandler.java:141)
   [junit4]   2> 	at org.eclipse.jetty.server.handler.gzip.GzipHandler.handle(GzipHandler.java:527)
   [junit4]   2> 	at org.eclipse.jetty.server.handler.HandlerWrapper.handle(HandlerWrapper.java:132)
   [junit4]   2> 	at org.eclipse.jetty.server.Server.handle(Server.java:530)
   [junit4]   2> 	at org.eclipse.jetty.server.HttpChannel.handle(HttpChannel.java:347)
   [junit4]   2> 	at org.eclipse.jetty.server.HttpConnection.onFillable(HttpConnection.java:256)
   [junit4]   2> 	at org.eclipse.jetty.io.AbstractConnection$ReadCallback.succeeded(AbstractConnection.java:279)
   [junit4]   2> 	at org.eclipse.jetty.io.FillInterest.fillable(FillInterest.java:102)
   [junit4]   2> 	at org.eclipse.jetty.io.ChannelEndPoint$2.run(ChannelEndPoint.java:124)
   [junit4]   2> 	at org.eclipse.jetty.util.thread.strategy.EatWhatYouKill.doProduce(EatWhatYouKill.java:247)
   [junit4]   2> 	at org.eclipse.jetty.util.thread.strategy.EatWhatYouKill.produce(EatWhatYouKill.java:140)
   [junit4]   2> 	at org.eclipse.jetty.util.thread.strategy.EatWhatYouKill.run(EatWhatYouKill.java:131)
   [junit4]   2> 	at org.eclipse.jetty.util.thread.ReservedThreadExecutor$ReservedThread.run(ReservedThreadExecutor.java:382)
   [junit4]   2> 	at org.eclipse.jetty.util.thread.QueuedThreadPool.runJob(QueuedThreadPool.java:708)
   [junit4]   2> 	at org.eclipse.jetty.util.thread.QueuedThreadPool$2.run(QueuedThreadPool.java:626)
   [junit4]   2> 	at java.lang.Thread.run(Thread.java:748)
   [junit4]   2> 
   [junit4]   2> 1084802 INFO  (qtp1175069728-15733) [    x:collection1] o.a.s.c.S.Request [collection1]  webapp=/solr path=/replication params={tlogFile=/x1/jenkins/jenkins-slave/workspace/Lucene-Solr-NightlyTests-7.x/checkout/solr/build/solr-core/test/J1/foo&command=filecontent} status=403 QTime=1
   [junit4]   2> 1084804 ERROR (qtp1175069728-15733) [    x:collection1] o.a.s.h.RequestHandlerBase org.apache.solr.common.SolrException: File name cannot contain ..
   [junit4]   2> 	at org.apache.solr.handler.ReplicationHandler$DirectoryFileStream.lambda$validateFilenameOrError$0(ReplicationHandler.java:1492)
   [junit4]   2> 	at java.lang.Iterable.forEach(Iterable.java:75)
   [junit4]   2> 	at org.apache.solr.handler.ReplicationHandler$DirectoryFileStream.validateFilenameOrError(ReplicationHandler.java:1490)
   [junit4]   2> 	at org.apache.solr.handler.ReplicationHandler$DirectoryFileStream.<init>(ReplicationHandler.java:1471)
   [junit4]   2> 	at org.apache.solr.handler.ReplicationHandler$LocalFsFileStream.<init>(ReplicationHandler.java:1615)
   [junit4]   2> 	at org.apache.solr.handler.ReplicationHandler$LocalFsTlogFileStream.<init>(ReplicationHandler.java:1668)
   [junit4]   2> 	at org.apache.solr.handler.ReplicationHandler.getFileStream(ReplicationHandler.java:591)
   [junit4]   2> 	at org.apache.solr.handler.ReplicationHandler.handleRequestBody(ReplicationHandler.java:276)
   [junit4]   2> 	at org.apache.solr.handler.RequestHandlerBase.handleRequest(RequestHandlerBase.java:195)
   [junit4]   2> 	at org.apache.solr.core.SolrCore.execute(SolrCore.java:2503)
   [junit4]   2> 	at org.apache.solr.servlet.HttpSolrCall.execute(HttpSolrCall.java:711)
   [junit4]   2> 	at org.apache.solr.servlet.HttpSolrCall.call(HttpSolrCall.java:517)
   [junit4]   2> 	at org.apache.solr.servlet.SolrDispatchFilter.doFilter(SolrDispatchFilter.java:384)
   [junit4]   2> 	at org.apache.solr.servlet.SolrDispatchFilter.doFilter(SolrDispatchFilter.java:330)
   [junit4]   2> 	at org.eclipse.jetty.servlet.ServletHandler$CachedChain.doFilter(ServletHandler.java:1637)
   [junit4]   2> 	at org.apache.solr.client.solrj.embedded.JettySolrRunner$DebugFilter.doFilter(JettySolrRunner.java:139)
   [junit4]   2> 	at org.eclipse.jetty.servlet.ServletHandler$CachedChain.doFilter(ServletHandler.java:1637)
   [junit4]   2> 	at org.eclipse.jetty.servlet.ServletHandler.doHandle(ServletHandler.java:533)
   [junit4]   2> 	at org.eclipse.jetty.server.handler.ScopedHandler.nextHandle(ScopedHandler.java:188)
   [junit4]   2> 	at org.eclipse.jetty.server.session.SessionHandler.doHandle(SessionHandler.java:1595)
   [junit4]   2> 	at org.eclipse.jetty.server.handler.ScopedHandler.nextHandle(ScopedHandler.java:188)
   [junit4]   2> 	at org.eclipse.jetty.server.handler.ContextHandler.doHandle(ContextHandler.java:1253)
   [junit4]   2> 	at org.eclipse.jetty.server.handler.ScopedHandler.nextScope(ScopedHandler.java:168)
   [junit4]   2> 	at org.eclipse.jetty.servlet.ServletHandler.doScope(ServletHandler.java:473)
   [junit4]   2> 	at org.eclipse.jetty.server.session.SessionHandler.doScope(SessionHandler.java:1564)
   [junit4]   2> 	at org.eclipse.jetty.server.handler.ScopedHandler.nextScope(ScopedHandler.java:166)
   [junit4]   2> 	at org.eclipse.jetty.server.handler.ContextHandler.doScope(ContextHandler.java:1155)
   [junit4]   2> 	at org.eclipse.jetty.server.handler.ScopedHandler.handle(ScopedHandler.java:141)
   [junit4]   2> 	at org.eclipse.jetty.server.handler.gzip.GzipHandler.handle(GzipHandler.java:527)
   [junit4]   2> 	at org.eclipse.jetty.server.handler.HandlerWrapper.handle(HandlerWrapper.java:132)
   [junit4]   2> 	at org.eclipse.jetty.server.Server.handle(Server.java:530)
   [junit4]   2> 	at org.eclipse.jetty.server.HttpChannel.handle(HttpChannel.java:347)
   [junit4]   2> 	at org.eclipse.jetty.server.HttpConnection.onFillable(HttpConnection.java:256)
   [junit4]   2> 	at org.eclipse.jetty.io.AbstractConnection$ReadCallback.succeeded(AbstractConnection.java:279)
   [junit4]   2> 	at org.eclipse.jetty.io.FillInterest.fillable(FillInterest.java:102)
   [junit4]   2> 	at org.eclipse.jetty.io.ChannelEndPoint$2.run(ChannelEndPoint.java:124)
   [junit4]   2> 	at org.eclipse.jetty.util.thread.strategy.EatWhatYouKill.doProduce(EatWhatYouKill.java:247)
   [junit4]   2> 	at org.eclipse.jetty.util.thread.strategy.EatWhatYouKill.produce(EatWhatYouKill.java:140)
   [junit4]   2> 	at org.eclipse.jetty.util.thread.strategy.EatWhatYouKill.run(EatWhatYouKill.java:131)
   [junit4]   2> 	at org.eclipse.jetty.util.thread.ReservedThreadExecutor$ReservedThread.run(ReservedThreadExecutor.java:382)
   [junit4]   2> 	at org.eclipse.jetty.util.thread.QueuedThreadPool.runJob(QueuedThreadPool.java:708)
   [junit4]   2> 	at org.eclipse.jetty.util.thread.QueuedThreadPool$2.run(QueuedThreadPool.java:626)
   [junit4]   2> 	at java.lang.Thread.run(Thread.java:748)
   [junit4]   2> 
   [junit4]   2> 1084804 INFO  (qtp1175069728-15733) [    x:collection1] o.a.s.c.S.Request [collection1]  webapp=/solr path=/replication params={tlogFile=../dir/traversal&command=filecontent} status=403 QTime=0
   [junit4]   2> 1084805 INFO  (TEST-TestReplicationHandler.doTestIllegalFilePaths-seed#[815806029902533F]) [    ] o.a.s.SolrTestCaseJ4 ###Ending doTestIllegalFilePaths
   [junit4]   2> 1084808 INFO  (TEST-TestReplicationHandler.doTestIllegalFilePaths-seed#[815806029902533F]) [    ] o.e.j.s.AbstractConnector Stopped ServerConnector@747ce196{HTTP/1.1,[http/1.1]}{127.0.0.1:0}
   [junit4]   2> 1084808 INFO  (TEST-TestReplicationHandler.doTestIllegalFilePaths-seed#[815806029902533F]) [    ] o.a.s.c.CoreContainer Shutting down CoreContainer instance=2023624753
   [junit4]   2> 1084808 INFO  (TEST-TestReplicationHandler.doTestIllegalFilePaths-seed#[815806029902533F]) [    ] o.a.s.m.SolrMetricManager Closing metric reporters for registry=solr.node, tag=null
   [junit4]   2> 1084808 INFO  (TEST-TestReplicationHandler.doTestIllegalFilePaths-seed#[815806029902533F]) [    ] o.a.s.m.r.SolrJmxReporter Closing reporter [org.apache.solr.metrics.reporters.SolrJmxReporter@48c72b2c: rootName = null, domain = solr.node, service url = null, agent id = null] for registry solr.node / com.codahale.metrics.MetricRegistry@4a1173f7
   [junit4]   2> 1084814 INFO  (TEST-TestReplicationHandler.doTestIllegalFilePaths-seed#[815806029902533F]) [    ] o.a.s.m.SolrMetricManager Closing metric reporters for registry=solr.jvm, tag=null
   [junit4]   2> 1084814 INFO  (TEST-TestReplicationHandler.doTestIllegalFilePaths-seed#[815806029902533F]) [    ] o.a.s.m.r.SolrJmxReporter Closing reporter [org.apache.solr.metrics.reporters.SolrJmxReporter@1eb4d804: rootName = null, domain = solr.jvm, service url = null, agent id = null] for registry solr.jvm / com.codahale.metrics.MetricRegistry@45ce5031
   [junit4]   2> 1084818 INFO  (TEST-TestReplicationHandler.doTestIllegalFilePaths-seed#[815806029902533F]) [    ] o.a.s.m.SolrMetricManager Closing metric reporters for registry=solr.jetty, tag=null
   [junit4]   2> 1084818 INFO  (TEST-TestReplicationHandler.doTestIllegalFilePaths-seed#[815806029902533F]) [    ] o.a.s.m.r.SolrJmxReporter Closing reporter [org.apache.solr.metrics.reporters.SolrJmxReporter@5ae43bdf: rootName = null, domain = solr.jetty, service url = null, agent id = null] for registry solr.jetty / com.codahale.metrics.MetricRegistry@6a7c90e1
   [junit4]   2> 1084818 INFO  (coreCloseExecutor-5541-thread-1) [    x:collection1] o.a.s.c.SolrCore [collection1]  CLOSING SolrCore org.apache.solr.core.SolrCore@6ff9e0a3
   [junit4]   2> 1084818 INFO  (coreCloseExecutor-5541-thread-1) [    x:collection1] o.a.s.m.SolrMetricManager Closing metric reporters for registry=solr.core.collection1, tag=1878646947
   [junit4]   2> 1084818 INFO  (coreCloseExecutor-5541-thread-1) [    x:collection1] o.a.s.m.r.SolrJmxReporter Closing reporter [org.apache.solr.metrics.reporters.SolrJmxReporter@574529e4: rootName = null, domain = solr.core.collection1, service url = null, agent id = null] for registry solr.core.collection1 / com.codahale.metrics.MetricRegistry@68a0ba1b
   [junit4]   2> 1084828 INFO  (TEST-TestReplicationHandler.doTestIllegalFilePaths-seed#[815806029902533F]) [    ] o.e.j.s.h.ContextHandler Stopped o.e.j.s.ServletContextHandler@401dfe74{/solr,null,UNAVAILABLE}
   [junit4]   2> 1084828 INFO  (TEST-TestReplicationHandler.doTestIllegalFilePaths-seed#[815806029902533F]) [    ] o.e.j.s.session Stopped scavenging
   [junit4]   2> 1084829 INFO  (TEST-TestReplicationHandler.doTestIllegalFilePaths-seed#[815806029902533F]) [    ] o.e.j.s.AbstractConnector Stopped ServerConnector@1e30b07e{HTTP/1.1,[http/1.1]}{127.0.0.1:0}
   [junit4]   2> 1084829 INFO  (TEST-TestReplicationHandler.doTestIllegalFilePaths-seed#[815806029902533F]) [    ] o.a.s.c.CoreContainer Shutting down CoreContainer instance=1430490617
   [junit4]   2> 1084829 INFO  (TEST-TestReplicationHandler.doTestIllegalFilePaths-seed#[815806029902533F]) [    ] o.a.s.m.SolrMetricManager Closing metric reporters for registry=solr.node, tag=null
   [junit4]   2> 1084829 INFO  (TEST-TestReplicationHandler.doTestIllegalFilePaths-seed#[815806029902533F]) [    ] o.a.s.m.r.SolrJmxReporter Closing reporter [org.apache.solr.metrics.reporters.SolrJmxReporter@17aeefb3: rootName = null, domain = solr.node, service url = null, agent id = null] for registry solr.node / com.codahale.metrics.MetricRegistry@28b56fb8
   [junit4]   2> 1084837 INFO  (TEST-TestReplicationHandler.doTestIllegalFilePaths-seed#[815806029902533F]) [    ] o.a.s.m.SolrMetricManager Closing metric reporters for registry=solr.jvm, tag=null
   [junit4]   2> 1084837 INFO  (TEST-TestReplicationHandler.doTestIllegalFilePaths-seed#[815806029902533F]) [    ] o.a.s.m.r.SolrJmxReporter Closing reporter [org.apache.solr.metrics.reporters.SolrJmxReporter@77e9d906: rootName = null, domain = solr.jvm, service url = null, agent id = null] for registry solr.jvm / com.codahale.metrics.MetricRegistry@45ce5031
   [junit4]   2> 1084843 INFO  (TEST-TestReplicationHandler.doTestIllegalFilePaths-seed#[815806029902533F]) [    ] o.a.s.m.SolrMetricManager Closing metric reporters for registry=solr.jetty, tag=null
   [junit4]   2> 1084843 INFO  (TEST-TestReplicationHandler.doTestIllegalFilePaths-seed#[815806029902533F]) [    ] o.a.s.m.r.SolrJmxReporter Closing reporter [org.apache.solr.metrics.reporters.SolrJmxReporter@96bc704: rootName = null, domain = solr.jetty, service url = null, agent id = null] for registry solr.jetty / com.codahale.metrics.MetricRegistry@6a7c90e1
   [junit4]   2> 1084843 INFO  (coreCloseExecutor-5543-thread-1) [    x:collection1] o.a.s.c.SolrCore [collection1]  CLOSING SolrCore org.apache.solr.core.SolrCore@79dfd19d
   [junit4]   2> 1084843 INFO  (coreCloseExecutor-5543-thread-1) [    x:collection1] o.a.s.m.SolrMetricManager Closing metric reporters for registry=solr.core.collection1, tag=2044711325
   [junit4]   2> 1084843 INFO  (coreCloseExecutor-5543-thread-1) [    x:collection1] o.a.s.m.r.SolrJmxReporter Closing reporter [org.apache.solr.metrics.reporters.SolrJmxReporter@66fd4007: rootName = null, domain = solr.core.collection1, service url = null, agent id = null] for registry solr.core.collection1 / com.codahale.metrics.MetricRegistry@1f4eaaba
   [junit4]   2> 1084856 INFO  (TEST-TestReplicationHandler.doTestIllegalFilePaths-seed#[815806029902533F]) [    ] o.e.j.s.h.ContextHandler Stopped o.e.j.s.ServletContextHandler@3caba9dd{/solr,null,UNAVAILABLE}
   [junit4]   2> 1084856 INFO  (TEST-TestReplicationHandler.doTestIllegalFilePaths-seed#[815806029902533F]) [    ] o.e.j.s.session Stopped scavenging
   [junit4]   2> 1084858 INFO  (TEST-TestReplicationHandler.testEmptyCommits-seed#[815806029902533F]) [    ] o.a.s.SolrTestCaseJ4 ###Starting testEmptyCommits
   [junit4]   2> 1084859 INFO  (TEST-TestReplicationHandler.testEmptyCommits-seed#[815806029902533F]) [    ] o.a.s.SolrTestCaseJ4 Writing core.properties file to /x1/jenkins/jenkins-slave/workspace/Lucene-Solr-NightlyTests-7.x/checkout/solr/build/solr-core/test/J1/temp/solr.handler.TestReplicationHandler_815806029902533F-001/solr-instance-003/collection1
   [junit4]   2> 1084862 INFO  (TEST-TestReplicationHandler.testEmptyCommits-seed#[815806029902533F]) [    ] o.e.j.s.Server jetty-9.4.8.v20171121, build timestamp: 2017-11-22T00:27:37+03:00, git hash: 82b8fb23f757335bb3329d540ce37a2a2615f0a8
   [junit4]   2> 1084869 INFO  (TEST-TestReplicationHandler.testEmptyCommits-seed#[815806029902533F]) [    ] o.e.j.s.session DefaultSessionIdManager workerName=node0
   [junit4]   2> 1084869 INFO  (TEST-TestReplicationHandler.testEmptyCommits-seed#[815806029902533F]) [    ] o.e.j.s.session No SessionScavenger set, using defaults
   [junit4]   2> 1084869 INFO  (TEST-TestReplicationHandler.testEmptyCommits-seed#[815806029902533F]) [    ] o.e.j.s.session Scavenging every 600000ms
   [junit4]   2> 1084870 INFO  (TEST-TestReplicationHandler.testEmptyCommits-seed#[815806029902533F]) [    ] o.e.j.s.h.ContextHandler Started o.e.j.s.ServletContextHandler@3e7cf85d{/solr,null,AVAILABLE}
   [junit4]   2> 1084870 INFO  (TEST-TestReplicationHandler.testEmptyCommits-seed#[815806029902533F]) [    ] o.e.j.s.AbstractConnector Started ServerConnector@3bc1e579{HTTP/1.1,[http/1.1]}{127.0.0.1:47382}
   [junit4]   2> 1084870 INFO  (TEST-TestReplicationHandler.testEmptyCommits-seed#[815806029902533F]) [    ] o.e.j.s.Server Started @1088191ms
   [junit4]   2> 1084870 INFO  (TEST-TestReplicationHandler.testEmptyCommits-seed#[815806029902533F]) [    ] o.a.s.c.s.e.JettySolrRunner Jetty properties: {solr.data.dir=/x1/jenkins/jenkins-slave/workspace/Lucene-Solr-NightlyTests-7.x/checkout/solr/build/solr-core/test/J1/temp/solr.handler.TestReplicationHandler_815806029902533F-001/solr-instance-003/collection1/data, hostContext=/solr, hostPort=47382}
   [junit4]   2> 1084871 ERROR (TEST-TestReplicationHandler.testEmptyCommits-seed#[815806029902533F]) [    ] o.a.s.u.StartupLoggingUtils Missing Java Option solr.log.dir. Logging may be missing or incomplete.
   [junit4]   2> 1084871 INFO  (TEST-TestReplicationHandler.testEmptyCommits-seed#[815806029902533F]) [    ] o.a.s.s.SolrDispatchFilter  ___      _       Welcome to Apache Solr? version 7.3.0
   [junit4]   2> 1084871 INFO  (TEST-TestReplicationHandler.testEmptyCommits-seed#[815806029902533F]) [    ] o.a.s.s.SolrDispatchFilter / __| ___| |_ _   Starting in standalone mode on port null
   [junit4]   2> 1084871 INFO  (TEST-TestReplicationHandler.testEmptyCommits-seed#[815806029902533F]) [    ] o.a.s.s.SolrDispatchFilter \__ \/ _ \ | '_|  Install dir: null
   [junit4]   2> 1084871 INFO  (TEST-TestReplicationHandler.testEmptyCommits-seed#[815806029902533F]) [    ] o.a.s.s.SolrDispatchFilter |___/\___/_|_|    Start time: 2018-03-07T18:22:09.513Z
   [junit4]   2> 1084871 INFO  (TEST-TestReplicationHandler.testEmptyCommits-seed#[815806029902533F]) [    ] o.a.s.c.SolrXmlConfig Loading container configuration from /x1/jenkins/jenkins-slave/workspace/Lucene-Solr-NightlyTests-7.x/checkout/solr/build/solr-core/test/J1/temp/solr.handler.TestReplicationHandler_815806029902533F-001/solr-instance-003/solr.xml
   [junit4]   2> 1084876 INFO  (TEST-TestReplicationHandler.testEmptyCommits-seed#[815806029902533F]) [    ] o.a.s.c.SolrXmlConfig Configuration parameter autoReplicaFailoverWorkLoopDelay is ignored
   [junit4]   2> 1084876 INFO  (TEST-TestReplicationHandler.testEmptyCommits-seed#[815806029902533F]) [    ] o.a.s.c.SolrXmlConfig Configuration parameter autoReplicaFailoverBadNodeExpiration is ignored
   [junit4]   2> 1084878 INFO  (TEST-TestReplicationHandler.testEmptyCommits-seed#[815806029902533F]) [    ] o.a.s.c.SolrXmlConfig MBean server found: com.sun.jmx.mbeanserver.JmxMBeanServer@21de7e02, but no JMX reporters were configured - adding default JMX reporter.
   [junit4]   2> 1084934 INFO  (TEST-TestReplicationHandler.testEmptyCommits-seed#[815806029902533F]) [    ] o.a.s.m.r.SolrJmxReporter JMX monitoring for 'solr.node' (registry 'solr.node') enabled at server: com.sun.jmx.mbeanserver.JmxMBeanServer@21de7e02
   [junit4]   2> 1084953 INFO  (TEST-TestReplicationHandler.testEmptyCommits-seed#[815806029902533F]) [    ] o.a.s.m.r.SolrJmxReporter JMX monitoring for 'solr.jvm' (registry 'solr.jvm') enabled at server: com.sun.jmx.mbeanserver.JmxMBeanServer@21de7e02
   [junit4]   2> 1084953 INFO  (TEST-TestReplicationHandler.testEmptyCommits-seed#[815806029902533F]) [    ] o.a.s.m.r.SolrJmxReporter JMX monitoring for 'solr.jetty' (registry 'solr.jetty') enabled at server: com.sun.jmx.mbeanserver.JmxMBeanServer@21de7e02
   [junit4]   2> 1084956 INFO  (TEST-TestReplicationHandler.testEmptyCommits-seed#[815806029902533F]) [    ] o.a.s.c.CorePropertiesLocator Found 1 core definitions underneath /x1/jenkins/jenkins-slave/workspace/Lucene-Solr-NightlyTests-7.x/checkout/solr/build/solr-core/test/J1/temp/solr.handler.TestReplicationHandler_815806029902533F-001/solr-instance-003/.
   [junit4]   2> 1084956 INFO  (TEST-TestReplicationHandler.testEmptyCommits-seed#[815806029902533F]) [    ] o.a.s.c.CorePropertiesLocator Cores are: [collection1]
   [junit4]   2> 1084957 INFO  (coreLoadExecutor-5550-thread-1) [    ] o.a.s.c.TransientSolrCoreCacheDefault Allocating transient cache for 4 transient cores
   [junit4]   2> 1084984 INFO  (coreLoadExecutor-5550-thread-1) [    x:collection1] o.a.s.c.SolrConfig Using Lucene MatchVersion: 7.3.0
   [junit4]   2> 1085000 INFO  (coreLoadExecutor-5550-thread-1) [    x:collection1] o.a.s.s.IndexSchema [collection1] Schema name=test
   [junit4]   2> 1085005 INFO  (coreLoadExecutor-5550-thread-1) [    x:collection1] o.a.s.s.IndexSchema Loaded schema test/1.2 with uniqueid field id
   [junit4]   2> 1085005 INFO  (coreLoadExecutor-5550-thread-1) [    x:collection1] o.a.s.c.CoreContainer Creating SolrCore 'collection1' using configuration from instancedir /x1/jenkins/jenkins-slave/workspace/Lucene-Solr-NightlyTests-7.x/checkout/solr/build/solr-core/test/J1/temp/solr.handler.TestReplicationHandler_815806029902533F-001/solr-instance-003/./collection1, trusted=true
   [junit4]   2> 1085006 INFO  (coreLoadExecutor-5550-thread-1) [    x:collection1] o.a.s.m.r.SolrJmxReporter JMX monitoring for 'solr.core.collection1' (registry 'solr.core.collection1') enabled at server: com.sun.jmx.mbeanserver.JmxMBeanServer@21de7e02
   [junit4]   2> 1085006 INFO  (coreLoadExecutor-5550-thread-1) [    x:collection1] o.a.s.c.SolrCore solr.RecoveryStrategy.Builder
   [junit4]   2> 1085006 INFO  (coreLoadExecutor-5550-thread-1) [    x:collection1] o.a.s.c.SolrCore [[collection1] ] Opening new SolrCore at [/x1/jenkins/jenkins-slave/workspace/Lucene-Solr-NightlyTests-7.x/checkout/solr/build/solr-core/test/J1/temp/solr.handler.TestReplicationHandler_815806029902533F-001/solr-instance-003/collection1], dataDir=[/x1/jenkins/jenkins-slave/workspace/Lucene-Solr-NightlyTests-7.x/checkout/solr/build/solr-core/test/J1/temp/solr.handler.TestReplicationHandler_815806029902533F-001/solr-instance-003/./collection1/data/]
   [junit4]   2> 1085013 INFO  (coreLoadExecutor-5550-thread-1) [    x:collection1] o.a.s.u.RandomMergePolicy RandomMergePolicy wrapping class org.apache.lucene.index.TieredMergePolicy: [TieredMergePolicy: maxMergeAtOnce=44, maxMergeAtOnceExplicit=31, maxMergedSegmentMB=51.9248046875, floorSegmentMB=0.9326171875, forceMergeDeletesPctAllowed=26.222047216310823, segmentsPerTier=43.0, maxCFSSegmentSizeMB=8.796093022207999E12, noCFSRatio=0.5394515258443326
   [junit4]   2> 1085070 INFO  (coreLoadExecutor-5550-thread-1) [    x:collection1] o.a.s.u.CommitTracker Hard AutoCommit: disabled
   [junit4]   2> 1085070 INFO  (coreLoadExecutor-5550-thread-1) [    x:collection1] o.a.s.u.CommitTracker Soft AutoCommit: disabled
   [junit4]   2> 1085072 INFO  (coreLoadExecutor-5550-thread-1) [    x:collection1] o.a.s.u.RandomMergePolicy RandomMergePolicy wrapping class org.apache.lucene.index.MockRandomMergePolicy: org.apache.lucene.index.MockRandomMergePolicy@d2375a5
   [junit4]   2> 1085072 INFO  (coreLoadExecutor-5550-thread-1) [    x:collection1] o.a.s.s.SolrIndexSearcher Opening [Searcher@6e6997cf[collection1] main]
   [junit4]   2> 1085073 INFO  (coreLoadExecutor-5550-thread-1) [    x:collection1] o.a.s.r.ManagedResourceStorage File-based storage initialized to use dir: /x1/jenkins/jenkins-slave/workspace/Lucene-Solr-NightlyTests-7.x/checkout/solr/build/solr-core/test/J1/temp/solr.handler.TestReplicationHandler_815806029902533F-001/solr-instance-003/collection1/conf
   [junit4]   2> 1085075 INFO  (coreLoadExecutor-5550-thread-1) [    x:collection1] o.a.s.h.ReplicationHandler Replication enabled for following config files: schema.xml,xslt/dummy.xsl
   [junit4]   2> 1085075 INFO  (coreLoadExecutor-5550-thread-1) [    x:collection1] o.a.s.h.ReplicationHandler Commits will be reserved for 10000ms.
   [junit4]   2> 1085078 INFO  (searcherExecutor-5551-thread-1-processing-x:collection1) [    x:collection1] o.a.s.c.SolrCore [collection1] Registered new searcher Searcher@6e6997cf[collection1] main{ExitableDirectoryReader(UninvertingDirectoryReader())}
   [junit4]   2> 1085581 INFO  (TEST-TestReplicationHandler.testEmptyCommits-seed#[815806029902533F]) [    ] o.a.s.SolrTestCaseJ4 Writing core.properties file to /x1/jenkins/jenkins-slave/workspace/Lucene-Solr-NightlyTests-7.x/checkout/solr/build/solr-core/test/J1/temp/solr.handler.TestReplicationHandler_815806029902533F-001/solr-instance-004/collection1
   [junit4]   2> 1085584 INFO  (TEST-TestReplicationHandler.testEmptyCommits-seed#[815806029902533F]) [    ] o.e.j.s.Server jetty-9.4.8.v20171121, build timestamp: 2017-11-22T00:27:37+03:00, git hash: 82b8fb23f757335bb3329d540ce37a2a2615f0a8
   [junit4]   2> 1085619 INFO  (TEST-TestReplicationHandler.testEmptyCommits-seed#[815806029902533F]) [    ] o.e.j.s.session DefaultSessionIdManager workerName=node0
   [junit4]   2> 1085619 INFO  (TEST-TestReplicationHandler.testEmptyCommits-seed#[815806029902533F]) [    ] o.e.j.s.session No SessionScavenger set, using defaults
   [junit4]   2> 1085620 INFO  (TEST-TestReplicationHandler.testEmptyCommits-seed#[815806029902533F]) [    ] o.e.j.s.session Scavenging every 660000ms
   [junit4]   2> 1085621 INFO  (TEST-TestReplicationHandler.testEmptyCommits-seed#[815806029902533F]) [    ] o.e.j.s.h.ContextHandler Started o.e.j.s.ServletContextHandler@473cfb2c{/solr,null,AVAILABLE}
   [junit4]   2> 1085621 INFO  (TEST-TestReplicationHandler.testEmptyCommits-seed#[815806029902533F]) [    ] o.e.j.s.AbstractConnector Started ServerConnector@363b4dad{HTTP/1.1,[http/1.1]}{127.0.0.1:38991}
   [junit4]   2> 1085621 INFO  (TEST-TestReplicationHandler.testEmptyCommits-seed#[815806029902533F]) [    ] o.e.j.s.Server Started @1088942ms
   [junit4]   2> 1085621 INFO  (TEST-TestReplicationHandler.testEmptyCommits-seed#[815806029902533F]) [    ] o.a.s.c.s.e.JettySolrRunner Jetty properties: {solr.data.dir=/x1/jenkins/jenkins-slave/workspace/Lucene-Solr-NightlyTests-7.x/checkout/solr/build/solr-core/test/J1/temp/solr.handler.TestReplicationHandler_815806029902533F-001/solr-instance-004/collection1/data, hostContext=/solr, hostPort=38991}
   [junit4]   2> 1085621 ERROR (TEST-TestReplicationHandler.testEmptyCommits-seed#[815806029902533F]) [    ] o.a.s.u.StartupLoggingUtils Missing Java Option solr.log.dir. Logging may be missing or incomplete.
   [junit4]   2> 1085622 INFO  (TEST-TestReplicationHandler.testEmptyCommits-seed#[815806029902533F]) [    ] o.a.s.s.SolrDispatchFilter  ___      _       Welcome to Apache Solr? version 7.3.0
   [junit4]   2> 1085622 INFO  (TEST-TestReplicationHandler.testEmptyCommits-seed#[815806029902533F]) [    ] o.a.s.s.SolrDispatchFilter / __| ___| |_ _   Starting in standalone mode on port null
   [junit4]   2> 1085622 INFO  (TEST-TestReplicationHandler.testEmptyCommits-seed#[815806029902533F]) [    ] o.a.s.s.SolrDispatchFilter \__ \/ _ \ | '_|  Install dir: null
   [junit4]   2> 1085622 INFO  (TEST-TestReplicationHandler.testEmptyCommits-seed#[815806029902533F]) [    ] o.a.s.s.SolrDispatchFilter |___/\___/_|_|    Start time: 2018-03-07T18:22:10.264Z
   [junit4]   2> 1085622 INFO  (TEST-TestReplicationHandler.testEmptyCommits-seed#[815806029902533F]) [    ] o.a.s.c.SolrXmlConfig Loading container configuration from /x1/jenkins/jenkins-slave/workspace/Lucene-Solr-NightlyTests-7.x/checkout/solr/build/solr-core/test/J1/temp/solr.handler.TestReplicationHandler_815806029902533F-001/solr-instance-004/solr.xml
   [junit4]   2> 1085627 INFO  (TEST-TestReplicationHandler.testEmptyCommits-seed#[815806029902533F]) [    ] o.a.s.c.SolrXmlConfig Configuration parameter autoReplicaFailoverWorkLoopDelay is ignored
   [junit4]   2> 1085627 INFO  (TEST-TestReplicationHandler.testEmptyCommits-seed#[815806029902533F]) [    ] o.a.s.c.SolrXmlConfig Configuration parameter autoReplicaFailoverBadNodeExpiration is ignored
   [junit4]   2> 1085629 INFO  (TEST-TestReplicationHandler.testEmptyCommits-seed#[815806029902533F]) [    ] o.a.s.c.SolrXmlConfig MBean server found: com.sun.jmx.mbeanserver.JmxMBeanServer@21de7e02, but no JMX reporters were configured - adding default JMX reporter.
   [junit4]   2> 1085746 INFO  (TEST-TestReplicationHandler.testEmptyCommits-seed#[815806029902533F]) [    ] o.a.s.m.r.SolrJmxReporter JMX monitoring for 'solr.node' (registry 'solr.node') enabled at server: com.sun.jmx.mbeanserver.JmxMBeanServer@21de7e02
   [junit4]   2> 1085766 INFO  (TEST-TestReplicationHandler.testEmptyCommits-seed#[815806029902533F]) [    ] o.a.s.m.r.SolrJmxReporter JMX monitoring for 'solr.jvm' (registry 'solr.jvm') enabled at server: com.sun.jmx.mbeanserver.JmxMBeanServer@21de7e02
   [junit4]   2> 1085766 INFO  (TEST-TestReplicationHandler.testEmptyCommits-seed#[815806029902533F]) [    ] o.a.s.m.r.SolrJmxReporter JMX monitoring for 'solr.jetty' (registry 'solr.jetty') enabled at server: com.sun.jmx.mbeanserver.JmxMBeanServer@21de7e02
   [junit4]   2> 1085770 INFO  (TEST-TestReplicationHandler.testEmptyCommits-seed#[815806029902533F]) [    ] o.a.s.c.CorePropertiesLocator Found 1 core definitions underneath /x1/jenkins/jenkins-slave/workspace/Lucene-Solr-NightlyTests-7.x/checkout/solr/build/solr-core/test/J1/temp/solr.handler.TestReplicationHandler_815806029902533F-001/solr-instance-004/.
   [junit4]   2> 1085770 INFO  (TEST-TestReplicationHandler.testEmptyCommits-seed#[815806029902533F]) [    ] o.a.s.c.CorePropertiesLocator Cores are: [collection1]
   [junit4]   2> 1085771 INFO  (coreLoadExecutor-5560-thread-1) [    ] o.a.s.c.TransientSolrCoreCacheDefault Allocating transient cache for 4 transient cores
   [junit4]   2> 1085804 INFO  (coreLoadExecutor-5560-thread-1) [    x:collection1] o.a.s.c.SolrConfig Using Lucene MatchVersion: 7.3.0
   [junit4]   2> 1085813 INFO  (coreLoadExecutor-5560-thread-1) [    x:collection1] o.a.s.s.IndexSchema [collection1] Schema name=test
   [junit4]   2> 1085816 INFO  (coreLoadExecutor-5560-thread-1) [    x:collection1] o.a.s.s.IndexSchema Loaded schema test/1.2 with uniqueid field id
   [junit4]   2> 1085816 INFO  (coreLoadExecutor-5560-thread-1) [    x:collection1] o.a.s.c.CoreContainer Creating SolrCore 'collection1' using configuration from instancedir /x1/jenkins/jenkins-slave/workspace/Lucene-Solr-NightlyTests-7.x/checkout/solr/build/solr-core/test/J1/temp/solr.handler.TestReplicationHandler_815806029902533F-001/solr-instance-004/./collection1, trusted=true
   [junit4]   2> 1085816 INFO  (coreLoadExecutor-5560-thread-1) [    x:collection1] o.a.s.m.r.SolrJmxReporter JMX monitoring for 'solr.core.collection1' (registry 'solr.core.collection1') enabled at server: com.sun.jmx.mbeanserver.JmxMBeanServer@21de7e02
   [junit4]   2> 1085816 INFO  (coreLoadExecutor-5560-thread-1) [    x:collection1] o.a.s.c.SolrCore solr.RecoveryStrategy.Builder
   [junit4]   2> 1085816 INFO  (coreLoadExecutor-5560-thread-1) [    x:collection1] o.a.s.c.SolrCore [[collection1] ] Opening new SolrCore at [/x1/jenkins/jenkins-slave/workspace/Lucene-Solr-NightlyTests-7.x/checkout/solr/build/solr-core/test/J1/temp/solr.handler.TestReplicationHandler_815806029902533F-001/solr-instance-004/collection1], dataDir=[/x1/jenkins/jenkins-slave/workspace/Lucene-Solr-NightlyTests-7.x/checkout/solr/build/solr-core/test/J1/temp/solr.handler.TestReplicationHandler_815806029902533F-001/solr-instance-004/./collection1/data/]
   [junit4]   2> 1085819 INFO  (coreLoadExecutor-5560-thread-1) [    x:collection1] o.a.s.u.RandomMergePolicy RandomMergePolicy wrapping class org.apache.lucene.index.TieredMergePolicy: [TieredMergePolicy: maxMergeAtOnce=44, maxMergeAtOnceExplicit=31, maxMergedSegmentMB=51.9248046875, floorSegmentMB=0.9326171875, forceMergeDeletesPctAllowed=26.222047216310823, segmentsPerTier=43.0, maxCFSSegmentSizeMB=8.796093022207999E12, noCFSRatio=0.5394515258443326
   [junit4]   2> 1085881 INFO  (coreLoadExecutor-5560-thread-1) [    x:collection1] o.a.s.u.CommitTracker Hard AutoCommit: disabled
   [junit4]   2> 1085881 INFO  (coreLoadExecutor-5560-thread-1) [    x:collection1] o.a.s.u.CommitTracker Soft AutoCommit: disabled
   [junit4]   2> 1085883 INFO  (coreLoadExecutor-5560-thread-1) [    x:collection1] o.a.s.u.RandomMergePolicy RandomMergePolicy wrapping class org.apache.lucene.index.MockRandomMergePolicy: org.apache.lucene.index.MockRandomMergePolicy@792e0e5
   [junit4]   2> 1085883 INFO  (coreLoadExecutor-5560-thread-1) [    x:collection1] o.a.s.s.SolrIndexSearcher Opening [Searcher@62649653[collection1] main]
   [junit4]   2> 1085883 INFO  (coreLoadExecutor-5560-thread-1) [    x:collection1] o.a.s.r.ManagedResourceStorage File-based storage initialized to use dir: /x1/jenkins/jenkins-slave/workspace/Lucene-Solr-NightlyTests-7.x/checkout/solr/build/solr-core/test/J1/temp/solr.handler.TestReplicationHandler_815806029902533F-001/solr-instance-004/collection1/conf
   [junit4]   2> 1085886 INFO  (coreLoadExecutor-5560-thread-1) [    x:collection1] o.a.s.h.ReplicationHandler Poll scheduled at an interval of 1000ms
   [junit4]   2> 1085886 INFO  (coreLoadExecutor-5560-thread-1) [    x:collection1] o.a.s.h.ReplicationHandler Commits will be reserved for 10000ms.
   [junit4]   2> 1085888 INFO  (searcherExecutor-5561-thread-1-processing-x:collection1) [    x:collection1] o.a.s.c.SolrCore [collection1] Registered new searcher Searcher@62649653[collection1] main{ExitableDirectoryReader(UninvertingDirectoryReader())}
   [junit4]   2> 1085892 INFO  (qtp2041507277-15773) [    x:collection1] o.a.s.c.S.Request [collection1]  webapp=/solr path=/replication params={qt=/replication&wt=javabin&version=2&command=indexversion} status=0 QTime=0
   [junit4]   2> 1085895 INFO  (qtp2041507277-15775) [    x:collection1] o.a.s.c.S.Request [collection1]  webapp=/solr path=/select params={q=*:*&sort=id+desc&wt=javabin&version=2} hits=0 status=0 QTime=0
   [junit4]   2> 1085896 INFO  (qtp2041507277-15773) [    x:collection1] o.a.s.u.p.LogUpdateProcessorFactory [collection1]  webapp=/solr path=/update params={wt=javabin&version=2}{add=[1]} 0 0
   [junit4]   2> 1085897 INFO  (qtp2041507277-15775) [    x:collection1] o.a.s.u.DirectUpdateHandler2 start commit{,optimize=false,openSearcher=true,waitSearcher=true,expungeDeletes=false,softCommit=false,prepareCommit=false}
   [junit4]   2> 1085897 INFO  (qtp2041507277-15775) [    x:collection1] o.a.s.u.SolrIndexWriter Calling setCommitData with IW:org.apache.solr.update.SolrIndexWriter@7a6ba2d4 commitCommandVersion:0
   [junit4]   2> 1085899 INFO  (indexFetcher-5565-thread-1) [    x:collection1] o.a.s.h.IndexFetcher Master's generation: 1
   [junit4]   2> 1085899 INFO  (indexFetcher-5565-thread-1) [    x:collection1] o.a.s.h.IndexFetcher Master's version: 0
   [junit4]   2> 1085899 INFO  (indexFetcher-5565-thread-1) [    x:collection1] o.a.s.h.IndexFetcher Slave's generation: 1
   [junit4]   2> 1085899 INFO  (indexFetcher-5565-thread-1) [    x:collection1] o.a.s.h.IndexFetcher Slave's version: 0
   [junit4]   2> 1085899 INFO  (indexFetcher-5565-thread-1) [    x:collection1] o.a.s.h.IndexFetcher New index in Master. Deleting mine...
   [junit4]   2> 1085899 INFO  (indexFetcher-5565-thread-1) [    x:colle

[...truncated too long message...]

calhost:0
   [junit4]   2> 3448843 WARN  (DataNode: [[[DISK]file:/x1/jenkins/jenkins-slave/workspace/Lucene-Solr-NightlyTests-7.x/checkout/solr/build/solr-core/test/J1/temp/solr.core.HdfsDirectoryFactoryTest_815806029902533F-001/tempDir-001/hdfsBaseDir/data/data3/, [DISK]file:/x1/jenkins/jenkins-slave/workspace/Lucene-Solr-NightlyTests-7.x/checkout/solr/build/solr-core/test/J1/temp/solr.core.HdfsDirectoryFactoryTest_815806029902533F-001/tempDir-001/hdfsBaseDir/data/data4/]]  heartbeating to localhost/127.0.0.1:56027) [    ] o.a.h.h.s.d.IncrementalBlockReportManager IncrementalBlockReportManager interrupted
   [junit4]   2> 3448843 WARN  (DataNode: [[[DISK]file:/x1/jenkins/jenkins-slave/workspace/Lucene-Solr-NightlyTests-7.x/checkout/solr/build/solr-core/test/J1/temp/solr.core.HdfsDirectoryFactoryTest_815806029902533F-001/tempDir-001/hdfsBaseDir/data/data3/, [DISK]file:/x1/jenkins/jenkins-slave/workspace/Lucene-Solr-NightlyTests-7.x/checkout/solr/build/solr-core/test/J1/temp/solr.core.HdfsDirectoryFactoryTest_815806029902533F-001/tempDir-001/hdfsBaseDir/data/data4/]]  heartbeating to localhost/127.0.0.1:56027) [    ] o.a.h.h.s.d.DataNode Ending block pool service for: Block pool BP-819179994-10.41.0.5-1520449289197 (Datanode Uuid 17c377de-6e5d-4862-a5b8-0fbea23a718a) service to localhost/127.0.0.1:56027
   [junit4]   2> 3448849 WARN  (SUITE-HdfsDirectoryFactoryTest-seed#[815806029902533F]-worker) [    ] o.a.h.h.s.d.DirectoryScanner DirectoryScanner: shutdown has been called
   [junit4]   2> 3448873 INFO  (SUITE-HdfsDirectoryFactoryTest-seed#[815806029902533F]-worker) [    ] o.m.log Stopped HttpServer2$SelectChannelConnectorWithSafeStartup@localhost:0
   [junit4]   2> 3448974 WARN  (DataNode: [[[DISK]file:/x1/jenkins/jenkins-slave/workspace/Lucene-Solr-NightlyTests-7.x/checkout/solr/build/solr-core/test/J1/temp/solr.core.HdfsDirectoryFactoryTest_815806029902533F-001/tempDir-001/hdfsBaseDir/data/data1/, [DISK]file:/x1/jenkins/jenkins-slave/workspace/Lucene-Solr-NightlyTests-7.x/checkout/solr/build/solr-core/test/J1/temp/solr.core.HdfsDirectoryFactoryTest_815806029902533F-001/tempDir-001/hdfsBaseDir/data/data2/]]  heartbeating to localhost/127.0.0.1:56027) [    ] o.a.h.h.s.d.IncrementalBlockReportManager IncrementalBlockReportManager interrupted
   [junit4]   2> 3448974 WARN  (DataNode: [[[DISK]file:/x1/jenkins/jenkins-slave/workspace/Lucene-Solr-NightlyTests-7.x/checkout/solr/build/solr-core/test/J1/temp/solr.core.HdfsDirectoryFactoryTest_815806029902533F-001/tempDir-001/hdfsBaseDir/data/data1/, [DISK]file:/x1/jenkins/jenkins-slave/workspace/Lucene-Solr-NightlyTests-7.x/checkout/solr/build/solr-core/test/J1/temp/solr.core.HdfsDirectoryFactoryTest_815806029902533F-001/tempDir-001/hdfsBaseDir/data/data2/]]  heartbeating to localhost/127.0.0.1:56027) [    ] o.a.h.h.s.d.DataNode Ending block pool service for: Block pool BP-819179994-10.41.0.5-1520449289197 (Datanode Uuid 69082480-c147-4d7d-9c89-97832075dcc7) service to localhost/127.0.0.1:56027
   [junit4]   2> 3449006 INFO  (SUITE-HdfsDirectoryFactoryTest-seed#[815806029902533F]-worker) [    ] o.m.log Stopped HttpServer2$SelectChannelConnectorWithSafeStartup@localhost:0
   [junit4]   2> NOTE: leaving temporary files on disk at: /x1/jenkins/jenkins-slave/workspace/Lucene-Solr-NightlyTests-7.x/checkout/solr/build/solr-core/test/J1/temp/solr.core.HdfsDirectoryFactoryTest_815806029902533F-001
   [junit4]   2> Mar 07, 2018 7:01:33 PM com.carrotsearch.randomizedtesting.ThreadLeakControl checkThreadLeaks
   [junit4]   2> WARNING: Will linger awaiting termination of 34 leaked thread(s).
   [junit4]   2> NOTE: test params are: codec=Asserting(Lucene70): {}, docValues:{}, maxPointsInLeafNode=1083, maxMBSortInHeap=6.808816151553782, sim=RandomSimilarity(queryNorm=true): {}, locale=no-NO, timezone=America/Cayman
   [junit4]   2> NOTE: Linux 3.13.0-88-generic amd64/Oracle Corporation 1.8.0_144 (64-bit)/cpus=4,threads=2,free=302631024,total=519045120
   [junit4]   2> NOTE: All tests run in this JVM: [TestNodeLostTrigger, TestCloudPseudoReturnFields, SuggesterFSTTest, CoreSorterTest, ConcurrentDeleteAndCreateCollectionTest, JvmMetricsTest, ResourceLoaderTest, TestSolrConfigHandler, FastVectorHighlighterTest, TestTrieFacet, SpatialHeatmapFacetsTest, TestConfigSetsAPIZkFailure, TestDistribDocBasedVersion, FieldMutatingUpdateProcessorTest, TestPartialUpdateDeduplication, SignatureUpdateProcessorFactoryTest, TestPayloadScoreQParserPlugin, TestSolrCLIRunExample, TestPostingsSolrHighlighter, OverseerModifyCollectionTest, TestPolicyCloud, PreAnalyzedUpdateProcessorTest, DocumentBuilderTest, CoreMergeIndexesAdminHandlerTest, LargeFieldTest, TestMacroExpander, TestEmbeddedSolrServerAdminHandler, AtomicUpdateProcessorFactoryTest, AddReplicaTest, HighlighterMaxOffsetTest, HdfsChaosMonkeySafeLeaderTest, TestSolr4Spatial, TestGenericDistributedQueue, TestUninvertingReader, SliceStateTest, TestSkipOverseerOperations, SchemaApiFailureTest, TestSolrCoreSnapshots, TestSystemCollAutoCreate, QueryElevationComponentTest, SchemaVersionSpecificBehaviorTest, TestCursorMarkWithoutUniqueKey, DistributedFacetPivotLargeTest, TestComputePlanAction, TestImpersonationWithHadoopAuth, RequiredFieldsTest, TestBM25SimilarityFactory, DistributedIntervalFacetingTest, TermsComponentTest, DistributedQueryComponentOptimizationTest, UpdateRequestProcessorFactoryTest, TestSolrIndexConfig, CdcrBootstrapTest, CdcrUpdateLogTest, TestSurroundQueryParser, OutOfBoxZkACLAndCredentialsProvidersTest, CollectionTooManyReplicasTest, TestComplexPhraseLeadingWildcard, TestRuleBasedAuthorizationPlugin, TestSimpleTrackingShardHandler, TestOnReconnectListenerSupport, TestMaxScoreQueryParser, TestTriggerIntegration, ChaosMonkeySafeLeaderTest, TestLRUStatsCache, TestLRUCache, TestMinMaxOnMultiValuedField, TestChildDocTransformer, HttpPartitionOnCommitTest, SimplePostToolTest, SampleTest, TestStressVersions, TestFieldCacheSortRandom, CollectionPropsTest, TestJsonRequest, SortSpecParsingTest, HdfsThreadLeakTest, ShardRoutingCustomTest, TestHashQParserPlugin, MetricUtilsTest, TestConfigOverlay, SolrJmxReporterTest, TestDistribIDF, SolrIndexMetricsTest, TestManagedStopFilterFactory, SolrShardReporterTest, AutoAddReplicasPlanActionTest, PKIAuthenticationIntegrationTest, SSLMigrationTest, HLLSerializationTest, OverseerTaskQueueTest, CdcrRequestHandlerTest, DistributedVersionInfoTest, RuleEngineTest, BlockJoinFacetSimpleTest, BadCopyFieldTest, DistributedFacetSimpleRefinementLongTailTest, UpdateLogTest, DeleteShardTest, PathHierarchyTokenizerFactoryTest, ConcurrentCreateRoutedAliasTest, BitVectorTest, TestSchemaManager, TestSubQueryTransformerDistrib, IndexSchemaTest, LeaderElectionContextKeyTest, TestNamedUpdateProcessors, QueryEqualityTest, UUIDUpdateProcessorFallbackTest, TestInfoStreamLogging, SystemInfoHandlerTest, SolrInfoBeanTest, TestRebalanceLeaders, DocExpirationUpdateProcessorFactoryTest, TestElisionMultitermQuery, TestReloadDeadlock, TestSchemaNameResource, TestNestedDocsSort, DistributedMLTComponentTest, TestReplicationHandler, TestZkChroot, TestCollationFieldDocValues, TestReqParamsAPI, OverseerTest, DistributedDebugComponentTest, CreateCollectionCleanupTest, TestRTGBase, SyncSliceTest, BasicDistributedZk2Test, BasicZkTest, ClusterStateUpdateTest, TestRandomFaceting, TestRandomDVFaceting, TestDistributedGrouping, TestFaceting, TestRecovery, DistributedSpellCheckComponentTest, ZkControllerTest, TestRealTimeGet, TestStressReorder, TestReload, DistributedTermsComponentTest, TestCoreContainer, SimpleFacetsTest, SolrCoreTest, SpellCheckComponentTest, PeerSyncTest, BadIndexSchemaTest, TestSort, TestFunctionQuery, BasicFunctionalityTest, TestLazyCores, DirectUpdateHandlerTest, TestBadConfig, HighlighterTest, SoftAutoCommitTest, SolrIndexSplitterTest, TestExtendedDismaxParser, TestFoldingMultitermQuery, DocValuesTest, SuggesterTest, TestTrie, TestCSVLoader, PolyFieldTest, WordBreakSolrSpellCheckerTest, SolrCoreCheckLockOnStartupTest, TestPseudoReturnFields, TestAtomicUpdateErrorCases, DirectUpdateHandlerOptimizeTest, DefaultValueUpdateProcessorTest, SortByFunctionTest, TestRemoteStreaming, TestSolrDeletionPolicy1, XsltUpdateRequestHandlerTest, DebugComponentTest, IndexBasedSpellCheckerTest, DisMaxRequestHandlerTest, TestQueryUtils, TestReversedWildcardFilterFactory, TestQueryTypes, PrimitiveFieldTypeTest, TestOmitPositions, XmlUpdateRequestHandlerTest, TestValueSourceCache, TestIndexingPerformance, FieldAnalysisRequestHandlerTest, LoggingHandlerTest, SolrPluginUtilsTest, TestCollationField, TestCSVResponseWriter, MBeansHandlerTest, QueryParsingTest, TestAnalyzedSuggestions, UniqFieldsUpdateProcessorFactoryTest, JsonLoaderTest, BinaryUpdateRequestHandlerTest, CSVRequestHandlerTest, TestComponentsName, SOLR749Test, AlternateDirectoryTest, TestQuerySenderNoQuery, BadComponentTest, TestStressRecovery, TestTolerantSearch, TestLuceneIndexBackCompat, ActionThrottleTest, AssignBackwardCompatibilityTest, AsyncCallRequestStatusResponseTest, CleanupOldIndexTest, DeleteNodeTest, DistribDocExpirationUpdateProcessorTest, LeaderInitiatedRecoveryOnShardRestartTest, MissingSegmentRecoveryTest, MoveReplicaHDFSFailoverTest, RollingRestartTest, TestStressInPlaceUpdates, TestTolerantUpdateProcessorCloud, TestTolerantUpdateProcessorRandomCloud, TriLevelCompositeIdRoutingTest, ZkShardTermsTest, AssignTest, CollectionsAPIAsyncDistributedZkTest, TestHdfsCloudBackupRestore, TestRequestStatusCollectionAPI, ExecutePlanActionTest, TestPolicyCloud, TestSimDistributedQueue, BaseCdcrDistributedZkTest, CdcrBidirectionalTest, HDFSCollectionsAPITest, HdfsBasicDistributedZk2Test, HdfsRecoverLeaseTest, HdfsRecoveryZkTest, HdfsTlogReplayBufferedWhileIndexingTest, HdfsUnloadDistributedZkTest, TestClusterStateMutator, ZkStateReaderTest, ZkStateWriterTest, ImplicitSnitchTest, RulesTest, BlobRepositoryCloudTest, ExitableDirectoryReaderTest, HdfsDirectoryFactoryTest]
   [junit4] Completed [615/780 (2!)] on J1 in 14.49s, 3 tests, 1 error <<< FAILURES!

[...truncated 50130 lines...]

Mime
View raw message