lucene-dev mailing list archives

Site index · List index
Message view « Date » · « Thread »
Top « Date » · « Thread »
From Apache Jenkins Server <jenk...@builds.apache.org>
Subject [JENKINS] Lucene-Solr-Tests-7.x - Build # 472 - Unstable
Date Thu, 01 Mar 2018 00:12:01 GMT
Build: https://builds.apache.org/job/Lucene-Solr-Tests-7.x/472/

1 tests failed.
FAILED:  org.apache.solr.cloud.MoveReplicaHDFSTest.testFailedMove

Error Message:
No live SolrServers available to handle this request:[http://127.0.0.1:38652/solr/MoveReplicaHDFSTest_failed_coll_true, http://127.0.0.1:56146/solr/MoveReplicaHDFSTest_failed_coll_true]

Stack Trace:
org.apache.solr.client.solrj.SolrServerException: No live SolrServers available to handle this request:[http://127.0.0.1:38652/solr/MoveReplicaHDFSTest_failed_coll_true, http://127.0.0.1:56146/solr/MoveReplicaHDFSTest_failed_coll_true]
	at __randomizedtesting.SeedInfo.seed([CEF8A02D5F0546E3:643573DFE8D69333]:0)
	at org.apache.solr.client.solrj.impl.LBHttpSolrClient.request(LBHttpSolrClient.java:462)
	at org.apache.solr.client.solrj.impl.CloudSolrClient.sendRequest(CloudSolrClient.java:1104)
	at org.apache.solr.client.solrj.impl.CloudSolrClient.requestWithRetryOnStaleState(CloudSolrClient.java:884)
	at org.apache.solr.client.solrj.impl.CloudSolrClient.requestWithRetryOnStaleState(CloudSolrClient.java:991)
	at org.apache.solr.client.solrj.impl.CloudSolrClient.request(CloudSolrClient.java:817)
	at org.apache.solr.client.solrj.SolrRequest.process(SolrRequest.java:194)
	at org.apache.solr.client.solrj.SolrClient.query(SolrClient.java:942)
	at org.apache.solr.cloud.MoveReplicaTest.testFailedMove(MoveReplicaTest.java:307)
	at sun.reflect.NativeMethodAccessorImpl.invoke0(Native Method)
	at sun.reflect.NativeMethodAccessorImpl.invoke(NativeMethodAccessorImpl.java:62)
	at sun.reflect.DelegatingMethodAccessorImpl.invoke(DelegatingMethodAccessorImpl.java:43)
	at java.lang.reflect.Method.invoke(Method.java:498)
	at com.carrotsearch.randomizedtesting.RandomizedRunner.invoke(RandomizedRunner.java:1737)
	at com.carrotsearch.randomizedtesting.RandomizedRunner$8.evaluate(RandomizedRunner.java:934)
	at com.carrotsearch.randomizedtesting.RandomizedRunner$9.evaluate(RandomizedRunner.java:970)
	at com.carrotsearch.randomizedtesting.RandomizedRunner$10.evaluate(RandomizedRunner.java:984)
	at com.carrotsearch.randomizedtesting.rules.SystemPropertiesRestoreRule$1.evaluate(SystemPropertiesRestoreRule.java:57)
	at org.apache.lucene.util.TestRuleSetupTeardownChained$1.evaluate(TestRuleSetupTeardownChained.java:49)
	at org.apache.lucene.util.AbstractBeforeAfterRule$1.evaluate(AbstractBeforeAfterRule.java:45)
	at org.apache.lucene.util.TestRuleThreadAndTestName$1.evaluate(TestRuleThreadAndTestName.java:48)
	at org.apache.lucene.util.TestRuleIgnoreAfterMaxFailures$1.evaluate(TestRuleIgnoreAfterMaxFailures.java:64)
	at org.apache.lucene.util.TestRuleMarkFailure$1.evaluate(TestRuleMarkFailure.java:47)
	at com.carrotsearch.randomizedtesting.rules.StatementAdapter.evaluate(StatementAdapter.java:36)
	at com.carrotsearch.randomizedtesting.ThreadLeakControl$StatementRunner.run(ThreadLeakControl.java:368)
	at com.carrotsearch.randomizedtesting.ThreadLeakControl.forkTimeoutingTask(ThreadLeakControl.java:817)
	at com.carrotsearch.randomizedtesting.ThreadLeakControl$3.evaluate(ThreadLeakControl.java:468)
	at com.carrotsearch.randomizedtesting.RandomizedRunner.runSingleTest(RandomizedRunner.java:943)
	at com.carrotsearch.randomizedtesting.RandomizedRunner$5.evaluate(RandomizedRunner.java:829)
	at com.carrotsearch.randomizedtesting.RandomizedRunner$6.evaluate(RandomizedRunner.java:879)
	at com.carrotsearch.randomizedtesting.RandomizedRunner$7.evaluate(RandomizedRunner.java:890)
	at com.carrotsearch.randomizedtesting.rules.StatementAdapter.evaluate(StatementAdapter.java:36)
	at com.carrotsearch.randomizedtesting.rules.SystemPropertiesRestoreRule$1.evaluate(SystemPropertiesRestoreRule.java:57)
	at org.apache.lucene.util.AbstractBeforeAfterRule$1.evaluate(AbstractBeforeAfterRule.java:45)
	at com.carrotsearch.randomizedtesting.rules.StatementAdapter.evaluate(StatementAdapter.java:36)
	at org.apache.lucene.util.TestRuleStoreClassName$1.evaluate(TestRuleStoreClassName.java:41)
	at com.carrotsearch.randomizedtesting.rules.NoShadowingOrOverridesOnMethodsRule$1.evaluate(NoShadowingOrOverridesOnMethodsRule.java:40)
	at com.carrotsearch.randomizedtesting.rules.NoShadowingOrOverridesOnMethodsRule$1.evaluate(NoShadowingOrOverridesOnMethodsRule.java:40)
	at com.carrotsearch.randomizedtesting.rules.StatementAdapter.evaluate(StatementAdapter.java:36)
	at com.carrotsearch.randomizedtesting.rules.StatementAdapter.evaluate(StatementAdapter.java:36)
	at com.carrotsearch.randomizedtesting.rules.StatementAdapter.evaluate(StatementAdapter.java:36)
	at org.apache.lucene.util.TestRuleAssertionsRequired$1.evaluate(TestRuleAssertionsRequired.java:53)
	at org.apache.lucene.util.TestRuleMarkFailure$1.evaluate(TestRuleMarkFailure.java:47)
	at org.apache.lucene.util.TestRuleIgnoreAfterMaxFailures$1.evaluate(TestRuleIgnoreAfterMaxFailures.java:64)
	at org.apache.lucene.util.TestRuleIgnoreTestSuites$1.evaluate(TestRuleIgnoreTestSuites.java:54)
	at com.carrotsearch.randomizedtesting.rules.StatementAdapter.evaluate(StatementAdapter.java:36)
	at com.carrotsearch.randomizedtesting.ThreadLeakControl$StatementRunner.run(ThreadLeakControl.java:368)
	at java.lang.Thread.run(Thread.java:748)
Caused by: org.apache.solr.client.solrj.impl.HttpSolrClient$RemoteSolrException: Error from server at http://127.0.0.1:56146/solr/MoveReplicaHDFSTest_failed_coll_true: no servers hosting shard: shard1
	at org.apache.solr.client.solrj.impl.HttpSolrClient.executeMethod(HttpSolrClient.java:643)
	at org.apache.solr.client.solrj.impl.HttpSolrClient.request(HttpSolrClient.java:255)
	at org.apache.solr.client.solrj.impl.HttpSolrClient.request(HttpSolrClient.java:244)
	at org.apache.solr.client.solrj.impl.LBHttpSolrClient.doRequest(LBHttpSolrClient.java:483)
	at org.apache.solr.client.solrj.impl.LBHttpSolrClient.request(LBHttpSolrClient.java:436)
	... 46 more




Build Log:
[...truncated 13537 lines...]
   [junit4] Suite: org.apache.solr.cloud.MoveReplicaHDFSTest
   [junit4]   2> 1434299 INFO  (SUITE-MoveReplicaHDFSTest-seed#[CEF8A02D5F0546E3]-worker) [    ] o.a.s.SolrTestCaseJ4 SecureRandom sanity checks: test.solr.allowed.securerandom=null & java.security.egd=file:/dev/./urandom
   [junit4]   2> Creating dataDir: /x1/jenkins/jenkins-slave/workspace/Lucene-Solr-Tests-7.x/solr/build/solr-core/test/J2/temp/solr.cloud.MoveReplicaHDFSTest_CEF8A02D5F0546E3-001/init-core-data-001
   [junit4]   2> 1434299 WARN  (SUITE-MoveReplicaHDFSTest-seed#[CEF8A02D5F0546E3]-worker) [    ] o.a.s.SolrTestCaseJ4 startTrackingSearchers: numOpens=17 numCloses=17
   [junit4]   2> 1434300 INFO  (SUITE-MoveReplicaHDFSTest-seed#[CEF8A02D5F0546E3]-worker) [    ] o.a.s.SolrTestCaseJ4 Using PointFields (NUMERIC_POINTS_SYSPROP=true) w/NUMERIC_DOCVALUES_SYSPROP=false
   [junit4]   2> 1434301 INFO  (SUITE-MoveReplicaHDFSTest-seed#[CEF8A02D5F0546E3]-worker) [    ] o.a.s.SolrTestCaseJ4 Randomized ssl (false) and clientAuth (true) via: @org.apache.solr.util.RandomizeSSL(reason=, ssl=NaN, value=NaN, clientAuth=NaN)
   [junit4]   2> 1434301 INFO  (SUITE-MoveReplicaHDFSTest-seed#[CEF8A02D5F0546E3]-worker) [    ] o.a.s.c.MiniSolrCloudCluster Starting cluster of 4 servers in /x1/jenkins/jenkins-slave/workspace/Lucene-Solr-Tests-7.x/solr/build/solr-core/test/J2/temp/solr.cloud.MoveReplicaHDFSTest_CEF8A02D5F0546E3-001/tempDir-001
   [junit4]   2> 1434301 INFO  (SUITE-MoveReplicaHDFSTest-seed#[CEF8A02D5F0546E3]-worker) [    ] o.a.s.c.ZkTestServer STARTING ZK TEST SERVER
   [junit4]   2> 1434302 INFO  (Thread-2882) [    ] o.a.s.c.ZkTestServer client port:0.0.0.0/0.0.0.0:0
   [junit4]   2> 1434302 INFO  (Thread-2882) [    ] o.a.s.c.ZkTestServer Starting server
   [junit4]   2> 1434303 ERROR (Thread-2882) [    ] o.a.z.s.ZooKeeperServer ZKShutdownHandler is not registered, so ZooKeeper server won't take any action on ERROR or SHUTDOWN server state changes
   [junit4]   2> 1434402 INFO  (SUITE-MoveReplicaHDFSTest-seed#[CEF8A02D5F0546E3]-worker) [    ] o.a.s.c.ZkTestServer start zk server on port:56414
   [junit4]   2> 1434403 INFO  (zkConnectionManagerCallback-5413-thread-1) [    ] o.a.s.c.c.ConnectionManager zkClient has connected
   [junit4]   2> 1434409 INFO  (jetty-launcher-5410-thread-1) [    ] o.e.j.s.Server jetty-9.4.8.v20171121, build timestamp: 2017-11-21T23:27:37+02:00, git hash: 82b8fb23f757335bb3329d540ce37a2a2615f0a8
   [junit4]   2> 1434409 INFO  (jetty-launcher-5410-thread-2) [    ] o.e.j.s.Server jetty-9.4.8.v20171121, build timestamp: 2017-11-21T23:27:37+02:00, git hash: 82b8fb23f757335bb3329d540ce37a2a2615f0a8
   [junit4]   2> 1434413 INFO  (jetty-launcher-5410-thread-3) [    ] o.e.j.s.Server jetty-9.4.8.v20171121, build timestamp: 2017-11-21T23:27:37+02:00, git hash: 82b8fb23f757335bb3329d540ce37a2a2615f0a8
   [junit4]   2> 1434421 INFO  (jetty-launcher-5410-thread-4) [    ] o.e.j.s.Server jetty-9.4.8.v20171121, build timestamp: 2017-11-21T23:27:37+02:00, git hash: 82b8fb23f757335bb3329d540ce37a2a2615f0a8
   [junit4]   2> 1434422 INFO  (jetty-launcher-5410-thread-2) [    ] o.e.j.s.session DefaultSessionIdManager workerName=node0
   [junit4]   2> 1434422 INFO  (jetty-launcher-5410-thread-2) [    ] o.e.j.s.session No SessionScavenger set, using defaults
   [junit4]   2> 1434422 INFO  (jetty-launcher-5410-thread-2) [    ] o.e.j.s.session Scavenging every 660000ms
   [junit4]   2> 1434422 INFO  (jetty-launcher-5410-thread-1) [    ] o.e.j.s.session DefaultSessionIdManager workerName=node0
   [junit4]   2> 1434422 INFO  (jetty-launcher-5410-thread-1) [    ] o.e.j.s.session No SessionScavenger set, using defaults
   [junit4]   2> 1434422 INFO  (jetty-launcher-5410-thread-1) [    ] o.e.j.s.session Scavenging every 660000ms
   [junit4]   2> 1434422 INFO  (jetty-launcher-5410-thread-2) [    ] o.e.j.s.h.ContextHandler Started o.e.j.s.ServletContextHandler@20d3925{/solr,null,AVAILABLE}
   [junit4]   2> 1434423 INFO  (jetty-launcher-5410-thread-3) [    ] o.e.j.s.session DefaultSessionIdManager workerName=node0
   [junit4]   2> 1434423 INFO  (jetty-launcher-5410-thread-3) [    ] o.e.j.s.session No SessionScavenger set, using defaults
   [junit4]   2> 1434423 INFO  (jetty-launcher-5410-thread-3) [    ] o.e.j.s.session Scavenging every 600000ms
   [junit4]   2> 1434423 INFO  (jetty-launcher-5410-thread-3) [    ] o.e.j.s.h.ContextHandler Started o.e.j.s.ServletContextHandler@3d37d864{/solr,null,AVAILABLE}
   [junit4]   2> 1434424 INFO  (jetty-launcher-5410-thread-1) [    ] o.e.j.s.h.ContextHandler Started o.e.j.s.ServletContextHandler@71376c7c{/solr,null,AVAILABLE}
   [junit4]   2> 1434424 INFO  (jetty-launcher-5410-thread-3) [    ] o.e.j.s.AbstractConnector Started ServerConnector@3d0028c5{HTTP/1.1,[http/1.1]}{127.0.0.1:32913}
   [junit4]   2> 1434424 INFO  (jetty-launcher-5410-thread-1) [    ] o.e.j.s.AbstractConnector Started ServerConnector@85a86ec{HTTP/1.1,[http/1.1]}{127.0.0.1:57334}
   [junit4]   2> 1434424 INFO  (jetty-launcher-5410-thread-3) [    ] o.e.j.s.Server Started @1436781ms
   [junit4]   2> 1434424 INFO  (jetty-launcher-5410-thread-1) [    ] o.e.j.s.Server Started @1436781ms
   [junit4]   2> 1434424 INFO  (jetty-launcher-5410-thread-3) [    ] o.a.s.c.s.e.JettySolrRunner Jetty properties: {hostContext=/solr, hostPort=32913}
   [junit4]   2> 1434424 INFO  (jetty-launcher-5410-thread-1) [    ] o.a.s.c.s.e.JettySolrRunner Jetty properties: {hostContext=/solr, hostPort=57334}
   [junit4]   2> 1434424 ERROR (jetty-launcher-5410-thread-3) [    ] o.a.s.u.StartupLoggingUtils Missing Java Option solr.log.dir. Logging may be missing or incomplete.
   [junit4]   2> 1434424 INFO  (jetty-launcher-5410-thread-2) [    ] o.e.j.s.AbstractConnector Started ServerConnector@61036ca6{HTTP/1.1,[http/1.1]}{127.0.0.1:52845}
   [junit4]   2> 1434424 INFO  (jetty-launcher-5410-thread-3) [    ] o.a.s.s.SolrDispatchFilter  ___      _       Welcome to Apache Solr? version 7.3.0
   [junit4]   2> 1434424 INFO  (jetty-launcher-5410-thread-2) [    ] o.e.j.s.Server Started @1436781ms
   [junit4]   2> 1434424 INFO  (jetty-launcher-5410-thread-3) [    ] o.a.s.s.SolrDispatchFilter / __| ___| |_ _   Starting in cloud mode on port null
   [junit4]   2> 1434424 INFO  (jetty-launcher-5410-thread-2) [    ] o.a.s.c.s.e.JettySolrRunner Jetty properties: {hostContext=/solr, hostPort=52845}
   [junit4]   2> 1434424 INFO  (jetty-launcher-5410-thread-3) [    ] o.a.s.s.SolrDispatchFilter \__ \/ _ \ | '_|  Install dir: null
   [junit4]   2> 1434424 INFO  (jetty-launcher-5410-thread-3) [    ] o.a.s.s.SolrDispatchFilter |___/\___/_|_|    Start time: 2018-02-28T23:26:13.800Z
   [junit4]   2> 1434425 ERROR (jetty-launcher-5410-thread-2) [    ] o.a.s.u.StartupLoggingUtils Missing Java Option solr.log.dir. Logging may be missing or incomplete.
   [junit4]   2> 1434425 INFO  (jetty-launcher-5410-thread-2) [    ] o.a.s.s.SolrDispatchFilter  ___      _       Welcome to Apache Solr? version 7.3.0
   [junit4]   2> 1434425 INFO  (jetty-launcher-5410-thread-2) [    ] o.a.s.s.SolrDispatchFilter / __| ___| |_ _   Starting in cloud mode on port null
   [junit4]   2> 1434425 INFO  (jetty-launcher-5410-thread-2) [    ] o.a.s.s.SolrDispatchFilter \__ \/ _ \ | '_|  Install dir: null
   [junit4]   2> 1434425 INFO  (jetty-launcher-5410-thread-2) [    ] o.a.s.s.SolrDispatchFilter |___/\___/_|_|    Start time: 2018-02-28T23:26:13.801Z
   [junit4]   2> 1434424 ERROR (jetty-launcher-5410-thread-1) [    ] o.a.s.u.StartupLoggingUtils Missing Java Option solr.log.dir. Logging may be missing or incomplete.
   [junit4]   2> 1434425 INFO  (jetty-launcher-5410-thread-1) [    ] o.a.s.s.SolrDispatchFilter  ___      _       Welcome to Apache Solr? version 7.3.0
   [junit4]   2> 1434425 INFO  (jetty-launcher-5410-thread-1) [    ] o.a.s.s.SolrDispatchFilter / __| ___| |_ _   Starting in cloud mode on port null
   [junit4]   2> 1434425 INFO  (jetty-launcher-5410-thread-1) [    ] o.a.s.s.SolrDispatchFilter \__ \/ _ \ | '_|  Install dir: null
   [junit4]   2> 1434425 INFO  (jetty-launcher-5410-thread-1) [    ] o.a.s.s.SolrDispatchFilter |___/\___/_|_|    Start time: 2018-02-28T23:26:13.801Z
   [junit4]   2> 1434433 INFO  (jetty-launcher-5410-thread-4) [    ] o.e.j.s.session DefaultSessionIdManager workerName=node0
   [junit4]   2> 1434433 INFO  (jetty-launcher-5410-thread-4) [    ] o.e.j.s.session No SessionScavenger set, using defaults
   [junit4]   2> 1434433 INFO  (jetty-launcher-5410-thread-4) [    ] o.e.j.s.session Scavenging every 600000ms
   [junit4]   2> 1434436 INFO  (jetty-launcher-5410-thread-4) [    ] o.e.j.s.h.ContextHandler Started o.e.j.s.ServletContextHandler@6c03116a{/solr,null,AVAILABLE}
   [junit4]   2> 1434440 INFO  (jetty-launcher-5410-thread-4) [    ] o.e.j.s.AbstractConnector Started ServerConnector@143d47bf{HTTP/1.1,[http/1.1]}{127.0.0.1:56146}
   [junit4]   2> 1434441 INFO  (jetty-launcher-5410-thread-4) [    ] o.e.j.s.Server Started @1436798ms
   [junit4]   2> 1434441 INFO  (jetty-launcher-5410-thread-4) [    ] o.a.s.c.s.e.JettySolrRunner Jetty properties: {hostContext=/solr, hostPort=56146}
   [junit4]   2> 1434441 INFO  (zkConnectionManagerCallback-5415-thread-1) [    ] o.a.s.c.c.ConnectionManager zkClient has connected
   [junit4]   2> 1434441 ERROR (jetty-launcher-5410-thread-4) [    ] o.a.s.u.StartupLoggingUtils Missing Java Option solr.log.dir. Logging may be missing or incomplete.
   [junit4]   2> 1434441 INFO  (jetty-launcher-5410-thread-4) [    ] o.a.s.s.SolrDispatchFilter  ___      _       Welcome to Apache Solr? version 7.3.0
   [junit4]   2> 1434441 INFO  (jetty-launcher-5410-thread-4) [    ] o.a.s.s.SolrDispatchFilter / __| ___| |_ _   Starting in cloud mode on port null
   [junit4]   2> 1434441 INFO  (jetty-launcher-5410-thread-4) [    ] o.a.s.s.SolrDispatchFilter \__ \/ _ \ | '_|  Install dir: null
   [junit4]   2> 1434441 INFO  (jetty-launcher-5410-thread-4) [    ] o.a.s.s.SolrDispatchFilter |___/\___/_|_|    Start time: 2018-02-28T23:26:13.817Z
   [junit4]   2> 1434442 INFO  (jetty-launcher-5410-thread-3) [    ] o.a.s.s.SolrDispatchFilter solr.xml found in ZooKeeper. Loading...
   [junit4]   2> 1434442 INFO  (zkConnectionManagerCallback-5417-thread-1) [    ] o.a.s.c.c.ConnectionManager zkClient has connected
   [junit4]   2> 1434444 INFO  (jetty-launcher-5410-thread-2) [    ] o.a.s.s.SolrDispatchFilter solr.xml found in ZooKeeper. Loading...
   [junit4]   2> 1434455 INFO  (zkConnectionManagerCallback-5419-thread-1) [    ] o.a.s.c.c.ConnectionManager zkClient has connected
   [junit4]   2> 1434457 INFO  (jetty-launcher-5410-thread-1) [    ] o.a.s.s.SolrDispatchFilter solr.xml found in ZooKeeper. Loading...
   [junit4]   2> 1434457 INFO  (jetty-launcher-5410-thread-2) [    ] o.a.s.c.ZkContainer Zookeeper client=127.0.0.1:56414/solr
   [junit4]   2> 1434461 INFO  (jetty-launcher-5410-thread-3) [    ] o.a.s.c.ZkContainer Zookeeper client=127.0.0.1:56414/solr
   [junit4]   2> 1434463 INFO  (zkConnectionManagerCallback-5426-thread-1) [    ] o.a.s.c.c.ConnectionManager zkClient has connected
   [junit4]   2> 1434468 INFO  (zkConnectionManagerCallback-5421-thread-1) [    ] o.a.s.c.c.ConnectionManager zkClient has connected
   [junit4]   2> 1434468 INFO  (zkConnectionManagerCallback-5429-thread-1) [    ] o.a.s.c.c.ConnectionManager zkClient has connected
   [junit4]   2> 1434469 INFO  (jetty-launcher-5410-thread-4) [    ] o.a.s.s.SolrDispatchFilter solr.xml found in ZooKeeper. Loading...
   [junit4]   2> 1434479 INFO  (jetty-launcher-5410-thread-4) [    ] o.a.s.c.ZkContainer Zookeeper client=127.0.0.1:56414/solr
   [junit4]   2> 1434479 INFO  (jetty-launcher-5410-thread-1) [    ] o.a.s.c.ZkContainer Zookeeper client=127.0.0.1:56414/solr
   [junit4]   2> 1434484 INFO  (zkConnectionManagerCallback-5432-thread-1-processing-n:127.0.0.1:52845_solr) [n:127.0.0.1:52845_solr    ] o.a.s.c.c.ConnectionManager zkClient has connected
   [junit4]   2> 1434485 INFO  (zkConnectionManagerCallback-5439-thread-1) [    ] o.a.s.c.c.ConnectionManager zkClient has connected
   [junit4]   2> 1434508 INFO  (zkConnectionManagerCallback-5436-thread-1) [    ] o.a.s.c.c.ConnectionManager zkClient has connected
   [junit4]   2> 1434515 INFO  (zkConnectionManagerCallback-5441-thread-1-processing-n:127.0.0.1:32913_solr) [n:127.0.0.1:32913_solr    ] o.a.s.c.c.ConnectionManager zkClient has connected
   [junit4]   2> 1434518 INFO  (zkConnectionManagerCallback-5444-thread-1-processing-n:127.0.0.1:56146_solr) [n:127.0.0.1:56146_solr    ] o.a.s.c.c.ConnectionManager zkClient has connected
   [junit4]   2> 1434520 INFO  (zkConnectionManagerCallback-5446-thread-1-processing-n:127.0.0.1:57334_solr) [n:127.0.0.1:57334_solr    ] o.a.s.c.c.ConnectionManager zkClient has connected
   [junit4]   2> 1434525 INFO  (jetty-launcher-5410-thread-3) [n:127.0.0.1:32913_solr    ] o.a.s.c.Overseer Overseer (id=null) closing
   [junit4]   2> 1434526 INFO  (jetty-launcher-5410-thread-3) [n:127.0.0.1:32913_solr    ] o.a.s.c.OverseerElectionContext I am going to be the leader 127.0.0.1:32913_solr
   [junit4]   2> 1434527 INFO  (jetty-launcher-5410-thread-3) [n:127.0.0.1:32913_solr    ] o.a.s.c.Overseer Overseer (id=73375672377933834-127.0.0.1:32913_solr-n_0000000000) starting
   [junit4]   2> 1434532 INFO  (jetty-launcher-5410-thread-4) [n:127.0.0.1:56146_solr    ] o.a.s.c.Overseer Overseer (id=null) closing
   [junit4]   2> 1434533 INFO  (jetty-launcher-5410-thread-4) [n:127.0.0.1:56146_solr    ] o.a.s.c.ZkController Register node as live in ZooKeeper:/live_nodes/127.0.0.1:56146_solr
   [junit4]   2> 1434536 INFO  (OverseerStateUpdate-73375672377933834-127.0.0.1:32913_solr-n_0000000000) [n:127.0.0.1:32913_solr    ] o.a.s.c.c.ZkStateReader Updated live nodes from ZooKeeper... (0) -> (1)
   [junit4]   2> 1434539 INFO  (jetty-launcher-5410-thread-1) [n:127.0.0.1:57334_solr    ] o.a.s.c.c.ZkStateReader Updated live nodes from ZooKeeper... (0) -> (1)
   [junit4]   2> 1434539 INFO  (zkCallback-5443-thread-1-processing-n:127.0.0.1:56146_solr) [n:127.0.0.1:56146_solr    ] o.a.s.c.c.ZkStateReader Updated live nodes from ZooKeeper... (0) -> (1)
   [junit4]   2> 1434541 INFO  (jetty-launcher-5410-thread-1) [n:127.0.0.1:57334_solr    ] o.a.s.c.Overseer Overseer (id=null) closing
   [junit4]   2> 1434545 INFO  (jetty-launcher-5410-thread-1) [n:127.0.0.1:57334_solr    ] o.a.s.c.ZkController Register node as live in ZooKeeper:/live_nodes/127.0.0.1:57334_solr
   [junit4]   2> 1434548 INFO  (jetty-launcher-5410-thread-3) [n:127.0.0.1:32913_solr    ] o.a.s.c.ZkController Register node as live in ZooKeeper:/live_nodes/127.0.0.1:32913_solr
   [junit4]   2> 1434551 INFO  (zkCallback-5445-thread-1-processing-n:127.0.0.1:57334_solr) [n:127.0.0.1:57334_solr    ] o.a.s.c.c.ZkStateReader Updated live nodes from ZooKeeper... (1) -> (3)
   [junit4]   2> 1434552 INFO  (zkCallback-5443-thread-1-processing-n:127.0.0.1:56146_solr) [n:127.0.0.1:56146_solr    ] o.a.s.c.c.ZkStateReader Updated live nodes from ZooKeeper... (1) -> (3)
   [junit4]   2> 1434552 INFO  (zkCallback-5440-thread-2-processing-n:127.0.0.1:32913_solr) [n:127.0.0.1:32913_solr    ] o.a.s.c.c.ZkStateReader Updated live nodes from ZooKeeper... (1) -> (3)
   [junit4]   2> 1434573 INFO  (jetty-launcher-5410-thread-2) [n:127.0.0.1:52845_solr    ] o.a.s.c.c.ZkStateReader Updated live nodes from ZooKeeper... (0) -> (3)
   [junit4]   2> 1434575 INFO  (jetty-launcher-5410-thread-2) [n:127.0.0.1:52845_solr    ] o.a.s.c.Overseer Overseer (id=null) closing
   [junit4]   2> 1434576 INFO  (jetty-launcher-5410-thread-2) [n:127.0.0.1:52845_solr    ] o.a.s.c.ZkController Register node as live in ZooKeeper:/live_nodes/127.0.0.1:52845_solr
   [junit4]   2> 1434590 INFO  (zkCallback-5440-thread-2-processing-n:127.0.0.1:32913_solr) [n:127.0.0.1:32913_solr    ] o.a.s.c.c.ZkStateReader Updated live nodes from ZooKeeper... (3) -> (4)
   [junit4]   2> 1434590 INFO  (zkCallback-5445-thread-1-processing-n:127.0.0.1:57334_solr) [n:127.0.0.1:57334_solr    ] o.a.s.c.c.ZkStateReader Updated live nodes from ZooKeeper... (3) -> (4)
   [junit4]   2> 1434590 INFO  (zkCallback-5443-thread-1-processing-n:127.0.0.1:56146_solr) [n:127.0.0.1:56146_solr    ] o.a.s.c.c.ZkStateReader Updated live nodes from ZooKeeper... (3) -> (4)
   [junit4]   2> 1434590 INFO  (zkCallback-5430-thread-1-processing-n:127.0.0.1:52845_solr) [n:127.0.0.1:52845_solr    ] o.a.s.c.c.ZkStateReader Updated live nodes from ZooKeeper... (3) -> (4)
   [junit4]   2> 1434645 INFO  (jetty-launcher-5410-thread-4) [n:127.0.0.1:56146_solr    ] o.a.s.m.r.SolrJmxReporter JMX monitoring for 'solr_56146.solr.node' (registry 'solr.node') enabled at server: com.sun.jmx.mbeanserver.JmxMBeanServer@6570962e
   [junit4]   2> 1434648 INFO  (jetty-launcher-5410-thread-3) [n:127.0.0.1:32913_solr    ] o.a.s.m.r.SolrJmxReporter JMX monitoring for 'solr_32913.solr.node' (registry 'solr.node') enabled at server: com.sun.jmx.mbeanserver.JmxMBeanServer@6570962e
   [junit4]   2> 1434653 INFO  (jetty-launcher-5410-thread-4) [n:127.0.0.1:56146_solr    ] o.a.s.m.r.SolrJmxReporter JMX monitoring for 'solr_56146.solr.jvm' (registry 'solr.jvm') enabled at server: com.sun.jmx.mbeanserver.JmxMBeanServer@6570962e
   [junit4]   2> 1434654 INFO  (jetty-launcher-5410-thread-4) [n:127.0.0.1:56146_solr    ] o.a.s.m.r.SolrJmxReporter JMX monitoring for 'solr_56146.solr.jetty' (registry 'solr.jetty') enabled at server: com.sun.jmx.mbeanserver.JmxMBeanServer@6570962e
   [junit4]   2> 1434654 INFO  (jetty-launcher-5410-thread-2) [n:127.0.0.1:52845_solr    ] o.a.s.m.r.SolrJmxReporter JMX monitoring for 'solr_52845.solr.node' (registry 'solr.node') enabled at server: com.sun.jmx.mbeanserver.JmxMBeanServer@6570962e
   [junit4]   2> 1434655 INFO  (jetty-launcher-5410-thread-4) [n:127.0.0.1:56146_solr    ] o.a.s.c.CorePropertiesLocator Found 0 core definitions underneath /x1/jenkins/jenkins-slave/workspace/Lucene-Solr-Tests-7.x/solr/build/solr-core/test/J2/temp/solr.cloud.MoveReplicaHDFSTest_CEF8A02D5F0546E3-001/tempDir-001/node4/.
   [junit4]   2> 1434658 INFO  (jetty-launcher-5410-thread-3) [n:127.0.0.1:32913_solr    ] o.a.s.m.r.SolrJmxReporter JMX monitoring for 'solr_32913.solr.jvm' (registry 'solr.jvm') enabled at server: com.sun.jmx.mbeanserver.JmxMBeanServer@6570962e
   [junit4]   2> 1434658 INFO  (jetty-launcher-5410-thread-3) [n:127.0.0.1:32913_solr    ] o.a.s.m.r.SolrJmxReporter JMX monitoring for 'solr_32913.solr.jetty' (registry 'solr.jetty') enabled at server: com.sun.jmx.mbeanserver.JmxMBeanServer@6570962e
   [junit4]   2> 1434685 INFO  (jetty-launcher-5410-thread-3) [n:127.0.0.1:32913_solr    ] o.a.s.c.CorePropertiesLocator Found 0 core definitions underneath /x1/jenkins/jenkins-slave/workspace/Lucene-Solr-Tests-7.x/solr/build/solr-core/test/J2/temp/solr.cloud.MoveReplicaHDFSTest_CEF8A02D5F0546E3-001/tempDir-001/node3/.
   [junit4]   2> 1434696 INFO  (jetty-launcher-5410-thread-1) [n:127.0.0.1:57334_solr    ] o.a.s.m.r.SolrJmxReporter JMX monitoring for 'solr_57334.solr.node' (registry 'solr.node') enabled at server: com.sun.jmx.mbeanserver.JmxMBeanServer@6570962e
   [junit4]   2> 1434699 INFO  (jetty-launcher-5410-thread-2) [n:127.0.0.1:52845_solr    ] o.a.s.m.r.SolrJmxReporter JMX monitoring for 'solr_52845.solr.jvm' (registry 'solr.jvm') enabled at server: com.sun.jmx.mbeanserver.JmxMBeanServer@6570962e
   [junit4]   2> 1434699 INFO  (jetty-launcher-5410-thread-2) [n:127.0.0.1:52845_solr    ] o.a.s.m.r.SolrJmxReporter JMX monitoring for 'solr_52845.solr.jetty' (registry 'solr.jetty') enabled at server: com.sun.jmx.mbeanserver.JmxMBeanServer@6570962e
   [junit4]   2> 1434700 INFO  (jetty-launcher-5410-thread-2) [n:127.0.0.1:52845_solr    ] o.a.s.c.CorePropertiesLocator Found 0 core definitions underneath /x1/jenkins/jenkins-slave/workspace/Lucene-Solr-Tests-7.x/solr/build/solr-core/test/J2/temp/solr.cloud.MoveReplicaHDFSTest_CEF8A02D5F0546E3-001/tempDir-001/node2/.
   [junit4]   2> 1434711 INFO  (jetty-launcher-5410-thread-1) [n:127.0.0.1:57334_solr    ] o.a.s.m.r.SolrJmxReporter JMX monitoring for 'solr_57334.solr.jvm' (registry 'solr.jvm') enabled at server: com.sun.jmx.mbeanserver.JmxMBeanServer@6570962e
   [junit4]   2> 1434711 INFO  (jetty-launcher-5410-thread-1) [n:127.0.0.1:57334_solr    ] o.a.s.m.r.SolrJmxReporter JMX monitoring for 'solr_57334.solr.jetty' (registry 'solr.jetty') enabled at server: com.sun.jmx.mbeanserver.JmxMBeanServer@6570962e
   [junit4]   2> 1434712 INFO  (jetty-launcher-5410-thread-1) [n:127.0.0.1:57334_solr    ] o.a.s.c.CorePropertiesLocator Found 0 core definitions underneath /x1/jenkins/jenkins-slave/workspace/Lucene-Solr-Tests-7.x/solr/build/solr-core/test/J2/temp/solr.cloud.MoveReplicaHDFSTest_CEF8A02D5F0546E3-001/tempDir-001/node1/.
   [junit4]   2> 1434821 INFO  (zkConnectionManagerCallback-5455-thread-1) [    ] o.a.s.c.c.ConnectionManager zkClient has connected
   [junit4]   2> 1434823 INFO  (zkConnectionManagerCallback-5459-thread-1) [    ] o.a.s.c.c.ConnectionManager zkClient has connected
   [junit4]   2> 1434824 INFO  (SUITE-MoveReplicaHDFSTest-seed#[CEF8A02D5F0546E3]-worker) [    ] o.a.s.c.c.ZkStateReader Updated live nodes from ZooKeeper... (0) -> (4)
   [junit4]   2> 1434825 INFO  (SUITE-MoveReplicaHDFSTest-seed#[CEF8A02D5F0546E3]-worker) [    ] o.a.s.c.s.i.ZkClientClusterStateProvider Cluster at 127.0.0.1:56414/solr ready
   [junit4]   2> 1434830 INFO  (qtp1832861987-17854) [n:127.0.0.1:32913_solr    ] o.a.s.h.a.CollectionsHandler Invoked Collection Action :overseerstatus with params action=OVERSEERSTATUS&wt=javabin&version=2 and sendToOCPQueue=true
   [junit4]   2> 1434840 INFO  (qtp1832861987-17854) [n:127.0.0.1:32913_solr    ] o.a.s.s.HttpSolrCall [admin] webapp=null path=/admin/collections params={action=OVERSEERSTATUS&wt=javabin&version=2} status=0 QTime=10
   [junit4]   1> Formatting using clusterid: testClusterID
   [junit4]   2> 1434887 WARN  (SUITE-MoveReplicaHDFSTest-seed#[CEF8A02D5F0546E3]-worker) [    ] o.a.h.m.i.MetricsConfig Cannot locate configuration: tried hadoop-metrics2-namenode.properties,hadoop-metrics2.properties
   [junit4]   2> 1434896 WARN  (SUITE-MoveReplicaHDFSTest-seed#[CEF8A02D5F0546E3]-worker) [    ] o.a.h.h.HttpRequestLog Jetty request log can only be enabled using Log4j
   [junit4]   2> 1434898 INFO  (SUITE-MoveReplicaHDFSTest-seed#[CEF8A02D5F0546E3]-worker) [    ] o.m.log jetty-6.1.26
   [junit4]   2> 1434910 INFO  (SUITE-MoveReplicaHDFSTest-seed#[CEF8A02D5F0546E3]-worker) [    ] o.m.log Extract jar:file:/x1/jenkins/.ivy2/cache/org.apache.hadoop/hadoop-hdfs/tests/hadoop-hdfs-2.7.4-tests.jar!/webapps/hdfs to ./temp/Jetty_localhost_38160_hdfs____h9lwpc/webapp
   [junit4]   2> 1435975 INFO  (SUITE-MoveReplicaHDFSTest-seed#[CEF8A02D5F0546E3]-worker) [    ] o.m.log Started HttpServer2$SelectChannelConnectorWithSafeStartup@localhost:38160
   [junit4]   2> 1436069 WARN  (SUITE-MoveReplicaHDFSTest-seed#[CEF8A02D5F0546E3]-worker) [    ] o.a.h.h.HttpRequestLog Jetty request log can only be enabled using Log4j
   [junit4]   2> 1436070 INFO  (SUITE-MoveReplicaHDFSTest-seed#[CEF8A02D5F0546E3]-worker) [    ] o.m.log jetty-6.1.26
   [junit4]   2> 1436085 INFO  (SUITE-MoveReplicaHDFSTest-seed#[CEF8A02D5F0546E3]-worker) [    ] o.m.log Extract jar:file:/x1/jenkins/.ivy2/cache/org.apache.hadoop/hadoop-hdfs/tests/hadoop-hdfs-2.7.4-tests.jar!/webapps/datanode to ./temp/Jetty_localhost_52594_datanode____.me751i/webapp
   [junit4]   2> 1436565 INFO  (SUITE-MoveReplicaHDFSTest-seed#[CEF8A02D5F0546E3]-worker) [    ] o.m.log Started HttpServer2$SelectChannelConnectorWithSafeStartup@localhost:52594
   [junit4]   2> 1436643 WARN  (SUITE-MoveReplicaHDFSTest-seed#[CEF8A02D5F0546E3]-worker) [    ] o.a.h.h.HttpRequestLog Jetty request log can only be enabled using Log4j
   [junit4]   2> 1436644 INFO  (SUITE-MoveReplicaHDFSTest-seed#[CEF8A02D5F0546E3]-worker) [    ] o.m.log jetty-6.1.26
   [junit4]   2> 1436658 INFO  (SUITE-MoveReplicaHDFSTest-seed#[CEF8A02D5F0546E3]-worker) [    ] o.m.log Extract jar:file:/x1/jenkins/.ivy2/cache/org.apache.hadoop/hadoop-hdfs/tests/hadoop-hdfs-2.7.4-tests.jar!/webapps/datanode to ./temp/Jetty_localhost_46919_datanode____.783cca/webapp
   [junit4]   2> 1436826 ERROR (DataNode: [[[DISK]file:/x1/jenkins/jenkins-slave/workspace/Lucene-Solr-Tests-7.x/solr/build/solr-core/test/J2/temp/solr.cloud.MoveReplicaHDFSTest_CEF8A02D5F0546E3-001/tempDir-002/hdfsBaseDir/data/data1/, [DISK]file:/x1/jenkins/jenkins-slave/workspace/Lucene-Solr-Tests-7.x/solr/build/solr-core/test/J2/temp/solr.cloud.MoveReplicaHDFSTest_CEF8A02D5F0546E3-001/tempDir-002/hdfsBaseDir/data/data2/]]  heartbeating to localhost/127.0.0.1:58384) [    ] o.a.h.h.s.d.DirectoryScanner dfs.datanode.directoryscan.throttle.limit.ms.per.sec set to value below 1 ms/sec. Assuming default value of 1000
   [junit4]   2> 1436839 INFO  (OverseerCollectionConfigSetProcessor-73375672377933834-127.0.0.1:32913_solr-n_0000000000) [n:127.0.0.1:32913_solr    ] o.a.s.c.OverseerTaskQueue Response ZK path: /overseer/collection-queue-work/qnr-0000000000 doesn't exist.  Requestor may have disconnected from ZooKeeper
   [junit4]   2> 1436853 INFO  (Block report processor) [    ] BlockStateChange BLOCK* processReport 0x4774038ab63016: from storage DS-ec6ab677-4a6e-40b3-a958-412344a0ac6a node DatanodeRegistration(127.0.0.1:51100, datanodeUuid=cd866351-3960-4da2-bb50-d2091fd138a0, infoPort=54474, infoSecurePort=0, ipcPort=53079, storageInfo=lv=-56;cid=testClusterID;nsid=877167349;c=0), blocks: 0, hasStaleStorage: true, processing time: 0 msecs
   [junit4]   2> 1436853 INFO  (Block report processor) [    ] BlockStateChange BLOCK* processReport 0x4774038ab63016: from storage DS-4e452790-321c-450f-bc3c-f462c81e2f1b node DatanodeRegistration(127.0.0.1:51100, datanodeUuid=cd866351-3960-4da2-bb50-d2091fd138a0, infoPort=54474, infoSecurePort=0, ipcPort=53079, storageInfo=lv=-56;cid=testClusterID;nsid=877167349;c=0), blocks: 0, hasStaleStorage: false, processing time: 0 msecs
   [junit4]   2> 1437166 INFO  (SUITE-MoveReplicaHDFSTest-seed#[CEF8A02D5F0546E3]-worker) [    ] o.m.log Started HttpServer2$SelectChannelConnectorWithSafeStartup@localhost:46919
   [junit4]   2> 1437290 ERROR (DataNode: [[[DISK]file:/x1/jenkins/jenkins-slave/workspace/Lucene-Solr-Tests-7.x/solr/build/solr-core/test/J2/temp/solr.cloud.MoveReplicaHDFSTest_CEF8A02D5F0546E3-001/tempDir-002/hdfsBaseDir/data/data3/, [DISK]file:/x1/jenkins/jenkins-slave/workspace/Lucene-Solr-Tests-7.x/solr/build/solr-core/test/J2/temp/solr.cloud.MoveReplicaHDFSTest_CEF8A02D5F0546E3-001/tempDir-002/hdfsBaseDir/data/data4/]]  heartbeating to localhost/127.0.0.1:58384) [    ] o.a.h.h.s.d.DirectoryScanner dfs.datanode.directoryscan.throttle.limit.ms.per.sec set to value below 1 ms/sec. Assuming default value of 1000
   [junit4]   2> 1437302 INFO  (Block report processor) [    ] BlockStateChange BLOCK* processReport 0x477403a585fe47: from storage DS-afa392f6-8d25-460b-a06b-ed1fedfca3ba node DatanodeRegistration(127.0.0.1:60861, datanodeUuid=41149b86-377c-4fb4-8dde-01f595313353, infoPort=53955, infoSecurePort=0, ipcPort=54265, storageInfo=lv=-56;cid=testClusterID;nsid=877167349;c=0), blocks: 0, hasStaleStorage: true, processing time: 0 msecs
   [junit4]   2> 1437302 INFO  (Block report processor) [    ] BlockStateChange BLOCK* processReport 0x477403a585fe47: from storage DS-ac955c65-b0c2-408a-81db-c9a3ee027e0f node DatanodeRegistration(127.0.0.1:60861, datanodeUuid=41149b86-377c-4fb4-8dde-01f595313353, infoPort=53955, infoSecurePort=0, ipcPort=54265, storageInfo=lv=-56;cid=testClusterID;nsid=877167349;c=0), blocks: 0, hasStaleStorage: false, processing time: 0 msecs
   [junit4]   2> 1437552 INFO  (TEST-MoveReplicaHDFSTest.test-seed#[CEF8A02D5F0546E3]) [    ] o.a.s.SolrTestCaseJ4 ###Starting test
   [junit4]   2> 1437553 INFO  (TEST-MoveReplicaHDFSTest.test-seed#[CEF8A02D5F0546E3]) [    ] o.a.s.c.c.ZkStateReader Updated live nodes from ZooKeeper... (0) -> (4)
   [junit4]   2> 1437554 INFO  (TEST-MoveReplicaHDFSTest.test-seed#[CEF8A02D5F0546E3]) [    ] o.e.j.s.Server jetty-9.4.8.v20171121, build timestamp: 2017-11-21T23:27:37+02:00, git hash: 82b8fb23f757335bb3329d540ce37a2a2615f0a8
   [junit4]   2> 1437555 INFO  (TEST-MoveReplicaHDFSTest.test-seed#[CEF8A02D5F0546E3]) [    ] o.e.j.s.session DefaultSessionIdManager workerName=node0
   [junit4]   2> 1437555 INFO  (TEST-MoveReplicaHDFSTest.test-seed#[CEF8A02D5F0546E3]) [    ] o.e.j.s.session No SessionScavenger set, using defaults
   [junit4]   2> 1437555 INFO  (TEST-MoveReplicaHDFSTest.test-seed#[CEF8A02D5F0546E3]) [    ] o.e.j.s.session Scavenging every 600000ms
   [junit4]   2> 1437555 INFO  (TEST-MoveReplicaHDFSTest.test-seed#[CEF8A02D5F0546E3]) [    ] o.e.j.s.h.ContextHandler Started o.e.j.s.ServletContextHandler@1b8244f0{/solr,null,AVAILABLE}
   [junit4]   2> 1437556 INFO  (TEST-MoveReplicaHDFSTest.test-seed#[CEF8A02D5F0546E3]) [    ] o.e.j.s.AbstractConnector Started ServerConnector@2e8caa70{HTTP/1.1,[http/1.1]}{127.0.0.1:38652}
   [junit4]   2> 1437556 INFO  (TEST-MoveReplicaHDFSTest.test-seed#[CEF8A02D5F0546E3]) [    ] o.e.j.s.Server Started @1439913ms
   [junit4]   2> 1437556 INFO  (TEST-MoveReplicaHDFSTest.test-seed#[CEF8A02D5F0546E3]) [    ] o.a.s.c.s.e.JettySolrRunner Jetty properties: {hostContext=/solr, hostPort=38652}
   [junit4]   2> 1437556 ERROR (TEST-MoveReplicaHDFSTest.test-seed#[CEF8A02D5F0546E3]) [    ] o.a.s.u.StartupLoggingUtils Missing Java Option solr.log.dir. Logging may be missing or incomplete.
   [junit4]   2> 1437556 INFO  (TEST-MoveReplicaHDFSTest.test-seed#[CEF8A02D5F0546E3]) [    ] o.a.s.s.SolrDispatchFilter  ___      _       Welcome to Apache Solr? version 7.3.0
   [junit4]   2> 1437556 INFO  (TEST-MoveReplicaHDFSTest.test-seed#[CEF8A02D5F0546E3]) [    ] o.a.s.s.SolrDispatchFilter / __| ___| |_ _   Starting in cloud mode on port null
   [junit4]   2> 1437556 INFO  (TEST-MoveReplicaHDFSTest.test-seed#[CEF8A02D5F0546E3]) [    ] o.a.s.s.SolrDispatchFilter \__ \/ _ \ | '_|  Install dir: null
   [junit4]   2> 1437556 INFO  (TEST-MoveReplicaHDFSTest.test-seed#[CEF8A02D5F0546E3]) [    ] o.a.s.s.SolrDispatchFilter |___/\___/_|_|    Start time: 2018-02-28T23:26:16.932Z
   [junit4]   2> 1437558 INFO  (zkConnectionManagerCallback-5462-thread-1) [    ] o.a.s.c.c.ConnectionManager zkClient has connected
   [junit4]   2> 1437558 INFO  (TEST-MoveReplicaHDFSTest.test-seed#[CEF8A02D5F0546E3]) [    ] o.a.s.s.SolrDispatchFilter solr.xml found in ZooKeeper. Loading...
   [junit4]   2> 1437565 INFO  (TEST-MoveReplicaHDFSTest.test-seed#[CEF8A02D5F0546E3]) [    ] o.a.s.c.ZkContainer Zookeeper client=127.0.0.1:56414/solr
   [junit4]   2> 1437569 INFO  (zkConnectionManagerCallback-5466-thread-1) [    ] o.a.s.c.c.ConnectionManager zkClient has connected
   [junit4]   2> 1437570 INFO  (zkConnectionManagerCallback-5468-thread-1-processing-n:127.0.0.1:38652_solr) [n:127.0.0.1:38652_solr    ] o.a.s.c.c.ConnectionManager zkClient has connected
   [junit4]   2> 1437576 INFO  (TEST-MoveReplicaHDFSTest.test-seed#[CEF8A02D5F0546E3]) [n:127.0.0.1:38652_solr    ] o.a.s.c.c.ZkStateReader Updated live nodes from ZooKeeper... (0) -> (4)
   [junit4]   2> 1437578 INFO  (TEST-MoveReplicaHDFSTest.test-seed#[CEF8A02D5F0546E3]) [n:127.0.0.1:38652_solr    ] o.a.s.c.Overseer Overseer (id=null) closing
   [junit4]   2> 1437580 INFO  (TEST-MoveReplicaHDFSTest.test-seed#[CEF8A02D5F0546E3]) [n:127.0.0.1:38652_solr    ] o.a.s.c.ZkController Register node as live in ZooKeeper:/live_nodes/127.0.0.1:38652_solr
   [junit4]   2> 1437581 INFO  (zkCallback-5440-thread-2-processing-n:127.0.0.1:32913_solr) [n:127.0.0.1:32913_solr    ] o.a.s.c.c.ZkStateReader Updated live nodes from ZooKeeper... (4) -> (5)
   [junit4]   2> 1437582 INFO  (zkCallback-5445-thread-1-processing-n:127.0.0.1:57334_solr) [n:127.0.0.1:57334_solr    ] o.a.s.c.c.ZkStateReader Updated live nodes from ZooKeeper... (4) -> (5)
   [junit4]   2> 1437582 INFO  (zkCallback-5443-thread-1-processing-n:127.0.0.1:56146_solr) [n:127.0.0.1:56146_solr    ] o.a.s.c.c.ZkStateReader Updated live nodes from ZooKeeper... (4) -> (5)
   [junit4]   2> 1437582 INFO  (zkCallback-5430-thread-1-processing-n:127.0.0.1:52845_solr) [n:127.0.0.1:52845_solr    ] o.a.s.c.c.ZkStateReader Updated live nodes from ZooKeeper... (4) -> (5)
   [junit4]   2> 1437582 INFO  (zkCallback-5458-thread-1) [    ] o.a.s.c.c.ZkStateReader Updated live nodes from ZooKeeper... (4) -> (5)
   [junit4]   2> 1437582 INFO  (zkCallback-5467-thread-1-processing-n:127.0.0.1:38652_solr) [n:127.0.0.1:38652_solr    ] o.a.s.c.c.ZkStateReader Updated live nodes from ZooKeeper... (4) -> (5)
   [junit4]   2> 1437582 INFO  (zkCallback-5458-thread-2) [    ] o.a.s.c.c.ZkStateReader Updated live nodes from ZooKeeper... (4) -> (5)
   [junit4]   2> 1437630 INFO  (TEST-MoveReplicaHDFSTest.test-seed#[CEF8A02D5F0546E3]) [n:127.0.0.1:38652_solr    ] o.a.s.m.r.SolrJmxReporter JMX monitoring for 'solr_38652.solr.node' (registry 'solr.node') enabled at server: com.sun.jmx.mbeanserver.JmxMBeanServer@6570962e
   [junit4]   2> 1437641 INFO  (TEST-MoveReplicaHDFSTest.test-seed#[CEF8A02D5F0546E3]) [n:127.0.0.1:38652_solr    ] o.a.s.m.r.SolrJmxReporter JMX monitoring for 'solr_38652.solr.jvm' (registry 'solr.jvm') enabled at server: com.sun.jmx.mbeanserver.JmxMBeanServer@6570962e
   [junit4]   2> 1437641 INFO  (TEST-MoveReplicaHDFSTest.test-seed#[CEF8A02D5F0546E3]) [n:127.0.0.1:38652_solr    ] o.a.s.m.r.SolrJmxReporter JMX monitoring for 'solr_38652.solr.jetty' (registry 'solr.jetty') enabled at server: com.sun.jmx.mbeanserver.JmxMBeanServer@6570962e
   [junit4]   2> 1437643 INFO  (TEST-MoveReplicaHDFSTest.test-seed#[CEF8A02D5F0546E3]) [n:127.0.0.1:38652_solr    ] o.a.s.c.CorePropertiesLocator Found 0 core definitions underneath /x1/jenkins/jenkins-slave/workspace/Lucene-Solr-Tests-7.x/solr/build/solr-core/test/J2/temp/solr.cloud.MoveReplicaHDFSTest_CEF8A02D5F0546E3-001/tempDir-001/node5/.
   [junit4]   2> 1437697 INFO  (zkConnectionManagerCallback-5472-thread-1) [    ] o.a.s.c.c.ConnectionManager zkClient has connected
   [junit4]   2> 1437698 INFO  (TEST-MoveReplicaHDFSTest.test-seed#[CEF8A02D5F0546E3]) [    ] o.a.s.c.MoveReplicaTest total_jettys: 5
   [junit4]   2> 1437699 INFO  (qtp1832861987-17869) [n:127.0.0.1:32913_solr    ] o.a.s.h.a.CollectionsHandler Invoked Collection Action :create with params replicationFactor=2&collection.configName=conf1&maxShardsPerNode=2&autoAddReplicas=false&name=MoveReplicaHDFSTest_coll_true&nrtReplicas=2&action=CREATE&numShards=2&wt=javabin&version=2 and sendToOCPQueue=true
   [junit4]   2> 1437703 INFO  (OverseerThreadFactory-5533-thread-2-processing-n:127.0.0.1:32913_solr) [n:127.0.0.1:32913_solr    ] o.a.s.c.a.c.CreateCollectionCmd Create collection MoveReplicaHDFSTest_coll_true
   [junit4]   2> 1437816 INFO  (OverseerStateUpdate-73375672377933834-127.0.0.1:32913_solr-n_0000000000) [n:127.0.0.1:32913_solr    ] o.a.s.c.o.SliceMutator createReplica() {
   [junit4]   2>   "operation":"ADDREPLICA",
   [junit4]   2>   "collection":"MoveReplicaHDFSTest_coll_true",
   [junit4]   2>   "shard":"shard1",
   [junit4]   2>   "core":"MoveReplicaHDFSTest_coll_true_shard1_replica_n1",
   [junit4]   2>   "state":"down",
   [junit4]   2>   "base_url":"http://127.0.0.1:32913/solr",
   [junit4]   2>   "type":"NRT",
   [junit4]   2>   "waitForFinalState":"false"} 
   [junit4]   2> 1437818 INFO  (OverseerStateUpdate-73375672377933834-127.0.0.1:32913_solr-n_0000000000) [n:127.0.0.1:32913_solr    ] o.a.s.c.o.SliceMutator createReplica() {
   [junit4]   2>   "operation":"ADDREPLICA",
   [junit4]   2>   "collection":"MoveReplicaHDFSTest_coll_true",
   [junit4]   2>   "shard":"shard1",
   [junit4]   2>   "core":"MoveReplicaHDFSTest_coll_true_shard1_replica_n2",
   [junit4]   2>   "state":"down",
   [junit4]   2>   "base_url":"http://127.0.0.1:57334/solr",
   [junit4]   2>   "type":"NRT",
   [junit4]   2>   "waitForFinalState":"false"} 
   [junit4]   2> 1437820 INFO  (OverseerStateUpdate-73375672377933834-127.0.0.1:32913_solr-n_0000000000) [n:127.0.0.1:32913_solr    ] o.a.s.c.o.SliceMutator createReplica() {
   [junit4]   2>   "operation":"ADDREPLICA",
   [junit4]   2>   "collection":"MoveReplicaHDFSTest_coll_true",
   [junit4]   2>   "shard":"shard2",
   [junit4]   2>   "core":"MoveReplicaHDFSTest_coll_true_shard2_replica_n4",
   [junit4]   2>   "state":"down",
   [junit4]   2>   "base_url":"http://127.0.0.1:56146/solr",
   [junit4]   2>   "type":"NRT",
   [junit4]   2>   "waitForFinalState":"false"} 
   [junit4]   2> 1437822 INFO  (OverseerStateUpdate-73375672377933834-127.0.0.1:32913_solr-n_0000000000) [n:127.0.0.1:32913_solr    ] o.a.s.c.o.SliceMutator createReplica() {
   [junit4]   2>   "operation":"ADDREPLICA",
   [junit4]   2>   "collection":"MoveReplicaHDFSTest_coll_true",
   [junit4]   2>   "shard":"shard2",
   [junit4]   2>   "core":"MoveReplicaHDFSTest_coll_true_shard2_replica_n6",
   [junit4]   2>   "state":"down",
   [junit4]   2>   "base_url":"http://127.0.0.1:52845/solr",
   [junit4]   2>   "type":"NRT",
   [junit4]   2>   "waitForFinalState":"false"} 
   [junit4]   2> 1438024 INFO  (qtp1832861987-17873) [n:127.0.0.1:32913_solr    ] o.a.s.h.a.CoreAdminOperation core create command qt=/admin/cores&coreNodeName=core_node3&collection.configName=conf1&newCollection=true&name=MoveReplicaHDFSTest_coll_true_shard1_replica_n1&action=CREATE&numShards=2&collection=MoveReplicaHDFSTest_coll_true&shard=shard1&wt=javabin&version=2&replicaType=NRT
   [junit4]   2> 1438024 INFO  (qtp1832861987-17873) [n:127.0.0.1:32913_solr    ] o.a.s.c.TransientSolrCoreCacheDefault Allocating transient cache for 2147483647 transient cores
   [junit4]   2> 1438029 INFO  (qtp737089404-17859) [n:127.0.0.1:57334_solr    ] o.a.s.h.a.CoreAdminOperation core create command qt=/admin/cores&coreNodeName=core_node5&collection.configName=conf1&newCollection=true&name=MoveReplicaHDFSTest_coll_true_shard1_replica_n2&action=CREATE&numShards=2&collection=MoveReplicaHDFSTest_coll_true&shard=shard1&wt=javabin&version=2&replicaType=NRT
   [junit4]   2> 1438029 INFO  (qtp737089404-17859) [n:127.0.0.1:57334_solr    ] o.a.s.c.TransientSolrCoreCacheDefault Allocating transient cache for 2147483647 transient cores
   [junit4]   2> 1438030 INFO  (qtp822256037-17856) [n:127.0.0.1:56146_solr    ] o.a.s.h.a.CoreAdminOperation core create command qt=/admin/cores&coreNodeName=core_node7&collection.configName=conf1&newCollection=true&name=MoveReplicaHDFSTest_coll_true_shard2_replica_n4&action=CREATE&numShards=2&collection=MoveReplicaHDFSTest_coll_true&shard=shard2&wt=javabin&version=2&replicaType=NRT
   [junit4]   2> 1438030 INFO  (qtp822256037-17856) [n:127.0.0.1:56146_solr    ] o.a.s.c.TransientSolrCoreCacheDefault Allocating transient cache for 2147483647 transient cores
   [junit4]   2> 1438031 INFO  (qtp1999228359-17847) [n:127.0.0.1:52845_solr    ] o.a.s.h.a.CoreAdminOperation core create command qt=/admin/cores&coreNodeName=core_node8&collection.configName=conf1&newCollection=true&name=MoveReplicaHDFSTest_coll_true_shard2_replica_n6&action=CREATE&numShards=2&collection=MoveReplicaHDFSTest_coll_true&shard=shard2&wt=javabin&version=2&replicaType=NRT
   [junit4]   2> 1438031 INFO  (qtp1999228359-17847) [n:127.0.0.1:52845_solr    ] o.a.s.c.TransientSolrCoreCacheDefault Allocating transient cache for 2147483647 transient cores
   [junit4]   2> 1438136 INFO  (zkCallback-5445-thread-1-processing-n:127.0.0.1:57334_solr) [n:127.0.0.1:57334_solr    ] o.a.s.c.c.ZkStateReader A cluster state change: [WatchedEvent state:SyncConnected type:NodeDataChanged path:/collections/MoveReplicaHDFSTest_coll_true/state.json] for collection [MoveReplicaHDFSTest_coll_true] has occurred - updating... (live nodes size: [5])
   [junit4]   2> 1438136 INFO  (zkCallback-5430-thread-1-processing-n:127.0.0.1:52845_solr) [n:127.0.0.1:52845_solr    ] o.a.s.c.c.ZkStateReader A cluster state change: [WatchedEvent state:SyncConnected type:NodeDataChanged path:/collections/MoveReplicaHDFSTest_coll_true/state.json] for collection [MoveReplicaHDFSTest_coll_true] has occurred - updating... (live nodes size: [5])
   [junit4]   2> 1438136 INFO  (zkCallback-5440-thread-1-processing-n:127.0.0.1:32913_solr) [n:127.0.0.1:32913_solr    ] o.a.s.c.c.ZkStateReader A cluster state change: [WatchedEvent state:SyncConnected type:NodeDataChanged path:/collections/MoveReplicaHDFSTest_coll_true/state.json] for collection [MoveReplicaHDFSTest_coll_true] has occurred - updating... (live nodes size: [5])
   [junit4]   2> 1438136 INFO  (zkCallback-5440-thread-2-processing-n:127.0.0.1:32913_solr) [n:127.0.0.1:32913_solr    ] o.a.s.c.c.ZkStateReader A cluster state change: [WatchedEvent state:SyncConnected type:NodeDataChanged path:/collections/MoveReplicaHDFSTest_coll_true/state.json] for collection [MoveReplicaHDFSTest_coll_true] has occurred - updating... (live nodes size: [5])
   [junit4]   2> 1438136 INFO  (zkCallback-5443-thread-1-processing-n:127.0.0.1:56146_solr) [n:127.0.0.1:56146_solr    ] o.a.s.c.c.ZkStateReader A cluster state change: [WatchedEvent state:SyncConnected type:NodeDataChanged path:/collections/MoveReplicaHDFSTest_coll_true/state.json] for collection [MoveReplicaHDFSTest_coll_true] has occurred - updating... (live nodes size: [5])
   [junit4]   2> 1438137 INFO  (zkCallback-5430-thread-2-processing-n:127.0.0.1:52845_solr) [n:127.0.0.1:52845_solr    ] o.a.s.c.c.ZkStateReader A cluster state change: [WatchedEvent state:SyncConnected type:NodeDataChanged path:/collections/MoveReplicaHDFSTest_coll_true/state.json] for collection [MoveReplicaHDFSTest_coll_true] has occurred - updating... (live nodes size: [5])
   [junit4]   2> 1438137 INFO  (zkCallback-5445-thread-2-processing-n:127.0.0.1:57334_solr) [n:127.0.0.1:57334_solr    ] o.a.s.c.c.ZkStateReader A cluster state change: [WatchedEvent state:SyncConnected type:NodeDataChanged path:/collections/MoveReplicaHDFSTest_coll_true/state.json] for collection [MoveReplicaHDFSTest_coll_true] has occurred - updating... (live nodes size: [5])
   [junit4]   2> 1438138 INFO  (zkCallback-5443-thread-2-processing-n:127.0.0.1:56146_solr) [n:127.0.0.1:56146_solr    ] o.a.s.c.c.ZkStateReader A cluster state change: [WatchedEvent state:SyncConnected type:NodeDataChanged path:/collections/MoveReplicaHDFSTest_coll_true/state.json] for collection [MoveReplicaHDFSTest_coll_true] has occurred - updating... (live nodes size: [5])
   [junit4]   2> 1439046 INFO  (qtp1999228359-17847) [n:127.0.0.1:52845_solr c:MoveReplicaHDFSTest_coll_true s:shard2 r:core_node8 x:MoveReplicaHDFSTest_coll_true_shard2_replica_n6] o.a.s.c.SolrConfig Using Lucene MatchVersion: 7.3.0
   [junit4]   2> 1439046 INFO  (qtp1832861987-17873) [n:127.0.0.1:32913_solr c:MoveReplicaHDFSTest_coll_true s:shard1 r:core_node3 x:MoveReplicaHDFSTest_coll_true_shard1_replica_n1] o.a.s.c.SolrConfig Using Lucene MatchVersion: 7.3.0
   [junit4]   2> 1439047 INFO  (qtp822256037-17856) [n:127.0.0.1:56146_solr c:MoveReplicaHDFSTest_coll_true s:shard2 r:core_node7 x:MoveReplicaHDFSTest_coll_true_shard2_replica_n4] o.a.s.c.SolrConfig Using Lucene MatchVersion: 7.3.0
   [junit4]   2> 1439069 INFO  (qtp737089404-17859) [n:127.0.0.1:57334_solr c:MoveReplicaHDFSTest_coll_true s:shard1 r:core_node5 x:MoveReplicaHDFSTest_coll_true_shard1_replica_n2] o.a.s.c.SolrConfig Using Lucene MatchVersion: 7.3.0
   [junit4]   2> 1439072 INFO  (qtp1999228359-17847) [n:127.0.0.1:52845_solr c:MoveReplicaHDFSTest_coll_true s:shard2 r:core_node8 x:MoveReplicaHDFSTest_coll_true_shard2_replica_n6] o.a.s.s.IndexSchema [MoveReplicaHDFSTest_coll_true_shard2_replica_n6] Schema name=minimal
   [junit4]   2> 1439072 INFO  (qtp822256037-17856) [n:127.0.0.1:56146_solr c:MoveReplicaHDFSTest_coll_true s:shard2 r:core_node7 x:MoveReplicaHDFSTest_coll_true_shard2_replica_n4] o.a.s.s.IndexSchema [MoveReplicaHDFSTest_coll_true_shard2_replica_n4] Schema name=minimal
   [junit4]   2> 1439074 INFO  (qtp1832861987-17873) [n:127.0.0.1:32913_solr c:MoveReplicaHDFSTest_coll_true s:shard1 r:core_node3 x:MoveReplicaHDFSTest_coll_true_shard1_replica_n1] o.a.s.s.IndexSchema [MoveReplicaHDFSTest_coll_true_shard1_replica_n1] Schema name=minimal
   [junit4]   2> 1439075 INFO  (qtp737089404-17859) [n:127.0.0.1:57334_solr c:MoveReplicaHDFSTest_coll_true s:shard1 r:core_node5 x:MoveReplicaHDFSTest_coll_true_shard1_replica_n2] o.a.s.s.IndexSchema [MoveReplicaHDFSTest_coll_true_shard1_replica_n2] Schema name=minimal
   [junit4]   2> 1439075 INFO  (qtp1999228359-17847) [n:127.0.0.1:52845_solr c:MoveReplicaHDFSTest_coll_true s:shard2 r:core_node8 x:MoveReplicaHDFSTest_coll_true_shard2_replica_n6] o.a.s.s.IndexSchema Loaded schema minimal/1.1 with uniqueid field id
   [junit4]   2> 1439075 INFO  (qtp1999228359-17847) [n:127.0.0.1:52845_solr c:MoveReplicaHDFSTest_coll_true s:shard2 r:core_node8 x:MoveReplicaHDFSTest_coll_true_shard2_replica_n6] o.a.s.c.CoreContainer Creating SolrCore 'MoveReplicaHDFSTest_coll_true_shard2_replica_n6' using configuration from collection MoveReplicaHDFSTest_coll_true, trusted=true
   [junit4]   2> 1439075 INFO  (qtp822256037-17856) [n:127.0.0.1:56146_solr c:MoveReplicaHDFSTest_coll_true s:shard2 r:core_node7 x:MoveReplicaHDFSTest_coll_true_shard2_replica_n4] o.a.s.s.IndexSchema Loaded schema minimal/1.1 with uniqueid field id
   [junit4]   2> 1439075 INFO  (qtp822256037-17856) [n:127.0.0.1:56146_solr c:MoveReplicaHDFSTest_coll_true s:shard2 r:core_node7 x:MoveReplicaHDFSTest_coll_true_shard2_replica_n4] o.a.s.c.CoreContainer Creating SolrCore 'MoveReplicaHDFSTest_coll_true_shard2_replica_n4' using configuration from collection MoveReplicaHDFSTest_coll_true, trusted=true
   [junit4]   2> 1439075 INFO  (qtp1999228359-17847) [n:127.0.0.1:52845_solr c:MoveReplicaHDFSTest_coll_true s:shard2 r:core_node8 x:MoveReplicaHDFSTest_coll_true_shard2_replica_n6] o.a.s.m.r.SolrJmxReporter JMX monitoring for 'solr_52845.solr.core.MoveReplicaHDFSTest_coll_true.shard2.replica_n6' (registry 'solr.core.MoveReplicaHDFSTest_coll_true.shard2.replica_n6') enabled at server: com.sun.jmx.mbeanserver.JmxMBeanServer@6570962e
   [junit4]   2> 1439075 INFO  (qtp822256037-17856) [n:127.0.0.1:56146_solr c:MoveReplicaHDFSTest_coll_true s:shard2 r:core_node7 x:MoveReplicaHDFSTest_coll_true_shard2_replica_n4] o.a.s.m.r.SolrJmxReporter JMX monitoring for 'solr_56146.solr.core.MoveReplicaHDFSTest_coll_true.shard2.replica_n4' (registry 'solr.core.MoveReplicaHDFSTest_coll_true.shard2.replica_n4') enabled at server: com.sun.jmx.mbeanserver.JmxMBeanServer@6570962e
   [junit4]   2> 1439076 INFO  (qtp1832861987-17873) [n:127.0.0.1:32913_solr c:MoveReplicaHDFSTest_coll_true s:shard1 r:core_node3 x:MoveReplicaHDFSTest_coll_true_shard1_replica_n1] o.a.s.s.IndexSchema Loaded schema minimal/1.1 with uniqueid field id
   [junit4]   2> 1439076 INFO  (qtp1832861987-17873) [n:127.0.0.1:32913_solr c:MoveReplicaHDFSTest_coll_true s:shard1 r:core_node3 x:MoveReplicaHDFSTest_coll_true_shard1_replica_n1] o.a.s.c.CoreContainer Creating SolrCore 'MoveReplicaHDFSTest_coll_true_shard1_replica_n1' using configuration from collection MoveReplicaHDFSTest_coll_true, trusted=true
   [junit4]   2> 1439076 INFO  (qtp737089404-17859) [n:127.0.0.1:57334_solr c:MoveReplicaHDFSTest_coll_true s:shard1 r:core_node5 x:MoveReplicaHDFSTest_coll_true_shard1_replica_n2] o.a.s.s.IndexSchema Loaded schema minimal/1.1 with uniqueid field id
   [junit4]   2> 1439076 INFO  (qtp737089404-17859) [n:127.0.0.1:57334_solr c:MoveReplicaHDFSTest_coll_true s:shard1 r:core_node5 x:MoveReplicaHDFSTest_coll_true_shard1_replica_n2] o.a.s.c.CoreContainer Creating SolrCore 'MoveReplicaHDFSTest_coll_true_shard1_replica_n2' using configuration from collection MoveReplicaHDFSTest_coll_true, trusted=true
   [junit4]   2> 1439077 INFO  (qtp737089404-17859) [n:127.0.0.1:57334_solr c:MoveReplicaHDFSTest_coll_true s:shard1 r:core_node5 x:MoveReplicaHDFSTest_coll_true_shard1_replica_n2] o.a.s.m.r.SolrJmxReporter JMX monitoring for 'solr_57334.solr.core.MoveReplicaHDFSTest_coll_true.shard1.replica_n2' (registry 'solr.core.MoveReplicaHDFSTest_coll_true.shard1.replica_n2') enabled at server: com.sun.jmx.mbeanserver.JmxMBeanServer@6570962e
   [junit4]   2> 1439077 INFO  (qtp1832861987-17873) [n:127.0.0.1:32913_solr c:MoveReplicaHDFSTest_coll_true s:shard1 r:core_node3 x:MoveReplicaHDFSTest_coll_true_shard1_replica_n1] o.a.s.m.r.SolrJmxReporter JMX monitoring for 'solr_32913.solr.core.MoveReplicaHDFSTest_coll_true.shard1.replica_n1' (registry 'solr.core.MoveReplicaHDFSTest_coll_true.shard1.replica_n1') enabled at server: com.sun.jmx.mbeanserver.JmxMBeanServer@6570962e
   [junit4]   2> 1439081 INFO  (qtp1832861987-17873) [n:127.0.0.1:32913_solr c:MoveReplicaHDFSTest_coll_true s:shard1 r:core_node3 x:MoveReplicaHDFSTest_coll_true_shard1_replica_n1] o.a.s.c.HdfsDirectoryFactory solr.hdfs.home=hdfs://localhost:58384/data
   [junit4]   2> 1439081 INFO  (qtp1832861987-17873) [n:127.0.0.1:32913_solr c:MoveReplicaHDFSTest_coll_true s:shard1 r:core_node3 x:MoveReplicaHDFSTest_coll_true_shard1_replica_n1] o.a.s.c.HdfsDirectoryFactory Solr Kerberos Authentication disabled
   [junit4]   2> 1439081 INFO  (qtp1832861987-17873) [n:127.0.0.1:32913_solr c:MoveReplicaHDFSTest_coll_true s:shard1 r:core_node3 x:MoveReplicaHDFSTest_coll_true_shard1_replica_n1] o.a.s.c.SolrCore solr.RecoveryStrategy.Builder
   [junit4]   2> 1439081 INFO  (qtp737089404-17859) [n:127.0.0.1:57334_solr c:MoveReplicaHDFSTest_coll_true s:shard1 r:core_node5 x:MoveReplicaHDFSTest_coll_true_shard1_replica_n2] o.a.s.c.HdfsDirectoryFactory solr.hdfs.home=hdfs://localhost:58384/data
   [junit4]   2> 1439081 INFO  (qtp822256037-17856) [n:127.0.0.1:56146_solr c:MoveReplicaHDFSTest_coll_true s:shard2 r:core_node7 x:MoveReplicaHDFSTest_coll_true_shard2_replica_n4] o.a.s.c.HdfsDirectoryFactory solr.hdfs.home=hdfs://localhost:58384/data
   [junit4]   2> 1439081 INFO  (qtp737089404-17859) [n:127.0.0.1:57334_solr c:MoveReplicaHDFSTest_coll_true s:shard1 r:core_node5 x:MoveReplicaHDFSTest_coll_true_shard1_replica_n2] o.a.s.c.HdfsDirectoryFactory Solr Kerberos Authentication disabled
   [junit4]   2> 1439081 INFO  (qtp822256037-17856) [n:127.0.0.1:56146_solr c:MoveReplicaHDFSTest_coll_true s:shard2 r:core_node7 x:MoveReplicaHDFSTest_coll_true_shard2_replica_n4] o.a.s.c.HdfsDirectoryFactory Solr Kerberos Authentication disabled
   [junit4]   2> 1439081 INFO  (qtp822256037-17856) [n:127.0.0.1:56146_solr c:MoveReplicaHDFSTest_coll_true s:shard2 r:core_node7 x:MoveReplicaHDFSTest_coll_true_shard2_replica_n4] o.a.s.c.SolrCore solr.RecoveryStrategy.Builder
   [junit4]   2> 1439081 INFO  (qtp737089404-17859) [n:127.0.0.1:57334_solr c:MoveReplicaHDFSTest_coll_true s:shard1 r:core_node5 x:MoveReplicaHDFSTest_coll_true_shard1_replica_n2] o.a.s.c.SolrCore solr.RecoveryStrategy.Builder
   [junit4]   2> 1439081 INFO  (qtp1999228359-17847) [n:127.0.0.1:52845_solr c:MoveReplicaHDFSTest_coll_true s:shard2 r:core_node8 x:MoveReplicaHDFSTest_coll_true_shard2_replica_n6] o.a.s.c.HdfsDirectoryFactory solr.hdfs.home=hdfs://localhost:58384/data
   [junit4]   2> 1439082 INFO  (qtp822256037-17856) [n:127.0.0.1:56146_solr c:MoveReplicaHDFSTest_coll_true s:shard2 r:core_node7 x:MoveReplicaHDFSTest_coll_true_shard2_replica_n4] o.a.s.c.SolrCore [[MoveReplicaHDFSTest_coll_true_shard2_replica_n4] ] Opening new SolrCore at [/x1/jenkins/jenkins-slave/workspace/Lucene-Solr-Tests-7.x/solr/build/solr-core/test/J2/temp/solr.cloud.MoveReplicaHDFSTest_CEF8A02D5F0546E3-001/tempDir-001/node4/MoveReplicaHDFSTest_coll_true_shard2_replica_n4], dataDir=[hdfs://localhost:58384/data/MoveReplicaHDFSTest_coll_true/core_node7/data/]
   [junit4]   2> 1439083 INFO  (qtp1999228359-17847) [n:127.0.0.1:52845_solr c:MoveReplicaHDFSTest_coll_true s:shard2 r:core_node8 x:MoveReplicaHDFSTest_coll_true_shard2_replica_n6] o.a.s.c.HdfsDirectoryFactory Solr Kerberos Authentication disabled
   [junit4]   2> 1439083 INFO  (qtp1999228359-17847) [n:127.0.0.1:52845_solr c:MoveReplicaHDFSTest_coll_true s:shard2 r:core_node8 x:MoveReplicaHDFSTest_coll_true_shard2_replica_n6] o.a.s.c.SolrCore solr.RecoveryStrategy.Builder
   [junit4]   2> 1439083 INFO  (qtp1999228359-17847) [n:127.0.0.1:52845_solr c:MoveReplicaHDFSTest_coll_true s:shard2 r:core_node8 x:MoveReplicaHDFSTest_coll_true_shard2_replica_n6] o.a.s.c.SolrCore [[MoveReplicaHDFSTest_coll_true_shard2_replica_n6] ] Opening new SolrCore at [/x1/jenkins/jenkins-slave/workspace/Lucene-Solr-Tests-7.x/solr/build/solr-core/test/J2/temp/solr.cloud.MoveReplicaHDFSTest_CEF8A02D5F0546E3-001/tempDir-001/node2/MoveReplicaHDFSTest_coll_true_shard2_replica_n6], dataDir=[hdfs://localhost:58384/data/MoveReplicaHDFSTest_coll_true/core_node8/data/]
   [junit4]   2> 1439081 INFO  (qtp1832861987-17873) [n:127.0.0.1:32913_solr c:MoveReplicaHDFSTest_coll_true s:shard1 r:core_node3 x:MoveReplicaHDFSTest_coll_true_shard1_replica_n1] o.a.s.c.SolrCore [[MoveReplicaHDFSTest_coll_true_shard1_replica_n1] ] Opening new SolrCore at [/x1/jenkins/jenkins-slave/workspace/Lucene-Solr-Tests-7.x/solr/build/solr-core/test/J2/temp/solr.cloud.MoveReplicaHDFSTest_CEF8A02D5F0546E3-001/tempDir-001/node3/MoveReplicaHDFSTest_coll_true_shard1_replica_n1], dataDir=[hdfs://localhost:58384/data/MoveReplicaHDFSTest_coll_true/core_node3/data/]
   [junit4]   2> 1439085 INFO  (qtp822256037-17856) [n:127.0.0.1:56146_solr c:MoveReplicaHDFSTest_coll_true s:shard2 r:core_node7 x:MoveReplicaHDFSTest_coll_true_shard2_replica_n4] o.a.s.c.HdfsDirectoryFactory creating directory factory for path hdfs://localhost:58384/data/MoveReplicaHDFSTest_coll_true/core_node7/data/snapshot_metadata
   [junit4]   2> 1439081 INFO  (qtp737089404-17859) [n:127.0.0.1:57334_solr c:MoveReplicaHDFSTest_coll_true s:shard1 r:core_node5 x:MoveReplicaHDFSTest_coll_true_shard1_replica_n2] o.a.s.c.SolrCore [[MoveReplicaHDFSTest_coll_true_shard1_replica_n2] ] Opening new SolrCore at [/x1/jenkins/jenkins-slave/workspace/Lucene-Solr-Tests-7.x/solr/build/solr-core/test/J2/temp/solr.cloud.MoveReplicaHDFSTest_CEF8A02D5F0546E3-001/tempDir-001/node1/MoveReplicaHDFSTest_coll_true_shard1_replica_n2], dataDir=[hdfs://localhost:58384/data/MoveReplicaHDFSTest_coll_true/core_node5/data/]
   [junit4]   2> 1439087 INFO  (qtp1832861987-17873) [n:127.0.0.1:32913_solr c:MoveReplicaHDFSTest_coll_true s:shard1 r:core_node3 x:MoveReplicaHDFSTest_coll_true_shard1_replica_n1] o.a.s.c.HdfsDirectoryFactory creating directory factory for path hdfs://localhost:58384/data/MoveReplicaHDFSTest_coll_true/core_node3/data/snapshot_metadata
   [junit4]   2> 1439087 INFO  (qtp737089404-17859) [n:127.0.0.1:57334_solr c:MoveReplicaHDFSTest_coll_true s:shard1 r:core_node5 x:MoveReplicaHDFSTest_coll_true_shard1_replica_n2] o.a.s.c.HdfsDirectoryFactory creating directory factory for path hdfs://localhost:58384/data/MoveReplicaHDFSTest_coll_true/core_node5/data/snapshot_metadata
   [junit4]   2> 1439089 INFO  (qtp1999228359-17847) [n:127.0.0.1:52845_solr c:MoveReplicaHDFSTest_coll_true s:shard2 r:core_node8 x:MoveReplicaHDFSTest_coll_true_shard2_replica_n6] o.a.s.c.HdfsDirectoryFactory creating directory factory for path hdfs://localhost:58384/data/MoveReplicaHDFSTest_coll_true/core_node8/data/snapshot_metadata
   [junit4]   2> 1439116 INFO  (qtp1832861987-17873) [n:127.0.0.1:32913_solr c:MoveReplicaHDFSTest_coll_true s:shard1 r:core_node3 x:MoveReplicaHDFSTest_coll_true_shard1_replica_n1] o.a.s.c.HdfsDirectoryFactory creating directory factory for path hdfs://localhost:58384/data/MoveReplicaHDFSTest_coll_true/core_node3/data
   [junit4]   2> 1439116 INFO  (qtp1999228359-17847) [n:127.0.0.1:52845_solr c:MoveReplicaHDFSTest_coll_true s:shard2 r:core_node8 x:MoveReplicaHDFSTest_coll_true_shard2_replica_n6] o.a.s.c.HdfsDirectoryFactory creating directory factory for path hdfs://localhost:58384/data/MoveReplicaHDFSTest_coll_true/core_node8/data
   [junit4]   2> 1439121 INFO  (qtp737089404-17859) [n:127.0.0.1:57334_solr c:MoveReplicaHDFSTest_coll_true s:shard1 r:core_node5 x:MoveReplicaHDFSTest_coll_true_shard1_replica_n2] o.a.s.c.HdfsDirectoryFactory creating directory factory for path hdfs://localhost:58384/data/MoveReplicaHDFSTest_coll_true/core_node5/data
   [junit4]   2> 1439124 INFO  (qtp822256037-17856) [n:127.0.0.1:56146_solr c:MoveReplicaHDFSTest_coll_true s:shard2 r:core_node7 x:MoveReplicaHDFSTest_coll_true_shard2_replica_n4] o.a.s.c.HdfsDirectoryFactory creating directory factory for path hdfs://localhost:58384/data/MoveReplicaHDFSTest_coll_true/core_node7/data
   [junit4]   2> 1439149 INFO  (qtp1832861987-17873) [n:127.0.0.1:32913_solr c:MoveReplicaHDFSTest_coll_true s:shard1 r:core_node3 x:MoveReplicaHDFSTest_coll_true_shard1_replica_n1] o.a.s.c.HdfsDirectoryFactory creating directory factory for path hdfs://localhost:58384/data/MoveReplicaHDFSTest_coll_true/core_node3/data/index
   [junit4]   2> 1439173 INFO  (qtp737089404-17859) [n:127.0.0.1:57334_solr c:MoveReplicaHDFSTest_coll_true s:shard1 r:core_node5 x:MoveReplicaHDFSTest_coll_true_shard1_replica_n2] o.a.s.c.HdfsDirectoryFactory creating directory factory for path hdfs://localhost:58384/data/MoveReplicaHDFSTest_coll_true/core_node5/data/index
   [junit4]   2> 1439173 INFO  (qtp1999228359-17847) [n:127.0.0.1:52845_solr c:MoveReplicaHDFSTest_coll_true s:shard2 r:core_node8 x:MoveReplicaHDFSTest_coll_true_shard2_replica_n6] o.a.s.c.HdfsDirectoryFactory creating directory factory for path hdfs://localhost:58384/data/MoveReplicaHDFSTest_coll_true/core_node8/data/index
   [junit4]   2> 1439202 INFO  (qtp822256037-17856) [n:127.0.0.1:56146_solr c:MoveReplicaHDFSTest_coll_true s:shard2 r:core_node7 x:MoveReplicaHDFSTest_coll_true_shard2_replica_n4] o.a.s.c.HdfsDirectoryFactory creating directory factory for path hdfs://localhost:58384/data/MoveReplicaHDFSTest_coll_true/core_node7/data/index
   [junit4]   2> 1439377 INFO  (Block report processor) [    ] BlockStateChange BLOCK* addStoredBlock: blockMap updated: 127.0.0.1:51100 is added to blk_1073741828_1004{UCState=COMMITTED, truncateBlock=null, primaryNodeIndex=-1, replicas=[ReplicaUC[[DISK]DS-4e452790-321c-450f-bc3c-f462c81e2f1b:NORMAL:127.0.0.1:51100|RBW], ReplicaUC[[DISK]DS-afa392f6-8d25-460b-a06b-ed1fedfca3ba:NORMAL:127.0.0.1:60861|RBW]]} size 69
   [junit4]   2> 1439378 INFO  (Block report processor) [    ] BlockStateChange BLOCK* addStoredBlock: blockMap updated: 127.0.0.1:60861 is added to blk_1073741828_1004 size 69
   [junit4]   2> 1439385 INFO  (Block report processor) [    ] BlockStateChange BLOCK* addStoredBlock: blockMap updated: 127.0.0.1:51100 is added to blk_1073741825_1001{UCState=COMMITTED, truncateBlock=null, primaryNodeIndex=-1, replicas=[ReplicaUC[[DISK]DS-ec6ab677-4a6e-40b3-a958-412344a0ac6a:NORMAL:127.0.0.1:51100|RBW], ReplicaUC[[DISK]DS-ac955c65-b0c2-408a-81db-c9a3ee027e0f:NORMAL:127.0.0.1:60861|RBW]]} size 69
   [junit4]   2> 1439385 INFO  (Block report processor) [    ] BlockStateChange BLOCK* addStoredBlock: blockMap updated: 127.0.0.1:60861 is added to blk_1073741825_1001 size 69
   [junit4]   2> 1439387 INFO  (Block report processor) [    ] BlockStateChange BLOCK* addStoredBlock: blockMap updated: 127.0.0.1:60861 is added to blk_1073741827_1003{UCState=COMMITTED, truncateBlock=null, primaryNodeIndex=-1, replicas=[ReplicaUC[[DISK]DS-4e452790-321c-450f-bc3c-f462c81e2f1b:NORMAL:127.0.0.1:51100|RBW], ReplicaUC[[DISK]DS-afa392f6-8d25-460b-a06b-ed1fedfca3ba:NORMAL:127.0.0.1:60861|RBW]]} size 69
   [junit4]   2> 1439387 INFO  (Block report processor) [    ] BlockStateChange BLOCK* addStoredBlock: blockMap updated: 127.0.0.1:60861 is added to blk_1073741826_1002{UCState=COMMITTED, truncateBlock=null, primaryNodeIndex=-1, replicas=[ReplicaUC[[DISK]DS-ac955c65-b0c2-408a-81db-c9a3ee027e0f:NORMAL:127.0.0.1:60861|RBW], ReplicaUC[[DISK]DS-4e452790-321c-450f-bc3c-f462c81e2f1b:NORMAL:127.0.0.1:51100|RBW]]} size 69
   [junit4]   2> 1439387 INFO  (Block report processor) [    ] BlockStateChange BLOCK* addStoredBlock: blockMap updated: 127.0.0.1:51100 is added to blk_1073741826_1002 size 69
   [junit4]   2> 1439387 INFO  (Block report processor) [    ] BlockStateChange BLOCK* addStoredBlock: blockMap updated: 127.0.0.1:51100 is added to blk_1073741827_1003 size 69
   [junit4]   2> 1439889 INFO  (qtp1832861987-17873) [n:127.0.0.1:32913_solr c:MoveReplicaHDFSTest_coll_true s:shard1 r:core_node3 x:MoveReplicaHDFSTest_coll_true_shard1_replica_n1] o.a.s.u.UpdateHandler Using UpdateLog implementation: org.apache.solr.update.HdfsUpdateLog
   [junit4]   2> 1439890 INFO  (qtp1832861987-17873) [n:127.0.0.1:32913_solr c:MoveReplicaHDFSTest_coll_true s:shard1 r:core_node3 x:MoveReplicaHDFSTest_coll_true_shard1_replica_n1] o.a.s.u.UpdateLog Initializing UpdateLog: dataDir=null defaultSyncLevel=FLUSH numRecordsToKeep=100 maxNumLogsToKeep=10 numVersionBuckets=65536
   [junit4]   2> 1439890 INFO  (qtp1832861987-17873) [n:127.0.0.1:32913_solr c:MoveReplicaHDFSTest_coll_true s:shard1 r:core_node3 x:MoveReplicaHDFSTest_coll_true_shard1_replica_n1] o.a.s.u.HdfsUpdateLog Initializing HdfsUpdateLog: tlogDfsReplication=3
   [junit4]   2> 1439898 INFO  (qtp822256037-17856) [n:127.0.0.1:56146_solr c:MoveReplicaHDFSTest_coll_true s:shard2 r:core_node7 x:MoveReplicaHDFSTest_coll_true_shard2_replica_n4] o.a.s.u.UpdateHandler Using UpdateLog implementation: org.apache.solr.update.HdfsUpdateLog
   [junit4]   2> 1439898 INFO  (qtp822256037-17856) [n:127.0.0.1:56146_solr c:MoveReplicaHDFSTest_coll_true s:shard2 r:core_node7 x:MoveReplicaHDFSTest_coll_true_shard2_replica_n4] o.a.s.u.UpdateLog Initializing UpdateLog: dataDir=null defaultSyncLevel=FLUSH numRecordsToKeep=100 maxNumLogsToKeep=10 numVersionBuckets=65536
   [junit4]   2> 1439898 INFO  (qtp822256037-17856) [n:127.0.0.1:56146_solr c:MoveReplicaHDFSTest_coll_true s:shard2 r:core_node7 x:MoveReplicaHDFSTest_coll_true_shard2_replica_n4] o.a.s.u.HdfsUpdateLog Initializing HdfsUpdateLog: tlogDfsReplication=3
   [junit4]   2> 1439898 INFO  (qtp737089404-17859) [n:127.0.0.1:57334_solr c:MoveReplicaHDFSTest_coll_true s:shard1 r:core_node5 x:MoveReplicaHDFSTest_coll_true_shard1_replica_n2] o.a.s.u.UpdateHandler Using UpdateLog implementation: org.apache.solr.update.HdfsUpdateLog
   [junit4]   2> 1439898 INFO  (qtp737089404-17859) [n:127.0.0.1:57334_solr c:MoveReplicaHDFSTest_coll_true s:shard1 r:core_node5 x:MoveReplicaHDFSTest_coll_true_shard1_replica_n2] o.a.s.u.UpdateLog Initializing UpdateLog: dataDir=null defaultSyncLevel=FLUSH numRecordsToKeep=100 maxNumLogsToKeep=10 numVersionBuckets=65536
   [junit4]   2> 1439898 INFO  (qtp737089404-17859) [n:127.0.0.1:57334_solr c:MoveReplicaHDFSTest_coll_true s:shard1 r:core_node5 x:MoveReplicaHDFSTest_coll_true_shard1_replica_n2] o.a.s.u.HdfsUpdateLog Initializing HdfsUpdateLog: tlogDfsReplication=3
   [junit4]   2> 1439908 INFO  (qtp1999228359-17847) [n:127.0.0.1:52845_solr c:MoveReplicaHDFSTest_coll_true s:shard2 r:core_node8 x:MoveReplicaHDFSTest_coll_true_shard2_replica_n6] o.a.s.u.UpdateHandler Using UpdateLog implementation: org.apache.solr.update.HdfsUpdateLog
   [junit4]   2> 1439908 INFO  (qtp1999228359-17847) [n:127.0.0.1:52845_solr c:MoveReplicaHDFSTest_coll_true s:shard2 r:core_node8 x:MoveReplicaHDFSTest_coll_true_shard2_replica_n6] o.a.s.u.UpdateLog Initializing UpdateLog: dataDir=null defaultSyncLevel=FLUSH numRecordsToKeep=100 maxNumLogsToKeep=10 numVersionBuckets=65536
   [junit4]   2> 1439908 INFO  (qtp1999228359-17847) [n:127.0.0.1:52845_solr c:MoveReplicaHDFSTest_coll_true s:shard2 r:core_node8 x:MoveReplicaHDFSTest_coll_true_shard2_replica_n6] o.a.s.u.HdfsUpdateLog Initializing HdfsUpdateLog: tlogDfsReplication=3
   [junit4]   2> 1439910 INFO  (qtp737089404-17859) [n:127.0.0.1:57334_solr c:MoveReplicaHDFSTest_coll_true s:shard1 r:core_node5 x:MoveReplicaHDFSTest_coll_true_shard1_replica_n2] o.a.s.u.CommitTracker Hard AutoCommit: disabled
   [junit4]   2> 1439910 INFO  (qtp737089404-17859) [n:127.0.0.1:57334_solr c:MoveReplicaHDFSTest_coll_true s:shard1 r:core_node5 x:MoveReplicaHDFSTest_coll_true_shard1_replica_n2] o.a.s.u.CommitTracker Soft AutoCommit: disabled
   [junit4]   2> 1439913 INFO  (qtp1832861987-17873) [n:127.0.0.1:32913_solr c:MoveReplicaHDFSTest_coll_true s:shard1 r:core_node3 x:MoveReplicaHDFSTest_coll_true_shard1_replica_n1] o.a.s.u.CommitTracker Hard AutoCommit: disabled
   [junit4]   2> 1439913 INFO  (qtp1832861987-17873) [n:127.0.0.1:32913_solr c:MoveReplicaHDFSTest_coll_true s:shard1 r:core_node3 x:MoveReplicaHDFSTest_coll_true_shard1_replica_n1] o.a.s.u.CommitTracker Soft AutoCommit: disabled
   [junit4]   2> 1439920 INFO  (qtp822256037-17856) [n:127.0.0.1:56146_solr c:MoveReplicaHDFSTest_coll_true s:shard2 r:core_node7 x:MoveReplicaHDFSTest_coll_true_shard2_replica_n4] o.a.s.u.CommitTracker Hard AutoCommit: disabled
   [junit4]   2> 1439921 INFO  (qtp822256037-17856) [n:127.0.0.1:56146_solr c:MoveReplicaHDFSTest_coll_true s:shard2 r:core_node7 x:MoveReplicaHDFSTest_coll_true_shard2_replica_n4] o.a.s.u.CommitTracker Soft AutoCommit: disabled
   [junit4]   2> 1439923 INFO  (qtp1999228359-17847) [n:127.0.0.1:52845_solr c:MoveReplicaHDFSTest_coll_true s:shard2 r:core_node8 x:MoveReplicaHDFSTest_coll_true_shard2_replica_n6] o.a.s.u.CommitTracker Hard AutoCommit: disabled
   [junit4]   2> 1439923 INFO  (qtp1999228359-17847) [n:127.0.0.1:52845_solr c:MoveReplicaHDFSTest_coll_true s:shard2 r:core_node8 x:MoveReplicaHDFSTest_coll_true_shard2_replica_n6] o.a.s.u.CommitTracker Soft AutoCommit: disabled
   [junit4]   2> 1439957 INFO  (qtp737089404-17859) [n:127.0.0.1:57334_solr c:MoveReplicaHDFSTest_coll_true s:shard1 r:core_node5 x:MoveReplicaHDFSTest_coll_true_shard1_replica_n2] o.a.s.s.SolrIndexSearcher Opening [Searcher@7e8e3efe[MoveReplicaHDFSTest_coll_true_shard1_replica_n2] main]
   [junit4]   2> 1439959 INFO  (qtp737089404-17859) [n:127.0.0.1:57334_solr c:MoveReplicaHDFSTest_coll_true s:shard1 r:core_node5 x:MoveReplicaHDFSTest_coll_true_shard1_replica_n2] o.a.s.r.ManagedResourceStorage Configured ZooKeeperStorageIO with znodeBase: /configs/conf1
   [junit4]   2> 1439960 INFO  (qtp737089404-17859) [n:127.0.0.1:57334_solr c:MoveReplicaHDFSTest_coll_true s:shard1 r:core_node5 x:MoveReplicaHDFSTest_coll_true_shard1_replica_n2] o.a.s.r.ManagedResourceStorage Loaded null at path _rest_managed.json using ZooKeeperStorageIO:path=/configs/conf1
   [junit4]   2> 1439960 INFO  (qtp1832861987-17873) [n:127.0.0.1:32913_solr c:MoveReplicaHDFSTest_coll_true s:shard1 r:core_node3 x:MoveReplicaHDFSTest_coll_true_shard1_replica_n1] o.a.s.s.SolrIndexSearcher Opening [Searcher@40f69638[MoveReplicaHDFSTest_coll_true_shard1_replica_n1] main]
   [junit4]   2> 1439961 INFO  (qtp1832861987-17873) [n:127.0.0.1:32913_solr c:MoveReplicaHDFSTest_coll_true s:shard1 r:core_node3 x:MoveReplicaHDFSTest_coll_true_shard1_replica_n1] o.a.s.r.ManagedResourceStorage Configured ZooKeeperStorageIO with znodeBase: /configs/conf1
   [junit4]   2> 1439961 INFO  (qtp1832861987-17873) [n:127.0.0.1:32913_solr c:MoveReplicaHDFSTest_coll_true s:shard1 r:core_node3 x:MoveReplicaHDFSTest_coll_true_shard1_replica_n1] o.a.s.r.ManagedResourceStorage Loaded null at path _rest_managed.json using ZooKeeperStorageIO:path=/configs/conf1
   [junit4]   2> 1439962 INFO  (qtp1832861987-17873) [n:127.0.0.1:32913_solr c:MoveReplicaHDFSTest_coll_true s:shard1 r:core_node3 x:MoveReplicaHDFSTest_coll_true_shard1_replica_n1] o.a.s.h.ReplicationHandler Commits will be reserved for 10000ms.
   [junit4]   2> 1439962 INFO  (qtp737089404-17859) [n:127.0.0.1:57334_solr c:MoveReplicaHDFSTest_coll_true s:shard1 r:core_node5 x:MoveReplicaHDFSTest_coll_true_shard1_replica_n2] o.a.s.h.ReplicationHandler Commits will be reserved for 10000ms.
   [junit4]   2> 1439963 INFO  (searcherExecutor-5550-thread-1-processing-n:127.0.0.1:32913_solr x:MoveReplicaHDFSTest_coll_true_shard1_replica_n1 s:shard1 c:MoveReplicaHDFSTest_coll_true r:core_node3) [n:127.0.0.1:32913_solr c:MoveReplicaHDFSTest_coll_true s:shard1 r:core_node3 x:MoveReplicaHDFSTest_coll_true_shard1_replica_n1] o.a.s.c.SolrCore [MoveReplicaHDFSTest_coll_true_shard1_replica_n1] Registered new searcher Searcher@40f69638[MoveReplicaHDFSTest_coll_true_shard1_replica_n1] main{ExitableDirectoryReader(UninvertingDirectoryReader())}
   [junit4]   2> 1439963 INFO  (searcherExecutor-5551-thread-1-processing-n:127.0.0.1:57334_solr x:MoveReplicaHDFSTest_coll_true_shard1_replica_n2 s:shard1 c:MoveReplicaHDFSTest_coll_true r:core_node5) [n:127.0.0.1:57334_solr c:MoveReplicaHDFSTest_coll_true s:shard1 r:core_node5 x:MoveReplicaHDFSTest_coll_true_shard1_replica_n2] o.a.s.c.SolrCore [MoveReplicaHDFSTest_coll_true_shard1_replica_n2] Registered new searcher Searcher@7e8e3efe[MoveReplicaHDFSTest_coll_true_shard1_replica_n2] main{ExitableDirectoryReader(UninvertingDirectoryReader())}
   [junit4]   2> 1439964 INFO  (qtp1832861987-17873) [n:127.0.0.1:32913_solr c:MoveReplicaHDFSTest_coll_true s:shard1 r:core_node3 x:MoveReplicaHDFSTest_coll_true_shard1_replica_n1] o.a.s.u.UpdateLog Could not find max version in index or recent updates, using new clock 1593689117126819840
   [junit4]   2> 1439964 INFO  (qtp737089404-17859) [n:127.0.0.1:57334_solr c:MoveReplicaHDFSTest_coll_true s:shard1 r:core_node5 x:MoveReplicaHDFSTest_coll_true_shard1_replica_n2] o.a.s.u.UpdateLog Could not find max version in index or recent updates, using new clock 1593689117126819840
   [junit4]   2> 1439966 INFO  (qtp1999228359-17847) [n:127.0.0.1:52845_solr c:MoveReplicaHDFSTest_coll_true s:shard2 r:core_node8 x:MoveReplicaHDFSTest_coll_true_shard2_replica_n6] o.a.s.s.SolrIndexSearcher Opening [Searcher@49b3d2c0[MoveReplicaHDFSTest_coll_true_shard2_replica_n6] main]
   [junit4]   2> 1439969 INFO  (qtp1999228359-17847) [n:127.0.0.1:52845_solr c:MoveReplicaHDFSTest_coll_true s:shard2 r:core_node8 x:MoveReplicaHDFSTest_coll_true_shard2_replica_n6] o.a.s.r.ManagedResourceStorage Configured ZooKeeperStorageIO with znodeBase: /configs/conf1
   [junit4]   2> 1439969 INFO  (qtp822256037-17856) [n:127.0.0.1:56146_solr c:MoveReplicaHDFSTest_coll_true s:shard2 r:core_node7 x:MoveReplicaHDFSTest_coll_true_shard2_replica_n4] o.a.s.s.SolrIndexSearcher Opening [Searcher@26807273[MoveReplicaHDFSTest_coll_true_shard2_replica_n4] main]
   [junit4]   2> 1439970 INFO  (qtp1999228359-17847) [n:127.0.0.1:52845_solr c:MoveReplicaHDFSTest_coll_true s:shard2 r:core_node8 x:MoveReplicaHDFSTest_coll_true_shard2_replica_n6] o.a.s.r.ManagedResourceStorage Loaded null at path _rest_managed.json using ZooKeeperStorageIO:path=/configs/conf1
   [junit4]   2> 1439970 INFO  (qtp1999228359-17847) [n:127.0.0.1:52845_solr c:MoveReplicaHDFSTest_coll_true s:shard2 r:core_node8 x:MoveReplicaHDFSTest_coll_true_shard2_replica_n6] o.a.s.h.ReplicationHandler Commits will be reserved for 10000ms.
   [junit4]   2> 1439971 INFO  (qtp1999228359-17847) [n:127.0.0.1:52845_solr c:MoveReplicaHDFSTest_coll_true s:shard2 r:core_node8 x:MoveReplicaHDFSTest_coll_true_shard2_replica_n6] o.a.s.u.UpdateLog Could not find max version in index or recent updates, using new clock 1593689117134159872
   [junit4]   2> 1439973 INFO  (searcherExecutor-5548-thread-1-processing-n:127.0.0.1:52845_solr x:MoveReplicaHDFSTest_coll_true_shard2_replica_n6 s:shard2 c:MoveReplicaHDFSTest_coll_true r:core_node8) [n:127.0.0.1:52845_solr c:MoveReplicaHDFSTest_coll_true s:shard2 r:core_node8 x:MoveReplicaHDFSTest_coll_true_shard2_replica_n6] o.a.s.c.SolrCore [MoveReplicaHDFSTest_coll_true_shard2_replica_n6] Registered new searcher Searcher@49b3d2c0[MoveReplicaHDFSTest_coll_true_shard2_replica_n6] main{ExitableDirectoryReader(UninvertingDirectoryReader())}
   [junit4]   2> 1439973 INFO  (qtp822256037-17856) [n:127.0.0.1:56146_solr c:MoveReplicaHDFSTest_coll_true s:shard2 r:core_node7 x:MoveReplicaHDFSTest_coll_true_shard2_replica_n4] o.a.s.r.ManagedResourceStorage Configured ZooKeeperStorageIO with znodeBase: /configs/conf1
   [junit4]   2> 1439973 INFO  (qtp822256037-17856) [n:127.0.0.1:56146_solr c:MoveReplicaHDFSTest_coll_true s:shard2 r:core_node7 x:MoveReplicaHDFSTest_coll_true_shard2_replica_n4] o.a.s.r.ManagedResourceStorage Loaded null at path _rest_managed.json using ZooKeeperStorageIO:path=/configs/conf1
   [junit4]   2> 1439974 INFO  (qtp822256037-17856) [n:127.0.0.1:56146_solr c:MoveReplicaHDFSTest_coll_true s:shard2 r:core_node7 x:MoveReplicaHDFSTest_coll_true_shard2_replica_n4] o.a.s.h.ReplicationHandler Commits will be reserved for 10000ms.
   [junit4]   2> 1439975 INFO  (searcherExecutor-5549-thread-1-processing-n:127.0.0.1:56146_solr x:MoveReplicaHDFSTest_coll_true_shard2_replica_n4 s:shard2 c:MoveReplicaHDFSTest_coll_true r:core_node7) [n:127.0.0.1:56146_solr c:MoveReplicaHDFSTest_coll_true s:shard2 r:core_node7 x:MoveReplicaHDFSTest_coll_true_shard2_replica_n4] o.a.s.c.SolrCore [MoveReplicaHDFSTest_coll_true_shard2_replica_n4] Registered new searcher Searcher@26807273[MoveReplicaHDFSTest_coll_true_shard2_replica_n4] main{ExitableDirectoryReader(UninvertingDirectoryReader())}
   [junit4]   2> 1439975 INFO  (qtp822256037-17856) [n:127.0.0.1:56146_solr c:MoveReplicaHDFSTest_coll_true s:shard2 r:core_node7 x:MoveReplicaHDFSTest_coll_true_shard2_replica_n4] o.a.s.u.UpdateLog Could not find max version in index or recent updates, using new clock 1593689117138354176
   [junit4]   2> 1439979 INFO  (qtp822256037-17856) [n:127.0.0.1:56146_solr c:MoveReplicaHDFSTest_coll_true s:shard2 r:core_node7 x:MoveReplicaHDFSTest_coll_true_shard2_replica_n4] o.a.s.c.ZkShardTerms Failed to save terms, version is not match, retrying
   [junit4]   2> 1439980 INFO  (qtp737089404-17859) [n:127.0.0.1:57334_solr c:MoveReplicaHDFSTest_coll_true s:shard1 r:core_node5 x:MoveReplicaHDFSTest_coll_true_shard1_replica_n2] o.a.s.c.ShardLeaderElectionContext Enough replicas found to continue.
   [junit4]   2> 1439980 INFO  (qtp737089404-17859) [n:127.0.0.1:57334_solr c:MoveReplicaHDFSTest_coll_true s:shard1 r:core_node5 x:MoveReplicaHDFSTest_coll_true_shard1_replica_n2] o.a.s.c.ShardLeaderElectionContext I may be the new leader - try and sync
   [junit4]   2> 1439980 INFO  (qtp737089404-17859) [n:127.0.0.1:57334_solr c:MoveReplicaHDFSTest_coll_true s:shard1 r:core_node5 x:MoveReplicaHDFSTest_coll_true_shard1_replica_n2] o.a.s.c.SyncStrategy Sync replicas to http://127.0.0.1:57334/solr/MoveReplicaHDFSTest_coll_true_shard1_replica_n2/
   [junit4]   2> 1439980 INFO  (qtp737089404-17859) [n:127.0.0.1:57334_solr c:MoveReplicaHDFSTest_coll_true s:shard1 r:core_node5 x:MoveReplicaHDFSTest_coll_true_shard1_replica_n2] o.a.s.u.PeerSync PeerSync: core=MoveReplicaHDFSTest_coll_true_shard1_replica_n2 url=http://127.0.0.1:57334/solr START replicas=[http://127.0.0.1:32913/solr/MoveReplicaHDFSTest_coll_true_shard1_replica_n1/] nUpdates=100
   [junit4]   2> 1439982 INFO  (qtp1999228359-17847) [n:127.0.0.1:52845_solr c:MoveReplicaHDFSTest_coll_true s:shard2 r:core_node8 x:MoveReplicaHDFSTest_coll_true_shard2_replica_n6] o.a.s.c.ShardLeaderElectionContext Enough replicas found to continue.
   [junit4]   2> 1439982 INFO  (qtp1999228359-17847) [n:127.0.0.1:52845_solr c:MoveReplicaHDFSTest_coll_true s:shard2 r:core_node8 x:MoveReplicaHDFSTest_coll_true_shard2_replica_n6] o.a.s.c.ShardLeaderElectionContext I may be the new leader - try and sync
   [junit4]   2> 1439982 INFO  (qtp1999228359-17847) [n:127.0.0.1:52845_solr c:MoveReplicaHDFSTest_coll_true s:shard2 r:core_node8 x:MoveReplicaHDFSTest_coll_true_shard2_replica_n6] o.a.s.c.SyncStrategy Sync replicas to http://127.0.0.1:52845/solr/MoveReplicaHDFSTest_coll_true_shard2_replica_n6/
   [junit4]   2> 1439982 INFO  (qtp1999228359-17847) [n:127.0.0.1:52845_solr c:MoveReplicaHDFSTest_coll_true s:shard2 r:core_node8 x:MoveReplicaHDFSTest_coll_true_shard2_replica_n6] o.a.s.u.PeerSync PeerSync: core=MoveReplicaHDFSTest_coll_true_shard2_replica_n6 url=http://127.0.0.1:52845/solr START replicas=[http://127.0.0.1:56146/solr/MoveReplicaHDFSTest_coll_true_shard2_replica_n4/] nUpdates=100
   [junit4]   2> 1439986 INFO  (qtp822256037-17880) [n:127.0.0.1:56146_solr c:MoveReplicaHDFSTest_coll_true s:shard2 r:core_node7 x:MoveReplicaHDFSTest_coll_true_shard2_replica_n4] o.a.s.c.S.Request [MoveReplicaHDFSTest_coll_true_shard2_replica_n4]  webapp=/solr path=/get params={distrib=false&qt=/get&fingerprint=false&getVersions=100&wt=javabin&version=2} status=0 QTime=0
   [junit4]   2> 1439989 INFO  (qtp1832861987-17870) [n:127.0.0.1:32913_solr c:MoveReplicaHDFSTest_coll_true s:shard1 r:core_node3 x:MoveReplicaHDFSTest_coll_true_shard1_replica_n1] o.a.s.c.S.Request [MoveReplicaHDFSTest_coll_true_shard1_replica_n1]  webapp=/solr path=/get params={distrib=false&qt=/get&fingerprint=false&getVersions=100&wt=javabin&version=2} status=0 QTime=0
   [junit4]   2> 1440083 INFO  (zkCallback-5443-thread-2-processing-n:127.0.0.1:56146_solr) [n:127.0.0.1:56146_solr    ] o.a.s.c.c.ZkStateReader A cluster state change: [WatchedEvent state:SyncConnected type:NodeDataChanged path:/collections/MoveReplicaHDFSTest_coll_true/state.json] for collection [MoveReplicaHDFSTest_coll_true] has occurred - updating... (live nodes size: [5])
   [junit4]   2> 1440083 INFO  (zkCallback-5443-thread-1-processing-n:127.0.0.1:56146_solr) [n:127.0.0.1:56146_solr    ] o.a.s.c.c.ZkStateReader A cluster state change: [WatchedEvent state:SyncConnected type:NodeDataChanged path:/collections/MoveReplicaHDFSTest_coll_true/state.json] for collection [MoveReplicaHDFSTest_coll_true] has occurred - updating... (live nodes size: [5])
   [junit4]   2> 1440083 INFO  (zkCallback-5430-thread-1-processing-n:127.0.0.1:52845_solr) [n:127.0.0.1:52845_solr    ] o.a.s.c.c.ZkStateReader A cluster state change: [WatchedEvent state:SyncConnected type:NodeDataChanged path:/collections/MoveReplicaHDFSTest_coll_true/state.json] for collection [MoveReplicaHDFSTest_coll_true] has occurred - updating... (live nodes size: [5])
   [junit4]   2> 1440083 INFO  (zkCallback-5430-thread-2-processing-n:127.0.0.1:52845_solr) [n:127.0.0.1:52845_solr    ] o.a.s.c.c.ZkStateReader A cluster state change: [WatchedEvent state:SyncConnected type:NodeDataChanged path:/collections/MoveReplicaHDFSTest_coll_true/state.json] for collection [MoveReplicaHDFSTest_coll_true] has occurred - updating... (live nodes size: [5])
   [junit4]   2> 1440084 INFO  (zkCallback-5445-thread-2-processing-n:127.0.0.1:57334_solr) [n:127.0.0.1:57334_solr    ] o.a.s.c.c.ZkStateReader A cluster state change: [WatchedEvent state:SyncConnected type:NodeDataChanged path:/collections/MoveReplicaHDFSTest_coll_true/state.json] for collection [MoveReplicaHDFSTest_coll_true] has occurred - updating... (live nodes size: [5])
   [junit4]   2> 1440084 INFO  (zkCallback-5445-thread-1-processing-n:127.0.0.1:57334_solr) [n:127.0.0.1:57334_solr    ] o.a.s.c.c.ZkStateReader A cluster state change: [WatchedEvent state:SyncConnected type:NodeDataChanged path:/collections/MoveReplicaHDFSTest_coll_true/state.json] for collection [MoveReplicaHDFSTest_coll_true] has occurred - updating... (live nodes size: [5])
   [junit4]   2> 1440084 INFO  (zkCallback-5440-thread-3-processing-n:127.0.0.1:32913_solr) [n:127.0.0.1:32913_solr    ] o.a.s.c.c.ZkStateReader A cluster state change: [WatchedEvent state:SyncConnected type:NodeDataChanged path:/collections/MoveReplicaHDFSTest_coll_true/state.json] for collection [MoveReplicaHDFSTest_coll_true] has occurred - updating... (live nodes size: [5])
   [junit4]   2> 1440085 INFO  (zkCallback-5440-thread-1-processing-n:127.0.0.1:32913_solr) [n:127.0.0.1:32913_solr    ] o.a.s.c.c.ZkStateReader A cluster state change: [WatchedEvent state:SyncConnected type:NodeDataChanged path:/collections/MoveReplicaHDFSTest_coll_true/state.json] for collection [MoveReplicaHDFSTest_coll_true] has occurred - updating... (live nodes size: [5])
   [junit4]   2> 1440284 INFO  (qtp737089404-17859) [n:127.0.0.1:57334_solr c:MoveReplicaHDFSTest_coll_true s:shard1 r:core_node5 x:MoveReplicaHDFSTest_coll_true_shard1_replica_n2] o.a.s.u.PeerSync PeerSync: core=MoveReplicaHDFSTest_coll_true_shard1_replica_n2 url=http://127.0.0.1:57334/solr DONE.  We have no versions.  sync failed.
   [junit4]   2> 1440284 INFO  (qtp1999228359-17847) [n:127.0.0.1:52845_solr c:MoveReplicaHDFSTest_coll_true s:shard2 r:core_node8 x:MoveReplicaHDFSTest_coll_true_shard2_replica_n6] o.a.s.u.PeerSync PeerSync: core=MoveReplicaHDFSTest_coll_true_shard2_replica_n6 url=http://127.0.0.1:52845/solr DONE.  We have no versions.  sync failed.
   [junit4]   2> 1440284 INFO  (qtp737089404-17859) [n:127.0.0.1:57334_solr c:MoveReplicaHDFSTest_coll_true s:shard1 r:core_node5 x:MoveReplicaHDFSTest_coll_true_shard1_replica_n2] o.a.s.c.SyncStrategy Leader's attempt to sync with shard failed, moving to the next candidate
   [junit4]   2> 1440285 INFO  (qtp737089404-17859) [n:127.0.0.1:57334_solr c:MoveReplicaHDFSTest_coll_true s:shard1 r:core_node5 x:MoveReplicaHDFSTest_coll_true_shard1_replica_n2] o.a.s.c.ShardLeaderElectionContext We failed sync, but we have no versions - we can't sync in that case - we were active before, so become leader anyway
   [junit4]   2> 1440285 INFO  (qtp737089404-17859) [n:127.0.0.1:57334_solr c:MoveReplicaHDFSTest_coll_true s:shard1 r:core_node5 x:MoveReplicaHDFSTest_coll_true_shard1_replica_n2] o.a.s.c.ShardLeaderElectionContext Found all replicas participating in election, clear LIR
   [junit4]   2> 1440285 INFO  (qtp1999228359-17847) [n:127.0.0.1:52845_solr c:MoveReplicaHDFSTest_coll_true s:shard2 r:core_node8 x:MoveReplicaHDFSTest_coll_true_shard2_replica_n6] o.a.s.c.SyncStrategy Leader's attempt to sync with shard failed, moving to the next candidate
   [junit4]   2> 1440285 INFO  (qtp1999228359-17847) [n:127.0.0.1:52845_solr c:MoveReplicaHDFSTest_coll_true s:shard2 r:core_node8 x:MoveReplicaHDFSTest_coll_true_shard2_replica_n6] o.a.s.c.ShardLeaderElectionContext We failed sync, but we have no versions - we can't sync in that case - we were active before, so become leader anyway
   [junit4]   2> 1440285 INFO  (qtp1999228359-17847) [n:127.0.0.1:52845_solr c:MoveReplicaHDFSTest_coll_true s:shard2 r:core_node8 x:MoveReplicaHDFSTest_coll_true_shard2_replica_n6] o.a.s.c.ShardLeaderElectionContext Found all replicas participating in election, clear LIR
   [junit4]   2> 1440290 INFO  (qtp737089404-17859) [n:127.0.0.1:57334_solr c:MoveReplicaHDFSTest_coll_true s:shard1 r:core_node5 x:MoveReplicaHDFSTest_coll_true_shard1_replica_n2] o.a.s.c.ShardLeaderElectionContext I am the new leader: http://127.0.0.1:57334/solr/MoveReplicaHDFSTest_coll_true_shard1_replica_n2/ shard1
   [junit4]   2> 1440291 INFO  (qtp1999228359-17847) [n:127.0.0.1:52845_solr c:MoveReplicaHDFSTest_coll_true s:shard2 r:core_node8 x:MoveReplicaHDFSTest_coll_true_shard2_replica_n6] o.a.s.c.ShardLeaderElectionContext I am the new leader: http://127.0.0.1:52845/solr/MoveReplicaHDFSTest_coll_true_shard2_replica_n6/ shard2
   [junit4]   2> 1440393 INFO  (zkCallback-5443-thread-2-processing-n:127.0.0.1:56146_solr) [n:127.0.0.1:56146_solr    ] o.a.s.c.c.ZkStateReader A cluster state change: [WatchedEvent state:SyncConnected type:NodeDataChanged path:/collections/MoveReplicaHDFSTest_coll_true/state.json] for collection [MoveReplicaHDFSTest_coll_true] has occurred - updating... (live nodes size: [5])
   [junit4]   2> 1440393 INFO  (zkCallback-5443-thread-1-processing-n:127.0.0.1:56146_solr) [n:127.0.0.1:56146_solr    ] o.a.s.c.c.ZkStateReader A cluster state change: [WatchedEvent state:SyncConnected type:NodeDataChanged path:/collections/MoveReplicaHDFSTest_coll_true/state.json] for collection [MoveReplicaHDFSTest_coll_true] has occurred - updating... (live nodes size: [5])
   [junit4]   2> 1440393 INFO  (zkCallback-5430-thread-2-processing-n:127.0.0.1:52845_solr) [n:127.0.0.1:52845_solr    ] o.a.s.c.c.ZkStateReader A cluster state change: [WatchedEvent state:SyncConnected type:NodeDataChanged path:/collections/MoveReplicaHDFSTest_coll_true/state.json] for collection [MoveReplicaHDFSTest_coll_true] has occurred - updating... (live nodes size: [5])
   [junit4]   2> 1440393 INFO  (zkCallback-5430-thread-1-processing-n:127.0.0.1:52845_solr) [n:127.0.0.1:52845_solr    ] o.a.s.c.c.ZkStateReader A cluster state change: [WatchedEvent state:SyncConnected type:NodeDataChanged path:/collections/MoveReplicaHDFSTest_coll_true/state.json] for collection [MoveReplicaHDFSTest_coll_true] has occurred - updating... (live nodes size: [5])
   [junit4]   2> 1440393 INFO  (zkCallback-5445-thread-2-processing-n:127.0.0.1:57334_solr) [n:127.0.

[...truncated too long message...]

EF8A02D5F0546E3]-worker) [    ] o.a.z.s.ZooKeeperServer ZKShutdownHandler is not registered, so ZooKeeper server won't take any action on ERROR or SHUTDOWN server state changes
   [junit4]   2> 1495291 INFO  (SUITE-MoveReplicaHDFSTest-seed#[CEF8A02D5F0546E3]-worker) [    ] o.a.s.c.ZkTestServer connecting to 127.0.0.1:56414 56414
   [junit4]   2> 1495513 INFO  (Thread-2882) [    ] o.a.s.c.ZkTestServer connecting to 127.0.0.1:56414 56414
   [junit4]   2> 1495514 WARN  (Thread-2882) [    ] o.a.s.c.ZkTestServer Watch limit violations: 
   [junit4]   2> Maximum concurrent create/delete watches above limit:
   [junit4]   2> 
   [junit4]   2> 	21	/solr/collections/MoveReplicaHDFSTest_coll_false/terms/shard1
   [junit4]   2> 	16	/solr/collections/MoveReplicaHDFSTest_coll_true/terms/shard2
   [junit4]   2> 	14	/solr/configs/conf1
   [junit4]   2> 	9	/solr/clusterprops.json
   [junit4]   2> 	9	/solr/aliases.json
   [junit4]   2> 	8	/solr/collections/MoveReplicaHDFSTest_coll_false/terms/shard2
   [junit4]   2> 	6	/solr/collections/MoveReplicaHDFSTest_failed_coll_true/terms/shard1
   [junit4]   2> 	6	/solr/collections/MoveReplicaHDFSTest_coll_true/terms/shard1
   [junit4]   2> 	5	/solr/collections/MoveReplicaHDFSTest_failed_coll_true/terms/shard2
   [junit4]   2> 	5	/solr/security.json
   [junit4]   2> 
   [junit4]   2> Maximum concurrent data watches above limit:
   [junit4]   2> 
   [junit4]   2> 	68	/solr/collections/MoveReplicaHDFSTest_coll_true/state.json
   [junit4]   2> 	66	/solr/collections/MoveReplicaHDFSTest_coll_false/state.json
   [junit4]   2> 	33	/solr/collections/MoveReplicaHDFSTest_failed_coll_true/state.json
   [junit4]   2> 	9	/solr/clusterstate.json
   [junit4]   2> 	3	/solr/overseer_elect/election/73375672377933835-127.0.0.1:56146_solr-n_0000000001
   [junit4]   2> 	2	/solr/collections/MoveReplicaHDFSTest_coll_true/leader_elect/shard2/election/73375672377933835-core_node7-n_0000000001
   [junit4]   2> 	2	/solr/autoscaling.json
   [junit4]   2> 	2	/solr/collections/MoveReplicaHDFSTest_coll_false/leader_elect/shard1/election/73375672377933841-core_node3-n_0000000001
   [junit4]   2> 
   [junit4]   2> Maximum concurrent children watches above limit:
   [junit4]   2> 
   [junit4]   2> 	20	/solr/collections
   [junit4]   2> 	13	/solr/live_nodes
   [junit4]   2> 	2	/solr/overseer/queue
   [junit4]   2> 	2	/solr/autoscaling/events/.auto_add_replicas
   [junit4]   2> 	2	/solr/overseer/queue-work
   [junit4]   2> 	2	/solr/overseer/collection-queue-work
   [junit4]   2> 
   [junit4]   2> 1495515 WARN  (SUITE-MoveReplicaHDFSTest-seed#[CEF8A02D5F0546E3]-worker) [    ] o.a.h.h.s.d.DirectoryScanner DirectoryScanner: shutdown has been called
   [junit4]   2> 1495530 INFO  (SUITE-MoveReplicaHDFSTest-seed#[CEF8A02D5F0546E3]-worker) [    ] o.m.log Stopped HttpServer2$SelectChannelConnectorWithSafeStartup@localhost:0
   [junit4]   2> 1495535 WARN  (670186745@qtp-1919705393-1 - Acceptor0 HttpServer2$SelectChannelConnectorWithSafeStartup@localhost:46919) [    ] o.a.h.h.HttpServer2 HttpServer Acceptor: isRunning is false. Rechecking.
   [junit4]   2> 1495535 WARN  (670186745@qtp-1919705393-1 - Acceptor0 HttpServer2$SelectChannelConnectorWithSafeStartup@localhost:46919) [    ] o.a.h.h.HttpServer2 HttpServer Acceptor: isRunning is false
   [junit4]   2> 1495632 WARN  (DataNode: [[[DISK]file:/x1/jenkins/jenkins-slave/workspace/Lucene-Solr-Tests-7.x/solr/build/solr-core/test/J2/temp/solr.cloud.MoveReplicaHDFSTest_CEF8A02D5F0546E3-001/tempDir-002/hdfsBaseDir/data/data3/, [DISK]file:/x1/jenkins/jenkins-slave/workspace/Lucene-Solr-Tests-7.x/solr/build/solr-core/test/J2/temp/solr.cloud.MoveReplicaHDFSTest_CEF8A02D5F0546E3-001/tempDir-002/hdfsBaseDir/data/data4/]]  heartbeating to localhost/127.0.0.1:58384) [    ] o.a.h.h.s.d.IncrementalBlockReportManager IncrementalBlockReportManager interrupted
   [junit4]   2> 1495632 WARN  (DataNode: [[[DISK]file:/x1/jenkins/jenkins-slave/workspace/Lucene-Solr-Tests-7.x/solr/build/solr-core/test/J2/temp/solr.cloud.MoveReplicaHDFSTest_CEF8A02D5F0546E3-001/tempDir-002/hdfsBaseDir/data/data3/, [DISK]file:/x1/jenkins/jenkins-slave/workspace/Lucene-Solr-Tests-7.x/solr/build/solr-core/test/J2/temp/solr.cloud.MoveReplicaHDFSTest_CEF8A02D5F0546E3-001/tempDir-002/hdfsBaseDir/data/data4/]]  heartbeating to localhost/127.0.0.1:58384) [    ] o.a.h.h.s.d.DataNode Ending block pool service for: Block pool BP-1283207442-10.41.0.5-1519860374234 (Datanode Uuid 41149b86-377c-4fb4-8dde-01f595313353) service to localhost/127.0.0.1:58384
   [junit4]   2> 1495634 WARN  (SUITE-MoveReplicaHDFSTest-seed#[CEF8A02D5F0546E3]-worker) [    ] o.a.h.h.s.d.DirectoryScanner DirectoryScanner: shutdown has been called
   [junit4]   2> 1495642 INFO  (SUITE-MoveReplicaHDFSTest-seed#[CEF8A02D5F0546E3]-worker) [    ] o.m.log Stopped HttpServer2$SelectChannelConnectorWithSafeStartup@localhost:0
   [junit4]   2> 1495743 WARN  (DataNode: [[[DISK]file:/x1/jenkins/jenkins-slave/workspace/Lucene-Solr-Tests-7.x/solr/build/solr-core/test/J2/temp/solr.cloud.MoveReplicaHDFSTest_CEF8A02D5F0546E3-001/tempDir-002/hdfsBaseDir/data/data1/, [DISK]file:/x1/jenkins/jenkins-slave/workspace/Lucene-Solr-Tests-7.x/solr/build/solr-core/test/J2/temp/solr.cloud.MoveReplicaHDFSTest_CEF8A02D5F0546E3-001/tempDir-002/hdfsBaseDir/data/data2/]]  heartbeating to localhost/127.0.0.1:58384) [    ] o.a.h.h.s.d.IncrementalBlockReportManager IncrementalBlockReportManager interrupted
   [junit4]   2> 1495743 WARN  (DataNode: [[[DISK]file:/x1/jenkins/jenkins-slave/workspace/Lucene-Solr-Tests-7.x/solr/build/solr-core/test/J2/temp/solr.cloud.MoveReplicaHDFSTest_CEF8A02D5F0546E3-001/tempDir-002/hdfsBaseDir/data/data1/, [DISK]file:/x1/jenkins/jenkins-slave/workspace/Lucene-Solr-Tests-7.x/solr/build/solr-core/test/J2/temp/solr.cloud.MoveReplicaHDFSTest_CEF8A02D5F0546E3-001/tempDir-002/hdfsBaseDir/data/data2/]]  heartbeating to localhost/127.0.0.1:58384) [    ] o.a.h.h.s.d.DataNode Ending block pool service for: Block pool BP-1283207442-10.41.0.5-1519860374234 (Datanode Uuid cd866351-3960-4da2-bb50-d2091fd138a0) service to localhost/127.0.0.1:58384
   [junit4]   2> 1495750 INFO  (SUITE-MoveReplicaHDFSTest-seed#[CEF8A02D5F0546E3]-worker) [    ] o.m.log Stopped HttpServer2$SelectChannelConnectorWithSafeStartup@localhost:0
   [junit4]   2> 1495865 INFO  (SUITE-MoveReplicaHDFSTest-seed#[CEF8A02D5F0546E3]-worker) [    ] o.a.s.c.ZkTestServer connecting to 127.0.0.1:56414 56414
   [junit4]   2> NOTE: leaving temporary files on disk at: /x1/jenkins/jenkins-slave/workspace/Lucene-Solr-Tests-7.x/solr/build/solr-core/test/J2/temp/solr.cloud.MoveReplicaHDFSTest_CEF8A02D5F0546E3-001
   [junit4]   2> Feb 28, 2018 11:27:15 PM com.carrotsearch.randomizedtesting.ThreadLeakControl checkThreadLeaks
   [junit4]   2> WARNING: Will linger awaiting termination of 34 leaked thread(s).
   [junit4]   2> NOTE: test params are: codec=CheapBastard, sim=RandomSimilarity(queryNorm=false): {}, locale=es-UY, timezone=US/Mountain
   [junit4]   2> NOTE: Linux 3.13.0-88-generic amd64/Oracle Corporation 1.8.0_144 (64-bit)/cpus=4,threads=2,free=302060592,total=519569408
   [junit4]   2> NOTE: All tests run in this JVM: [RollingRestartTest, AutoAddReplicasPlanActionTest, TestRandomDVFaceting, TestSolrConfigHandlerCloud, HdfsLockFactoryTest, TestOnReconnectListenerSupport, DocValuesTest, SolrSlf4jReporterTest, AliasIntegrationTest, CleanupOldIndexTest, TestNumericTokenStream, TestSolr4Spatial2, CdcrVersionReplicationTest, NodeMutatorTest, SolrMetricReporterTest, TriggerIntegrationTest, DateMathParserTest, TestLMJelinekMercerSimilarityFactory, VersionInfoTest, CachingDirectoryFactoryTest, CacheHeaderTest, NoCacheHeaderTest, DistributedSuggestComponentTest, TestTrackingShardHandlerFactory, TestFaceting, TestRangeQuery, TestCoreDiscovery, TestEmbeddedSolrServerConstructors, HdfsRestartWhileUpdatingTest, ConnectionReuseTest, TimeRoutedAliasUpdateProcessorTest, TestDynamicLoading, BasicDistributedZk2Test, ConvertedLegacyTest, DistributedFacetPivotLongTailTest, DisMaxRequestHandlerTest, TestInitParams, TestBulkSchemaAPI, TestOrdValues, TestHdfsBackupRestoreCore, TestUtils, DistribCursorPagingTest, DistributedSpellCheckComponentTest, TestSegmentSorting, TestLeaderInitiatedRecoveryThread, TestDynamicFieldResource, ShowFileRequestHandlerTest, RecoveryZkTest, ResponseLogComponentTest, RecoveryAfterSoftCommitTest, TestQuerySenderListener, TestPolicyCloud, TestCloudManagedSchema, TestDFISimilarityFactory, TestSchemaResource, TestSolrCloudWithSecureImpersonation, TestShardHandlerFactory, TestAuthorizationFramework, DistanceUnitsTest, TestCloudInspectUtil, TestAnalyzeInfixSuggestions, TestValueSourceCache, TestConfigSetImmutable, TestClusterProperties, CloudMLTQParserTest, AddBlockUpdateTest, TestLazyCores, TestDocBasedVersionConstraints, ClusterStateTest, DataDrivenBlockJoinTest, TestDistribStateManager, LukeRequestHandlerTest, TestFiltering, IgnoreCommitOptimizeUpdateProcessorFactoryTest, NotRequiredUniqueKeyTest, SuggesterTSTTest, CurrencyRangeFacetCloudTest, TestBadConfig, ResponseHeaderTest, SolrTestCaseJ4Test, V2ApiIntegrationTest, TestRebalanceLeaders, UnloadDistributedZkTest, TestSubQueryTransformer, TestSha256AuthenticationProvider, TestAddFieldRealTimeGet, CopyFieldTest, TestSchemalessBufferedUpdates, TestFieldCacheVsDocValues, SpatialFilterTest, TestPullReplicaErrorHandling, TestCollectionsAPIViaSolrCloudCluster, ConnectionManagerTest, TestPushWriter, MoreLikeThisHandlerTest, FileBasedSpellCheckerTest, TestStressLiveNodes, WordBreakSolrSpellCheckerTest, DateFieldTest, TestComplexPhraseQParserPlugin, BlockJoinFacetDistribTest, MetricTriggerTest, TestStressReorder, SuggestComponentContextFilterQueryTest, MigrateRouteKeyTest, TestSearcherReuse, TestDistribDocBasedVersion, TestSolrCloudWithHadoopAuthPlugin, DirectoryFactoryTest, LeaderFailureAfterFreshStartTest, ExplicitHLLTest, MoveReplicaHDFSTest]
   [junit4] Completed [440/777 (1!)] on J2 in 71.26s, 4 tests, 1 error, 1 skipped <<< FAILURES!

[...truncated 49118 lines...]

Mime
View raw message