lucene-dev mailing list archives

Site index · List index
Message view « Date » · « Thread »
Top « Date » · « Thread »
From Apache Jenkins Server <jenk...@builds.apache.org>
Subject [JENKINS] Lucene-Solr-NightlyTests-7.x - Build # 175 - Failure
Date Thu, 15 Mar 2018 05:03:00 GMT
Build: https://builds.apache.org/job/Lucene-Solr-NightlyTests-7.x/175/

4 tests failed.
FAILED:  org.apache.solr.cloud.RollingRestartTest.test

Error Message:
Unable to restart (#6): CloudJettyRunner [url=http://127.0.0.1:46425/bcb/collection1_shard1_replica_n67]

Stack Trace:
java.lang.AssertionError: Unable to restart (#6): CloudJettyRunner [url=http://127.0.0.1:46425/bcb/collection1_shard1_replica_n67]
	at __randomizedtesting.SeedInfo.seed([E7C8D9B9A63EB0:88B3F703175A5348]:0)
	at org.junit.Assert.fail(Assert.java:93)
	at org.junit.Assert.assertTrue(Assert.java:43)
	at org.apache.solr.cloud.RollingRestartTest.restartWithRolesTest(RollingRestartTest.java:103)
	at org.apache.solr.cloud.RollingRestartTest.test(RollingRestartTest.java:52)
	at sun.reflect.NativeMethodAccessorImpl.invoke0(Native Method)
	at sun.reflect.NativeMethodAccessorImpl.invoke(NativeMethodAccessorImpl.java:62)
	at sun.reflect.DelegatingMethodAccessorImpl.invoke(DelegatingMethodAccessorImpl.java:43)
	at java.lang.reflect.Method.invoke(Method.java:498)
	at com.carrotsearch.randomizedtesting.RandomizedRunner.invoke(RandomizedRunner.java:1737)
	at com.carrotsearch.randomizedtesting.RandomizedRunner$8.evaluate(RandomizedRunner.java:934)
	at com.carrotsearch.randomizedtesting.RandomizedRunner$9.evaluate(RandomizedRunner.java:970)
	at com.carrotsearch.randomizedtesting.RandomizedRunner$10.evaluate(RandomizedRunner.java:984)
	at org.apache.solr.BaseDistributedSearchTestCase$ShardsRepeatRule$ShardsFixedStatement.callStatement(BaseDistributedSearchTestCase.java:993)
	at org.apache.solr.BaseDistributedSearchTestCase$ShardsRepeatRule$ShardsStatement.evaluate(BaseDistributedSearchTestCase.java:968)
	at com.carrotsearch.randomizedtesting.rules.SystemPropertiesRestoreRule$1.evaluate(SystemPropertiesRestoreRule.java:57)
	at org.apache.lucene.util.TestRuleSetupTeardownChained$1.evaluate(TestRuleSetupTeardownChained.java:49)
	at org.apache.lucene.util.AbstractBeforeAfterRule$1.evaluate(AbstractBeforeAfterRule.java:45)
	at org.apache.lucene.util.TestRuleThreadAndTestName$1.evaluate(TestRuleThreadAndTestName.java:48)
	at org.apache.lucene.util.TestRuleIgnoreAfterMaxFailures$1.evaluate(TestRuleIgnoreAfterMaxFailures.java:64)
	at org.apache.lucene.util.TestRuleMarkFailure$1.evaluate(TestRuleMarkFailure.java:47)
	at com.carrotsearch.randomizedtesting.rules.StatementAdapter.evaluate(StatementAdapter.java:36)
	at com.carrotsearch.randomizedtesting.ThreadLeakControl$StatementRunner.run(ThreadLeakControl.java:368)
	at com.carrotsearch.randomizedtesting.ThreadLeakControl.forkTimeoutingTask(ThreadLeakControl.java:817)
	at com.carrotsearch.randomizedtesting.ThreadLeakControl$3.evaluate(ThreadLeakControl.java:468)
	at com.carrotsearch.randomizedtesting.RandomizedRunner.runSingleTest(RandomizedRunner.java:943)
	at com.carrotsearch.randomizedtesting.RandomizedRunner$5.evaluate(RandomizedRunner.java:829)
	at com.carrotsearch.randomizedtesting.RandomizedRunner$6.evaluate(RandomizedRunner.java:879)
	at com.carrotsearch.randomizedtesting.RandomizedRunner$7.evaluate(RandomizedRunner.java:890)
	at com.carrotsearch.randomizedtesting.rules.StatementAdapter.evaluate(StatementAdapter.java:36)
	at com.carrotsearch.randomizedtesting.rules.SystemPropertiesRestoreRule$1.evaluate(SystemPropertiesRestoreRule.java:57)
	at org.apache.lucene.util.AbstractBeforeAfterRule$1.evaluate(AbstractBeforeAfterRule.java:45)
	at com.carrotsearch.randomizedtesting.rules.StatementAdapter.evaluate(StatementAdapter.java:36)
	at org.apache.lucene.util.TestRuleStoreClassName$1.evaluate(TestRuleStoreClassName.java:41)
	at com.carrotsearch.randomizedtesting.rules.NoShadowingOrOverridesOnMethodsRule$1.evaluate(NoShadowingOrOverridesOnMethodsRule.java:40)
	at com.carrotsearch.randomizedtesting.rules.NoShadowingOrOverridesOnMethodsRule$1.evaluate(NoShadowingOrOverridesOnMethodsRule.java:40)
	at com.carrotsearch.randomizedtesting.rules.StatementAdapter.evaluate(StatementAdapter.java:36)
	at com.carrotsearch.randomizedtesting.rules.StatementAdapter.evaluate(StatementAdapter.java:36)
	at com.carrotsearch.randomizedtesting.rules.StatementAdapter.evaluate(StatementAdapter.java:36)
	at org.apache.lucene.util.TestRuleAssertionsRequired$1.evaluate(TestRuleAssertionsRequired.java:53)
	at org.apache.lucene.util.TestRuleMarkFailure$1.evaluate(TestRuleMarkFailure.java:47)
	at org.apache.lucene.util.TestRuleIgnoreAfterMaxFailures$1.evaluate(TestRuleIgnoreAfterMaxFailures.java:64)
	at org.apache.lucene.util.TestRuleIgnoreTestSuites$1.evaluate(TestRuleIgnoreTestSuites.java:54)
	at com.carrotsearch.randomizedtesting.rules.StatementAdapter.evaluate(StatementAdapter.java:36)
	at com.carrotsearch.randomizedtesting.ThreadLeakControl$StatementRunner.run(ThreadLeakControl.java:368)
	at java.lang.Thread.run(Thread.java:748)


FAILED:  org.apache.solr.handler.TestReplicationHandler.doTestReplicateAfterCoreReload

Error Message:
expected:<[{indexVersion=1521086194421,generation=2,filelist=[_20c.cfe, _20c.cfs, _20c.si, _20d.cfe, _20d.cfs, _20d.si, _20e.cfe, _20e.cfs, _20e.si, _20f.cfe, _20f.cfs, _20f.si, _20g.cfe, _20g.cfs, _20g.si, _20h.cfe, _20h.cfs, _20h.si, _20i.cfe, _20i.cfs, _20i.si, _20j.cfe, _20j.cfs, _20j.si, _20k.cfe, _20k.cfs, _20k.si, _20l.cfe, _20l.cfs, _20l.si, _20m.cfe, _20m.cfs, _20m.si, _20n.cfe, _20n.cfs, _20n.si, _20o.cfe, _20o.cfs, _20o.si, _20p.cfe, _20p.cfs, _20p.si, _20q.cfe, _20q.cfs, _20q.si, _20r.cfe, _20r.cfs, _20r.si, _20s.cfe, _20s.cfs, _20s.si, _20t.cfe, _20t.cfs, _20t.si, _20u.cfe, _20u.cfs, _20u.si, _20v.cfe, _20v.cfs, _20v.si, _20w.cfe, _20w.cfs, _20w.si, _20x.cfe, _20x.cfs, _20x.si, _20y.cfe, _20y.cfs, _20y.si, _20z.cfe, _20z.cfs, _20z.si, _210.cfe, _210.cfs, _210.si, _211.cfe, _211.cfs, _211.si, _212.cfe, _212.cfs, _212.si, _213.cfe, _213.cfs, _213.si, _214.cfe, _214.cfs, _214.si, _216.cfe, _216.cfs, _216.si, _217.cfe, _217.cfs, _217.si, _218.cfe, _218.cfs, _218.si, _219.cfe, _219.cfs, _219.si, _21a.cfe, _21a.cfs, _21a.si, _21b.cfe, _21b.cfs, _21b.si, _21c.cfe, _21c.cfs, _21c.si, _21d.cfe, _21d.cfs, _21d.si, _21e.cfe, _21e.cfs, _21e.si, _21f.cfe, _21f.cfs, _21f.si, _21g.cfe, _21g.cfs, _21g.si, _21h.cfe, _21h.cfs, _21h.si, _21i.cfe, _21i.cfs, _21i.si, _21j.cfe, _21j.cfs, _21j.si, _21k.cfe, _21k.cfs, _21k.si, _21l.cfe, _21l.cfs, _21l.si, _21m.cfe, _21m.cfs, _21m.si, _21n.cfe, _21n.cfs, _21n.si, _21o.cfe, _21o.cfs, _21o.si, _21p.cfe, _21p.cfs, _21p.si, _21q.cfe, _21q.cfs, _21q.si, _21r.cfe, _21r.cfs, _21r.si, _21s.cfe, _21s.cfs, _21s.si, _21t.cfe, _21t.cfs, _21t.si, _21u.cfe, _21u.cfs, _21u.si, segments_2]}]> but was:<[{indexVersion=1521086194421,generation=2,filelist=[_20c.cfe, _20c.cfs, _20c.si, _20d.cfe, _20d.cfs, _20d.si, _20e.cfe, _20e.cfs, _20e.si, _20f.cfe, _20f.cfs, _20f.si, _20g.cfe, _20g.cfs, _20g.si, _20h.cfe, _20h.cfs, _20h.si, _20i.cfe, _20i.cfs, _20i.si, _20j.cfe, _20j.cfs, _20j.si, _20k.cfe, _20k.cfs, _20k.si, _20l.cfe, _20l.cfs, _20l.si, _20m.cfe, _20m.cfs, _20m.si, _20n.cfe, _20n.cfs, _20n.si, _20o.cfe, _20o.cfs, _20o.si, _20p.cfe, _20p.cfs, _20p.si, _20q.cfe, _20q.cfs, _20q.si, _20r.cfe, _20r.cfs, _20r.si, _20s.cfe, _20s.cfs, _20s.si, _20t.cfe, _20t.cfs, _20t.si, _20u.cfe, _20u.cfs, _20u.si, _20v.cfe, _20v.cfs, _20v.si, _20w.cfe, _20w.cfs, _20w.si, _20x.cfe, _20x.cfs, _20x.si, _20y.cfe, _20y.cfs, _20y.si, _20z.cfe, _20z.cfs, _20z.si, _210.cfe, _210.cfs, _210.si, _211.cfe, _211.cfs, _211.si, _212.cfe, _212.cfs, _212.si, _213.cfe, _213.cfs, _213.si, _214.cfe, _214.cfs, _214.si, _216.cfe, _216.cfs, _216.si, _217.cfe, _217.cfs, _217.si, _218.cfe, _218.cfs, _218.si, _219.cfe, _219.cfs, _219.si, _21a.cfe, _21a.cfs, _21a.si, _21b.cfe, _21b.cfs, _21b.si, _21c.cfe, _21c.cfs, _21c.si, _21d.cfe, _21d.cfs, _21d.si, _21e.cfe, _21e.cfs, _21e.si, _21f.cfe, _21f.cfs, _21f.si, _21g.cfe, _21g.cfs, _21g.si, _21h.cfe, _21h.cfs, _21h.si, _21i.cfe, _21i.cfs, _21i.si, _21j.cfe, _21j.cfs, _21j.si, _21k.cfe, _21k.cfs, _21k.si, _21l.cfe, _21l.cfs, _21l.si, _21m.cfe, _21m.cfs, _21m.si, _21n.cfe, _21n.cfs, _21n.si, _21o.cfe, _21o.cfs, _21o.si, _21p.cfe, _21p.cfs, _21p.si, _21q.cfe, _21q.cfs, _21q.si, _21r.cfe, _21r.cfs, _21r.si, _21s.cfe, _21s.cfs, _21s.si, _21t.cfe, _21t.cfs, _21t.si, _21u.cfe, _21u.cfs, _21u.si, segments_2]}, {indexVersion=1521086194421,generation=3,filelist=[_214.cfe, _214.cfs, _214.si, _215.cfe, _215.cfs, _215.si, _216.cfe, _216.cfs, _216.si, _217.cfe, _217.cfs, _217.si, _218.cfe, _218.cfs, _218.si, _219.cfe, _219.cfs, _219.si, _21a.cfe, _21a.cfs, _21a.si, _21b.cfe, _21b.cfs, _21b.si, _21c.cfe, _21c.cfs, _21c.si, _21d.cfe, _21d.cfs, _21d.si, _21e.cfe, _21e.cfs, _21e.si, _21f.cfe, _21f.cfs, _21f.si, _21g.cfe, _21g.cfs, _21g.si, _21h.cfe, _21h.cfs, _21h.si, _21i.cfe, _21i.cfs, _21i.si, _21j.cfe, _21j.cfs, _21j.si, _21k.cfe, _21k.cfs, _21k.si, _21l.cfe, _21l.cfs, _21l.si, _21m.cfe, _21m.cfs, _21m.si, _21n.cfe, _21n.cfs, _21n.si, _21o.cfe, _21o.cfs, _21o.si, _21p.cfe, _21p.cfs, _21p.si, _21q.cfe, _21q.cfs, _21q.si, _21r.cfe, _21r.cfs, _21r.si, _21s.cfe, _21s.cfs, _21s.si, _21t.cfe, _21t.cfs, _21t.si, _21u.cfe, _21u.cfs, _21u.si, segments_3]}]>

Stack Trace:
java.lang.AssertionError: expected:<[{indexVersion=1521086194421,generation=2,filelist=[_20c.cfe, _20c.cfs, _20c.si, _20d.cfe, _20d.cfs, _20d.si, _20e.cfe, _20e.cfs, _20e.si, _20f.cfe, _20f.cfs, _20f.si, _20g.cfe, _20g.cfs, _20g.si, _20h.cfe, _20h.cfs, _20h.si, _20i.cfe, _20i.cfs, _20i.si, _20j.cfe, _20j.cfs, _20j.si, _20k.cfe, _20k.cfs, _20k.si, _20l.cfe, _20l.cfs, _20l.si, _20m.cfe, _20m.cfs, _20m.si, _20n.cfe, _20n.cfs, _20n.si, _20o.cfe, _20o.cfs, _20o.si, _20p.cfe, _20p.cfs, _20p.si, _20q.cfe, _20q.cfs, _20q.si, _20r.cfe, _20r.cfs, _20r.si, _20s.cfe, _20s.cfs, _20s.si, _20t.cfe, _20t.cfs, _20t.si, _20u.cfe, _20u.cfs, _20u.si, _20v.cfe, _20v.cfs, _20v.si, _20w.cfe, _20w.cfs, _20w.si, _20x.cfe, _20x.cfs, _20x.si, _20y.cfe, _20y.cfs, _20y.si, _20z.cfe, _20z.cfs, _20z.si, _210.cfe, _210.cfs, _210.si, _211.cfe, _211.cfs, _211.si, _212.cfe, _212.cfs, _212.si, _213.cfe, _213.cfs, _213.si, _214.cfe, _214.cfs, _214.si, _216.cfe, _216.cfs, _216.si, _217.cfe, _217.cfs, _217.si, _218.cfe, _218.cfs, _218.si, _219.cfe, _219.cfs, _219.si, _21a.cfe, _21a.cfs, _21a.si, _21b.cfe, _21b.cfs, _21b.si, _21c.cfe, _21c.cfs, _21c.si, _21d.cfe, _21d.cfs, _21d.si, _21e.cfe, _21e.cfs, _21e.si, _21f.cfe, _21f.cfs, _21f.si, _21g.cfe, _21g.cfs, _21g.si, _21h.cfe, _21h.cfs, _21h.si, _21i.cfe, _21i.cfs, _21i.si, _21j.cfe, _21j.cfs, _21j.si, _21k.cfe, _21k.cfs, _21k.si, _21l.cfe, _21l.cfs, _21l.si, _21m.cfe, _21m.cfs, _21m.si, _21n.cfe, _21n.cfs, _21n.si, _21o.cfe, _21o.cfs, _21o.si, _21p.cfe, _21p.cfs, _21p.si, _21q.cfe, _21q.cfs, _21q.si, _21r.cfe, _21r.cfs, _21r.si, _21s.cfe, _21s.cfs, _21s.si, _21t.cfe, _21t.cfs, _21t.si, _21u.cfe, _21u.cfs, _21u.si, segments_2]}]> but was:<[{indexVersion=1521086194421,generation=2,filelist=[_20c.cfe, _20c.cfs, _20c.si, _20d.cfe, _20d.cfs, _20d.si, _20e.cfe, _20e.cfs, _20e.si, _20f.cfe, _20f.cfs, _20f.si, _20g.cfe, _20g.cfs, _20g.si, _20h.cfe, _20h.cfs, _20h.si, _20i.cfe, _20i.cfs, _20i.si, _20j.cfe, _20j.cfs, _20j.si, _20k.cfe, _20k.cfs, _20k.si, _20l.cfe, _20l.cfs, _20l.si, _20m.cfe, _20m.cfs, _20m.si, _20n.cfe, _20n.cfs, _20n.si, _20o.cfe, _20o.cfs, _20o.si, _20p.cfe, _20p.cfs, _20p.si, _20q.cfe, _20q.cfs, _20q.si, _20r.cfe, _20r.cfs, _20r.si, _20s.cfe, _20s.cfs, _20s.si, _20t.cfe, _20t.cfs, _20t.si, _20u.cfe, _20u.cfs, _20u.si, _20v.cfe, _20v.cfs, _20v.si, _20w.cfe, _20w.cfs, _20w.si, _20x.cfe, _20x.cfs, _20x.si, _20y.cfe, _20y.cfs, _20y.si, _20z.cfe, _20z.cfs, _20z.si, _210.cfe, _210.cfs, _210.si, _211.cfe, _211.cfs, _211.si, _212.cfe, _212.cfs, _212.si, _213.cfe, _213.cfs, _213.si, _214.cfe, _214.cfs, _214.si, _216.cfe, _216.cfs, _216.si, _217.cfe, _217.cfs, _217.si, _218.cfe, _218.cfs, _218.si, _219.cfe, _219.cfs, _219.si, _21a.cfe, _21a.cfs, _21a.si, _21b.cfe, _21b.cfs, _21b.si, _21c.cfe, _21c.cfs, _21c.si, _21d.cfe, _21d.cfs, _21d.si, _21e.cfe, _21e.cfs, _21e.si, _21f.cfe, _21f.cfs, _21f.si, _21g.cfe, _21g.cfs, _21g.si, _21h.cfe, _21h.cfs, _21h.si, _21i.cfe, _21i.cfs, _21i.si, _21j.cfe, _21j.cfs, _21j.si, _21k.cfe, _21k.cfs, _21k.si, _21l.cfe, _21l.cfs, _21l.si, _21m.cfe, _21m.cfs, _21m.si, _21n.cfe, _21n.cfs, _21n.si, _21o.cfe, _21o.cfs, _21o.si, _21p.cfe, _21p.cfs, _21p.si, _21q.cfe, _21q.cfs, _21q.si, _21r.cfe, _21r.cfs, _21r.si, _21s.cfe, _21s.cfs, _21s.si, _21t.cfe, _21t.cfs, _21t.si, _21u.cfe, _21u.cfs, _21u.si, segments_2]}, {indexVersion=1521086194421,generation=3,filelist=[_214.cfe, _214.cfs, _214.si, _215.cfe, _215.cfs, _215.si, _216.cfe, _216.cfs, _216.si, _217.cfe, _217.cfs, _217.si, _218.cfe, _218.cfs, _218.si, _219.cfe, _219.cfs, _219.si, _21a.cfe, _21a.cfs, _21a.si, _21b.cfe, _21b.cfs, _21b.si, _21c.cfe, _21c.cfs, _21c.si, _21d.cfe, _21d.cfs, _21d.si, _21e.cfe, _21e.cfs, _21e.si, _21f.cfe, _21f.cfs, _21f.si, _21g.cfe, _21g.cfs, _21g.si, _21h.cfe, _21h.cfs, _21h.si, _21i.cfe, _21i.cfs, _21i.si, _21j.cfe, _21j.cfs, _21j.si, _21k.cfe, _21k.cfs, _21k.si, _21l.cfe, _21l.cfs, _21l.si, _21m.cfe, _21m.cfs, _21m.si, _21n.cfe, _21n.cfs, _21n.si, _21o.cfe, _21o.cfs, _21o.si, _21p.cfe, _21p.cfs, _21p.si, _21q.cfe, _21q.cfs, _21q.si, _21r.cfe, _21r.cfs, _21r.si, _21s.cfe, _21s.cfs, _21s.si, _21t.cfe, _21t.cfs, _21t.si, _21u.cfe, _21u.cfs, _21u.si, segments_3]}]>
	at __randomizedtesting.SeedInfo.seed([E7C8D9B9A63EB0:2530D3E9C9EE30B3]:0)
	at org.junit.Assert.fail(Assert.java:93)
	at org.junit.Assert.failNotEquals(Assert.java:647)
	at org.junit.Assert.assertEquals(Assert.java:128)
	at org.junit.Assert.assertEquals(Assert.java:147)
	at org.apache.solr.handler.TestReplicationHandler.doTestReplicateAfterCoreReload(TestReplicationHandler.java:1284)
	at sun.reflect.NativeMethodAccessorImpl.invoke0(Native Method)
	at sun.reflect.NativeMethodAccessorImpl.invoke(NativeMethodAccessorImpl.java:62)
	at sun.reflect.DelegatingMethodAccessorImpl.invoke(DelegatingMethodAccessorImpl.java:43)
	at java.lang.reflect.Method.invoke(Method.java:498)
	at com.carrotsearch.randomizedtesting.RandomizedRunner.invoke(RandomizedRunner.java:1737)
	at com.carrotsearch.randomizedtesting.RandomizedRunner$8.evaluate(RandomizedRunner.java:934)
	at com.carrotsearch.randomizedtesting.RandomizedRunner$9.evaluate(RandomizedRunner.java:970)
	at com.carrotsearch.randomizedtesting.RandomizedRunner$10.evaluate(RandomizedRunner.java:984)
	at com.carrotsearch.randomizedtesting.rules.SystemPropertiesRestoreRule$1.evaluate(SystemPropertiesRestoreRule.java:57)
	at org.apache.lucene.util.TestRuleSetupTeardownChained$1.evaluate(TestRuleSetupTeardownChained.java:49)
	at org.apache.lucene.util.AbstractBeforeAfterRule$1.evaluate(AbstractBeforeAfterRule.java:45)
	at org.apache.lucene.util.TestRuleThreadAndTestName$1.evaluate(TestRuleThreadAndTestName.java:48)
	at org.apache.lucene.util.TestRuleIgnoreAfterMaxFailures$1.evaluate(TestRuleIgnoreAfterMaxFailures.java:64)
	at org.apache.lucene.util.TestRuleMarkFailure$1.evaluate(TestRuleMarkFailure.java:47)
	at com.carrotsearch.randomizedtesting.rules.StatementAdapter.evaluate(StatementAdapter.java:36)
	at com.carrotsearch.randomizedtesting.ThreadLeakControl$StatementRunner.run(ThreadLeakControl.java:368)
	at com.carrotsearch.randomizedtesting.ThreadLeakControl.forkTimeoutingTask(ThreadLeakControl.java:817)
	at com.carrotsearch.randomizedtesting.ThreadLeakControl$3.evaluate(ThreadLeakControl.java:468)
	at com.carrotsearch.randomizedtesting.RandomizedRunner.runSingleTest(RandomizedRunner.java:943)
	at com.carrotsearch.randomizedtesting.RandomizedRunner$5.evaluate(RandomizedRunner.java:829)
	at com.carrotsearch.randomizedtesting.RandomizedRunner$6.evaluate(RandomizedRunner.java:879)
	at com.carrotsearch.randomizedtesting.RandomizedRunner$7.evaluate(RandomizedRunner.java:890)
	at com.carrotsearch.randomizedtesting.rules.StatementAdapter.evaluate(StatementAdapter.java:36)
	at com.carrotsearch.randomizedtesting.rules.SystemPropertiesRestoreRule$1.evaluate(SystemPropertiesRestoreRule.java:57)
	at org.apache.lucene.util.AbstractBeforeAfterRule$1.evaluate(AbstractBeforeAfterRule.java:45)
	at com.carrotsearch.randomizedtesting.rules.StatementAdapter.evaluate(StatementAdapter.java:36)
	at org.apache.lucene.util.TestRuleStoreClassName$1.evaluate(TestRuleStoreClassName.java:41)
	at com.carrotsearch.randomizedtesting.rules.NoShadowingOrOverridesOnMethodsRule$1.evaluate(NoShadowingOrOverridesOnMethodsRule.java:40)
	at com.carrotsearch.randomizedtesting.rules.NoShadowingOrOverridesOnMethodsRule$1.evaluate(NoShadowingOrOverridesOnMethodsRule.java:40)
	at com.carrotsearch.randomizedtesting.rules.StatementAdapter.evaluate(StatementAdapter.java:36)
	at com.carrotsearch.randomizedtesting.rules.StatementAdapter.evaluate(StatementAdapter.java:36)
	at com.carrotsearch.randomizedtesting.rules.StatementAdapter.evaluate(StatementAdapter.java:36)
	at org.apache.lucene.util.TestRuleAssertionsRequired$1.evaluate(TestRuleAssertionsRequired.java:53)
	at org.apache.lucene.util.TestRuleMarkFailure$1.evaluate(TestRuleMarkFailure.java:47)
	at org.apache.lucene.util.TestRuleIgnoreAfterMaxFailures$1.evaluate(TestRuleIgnoreAfterMaxFailures.java:64)
	at org.apache.lucene.util.TestRuleIgnoreTestSuites$1.evaluate(TestRuleIgnoreTestSuites.java:54)
	at com.carrotsearch.randomizedtesting.rules.StatementAdapter.evaluate(StatementAdapter.java:36)
	at com.carrotsearch.randomizedtesting.ThreadLeakControl$StatementRunner.run(ThreadLeakControl.java:368)
	at java.lang.Thread.run(Thread.java:748)


FAILED:  org.apache.solr.uninverting.TestDocTermOrds.testTriggerUnInvertLimit

Error Message:
Java heap space

Stack Trace:
java.lang.OutOfMemoryError: Java heap space
	at __randomizedtesting.SeedInfo.seed([E7C8D9B9A63EB0:3355E01DB411E407]:0)
	at org.apache.lucene.store.RAMFile.newBuffer(RAMFile.java:78)
	at org.apache.lucene.store.RAMFile.addBuffer(RAMFile.java:51)
	at org.apache.lucene.store.RAMOutputStream.switchCurrentBuffer(RAMOutputStream.java:164)
	at org.apache.lucene.store.RAMOutputStream.writeBytes(RAMOutputStream.java:150)
	at org.apache.lucene.store.DataOutput.copyBytes(DataOutput.java:278)
	at org.apache.lucene.store.MockIndexOutputWrapper.copyBytes(MockIndexOutputWrapper.java:165)
	at org.apache.lucene.codecs.lucene50.Lucene50CompoundFormat.write(Lucene50CompoundFormat.java:100)
	at org.apache.lucene.index.IndexWriter.createCompoundFile(IndexWriter.java:5098)
	at org.apache.lucene.index.IndexWriter.mergeMiddle(IndexWriter.java:4595)
	at org.apache.lucene.index.IndexWriter.merge(IndexWriter.java:4171)
	at org.apache.lucene.index.SerialMergeScheduler.merge(SerialMergeScheduler.java:40)
	at org.apache.lucene.index.IndexWriter.maybeMerge(IndexWriter.java:2347)
	at org.apache.lucene.index.IndexWriter.processEvents(IndexWriter.java:5186)
	at org.apache.lucene.index.IndexWriter.updateDocument(IndexWriter.java:1783)
	at org.apache.lucene.index.IndexWriter.addDocument(IndexWriter.java:1464)
	at org.apache.lucene.index.RandomIndexWriter.addDocument(RandomIndexWriter.java:171)
	at org.apache.solr.uninverting.TestDocTermOrds.testTriggerUnInvertLimit(TestDocTermOrds.java:167)
	at sun.reflect.NativeMethodAccessorImpl.invoke0(Native Method)
	at sun.reflect.NativeMethodAccessorImpl.invoke(NativeMethodAccessorImpl.java:62)
	at sun.reflect.DelegatingMethodAccessorImpl.invoke(DelegatingMethodAccessorImpl.java:43)
	at java.lang.reflect.Method.invoke(Method.java:498)
	at com.carrotsearch.randomizedtesting.RandomizedRunner.invoke(RandomizedRunner.java:1737)
	at com.carrotsearch.randomizedtesting.RandomizedRunner$8.evaluate(RandomizedRunner.java:934)
	at com.carrotsearch.randomizedtesting.RandomizedRunner$9.evaluate(RandomizedRunner.java:970)
	at com.carrotsearch.randomizedtesting.RandomizedRunner$10.evaluate(RandomizedRunner.java:984)
	at org.apache.lucene.util.TestRuleSetupTeardownChained$1.evaluate(TestRuleSetupTeardownChained.java:49)
	at org.apache.lucene.util.AbstractBeforeAfterRule$1.evaluate(AbstractBeforeAfterRule.java:45)
	at org.apache.lucene.util.TestRuleThreadAndTestName$1.evaluate(TestRuleThreadAndTestName.java:48)
	at org.apache.lucene.util.TestRuleIgnoreAfterMaxFailures$1.evaluate(TestRuleIgnoreAfterMaxFailures.java:64)
	at org.apache.lucene.util.TestRuleMarkFailure$1.evaluate(TestRuleMarkFailure.java:47)
	at com.carrotsearch.randomizedtesting.rules.StatementAdapter.evaluate(StatementAdapter.java:36)
	at com.carrotsearch.randomizedtesting.ThreadLeakControl$StatementRunner.run(ThreadLeakControl.java:368)


FAILED:  org.apache.solr.update.TestInPlaceUpdatesDistrib.test

Error Message:
Timeout occured while waiting response from server at: https://127.0.0.1:45073/xsyf/collection1

Stack Trace:
org.apache.solr.client.solrj.SolrServerException: Timeout occured while waiting response from server at: https://127.0.0.1:45073/xsyf/collection1
	at __randomizedtesting.SeedInfo.seed([E7C8D9B9A63EB0:88B3F703175A5348]:0)
	at org.apache.solr.client.solrj.impl.HttpSolrClient.executeMethod(HttpSolrClient.java:654)
	at org.apache.solr.client.solrj.impl.HttpSolrClient.request(HttpSolrClient.java:255)
	at org.apache.solr.client.solrj.impl.HttpSolrClient.request(HttpSolrClient.java:244)
	at org.apache.solr.client.solrj.impl.LBHttpSolrClient.doRequest(LBHttpSolrClient.java:483)
	at org.apache.solr.client.solrj.impl.LBHttpSolrClient.request(LBHttpSolrClient.java:413)
	at org.apache.solr.client.solrj.impl.CloudSolrClient.sendRequest(CloudSolrClient.java:1105)
	at org.apache.solr.client.solrj.impl.CloudSolrClient.requestWithRetryOnStaleState(CloudSolrClient.java:885)
	at org.apache.solr.client.solrj.impl.CloudSolrClient.request(CloudSolrClient.java:818)
	at org.apache.solr.client.solrj.SolrRequest.process(SolrRequest.java:194)
	at org.apache.solr.client.solrj.SolrClient.commit(SolrClient.java:484)
	at org.apache.solr.client.solrj.SolrClient.commit(SolrClient.java:463)
	at org.apache.solr.cloud.AbstractFullDistribZkTestBase.commit(AbstractFullDistribZkTestBase.java:1591)
	at org.apache.solr.update.TestInPlaceUpdatesDistrib.docValuesUpdateTest(TestInPlaceUpdatesDistrib.java:352)
	at org.apache.solr.update.TestInPlaceUpdatesDistrib.test(TestInPlaceUpdatesDistrib.java:144)
	at sun.reflect.NativeMethodAccessorImpl.invoke0(Native Method)
	at sun.reflect.NativeMethodAccessorImpl.invoke(NativeMethodAccessorImpl.java:62)
	at sun.reflect.DelegatingMethodAccessorImpl.invoke(DelegatingMethodAccessorImpl.java:43)
	at java.lang.reflect.Method.invoke(Method.java:498)
	at com.carrotsearch.randomizedtesting.RandomizedRunner.invoke(RandomizedRunner.java:1737)
	at com.carrotsearch.randomizedtesting.RandomizedRunner$8.evaluate(RandomizedRunner.java:934)
	at com.carrotsearch.randomizedtesting.RandomizedRunner$9.evaluate(RandomizedRunner.java:970)
	at com.carrotsearch.randomizedtesting.RandomizedRunner$10.evaluate(RandomizedRunner.java:984)
	at org.apache.solr.BaseDistributedSearchTestCase$ShardsRepeatRule$ShardsFixedStatement.callStatement(BaseDistributedSearchTestCase.java:993)
	at org.apache.solr.BaseDistributedSearchTestCase$ShardsRepeatRule$ShardsStatement.evaluate(BaseDistributedSearchTestCase.java:968)
	at com.carrotsearch.randomizedtesting.rules.SystemPropertiesRestoreRule$1.evaluate(SystemPropertiesRestoreRule.java:57)
	at org.apache.lucene.util.TestRuleSetupTeardownChained$1.evaluate(TestRuleSetupTeardownChained.java:49)
	at org.apache.lucene.util.AbstractBeforeAfterRule$1.evaluate(AbstractBeforeAfterRule.java:45)
	at org.apache.lucene.util.TestRuleThreadAndTestName$1.evaluate(TestRuleThreadAndTestName.java:48)
	at org.apache.lucene.util.TestRuleIgnoreAfterMaxFailures$1.evaluate(TestRuleIgnoreAfterMaxFailures.java:64)
	at org.apache.lucene.util.TestRuleMarkFailure$1.evaluate(TestRuleMarkFailure.java:47)
	at com.carrotsearch.randomizedtesting.rules.StatementAdapter.evaluate(StatementAdapter.java:36)
	at com.carrotsearch.randomizedtesting.ThreadLeakControl$StatementRunner.run(ThreadLeakControl.java:368)
	at com.carrotsearch.randomizedtesting.ThreadLeakControl.forkTimeoutingTask(ThreadLeakControl.java:817)
	at com.carrotsearch.randomizedtesting.ThreadLeakControl$3.evaluate(ThreadLeakControl.java:468)
	at com.carrotsearch.randomizedtesting.RandomizedRunner.runSingleTest(RandomizedRunner.java:943)
	at com.carrotsearch.randomizedtesting.RandomizedRunner$5.evaluate(RandomizedRunner.java:829)
	at com.carrotsearch.randomizedtesting.RandomizedRunner$6.evaluate(RandomizedRunner.java:879)
	at com.carrotsearch.randomizedtesting.RandomizedRunner$7.evaluate(RandomizedRunner.java:890)
	at com.carrotsearch.randomizedtesting.rules.StatementAdapter.evaluate(StatementAdapter.java:36)
	at com.carrotsearch.randomizedtesting.rules.SystemPropertiesRestoreRule$1.evaluate(SystemPropertiesRestoreRule.java:57)
	at org.apache.lucene.util.AbstractBeforeAfterRule$1.evaluate(AbstractBeforeAfterRule.java:45)
	at com.carrotsearch.randomizedtesting.rules.StatementAdapter.evaluate(StatementAdapter.java:36)
	at org.apache.lucene.util.TestRuleStoreClassName$1.evaluate(TestRuleStoreClassName.java:41)
	at com.carrotsearch.randomizedtesting.rules.NoShadowingOrOverridesOnMethodsRule$1.evaluate(NoShadowingOrOverridesOnMethodsRule.java:40)
	at com.carrotsearch.randomizedtesting.rules.NoShadowingOrOverridesOnMethodsRule$1.evaluate(NoShadowingOrOverridesOnMethodsRule.java:40)
	at com.carrotsearch.randomizedtesting.rules.StatementAdapter.evaluate(StatementAdapter.java:36)
	at com.carrotsearch.randomizedtesting.rules.StatementAdapter.evaluate(StatementAdapter.java:36)
	at com.carrotsearch.randomizedtesting.rules.StatementAdapter.evaluate(StatementAdapter.java:36)
	at org.apache.lucene.util.TestRuleAssertionsRequired$1.evaluate(TestRuleAssertionsRequired.java:53)
	at org.apache.lucene.util.TestRuleMarkFailure$1.evaluate(TestRuleMarkFailure.java:47)
	at org.apache.lucene.util.TestRuleIgnoreAfterMaxFailures$1.evaluate(TestRuleIgnoreAfterMaxFailures.java:64)
	at org.apache.lucene.util.TestRuleIgnoreTestSuites$1.evaluate(TestRuleIgnoreTestSuites.java:54)
	at com.carrotsearch.randomizedtesting.rules.StatementAdapter.evaluate(StatementAdapter.java:36)
	at com.carrotsearch.randomizedtesting.ThreadLeakControl$StatementRunner.run(ThreadLeakControl.java:368)
	at java.lang.Thread.run(Thread.java:748)
Caused by: java.net.SocketTimeoutException: Read timed out
	at java.net.SocketInputStream.socketRead0(Native Method)
	at java.net.SocketInputStream.socketRead(SocketInputStream.java:116)
	at java.net.SocketInputStream.read(SocketInputStream.java:171)
	at java.net.SocketInputStream.read(SocketInputStream.java:141)
	at sun.security.ssl.InputRecord.readFully(InputRecord.java:465)
	at sun.security.ssl.InputRecord.read(InputRecord.java:503)
	at sun.security.ssl.SSLSocketImpl.readRecord(SSLSocketImpl.java:983)
	at sun.security.ssl.SSLSocketImpl.readDataRecord(SSLSocketImpl.java:940)
	at sun.security.ssl.AppInputStream.read(AppInputStream.java:105)
	at org.apache.http.impl.io.SessionInputBufferImpl.streamRead(SessionInputBufferImpl.java:137)
	at org.apache.http.impl.io.SessionInputBufferImpl.fillBuffer(SessionInputBufferImpl.java:153)
	at org.apache.http.impl.io.SessionInputBufferImpl.readLine(SessionInputBufferImpl.java:282)
	at org.apache.http.impl.conn.DefaultHttpResponseParser.parseHead(DefaultHttpResponseParser.java:138)
	at org.apache.http.impl.conn.DefaultHttpResponseParser.parseHead(DefaultHttpResponseParser.java:56)
	at org.apache.http.impl.io.AbstractMessageParser.parse(AbstractMessageParser.java:259)
	at org.apache.http.impl.DefaultBHttpClientConnection.receiveResponseHeader(DefaultBHttpClientConnection.java:163)
	at org.apache.http.impl.conn.CPoolProxy.receiveResponseHeader(CPoolProxy.java:165)
	at org.apache.http.protocol.HttpRequestExecutor.doReceiveResponse(HttpRequestExecutor.java:273)
	at org.apache.http.protocol.HttpRequestExecutor.execute(HttpRequestExecutor.java:125)
	at org.apache.http.impl.execchain.MainClientExec.execute(MainClientExec.java:272)
	at org.apache.http.impl.execchain.ProtocolExec.execute(ProtocolExec.java:185)
	at org.apache.http.impl.execchain.RetryExec.execute(RetryExec.java:89)
	at org.apache.http.impl.execchain.RedirectExec.execute(RedirectExec.java:111)
	at org.apache.http.impl.client.InternalHttpClient.doExecute(InternalHttpClient.java:185)
	at org.apache.http.impl.client.CloseableHttpClient.execute(CloseableHttpClient.java:83)
	at org.apache.http.impl.client.CloseableHttpClient.execute(CloseableHttpClient.java:56)
	at org.apache.solr.client.solrj.impl.HttpSolrClient.executeMethod(HttpSolrClient.java:542)
	... 54 more




Build Log:
[...truncated 1882 lines...]
   [junit4] JVM J0: stdout was not empty, see: /x1/jenkins/jenkins-slave/workspace/Lucene-Solr-NightlyTests-7.x/checkout/lucene/build/core/test/temp/junit4-J0-20180315_002917_8107147507931525865805.sysout
   [junit4] >>> JVM J0 emitted unexpected output (verbatim) ----
   [junit4] codec: DummyCompressingStoredFields, pf: Memory, dvf: Lucene70
   [junit4] <<< JVM J0: EOF ----

[...truncated 11039 lines...]
   [junit4] Suite: org.apache.solr.cloud.RollingRestartTest
   [junit4]   2> Creating dataDir: /x1/jenkins/jenkins-slave/workspace/Lucene-Solr-NightlyTests-7.x/checkout/solr/build/solr-core/test/J2/temp/solr.cloud.RollingRestartTest_E7C8D9B9A63EB0-001/init-core-data-001
   [junit4]   2> 0    INFO  (SUITE-RollingRestartTest-seed#[E7C8D9B9A63EB0]-worker) [    ] o.a.s.SolrTestCaseJ4 Using PointFields (NUMERIC_POINTS_SYSPROP=true) w/NUMERIC_DOCVALUES_SYSPROP=false
   [junit4]   2> 118  INFO  (SUITE-RollingRestartTest-seed#[E7C8D9B9A63EB0]-worker) [    ] o.e.j.u.log Logging initialized @3596ms to org.eclipse.jetty.util.log.Slf4jLog
   [junit4]   2> 127  INFO  (SUITE-RollingRestartTest-seed#[E7C8D9B9A63EB0]-worker) [    ] o.a.s.SolrTestCaseJ4 Randomized ssl (false) and clientAuth (true) via: @org.apache.solr.util.RandomizeSSL(reason=, value=NaN, ssl=NaN, clientAuth=NaN)
   [junit4]   2> 148  INFO  (SUITE-RollingRestartTest-seed#[E7C8D9B9A63EB0]-worker) [    ] o.a.s.SolrTestCaseJ4 SecureRandom sanity checks: test.solr.allowed.securerandom=null & java.security.egd=file:/dev/./urandom
   [junit4]   2> 181  INFO  (SUITE-RollingRestartTest-seed#[E7C8D9B9A63EB0]-worker) [    ] o.a.s.BaseDistributedSearchTestCase Setting hostContext system property: /bcb/
   [junit4]   2> 265  INFO  (TEST-RollingRestartTest.test-seed#[E7C8D9B9A63EB0]) [    ] o.a.s.c.ZkTestServer STARTING ZK TEST SERVER
   [junit4]   2> 298  INFO  (Thread-1) [    ] o.a.s.c.ZkTestServer client port:0.0.0.0/0.0.0.0:0
   [junit4]   2> 300  INFO  (Thread-1) [    ] o.a.s.c.ZkTestServer Starting server
   [junit4]   2> 498  INFO  (TEST-RollingRestartTest.test-seed#[E7C8D9B9A63EB0]) [    ] o.a.s.c.ZkTestServer start zk server on port:56510
   [junit4]   2> 599  ERROR (Thread-1) [    ] o.a.z.s.ZooKeeperServer ZKShutdownHandler is not registered, so ZooKeeper server won't take any action on ERROR or SHUTDOWN server state changes
   [junit4]   2> 681  INFO  (zkConnectionManagerCallback-2-thread-1) [    ] o.a.s.c.c.ConnectionManager zkClient has connected
   [junit4]   2> 733  WARN  (NIOServerCxn.Factory:0.0.0.0/0.0.0.0:0) [    ] o.a.z.s.NIOServerCnxn Unable to read additional data from client sessionid 0x104f7bbc0dc0000, likely client has closed socket
   [junit4]   2> 765  INFO  (zkConnectionManagerCallback-4-thread-1) [    ] o.a.s.c.c.ConnectionManager zkClient has connected
   [junit4]   2> 805  INFO  (TEST-RollingRestartTest.test-seed#[E7C8D9B9A63EB0]) [    ] o.a.s.c.AbstractZkTestCase put /x1/jenkins/jenkins-slave/workspace/Lucene-Solr-NightlyTests-7.x/checkout/solr/core/src/test-files/solr/collection1/conf/solrconfig-tlog.xml to /configs/conf1/solrconfig.xml
   [junit4]   2> 847  INFO  (TEST-RollingRestartTest.test-seed#[E7C8D9B9A63EB0]) [    ] o.a.s.c.AbstractZkTestCase put /x1/jenkins/jenkins-slave/workspace/Lucene-Solr-NightlyTests-7.x/checkout/solr/core/src/test-files/solr/collection1/conf/schema.xml to /configs/conf1/schema.xml
   [junit4]   2> 860  INFO  (TEST-RollingRestartTest.test-seed#[E7C8D9B9A63EB0]) [    ] o.a.s.c.AbstractZkTestCase put /x1/jenkins/jenkins-slave/workspace/Lucene-Solr-NightlyTests-7.x/checkout/solr/core/src/test-files/solr/collection1/conf/solrconfig.snippet.randomindexconfig.xml to /configs/conf1/solrconfig.snippet.randomindexconfig.xml
   [junit4]   2> 866  INFO  (TEST-RollingRestartTest.test-seed#[E7C8D9B9A63EB0]) [    ] o.a.s.c.AbstractZkTestCase put /x1/jenkins/jenkins-slave/workspace/Lucene-Solr-NightlyTests-7.x/checkout/solr/core/src/test-files/solr/collection1/conf/stopwords.txt to /configs/conf1/stopwords.txt
   [junit4]   2> 873  INFO  (TEST-RollingRestartTest.test-seed#[E7C8D9B9A63EB0]) [    ] o.a.s.c.AbstractZkTestCase put /x1/jenkins/jenkins-slave/workspace/Lucene-Solr-NightlyTests-7.x/checkout/solr/core/src/test-files/solr/collection1/conf/protwords.txt to /configs/conf1/protwords.txt
   [junit4]   2> 877  INFO  (TEST-RollingRestartTest.test-seed#[E7C8D9B9A63EB0]) [    ] o.a.s.c.AbstractZkTestCase put /x1/jenkins/jenkins-slave/workspace/Lucene-Solr-NightlyTests-7.x/checkout/solr/core/src/test-files/solr/collection1/conf/currency.xml to /configs/conf1/currency.xml
   [junit4]   2> 894  INFO  (TEST-RollingRestartTest.test-seed#[E7C8D9B9A63EB0]) [    ] o.a.s.c.AbstractZkTestCase put /x1/jenkins/jenkins-slave/workspace/Lucene-Solr-NightlyTests-7.x/checkout/solr/core/src/test-files/solr/collection1/conf/enumsConfig.xml to /configs/conf1/enumsConfig.xml
   [junit4]   2> 907  INFO  (TEST-RollingRestartTest.test-seed#[E7C8D9B9A63EB0]) [    ] o.a.s.c.AbstractZkTestCase put /x1/jenkins/jenkins-slave/workspace/Lucene-Solr-NightlyTests-7.x/checkout/solr/core/src/test-files/solr/collection1/conf/open-exchange-rates.json to /configs/conf1/open-exchange-rates.json
   [junit4]   2> 912  INFO  (TEST-RollingRestartTest.test-seed#[E7C8D9B9A63EB0]) [    ] o.a.s.c.AbstractZkTestCase put /x1/jenkins/jenkins-slave/workspace/Lucene-Solr-NightlyTests-7.x/checkout/solr/core/src/test-files/solr/collection1/conf/mapping-ISOLatin1Accent.txt to /configs/conf1/mapping-ISOLatin1Accent.txt
   [junit4]   2> 917  INFO  (TEST-RollingRestartTest.test-seed#[E7C8D9B9A63EB0]) [    ] o.a.s.c.AbstractZkTestCase put /x1/jenkins/jenkins-slave/workspace/Lucene-Solr-NightlyTests-7.x/checkout/solr/core/src/test-files/solr/collection1/conf/old_synonyms.txt to /configs/conf1/old_synonyms.txt
   [junit4]   2> 921  INFO  (TEST-RollingRestartTest.test-seed#[E7C8D9B9A63EB0]) [    ] o.a.s.c.AbstractZkTestCase put /x1/jenkins/jenkins-slave/workspace/Lucene-Solr-NightlyTests-7.x/checkout/solr/core/src/test-files/solr/collection1/conf/synonyms.txt to /configs/conf1/synonyms.txt
   [junit4]   2> 927  INFO  (TEST-RollingRestartTest.test-seed#[E7C8D9B9A63EB0]) [    ] o.a.s.c.AbstractFullDistribZkTestBase Will use NRT replicas unless explicitly asked otherwise
   [junit4]   2> 1918 INFO  (TEST-RollingRestartTest.test-seed#[E7C8D9B9A63EB0]) [    ] o.e.j.s.Server jetty-9.4.8.v20171121, build timestamp: 2017-11-22T08:27:37+11:00, git hash: 82b8fb23f757335bb3329d540ce37a2a2615f0a8
   [junit4]   2> 1945 INFO  (TEST-RollingRestartTest.test-seed#[E7C8D9B9A63EB0]) [    ] o.e.j.s.session DefaultSessionIdManager workerName=node0
   [junit4]   2> 1945 INFO  (TEST-RollingRestartTest.test-seed#[E7C8D9B9A63EB0]) [    ] o.e.j.s.session No SessionScavenger set, using defaults
   [junit4]   2> 1950 INFO  (TEST-RollingRestartTest.test-seed#[E7C8D9B9A63EB0]) [    ] o.e.j.s.session Scavenging every 600000ms
   [junit4]   2> 1972 INFO  (TEST-RollingRestartTest.test-seed#[E7C8D9B9A63EB0]) [    ] o.e.j.s.h.ContextHandler Started o.e.j.s.ServletContextHandler@38b2d9c1{/bcb,null,AVAILABLE}
   [junit4]   2> 1994 INFO  (TEST-RollingRestartTest.test-seed#[E7C8D9B9A63EB0]) [    ] o.e.j.s.AbstractConnector Started ServerConnector@47e10803{HTTP/1.1,[http/1.1]}{127.0.0.1:36064}
   [junit4]   2> 1996 INFO  (TEST-RollingRestartTest.test-seed#[E7C8D9B9A63EB0]) [    ] o.e.j.s.Server Started @5480ms
   [junit4]   2> 1997 INFO  (TEST-RollingRestartTest.test-seed#[E7C8D9B9A63EB0]) [    ] o.a.s.c.s.e.JettySolrRunner Jetty properties: {solr.data.dir=/x1/jenkins/jenkins-slave/workspace/Lucene-Solr-NightlyTests-7.x/checkout/solr/build/solr-core/test/J2/temp/solr.cloud.RollingRestartTest_E7C8D9B9A63EB0-001/tempDir-001/control/data, replicaType=NRT, hostContext=/bcb, hostPort=36064, coreRootDirectory=/x1/jenkins/jenkins-slave/workspace/Lucene-Solr-NightlyTests-7.x/checkout/solr/build/solr-core/test/J2/temp/solr.cloud.RollingRestartTest_E7C8D9B9A63EB0-001/control-001/cores}
   [junit4]   2> 2039 ERROR (TEST-RollingRestartTest.test-seed#[E7C8D9B9A63EB0]) [    ] o.a.s.u.StartupLoggingUtils Missing Java Option solr.log.dir. Logging may be missing or incomplete.
   [junit4]   2> 2040 INFO  (TEST-RollingRestartTest.test-seed#[E7C8D9B9A63EB0]) [    ] o.a.s.s.SolrDispatchFilter  ___      _       Welcome to Apache Solr™ version 7.4.0
   [junit4]   2> 2054 INFO  (TEST-RollingRestartTest.test-seed#[E7C8D9B9A63EB0]) [    ] o.a.s.s.SolrDispatchFilter / __| ___| |_ _   Starting in cloud mode on port null
   [junit4]   2> 2055 INFO  (TEST-RollingRestartTest.test-seed#[E7C8D9B9A63EB0]) [    ] o.a.s.s.SolrDispatchFilter \__ \/ _ \ | '_|  Install dir: null
   [junit4]   2> 2086 INFO  (TEST-RollingRestartTest.test-seed#[E7C8D9B9A63EB0]) [    ] o.a.s.s.SolrDispatchFilter |___/\___/_|_|    Start time: 2018-03-15T03:24:05.152Z
   [junit4]   2> 2125 INFO  (TEST-RollingRestartTest.test-seed#[E7C8D9B9A63EB0]) [    ] o.a.s.c.SolrResourceLoader solr home defaulted to 'solr/' (could not find system property or JNDI)
   [junit4]   2> 2138 INFO  (zkConnectionManagerCallback-6-thread-1) [    ] o.a.s.c.c.ConnectionManager zkClient has connected
   [junit4]   2> 2165 INFO  (TEST-RollingRestartTest.test-seed#[E7C8D9B9A63EB0]) [    ] o.a.s.s.SolrDispatchFilter Loading solr.xml from SolrHome (not found in ZooKeeper)
   [junit4]   2> 2168 INFO  (TEST-RollingRestartTest.test-seed#[E7C8D9B9A63EB0]) [    ] o.a.s.c.SolrXmlConfig Loading container configuration from /x1/jenkins/jenkins-slave/workspace/Lucene-Solr-NightlyTests-7.x/checkout/solr/build/solr-core/test/J2/temp/solr.cloud.RollingRestartTest_E7C8D9B9A63EB0-001/control-001/solr.xml
   [junit4]   2> 2426 INFO  (TEST-RollingRestartTest.test-seed#[E7C8D9B9A63EB0]) [    ] o.a.s.c.SolrXmlConfig Configuration parameter autoReplicaFailoverWorkLoopDelay is ignored
   [junit4]   2> 2426 INFO  (TEST-RollingRestartTest.test-seed#[E7C8D9B9A63EB0]) [    ] o.a.s.c.SolrXmlConfig Configuration parameter autoReplicaFailoverBadNodeExpiration is ignored
   [junit4]   2> 2448 INFO  (TEST-RollingRestartTest.test-seed#[E7C8D9B9A63EB0]) [    ] o.a.s.c.SolrXmlConfig MBean server found: com.sun.jmx.mbeanserver.JmxMBeanServer@7ef3a863, but no JMX reporters were configured - adding default JMX reporter.
   [junit4]   2> 3001 INFO  (TEST-RollingRestartTest.test-seed#[E7C8D9B9A63EB0]) [    ] o.a.s.c.ZkContainer Zookeeper client=127.0.0.1:56510/solr
   [junit4]   2> 3033 INFO  (zkConnectionManagerCallback-10-thread-1) [    ] o.a.s.c.c.ConnectionManager zkClient has connected
   [junit4]   2> 3055 INFO  (zkConnectionManagerCallback-12-thread-1-processing-n:127.0.0.1:36064_bcb) [n:127.0.0.1:36064_bcb    ] o.a.s.c.c.ConnectionManager zkClient has connected
   [junit4]   2> 3509 INFO  (TEST-RollingRestartTest.test-seed#[E7C8D9B9A63EB0]) [n:127.0.0.1:36064_bcb    ] o.a.s.c.Overseer Overseer (id=null) closing
   [junit4]   2> 3514 INFO  (TEST-RollingRestartTest.test-seed#[E7C8D9B9A63EB0]) [n:127.0.0.1:36064_bcb    ] o.a.s.c.OverseerElectionContext I am going to be the leader 127.0.0.1:36064_bcb
   [junit4]   2> 3517 INFO  (TEST-RollingRestartTest.test-seed#[E7C8D9B9A63EB0]) [n:127.0.0.1:36064_bcb    ] o.a.s.c.Overseer Overseer (id=73455879711358980-127.0.0.1:36064_bcb-n_0000000000) starting
   [junit4]   2> 3695 INFO  (zkConnectionManagerCallback-17-thread-1-processing-n:127.0.0.1:36064_bcb) [n:127.0.0.1:36064_bcb    ] o.a.s.c.c.ConnectionManager zkClient has connected
   [junit4]   2> 3706 INFO  (TEST-RollingRestartTest.test-seed#[E7C8D9B9A63EB0]) [n:127.0.0.1:36064_bcb    ] o.a.s.c.s.i.ZkClientClusterStateProvider Cluster at 127.0.0.1:56510/solr ready
   [junit4]   2> 3806 INFO  (TEST-RollingRestartTest.test-seed#[E7C8D9B9A63EB0]) [n:127.0.0.1:36064_bcb    ] o.a.s.c.ZkController Register node as live in ZooKeeper:/live_nodes/127.0.0.1:36064_bcb
   [junit4]   2> 3875 INFO  (zkCallback-16-thread-1-processing-n:127.0.0.1:36064_bcb) [n:127.0.0.1:36064_bcb    ] o.a.s.c.c.ZkStateReader Updated live nodes from ZooKeeper... (0) -> (1)
   [junit4]   2> 3889 INFO  (zkCallback-11-thread-1-processing-n:127.0.0.1:36064_bcb) [n:127.0.0.1:36064_bcb    ] o.a.s.c.c.ZkStateReader Updated live nodes from ZooKeeper... (0) -> (1)
   [junit4]   2> 4918 INFO  (TEST-RollingRestartTest.test-seed#[E7C8D9B9A63EB0]) [n:127.0.0.1:36064_bcb    ] o.a.s.m.r.SolrJmxReporter JMX monitoring for 'solr.node' (registry 'solr.node') enabled at server: com.sun.jmx.mbeanserver.JmxMBeanServer@7ef3a863
   [junit4]   2> 4920 INFO  (TEST-RollingRestartTest.test-seed#[E7C8D9B9A63EB0]) [n:127.0.0.1:36064_bcb    ] o.a.s.m.r.SolrJmxReporter JMX monitoring for 'solr.jvm' (registry 'solr.jvm') enabled at server: com.sun.jmx.mbeanserver.JmxMBeanServer@7ef3a863
   [junit4]   2> 4920 INFO  (TEST-RollingRestartTest.test-seed#[E7C8D9B9A63EB0]) [n:127.0.0.1:36064_bcb    ] o.a.s.m.r.SolrJmxReporter JMX monitoring for 'solr.jetty' (registry 'solr.jetty') enabled at server: com.sun.jmx.mbeanserver.JmxMBeanServer@7ef3a863
   [junit4]   2> 4976 INFO  (TEST-RollingRestartTest.test-seed#[E7C8D9B9A63EB0]) [n:127.0.0.1:36064_bcb    ] o.a.s.c.CorePropertiesLocator Found 0 core definitions underneath /x1/jenkins/jenkins-slave/workspace/Lucene-Solr-NightlyTests-7.x/checkout/solr/build/solr-core/test/J2/temp/solr.cloud.RollingRestartTest_E7C8D9B9A63EB0-001/control-001/cores
   [junit4]   2> 5155 INFO  (zkConnectionManagerCallback-21-thread-1) [    ] o.a.s.c.c.ConnectionManager zkClient has connected
   [junit4]   2> 5169 INFO  (TEST-RollingRestartTest.test-seed#[E7C8D9B9A63EB0]) [    ] o.a.s.c.c.ZkStateReader Updated live nodes from ZooKeeper... (0) -> (1)
   [junit4]   2> 5171 INFO  (TEST-RollingRestartTest.test-seed#[E7C8D9B9A63EB0]) [    ] o.a.s.c.s.i.ZkClientClusterStateProvider Cluster at 127.0.0.1:56510/solr ready
   [junit4]   2> 6050 INFO  (qtp1042177942-26) [n:127.0.0.1:36064_bcb    ] o.a.s.h.a.CollectionsHandler Invoked Collection Action :create with params replicationFactor=1&collection.configName=conf1&name=control_collection&nrtReplicas=1&action=CREATE&numShards=1&createNodeSet=127.0.0.1:36064_bcb&wt=javabin&version=2 and sendToOCPQueue=true
   [junit4]   2> 6112 INFO  (OverseerThreadFactory-8-thread-1-processing-n:127.0.0.1:36064_bcb) [n:127.0.0.1:36064_bcb    ] o.a.s.c.a.c.CreateCollectionCmd Create collection control_collection
   [junit4]   2> 6324 INFO  (qtp1042177942-30) [n:127.0.0.1:36064_bcb    ] o.a.s.h.a.CoreAdminOperation core create command qt=/admin/cores&collection.configName=conf1&newCollection=true&name=control_collection_shard1_replica_n1&action=CREATE&numShards=1&collection=control_collection&shard=shard1&wt=javabin&version=2&replicaType=NRT
   [junit4]   2> 6344 INFO  (qtp1042177942-30) [n:127.0.0.1:36064_bcb    ] o.a.s.c.TransientSolrCoreCacheDefault Allocating transient cache for 4 transient cores
   [junit4]   2> 6489 INFO  (zkCallback-11-thread-1-processing-n:127.0.0.1:36064_bcb) [n:127.0.0.1:36064_bcb    ] o.a.s.c.c.ZkStateReader A cluster state change: [WatchedEvent state:SyncConnected type:NodeDataChanged path:/collections/control_collection/state.json] for collection [control_collection] has occurred - updating... (live nodes size: [1])
   [junit4]   2> 7543 INFO  (qtp1042177942-30) [n:127.0.0.1:36064_bcb c:control_collection s:shard1  x:control_collection_shard1_replica_n1] o.a.s.c.SolrConfig Using Lucene MatchVersion: 7.4.0
   [junit4]   2> 7757 INFO  (qtp1042177942-30) [n:127.0.0.1:36064_bcb c:control_collection s:shard1  x:control_collection_shard1_replica_n1] o.a.s.s.IndexSchema [control_collection_shard1_replica_n1] Schema name=test
   [junit4]   2> 8337 WARN  (qtp1042177942-30) [n:127.0.0.1:36064_bcb c:control_collection s:shard1  x:control_collection_shard1_replica_n1] o.a.s.c.SolrResourceLoader Solr loaded a deprecated plugin/analysis class [solr.WordDelimiterFilterFactory]. Please consult documentation how to replace it accordingly.
   [junit4]   2> 8444 WARN  (qtp1042177942-30) [n:127.0.0.1:36064_bcb c:control_collection s:shard1  x:control_collection_shard1_replica_n1] o.a.s.c.SolrResourceLoader Solr loaded a deprecated plugin/analysis class [solr.GeoHashField]. Please consult documentation how to replace it accordingly.
   [junit4]   2> 8452 WARN  (qtp1042177942-30) [n:127.0.0.1:36064_bcb c:control_collection s:shard1  x:control_collection_shard1_replica_n1] o.a.s.c.SolrResourceLoader Solr loaded a deprecated plugin/analysis class [solr.LatLonType]. Please consult documentation how to replace it accordingly.
   [junit4]   2> 8464 WARN  (qtp1042177942-30) [n:127.0.0.1:36064_bcb c:control_collection s:shard1  x:control_collection_shard1_replica_n1] o.a.s.c.SolrResourceLoader Solr loaded a deprecated plugin/analysis class [solr.CurrencyField]. Please consult documentation how to replace it accordingly.
   [junit4]   2> 8609 INFO  (qtp1042177942-30) [n:127.0.0.1:36064_bcb c:control_collection s:shard1  x:control_collection_shard1_replica_n1] o.a.s.s.IndexSchema Loaded schema test/1.0 with uniqueid field id
   [junit4]   2> 8911 INFO  (qtp1042177942-30) [n:127.0.0.1:36064_bcb c:control_collection s:shard1  x:control_collection_shard1_replica_n1] o.a.s.c.CoreContainer Creating SolrCore 'control_collection_shard1_replica_n1' using configuration from collection control_collection, trusted=true
   [junit4]   2> 8944 INFO  (qtp1042177942-30) [n:127.0.0.1:36064_bcb c:control_collection s:shard1  x:control_collection_shard1_replica_n1] o.a.s.m.r.SolrJmxReporter JMX monitoring for 'solr.core.control_collection.shard1.replica_n1' (registry 'solr.core.control_collection.shard1.replica_n1') enabled at server: com.sun.jmx.mbeanserver.JmxMBeanServer@7ef3a863
   [junit4]   2> 8963 INFO  (qtp1042177942-30) [n:127.0.0.1:36064_bcb c:control_collection s:shard1  x:control_collection_shard1_replica_n1] o.a.s.c.SolrCore solr.RecoveryStrategy.Builder
   [junit4]   2> 9048 INFO  (qtp1042177942-30) [n:127.0.0.1:36064_bcb c:control_collection s:shard1  x:control_collection_shard1_replica_n1] o.a.s.c.SolrCore [[control_collection_shard1_replica_n1] ] Opening new SolrCore at [/x1/jenkins/jenkins-slave/workspace/Lucene-Solr-NightlyTests-7.x/checkout/solr/build/solr-core/test/J2/temp/solr.cloud.RollingRestartTest_E7C8D9B9A63EB0-001/control-001/cores/control_collection_shard1_replica_n1], dataDir=[/x1/jenkins/jenkins-slave/workspace/Lucene-Solr-NightlyTests-7.x/checkout/solr/build/solr-core/test/J2/temp/solr.cloud.RollingRestartTest_E7C8D9B9A63EB0-001/control-001/cores/control_collection_shard1_replica_n1/data/]
   [junit4]   2> 9120 INFO  (qtp1042177942-30) [n:127.0.0.1:36064_bcb c:control_collection s:shard1  x:control_collection_shard1_replica_n1] o.a.s.u.RandomMergePolicy RandomMergePolicy wrapping class org.apache.lucene.index.LogDocMergePolicy: [LogDocMergePolicy: minMergeSize=1000, mergeFactor=18, maxMergeSize=9223372036854775807, maxMergeSizeForForcedMerge=9223372036854775807, calibrateSizeByDeletes=false, maxMergeDocs=2147483647, maxCFSSegmentSizeMB=8.796093022207999E12, noCFSRatio=0.26551317155982646]
   [junit4]   2> 9604 WARN  (qtp1042177942-30) [n:127.0.0.1:36064_bcb c:control_collection s:shard1  x:control_collection_shard1_replica_n1] o.a.s.c.RequestHandlers INVALID paramSet a in requestHandler {type = requestHandler,name = /dump,class = DumpRequestHandler,attributes = {initParams=a, name=/dump, class=DumpRequestHandler},args = {defaults={a=A,b=B}}}
   [junit4]   2> 10128 INFO  (qtp1042177942-30) [n:127.0.0.1:36064_bcb c:control_collection s:shard1  x:control_collection_shard1_replica_n1] o.a.s.u.UpdateHandler Using UpdateLog implementation: org.apache.solr.update.UpdateLog
   [junit4]   2> 10128 INFO  (qtp1042177942-30) [n:127.0.0.1:36064_bcb c:control_collection s:shard1  x:control_collection_shard1_replica_n1] o.a.s.u.UpdateLog Initializing UpdateLog: dataDir= defaultSyncLevel=FLUSH numRecordsToKeep=100 maxNumLogsToKeep=10 numVersionBuckets=65536
   [junit4]   2> 10142 INFO  (qtp1042177942-30) [n:127.0.0.1:36064_bcb c:control_collection s:shard1  x:control_collection_shard1_replica_n1] o.a.s.u.CommitTracker Hard AutoCommit: disabled
   [junit4]   2> 10142 INFO  (qtp1042177942-30) [n:127.0.0.1:36064_bcb c:control_collection s:shard1  x:control_collection_shard1_replica_n1] o.a.s.u.CommitTracker Soft AutoCommit: disabled
   [junit4]   2> 10149 INFO  (qtp1042177942-30) [n:127.0.0.1:36064_bcb c:control_collection s:shard1  x:control_collection_shard1_replica_n1] o.a.s.u.RandomMergePolicy RandomMergePolicy wrapping class org.apache.lucene.index.TieredMergePolicy: [TieredMergePolicy: maxMergeAtOnce=16, maxMergeAtOnceExplicit=33, maxMergedSegmentMB=0.70703125, floorSegmentMB=1.1787109375, forceMergeDeletesPctAllowed=17.885234616518897, segmentsPerTier=20.0, maxCFSSegmentSizeMB=8.796093022207999E12, noCFSRatio=0.2553250261423684
   [junit4]   2> 10184 INFO  (qtp1042177942-30) [n:127.0.0.1:36064_bcb c:control_collection s:shard1  x:control_collection_shard1_replica_n1] o.a.s.s.SolrIndexSearcher Opening [Searcher@38cf781d[control_collection_shard1_replica_n1] main]
   [junit4]   2> 10225 INFO  (qtp1042177942-30) [n:127.0.0.1:36064_bcb c:control_collection s:shard1  x:control_collection_shard1_replica_n1] o.a.s.r.ManagedResourceStorage Configured ZooKeeperStorageIO with znodeBase: /configs/conf1
   [junit4]   2> 10283 INFO  (qtp1042177942-30) [n:127.0.0.1:36064_bcb c:control_collection s:shard1  x:control_collection_shard1_replica_n1] o.a.s.r.ManagedResourceStorage Loaded null at path _rest_managed.json using ZooKeeperStorageIO:path=/configs/conf1
   [junit4]   2> 10330 INFO  (qtp1042177942-30) [n:127.0.0.1:36064_bcb c:control_collection s:shard1  x:control_collection_shard1_replica_n1] o.a.s.h.ReplicationHandler Commits will be reserved for 10000ms.
   [junit4]   2> 10568 INFO  (searcherExecutor-11-thread-1-processing-n:127.0.0.1:36064_bcb x:control_collection_shard1_replica_n1 s:shard1 c:control_collection) [n:127.0.0.1:36064_bcb c:control_collection s:shard1  x:control_collection_shard1_replica_n1] o.a.s.c.SolrCore [control_collection_shard1_replica_n1] Registered new searcher Searcher@38cf781d[control_collection_shard1_replica_n1] main{ExitableDirectoryReader(UninvertingDirectoryReader())}
   [junit4]   2> 10579 INFO  (qtp1042177942-30) [n:127.0.0.1:36064_bcb c:control_collection s:shard1  x:control_collection_shard1_replica_n1] o.a.s.u.UpdateLog Could not find max version in index or recent updates, using new clock 1594972442381516800
   [junit4]   2> 10628 INFO  (qtp1042177942-30) [n:127.0.0.1:36064_bcb c:control_collection s:shard1  x:control_collection_shard1_replica_n1] o.a.s.c.ZkShardTerms Successful update terms at /collections/control_collection/terms/shard1 to Terms{values={core_node2=0}, version=0}
   [junit4]   2> 10654 INFO  (qtp1042177942-30) [n:127.0.0.1:36064_bcb c:control_collection s:shard1  x:control_collection_shard1_replica_n1] o.a.s.c.ShardLeaderElectionContext Enough replicas found to continue.
   [junit4]   2> 10654 INFO  (qtp1042177942-30) [n:127.0.0.1:36064_bcb c:control_collection s:shard1  x:control_collection_shard1_replica_n1] o.a.s.c.ShardLeaderElectionContext I may be the new leader - try and sync
   [junit4]   2> 10654 INFO  (qtp1042177942-30) [n:127.0.0.1:36064_bcb c:control_collection s:shard1  x:control_collection_shard1_replica_n1] o.a.s.c.SyncStrategy Sync replicas to http://127.0.0.1:36064/bcb/control_collection_shard1_replica_n1/
   [junit4]   2> 10656 INFO  (qtp1042177942-30) [n:127.0.0.1:36064_bcb c:control_collection s:shard1  x:control_collection_shard1_replica_n1] o.a.s.c.SyncStrategy Sync Success - now sync replicas to me
   [junit4]   2> 10656 INFO  (qtp1042177942-30) [n:127.0.0.1:36064_bcb c:control_collection s:shard1  x:control_collection_shard1_replica_n1] o.a.s.c.SyncStrategy http://127.0.0.1:36064/bcb/control_collection_shard1_replica_n1/ has no replicas
   [junit4]   2> 10657 INFO  (qtp1042177942-30) [n:127.0.0.1:36064_bcb c:control_collection s:shard1  x:control_collection_shard1_replica_n1] o.a.s.c.ShardLeaderElectionContext Found all replicas participating in election, clear LIR
   [junit4]   2> 10687 INFO  (qtp1042177942-30) [n:127.0.0.1:36064_bcb c:control_collection s:shard1  x:control_collection_shard1_replica_n1] o.a.s.c.ShardLeaderElectionContext I am the new leader: http://127.0.0.1:36064/bcb/control_collection_shard1_replica_n1/ shard1
   [junit4]   2> 10695 INFO  (zkCallback-11-thread-2-processing-n:127.0.0.1:36064_bcb) [n:127.0.0.1:36064_bcb    ] o.a.s.c.c.ZkStateReader A cluster state change: [WatchedEvent state:SyncConnected type:NodeDataChanged path:/collections/control_collection/state.json] for collection [control_collection] has occurred - updating... (live nodes size: [1])
   [junit4]   2> 10746 INFO  (qtp1042177942-30) [n:127.0.0.1:36064_bcb c:control_collection s:shard1  x:control_collection_shard1_replica_n1] o.a.s.c.ZkController I am the leader, no recovery necessary
   [junit4]   2> 10754 INFO  (qtp1042177942-30) [n:127.0.0.1:36064_bcb c:control_collection s:shard1  x:control_collection_shard1_replica_n1] o.a.s.s.HttpSolrCall [admin] webapp=null path=/admin/cores params={qt=/admin/cores&collection.configName=conf1&newCollection=true&name=control_collection_shard1_replica_n1&action=CREATE&numShards=1&collection=control_collection&shard=shard1&wt=javabin&version=2&replicaType=NRT} status=0 QTime=4438
   [junit4]   2> 10853 INFO  (qtp1042177942-26) [n:127.0.0.1:36064_bcb    ] o.a.s.h.a.CollectionsHandler Wait for new collection to be active for at most 30 seconds. Check all shard replicas
   [junit4]   2> 10856 INFO  (zkCallback-11-thread-1-processing-n:127.0.0.1:36064_bcb) [n:127.0.0.1:36064_bcb    ] o.a.s.c.c.ZkStateReader A cluster state change: [WatchedEvent state:SyncConnected type:NodeDataChanged path:/collections/control_collection/state.json] for collection [control_collection] has occurred - updating... (live nodes size: [1])
   [junit4]   2> 11854 INFO  (qtp1042177942-26) [n:127.0.0.1:36064_bcb    ] o.a.s.s.HttpSolrCall [admin] webapp=null path=/admin/collections params={replicationFactor=1&collection.configName=conf1&name=control_collection&nrtReplicas=1&action=CREATE&numShards=1&createNodeSet=127.0.0.1:36064_bcb&wt=javabin&version=2} status=0 QTime=5962
   [junit4]   2> 11911 INFO  (zkConnectionManagerCallback-25-thread-1) [    ] o.a.s.c.c.ConnectionManager zkClient has connected
   [junit4]   2> 11919 INFO  (TEST-RollingRestartTest.test-seed#[E7C8D9B9A63EB0]) [    ] o.a.s.c.c.ZkStateReader Updated live nodes from ZooKeeper... (0) -> (1)
   [junit4]   2> 11924 INFO  (TEST-RollingRestartTest.test-seed#[E7C8D9B9A63EB0]) [    ] o.a.s.c.s.i.ZkClientClusterStateProvider Cluster at 127.0.0.1:56510/solr ready
   [junit4]   2> 11928 INFO  (TEST-RollingRestartTest.test-seed#[E7C8D9B9A63EB0]) [    ] o.a.s.c.ChaosMonkey monkey: init - expire sessions:false cause connection loss:false
   [junit4]   2> 11931 INFO  (qtp1042177942-30) [n:127.0.0.1:36064_bcb    ] o.a.s.h.a.CollectionsHandler Invoked Collection Action :create with params replicationFactor=1&collection.configName=conf1&name=collection1&nrtReplicas=1&action=CREATE&numShards=2&createNodeSet=&stateFormat=2&wt=javabin&version=2 and sendToOCPQueue=true
   [junit4]   2> 11948 INFO  (OverseerCollectionConfigSetProcessor-73455879711358980-127.0.0.1:36064_bcb-n_0000000000) [n:127.0.0.1:36064_bcb    ] o.a.s.c.OverseerTaskQueue Response ZK path: /overseer/collection-queue-work/qnr-0000000000 doesn't exist.  Requestor may have disconnected from ZooKeeper
   [junit4]   2> 11949 INFO  (OverseerThreadFactory-8-thread-2-processing-n:127.0.0.1:36064_bcb) [n:127.0.0.1:36064_bcb    ] o.a.s.c.a.c.CreateCollectionCmd Create collection collection1
   [junit4]   2> 11956 WARN  (OverseerThreadFactory-8-thread-2-processing-n:127.0.0.1:36064_bcb) [n:127.0.0.1:36064_bcb    ] o.a.s.c.a.c.CreateCollectionCmd It is unusual to create a collection (collection1) without cores.
   [junit4]   2> 12171 INFO  (qtp1042177942-30) [n:127.0.0.1:36064_bcb    ] o.a.s.h.a.CollectionsHandler Wait for new collection to be active for at most 30 seconds. Check all shard replicas
   [junit4]   2> 12183 INFO  (qtp1042177942-30) [n:127.0.0.1:36064_bcb    ] o.a.s.s.HttpSolrCall [admin] webapp=null path=/admin/collections params={replicationFactor=1&collection.configName=conf1&name=collection1&nrtReplicas=1&action=CREATE&numShards=2&createNodeSet=&stateFormat=2&wt=javabin&version=2} status=0 QTime=251
   [junit4]   2> 12391 INFO  (TEST-RollingRestartTest.test-seed#[E7C8D9B9A63EB0]) [    ] o.a.s.c.AbstractFullDistribZkTestBase create jetty 1 in directory /x1/jenkins/jenkins-slave/workspace/Lucene-Solr-NightlyTests-7.x/checkout/solr/build/solr-core/test/J2/temp/solr.cloud.RollingRestartTest_E7C8D9B9A63EB0-001/shard-1-001 of type NRT
   [junit4]   2> 12393 INFO  (TEST-RollingRestartTest.test-seed#[E7C8D9B9A63EB0]) [    ] o.e.j.s.Server jetty-9.4.8.v20171121, build timestamp: 2017-11-22T08:27:37+11:00, git hash: 82b8fb23f757335bb3329d540ce37a2a2615f0a8
   [junit4]   2> 12426 INFO  (TEST-RollingRestartTest.test-seed#[E7C8D9B9A63EB0]) [    ] o.e.j.s.session DefaultSessionIdManager workerName=node0
   [junit4]   2> 12426 INFO  (TEST-RollingRestartTest.test-seed#[E7C8D9B9A63EB0]) [    ] o.e.j.s.session No SessionScavenger set, using defaults
   [junit4]   2> 12426 INFO  (TEST-RollingRestartTest.test-seed#[E7C8D9B9A63EB0]) [    ] o.e.j.s.session Scavenging every 660000ms
   [junit4]   2> 12428 INFO  (TEST-RollingRestartTest.test-seed#[E7C8D9B9A63EB0]) [    ] o.e.j.s.h.ContextHandler Started o.e.j.s.ServletContextHandler@779123f5{/bcb,null,AVAILABLE}
   [junit4]   2> 12429 INFO  (TEST-RollingRestartTest.test-seed#[E7C8D9B9A63EB0]) [    ] o.e.j.s.AbstractConnector Started ServerConnector@5e4e76c5{HTTP/1.1,[http/1.1]}{127.0.0.1:51556}
   [junit4]   2> 12429 INFO  (TEST-RollingRestartTest.test-seed#[E7C8D9B9A63EB0]) [    ] o.e.j.s.Server Started @15913ms
   [junit4]   2> 12429 INFO  (TEST-RollingRestartTest.test-seed#[E7C8D9B9A63EB0]) [    ] o.a.s.c.s.e.JettySolrRunner Jetty properties: {solr.data.dir=/x1/jenkins/jenkins-slave/workspace/Lucene-Solr-NightlyTests-7.x/checkout/solr/build/solr-core/test/J2/temp/solr.cloud.RollingRestartTest_E7C8D9B9A63EB0-001/tempDir-001/jetty1, solrconfig=solrconfig.xml, hostContext=/bcb, hostPort=51556, coreRootDirectory=/x1/jenkins/jenkins-slave/workspace/Lucene-Solr-NightlyTests-7.x/checkout/solr/build/solr-core/test/J2/temp/solr.cloud.RollingRestartTest_E7C8D9B9A63EB0-001/shard-1-001/cores}
   [junit4]   2> 12429 ERROR (TEST-RollingRestartTest.test-seed#[E7C8D9B9A63EB0]) [    ] o.a.s.u.StartupLoggingUtils Missing Java Option solr.log.dir. Logging may be missing or incomplete.
   [junit4]   2> 12430 INFO  (TEST-RollingRestartTest.test-seed#[E7C8D9B9A63EB0]) [    ] o.a.s.s.SolrDispatchFilter  ___      _       Welcome to Apache Solr™ version 7.4.0
   [junit4]   2> 12430 INFO  (TEST-RollingRestartTest.test-seed#[E7C8D9B9A63EB0]) [    ] o.a.s.s.SolrDispatchFilter / __| ___| |_ _   Starting in cloud mode on port null
   [junit4]   2> 12430 INFO  (TEST-RollingRestartTest.test-seed#[E7C8D9B9A63EB0]) [    ] o.a.s.s.SolrDispatchFilter \__ \/ _ \ | '_|  Install dir: null
   [junit4]   2> 12430 INFO  (TEST-RollingRestartTest.test-seed#[E7C8D9B9A63EB0]) [    ] o.a.s.s.SolrDispatchFilter |___/\___/_|_|    Start time: 2018-03-15T03:24:15.526Z
   [junit4]   2> 12460 INFO  (zkConnectionManagerCallback-27-thread-1) [    ] o.a.s.c.c.ConnectionManager zkClient has connected
   [junit4]   2> 12462 INFO  (TEST-RollingRestartTest.test-seed#[E7C8D9B9A63EB0]) [    ] o.a.s.s.SolrDispatchFilter Loading solr.xml from SolrHome (not found in ZooKeeper)
   [junit4]   2> 12465 INFO  (TEST-RollingRestartTest.test-seed#[E7C8D9B9A63EB0]) [    ] o.a.s.c.SolrXmlConfig Loading container configuration from /x1/jenkins/jenkins-slave/workspace/Lucene-Solr-NightlyTests-7.x/checkout/solr/build/solr-core/test/J2/temp/solr.cloud.RollingRestartTest_E7C8D9B9A63EB0-001/shard-1-001/solr.xml
   [junit4]   2> 12477 INFO  (TEST-RollingRestartTest.test-seed#[E7C8D9B9A63EB0]) [    ] o.a.s.c.SolrXmlConfig Configuration parameter autoReplicaFailoverWorkLoopDelay is ignored
   [junit4]   2> 12478 INFO  (TEST-RollingRestartTest.test-seed#[E7C8D9B9A63EB0]) [    ] o.a.s.c.SolrXmlConfig Configuration parameter autoReplicaFailoverBadNodeExpiration is ignored
   [junit4]   2> 12497 INFO  (TEST-RollingRestartTest.test-seed#[E7C8D9B9A63EB0]) [    ] o.a.s.c.SolrXmlConfig MBean server found: com.sun.jmx.mbeanserver.JmxMBeanServer@7ef3a863, but no JMX reporters were configured - adding default JMX reporter.
   [junit4]   2> 12519 INFO  (TEST-RollingRestartTest.test-seed#[E7C8D9B9A63EB0]) [    ] o.a.s.c.ZkContainer Zookeeper client=127.0.0.1:56510/solr
   [junit4]   2> 12551 INFO  (zkConnectionManagerCallback-31-thread-1) [    ] o.a.s.c.c.ConnectionManager zkClient has connected
   [junit4]   2> 12607 INFO  (zkConnectionManagerCallback-33-thread-1-processing-n:127.0.0.1:51556_bcb) [n:127.0.0.1:51556_bcb    ] o.a.s.c.c.ConnectionManager zkClient has connected
   [junit4]   2> 12626 INFO  (TEST-RollingRestartTest.test-seed#[E7C8D9B9A63EB0]) [n:127.0.0.1:51556_bcb    ] o.a.s.c.c.ZkStateReader Updated live nodes from ZooKeeper... (0) -> (1)
   [junit4]   2> 12629 INFO  (TEST-RollingRestartTest.test-seed#[E7C8D9B9A63EB0]) [n:127.0.0.1:51556_bcb    ] o.a.s.c.Overseer Overseer (id=null) closing
   [junit4]   2> 12637 INFO  (TEST-RollingRestartTest.test-seed#[E7C8D9B9A63EB0]) [n:127.0.0.1:51556_bcb    ] o.a.s.c.ZkController Register node as live in ZooKeeper:/live_nodes/127.0.0.1:51556_bcb
   [junit4]   2> 12641 INFO  (zkCallback-11-thread-1-processing-n:127.0.0.1:36064_bcb) [n:127.0.0.1:36064_bcb    ] o.a.s.c.c.ZkStateReader Updated live nodes from ZooKeeper... (1) -> (2)
   [junit4]   2> 12663 INFO  (zkCallback-16-thread-1-processing-n:127.0.0.1:36064_bcb) [n:127.0.0.1:36064_bcb    ] o.a.s.c.c.ZkStateReader Updated live nodes from ZooKeeper... (1) -> (2)
   [junit4]   2> 12683 INFO  (zkCallback-32-thread-1-processing-n:127.0.0.1:51556_bcb) [n:127.0.0.1:51556_bcb    ] o.a.s.c.c.ZkStateReader Updated live nodes from ZooKeeper... (1) -> (2)
   [junit4]   2> 12684 INFO  (zkCallback-24-thread-1) [    ] o.a.s.c.c.ZkStateReader Updated live nodes from ZooKeeper... (1) -> (2)
   [junit4]   2> 12882 INFO  (TEST-RollingRestartTest.test-seed#[E7C8D9B9A63EB0]) [n:127.0.0.1:51556_bcb    ] o.a.s.m.r.SolrJmxReporter JMX monitoring for 'solr.node' (registry 'solr.node') enabled at server: com.sun.jmx.mbeanserver.JmxMBeanServer@7ef3a863
   [junit4]   2> 12968 INFO  (TEST-RollingRestartTest.test-seed#[E7C8D9B9A63EB0]) [n:127.0.0.1:51556_bcb    ] o.a.s.m.r.SolrJmxReporter JMX monitoring for 'solr.jvm' (registry 'solr.jvm') enabled at server: com.sun.jmx.mbeanserver.JmxMBeanServer@7ef3a863
   [junit4]   2> 12969 INFO  (TEST-RollingRestartTest.test-seed#[E7C8D9B9A63EB0]) [n:127.0.0.1:51556_bcb    ] o.a.s.m.r.SolrJmxReporter JMX monitoring for 'solr.jetty' (registry 'solr.jetty') enabled at server: com.sun.jmx.mbeanserver.JmxMBeanServer@7ef3a863
   [junit4]   2> 12980 INFO  (TEST-RollingRestartTest.test-seed#[E7C8D9B9A63EB0]) [n:127.0.0.1:51556_bcb    ] o.a.s.c.CorePropertiesLocator Found 0 core definitions underneath /x1/jenkins/jenkins-slave/workspace/Lucene-Solr-NightlyTests-7.x/checkout/solr/build/solr-core/test/J2/temp/solr.cloud.RollingRestartTest_E7C8D9B9A63EB0-001/shard-1-001/cores
   [junit4]   2> 13026 INFO  (zkConnectionManagerCallback-38-thread-1-processing-n:127.0.0.1:51556_bcb) [n:127.0.0.1:51556_bcb    ] o.a.s.c.c.ConnectionManager zkClient has connected
   [junit4]   2> 13031 INFO  (TEST-RollingRestartTest.test-seed#[E7C8D9B9A63EB0]) [n:127.0.0.1:51556_bcb    ] o.a.s.c.c.ZkStateReader Updated live nodes from ZooKeeper... (0) -> (2)
   [junit4]   2> 13033 INFO  (TEST-RollingRestartTest.test-seed#[E7C8D9B9A63EB0]) [n:127.0.0.1:51556_bcb    ] o.a.s.c.s.i.ZkClientClusterStateProvider Cluster at 127.0.0.1:56510/solr ready
   [junit4]   2> 13145 INFO  (qtp1042177942-28) [n:127.0.0.1:36064_bcb    ] o.a.s.h.a.CollectionsHandler Invoked Collection Action :addreplica with params node=127.0.0.1:51556_bcb&action=ADDREPLICA&collection=collection1&shard=shard2&type=NRT&wt=javabin&version=2 and sendToOCPQueue=true
   [junit4]   2> 13164 INFO  (OverseerCollectionConfigSetProcessor-73455879711358980-127.0.0.1:36064_bcb-n_0000000000) [n:127.0.0.1:36064_bcb    ] o.a.s.c.OverseerTaskQueue Response ZK path: /overseer/collection-queue-work/qnr-0000000002 doesn't exist.  Requestor may have disconnected from ZooKeeper
   [junit4]   2> 13172 INFO  (OverseerThreadFactory-8-thread-3-processing-n:127.0.0.1:36064_bcb) [n:127.0.0.1:36064_bcb    ] o.a.s.c.a.c.AddReplicaCmd Node Identified 127.0.0.1:51556_bcb for creating new replica
   [junit4]   2> 13208 INFO  (qtp1749943126-78) [n:127.0.0.1:51556_bcb    ] o.a.s.h.a.CoreAdminOperation core create command qt=/admin/cores&collection.configName=conf1&name=collection1_shard2_replica_n41&action=CREATE&collection=collection1&shard=shard2&wt=javabin&version=2&replicaType=NRT
   [junit4]   2> 13210 INFO  (qtp1749943126-78) [n:127.0.0.1:51556_bcb    ] o.a.s.c.TransientSolrCoreCacheDefault Allocating transient cache for 4 transient cores
   [junit4]   2> 13329 INFO  (zkCallback-32-thread-1-processing-n:127.0.0.1:51556_bcb) [n:127.0.0.1:51556_bcb    ] o.a.s.c.c.ZkStateReader A cluster state change: [WatchedEvent state:SyncConnected type:NodeDataChanged path:/collections/collection1/state.json] for collection [collection1] has occurred - updating... (live nodes size: [2])
   [junit4]   2> 14315 INFO  (qtp1749943126-78) [n:127.0.0.1:51556_bcb c:collection1 s:shard2  x:collection1_shard2_replica_n41] o.a.s.c.SolrConfig Using Lucene MatchVersion: 7.4.0
   [junit4]   2> 14456 INFO  (qtp1749943126-78) [n:127.0.0.1:51556_bcb c:collection1 s:shard2  x:collection1_shard2_replica_n41] o.a.s.s.IndexSchema [collection1_shard2_replica_n41] Schema name=test
   [junit4]   2> 14832 INFO  (qtp1749943126-78) [n:127.0.0.1:51556_bcb c:collection1 s:shard2  x:collection1_shard2_replica_n41] o.a.s.s.IndexSchema Loaded schema test/1.0 with uniqueid field id
   [junit4]   2> 14995 INFO  (qtp1749943126-78) [n:127.0.0.1:51556_bcb c:collection1 s:shard2  x:collection1_shard2_replica_n41] o.a.s.c.CoreContainer Creating SolrCore 'collection1_shard2_replica_n41' using configuration from collection collection1, trusted=true
   [junit4]   2> 14996 INFO  (qtp1749943126-78) [n:127.0.0.1:51556_bcb c:collection1 s:shard2  x:collection1_shard2_replica_n41] o.a.s.m.r.SolrJmxReporter JMX monitoring for 'solr.core.collection1.shard2.replica_n41' (registry 'solr.core.collection1.shard2.replica_n41') enabled at server: com.sun.jmx.mbeanserver.JmxMBeanServer@7ef3a863
   [junit4]   2> 14996 INFO  (qtp1749943126-78) [n:127.0.0.1:51556_bcb c:collection1 s:shard2  x:collection1_shard2_replica_n41] o.a.s.c.SolrCore solr.RecoveryStrategy.Builder
   [junit4]   2> 14996 INFO  (qtp1749943126-78) [n:127.0.0.1:51556_bcb c:collection1 s:shard2  x:collection1_shard2_replica_n41] o.a.s.c.SolrCore [[collection1_shard2_replica_n41] ] Opening new SolrCore at [/x1/jenkins/jenkins-slave/workspace/Lucene-Solr-NightlyTests-7.x/checkout/solr/build/solr-core/test/J2/temp/solr.cloud.RollingRestartTest_E7C8D9B9A63EB0-001/shard-1-001/cores/collection1_shard2_replica_n41], dataDir=[/x1/jenkins/jenkins-slave/workspace/Lucene-Solr-NightlyTests-7.x/checkout/solr/build/solr-core/test/J2/temp/solr.cloud.RollingRestartTest_E7C8D9B9A63EB0-001/shard-1-001/cores/collection1_shard2_replica_n41/data/]
   [junit4]   2> 15016 INFO  (qtp1749943126-78) [n:127.0.0.1:51556_bcb c:collection1 s:shard2  x:collection1_shard2_replica_n41] o.a.s.u.RandomMergePolicy RandomMergePolicy wrapping class org.apache.lucene.index.LogDocMergePolicy: [LogDocMergePolicy: minMergeSize=1000, mergeFactor=18, maxMergeSize=9223372036854775807, maxMergeSizeForForcedMerge=9223372036854775807, calibrateSizeByDeletes=false, maxMergeDocs=2147483647, maxCFSSegmentSizeMB=8.796093022207999E12, noCFSRatio=0.26551317155982646]
   [junit4]   2> 15059 WARN  (qtp1749943126-78) [n:127.0.0.1:51556_bcb c:collection1 s:shard2  x:collection1_shard2_replica_n41] o.a.s.c.RequestHandlers INVALID paramSet a in requestHandler {type = requestHandler,name = /dump,class = DumpRequestHandler,attributes = {initParams=a, name=/dump, class=DumpRequestHandler},args = {defaults={a=A,b=B}}}
   [junit4]   2> 15357 INFO  (qtp1749943126-78) [n:127.0.0.1:51556_bcb c:collection1 s:shard2  x:collection1_shard2_replica_n41] o.a.s.u.UpdateHandler Using UpdateLog implementation: org.apache.solr.update.UpdateLog
   [junit4]   2> 15359 INFO  (qtp1749943126-78) [n:127.0.0.1:51556_bcb c:collection1 s:shard2  x:collection1_shard2_replica_n41] o.a.s.u.UpdateLog Initializing UpdateLog: dataDir= defaultSyncLevel=FLUSH numRecordsToKeep=100 maxNumLogsToKeep=10 numVersionBuckets=65536
   [junit4]   2> 15362 INFO  (qtp1749943126-78) [n:127.0.0.1:51556_bcb c:collection1 s:shard2  x:collection1_shard2_replica_n41] o.a.s.u.CommitTracker Hard AutoCommit: disabled
   [junit4]   2> 15368 INFO  (qtp1749943126-78) [n:127.0.0.1:51556_bcb c:collection1 s:shard2  x:collection1_shard2_replica_n41] o.a.s.u.CommitTracker Soft AutoCommit: disabled
   [junit4]   2> 15380 INFO  (qtp1749943126-78) [n:127.0.0.1:51556_bcb c:collection1 s:shard2  x:collection1_shard2_replica_n41] o.a.s.u.RandomMergePolicy RandomMergePolicy wrapping class org.apache.lucene.index.TieredMergePolicy: [TieredMergePolicy: maxMergeAtOnce=16, maxMergeAtOnceExplicit=33, maxMergedSegmentMB=0.70703125, floorSegmentMB=1.1787109375, forceMergeDeletesPctAllowed=17.885234616518897, segmentsPerTier=20.0, maxCFSSegmentSizeMB=8.796093022207999E12, noCFSRatio=0.2553250261423684
   [junit4]   2> 15391 INFO  (qtp1749943126-78) [n:127.0.0.1:51556_bcb c:collection1 s:shard2  x:collection1_shard2_replica_n41] o.a.s.s.SolrIndexSearcher Opening [Searcher@7dfbfe64[collection1_shard2_replica_n41] main]
   [junit4]   2> 15395 INFO  (qtp1749943126-78) [n:127.0.0.1:51556_bcb c:collection1 s:shard2  x:collection1_shard2_replica_n41] o.a.s.r.ManagedResourceStorage Configured ZooKeeperStorageIO with znodeBase: /configs/conf1
   [junit4]   2> 15397 INFO  (qtp1749943126-78) [n:127.0.0.1:51556_bcb c:collection1 s:shard2  x:collection1_shard2_replica_n41] o.a.s.r.ManagedResourceStorage Loaded null at path _rest_managed.json using ZooKeeperStorageIO:path=/configs/conf1
   [junit4]   2> 15399 INFO  (qtp1749943126-78) [n:127.0.0.1:51556_bcb c:collection1 s:shard2  x:collection1_shard2_replica_n41] o.a.s.h.ReplicationHandler Commits will be reserved for 10000ms.
   [junit4]   2> 15404 INFO  (searcherExecutor-22-thread-1-processing-n:127.0.0.1:51556_bcb x:collection1_shard2_replica_n41 s:shard2 c:collection1) [n:127.0.0.1:51556_bcb c:collection1 s:shard2  x:collection1_shard2_replica_n41] o.a.s.c.SolrCore [collection1_shard2_replica_n41] Registered new searcher Searcher@7dfbfe64[collection1_shard2_replica_n41] main{ExitableDirectoryReader(UninvertingDirectoryReader())}
   [junit4]   2> 15405 INFO  (qtp1749943126-78) [n:127.0.0.1:51556_bcb c:collection1 s:shard2  x:collection1_shard2_replica_n41] o.a.s.u.UpdateLog Could not find max version in index or recent updates, using new clock 1594972447441944576
   [junit4]   2> 15436 INFO  (qtp1749943126-78) [n:127.0.0.1:51556_bcb c:collection1 s:shard2  x:collection1_shard2_replica_n41] o.a.s.c.ZkShardTerms Successful update terms at /collections/collection1/terms/shard2 to Terms{values={core_node42=0}, version=0}
   [junit4]   2> 15468 INFO  (qtp1749943126-78) [n:127.0.0.1:51556_bcb c:collection1 s:shard2  x:collection1_shard2_replica_n41] o.a.s.c.ShardLeaderElectionContext Enough replicas found to continue.
   [junit4]   2> 15468 INFO  (qtp1749943126-78) [n:127.0.0.1:51556_bcb c:collection1 s:shard2  x:collection1_shard2_replica_n41] o.a.s.c.ShardLeaderElectionContext I may be the new leader - try and sync
   [junit4]   2> 15468 INFO  (qtp1749943126-78) [n:127.0.0.1:51556_bcb c:collection1 s:shard2  x:collection1_shard2_replica_n41] o.a.s.c.SyncStrategy Sync replicas to http://127.0.0.1:51556/bcb/collection1_shard2_replica_n41/
   [junit4]   2> 15468 INFO  (qtp1749943126-78) [n:127.0.0.1:51556_bcb c:collection1 s:shard2  x:collection1_shard2_replica_n41] o.a.s.c.SyncStrategy Sync Success - now sync replicas to me
   [junit4]   2> 15468 INFO  (qtp1749943126-78) [n:127.0.0.1:51556_bcb c:collection1 s:shard2  x:collection1_shard2_replica_n41] o.a.s.c.SyncStrategy http://127.0.0.1:51556/bcb/collection1_shard2_replica_n41/ has no replicas
   [junit4]   2> 15468 INFO  (qtp1749943126-78) [n:127.0.0.1:51556_bcb c:collection1 s:shard2  x:collection1_shard2_replica_n41] o.a.s.c.ShardLeaderElectionContext Found all replicas participating in election, clear LIR
   [junit4]   2> 15480 INFO  (qtp1749943126-78) [n:127.0.0.1:51556_bcb c:collection1 s:shard2  x:collection1_shard2_replica_n41] o.a.s.c.ShardLeaderElectionContext I am the new leader: http://127.0.0.1:51556/bcb/collection1_shard2_replica_n41/ shard2
   [junit4]   2> 15480 INFO  (zkCallback-32-thread-1-processing-n:127.0.0.1:51556_bcb) [n:127.0.0.1:51556_bcb    ] o.a.s.c.c.ZkStateReader A cluster state change: [WatchedEvent state:SyncConnected type:NodeDataChanged path:/collections/collection1/state.json] for collection [collection1] has occurred - updating... (live nodes size: [2])
   [junit4]   2> 15482 INFO  (qtp1749943126-78) [n:127.0.0.1:51556_bcb c:collection1 s:shard2  x:collection1_shard2_replica_n41] o.a.s.c.ZkController I am the leader, no recovery necessary
   [junit4]   2> 15486 INFO  (qtp1749943126-78) [n:127.0.0.1:51556_bcb c:collection1 s:shard2  x:collection1_shard2_replica_n41] o.a.s.s.HttpSolrCall [admin] webapp=null path=/admin/cores params={qt=/admin/cores&collection.configName=conf1&name=collection1_shard2_replica_n41&action=CREATE&collection=collection1&shard=shard2&wt=javabin&version=2&replicaType=NRT} status=0 QTime=2278
   [junit4]   2> 15507 INFO  (qtp1042177942-28) [n:127.0.0.1:36064_bcb    ] o.a.s.s.HttpSolrCall [admin] webapp=null path=/admin/collections params={node=127.0.0.1:51556_bcb&action=ADDREPLICA&collection=collection1&shard=shard2&type=NRT&wt=javabin&version=2} status=0 QTime=2361
   [junit4]   2> 15586 INFO  (zkCallback-32-thread-1-processing-n:127.0.0.1:51556_bcb) [n:127.0.0.1:51556_bcb    ] o.a.s.c.c.ZkStateReader A cluster state change: [WatchedEvent state:SyncConnected type:NodeDataChanged path:/collections/collection1/state.json] for collection [collection1] has occurred - updating... (live nodes size: [2])
   [junit4]   2> 15688 INFO  (TEST-RollingRestartTest.test-seed#[E7C8D9B9A63EB0]) [    ] o.a.s.c.AbstractFullDistribZkTestBase create jetty 2 in directory /x1/jenkins/jenkins-slave/workspace/Lucene-Solr-NightlyTests-7.x/checkout/solr/build/solr-core/test/J2/temp/solr.cloud.RollingRestartTest_E7C8D9B9A63EB0-001/shard-2-001 of type NRT
   [junit4]   2> 15699 INFO  (TEST-RollingRestartTest.test-seed#[E7C8D9B9A63EB0]) [    ] o.e.j.s.Server jetty-9.4.8.v20171121, build timestamp: 2017-11-22T08:27:37+11:00, git hash: 82b8fb23f757335bb3329d540ce37a2a2615f0a8
   [junit4]   2> 15708 INFO  (TEST-RollingRestartTest.test-seed#[E7C8D9B9A63EB0]) [    ] o.e.j.s.session DefaultSessionIdManager workerName=node0
   [junit4]   2> 15708 INFO  (TEST-RollingRestartTest.test-seed#[E7C8D9B9A63EB0]) [    ] o.e.j.s.session No SessionScavenger set, using defaults
   [junit4]   2> 15708 INFO  (TEST-RollingRestartTest.test-seed#[E7C8D9B9A63EB0]) [    ] o.e.j.s.session Scavenging every 660000ms
   [junit4]   2> 15709 INFO  (TEST-RollingRestartTest.test-seed#[E7C8D9B9A63EB0]) [    ] o.e.j.s.h.ContextHandler Started o.e.j.s.ServletContextHandler@880b243{/bcb,null,AVAILABLE}
   [junit4]   2> 15710 INFO  (TEST-RollingRestartTest.test-seed#[E7C8D9B9A63EB0]) [    ] o.e.j.s.AbstractConnector Started ServerConnector@c43d74e{HTTP/1.1,[http/1.1]}{127.0.0.1:33615}
   [junit4]   2> 15710 INFO  (TEST-RollingRestartTest.test-seed#[E7C8D9B9A63EB0]) [    ] o.e.j.s.Server Started @19194ms
   [junit4]   2> 15710 INFO  (TEST-RollingRestartTest.test-seed#[E7C8D9B9A63EB0]) [    ] o.a.s.c.s.e.JettySolrRunner Jetty properties: {solr.data.dir=/x1/jenkins/jenkins-slave/workspace/Lucene-Solr-NightlyTests-7.x/checkout/solr/build/solr-core/test/J2/temp/solr.cloud.RollingRestartTest_E7C8D9B9A63EB0-001/tempDir-001/jetty2, solrconfig=solrconfig.xml, hostContext=/bcb, hostPort=33615, coreRootDirectory=/x1/jenkins/jenkins-slave/workspace/Lucene-Solr-NightlyTests-7.x/checkout/solr/build/solr-core/test/J2/temp/solr.cloud.RollingRestartTest_E7C8D9B9A63EB0-001/shard-2-001/cores}
   [junit4]   2> 15711 ERROR (TEST-RollingRestartTest.test-seed#[E7C8D9B9A63EB0]) [    ] o.a.s.u.StartupLoggingUtils Missing Java Option solr.log.dir. Logging may be missing or incomplete.
   [junit4]   2> 15717 INFO  (TEST-RollingRestartTest.test-seed#[E7C8D9B9A63EB0]) [    ] o.a.s.s.SolrDispatchFilter  ___      _       Welcome to Apache Solr™ version 7.4.0
   [junit4]   2> 15718 INFO  (TEST-RollingRestartTest.test-seed#[E7C8D9B9A63EB0]) [    ] o.a.s.s.SolrDispatchFilter / __| ___| |_ _   Starting in cloud mode on port null
   [junit4]   2> 15718 INFO  (TEST-RollingRestartTest.test-seed#[E7C8D9B9A63EB0]) [    ] o.a.s.s.SolrDispatchFilter \__ \/ _ \ | '_|  Install dir: null
   [junit4]   2> 15719 INFO  (TEST-RollingRestartTest.test-seed#[E7C8D9B9A63EB0]) [    ] o.a.s.s.SolrDispatchFilter |___/\___/_|_|    Start time: 2018-03-15T03:24:18.815Z
   [junit4]   2> 15746 INFO  (zkConnectionManagerCallback-40-thread-1) [    ] o.a.s.c.c.ConnectionManager zkClient has connected
   [junit4]   2> 15748 INFO  (TEST-RollingRestartTest.test-seed#[E7C8D9B9A63EB0]) [    ] o.a.s.s.SolrDispatchFilter Loading solr.xml from SolrHome (not found in ZooKeeper)
   [junit4]   2> 15748 INFO  (TEST-RollingRestartTest.test-seed#[E7C8D9B9A63EB0]) [    ] o.a.s.c.SolrXmlConfig Loading container configuration from /x1/jenkins/jenkins-slave/workspace/Lucene-Solr-NightlyTests-7.x/checkout/solr/build/solr-core/test/J2/temp/solr.cloud.RollingRestartTest_E7C8D9B9A63EB0-001/shard-2-001/solr.xml
   [junit4]   2> 15756 INFO  (TEST-RollingRestartTest.test-seed#[E7C8D9B9A63EB0]) [    ] o.a.s.c.SolrXmlConfig Configuration parameter autoReplicaFailoverWorkLoopDelay is ignored
   [junit4]   2> 15756 INFO  (TEST-RollingRestartTest.test-seed#[E7C8D9B9A63EB0]) [    ] o.a.s.c.SolrXmlConfig Configuration parameter autoReplicaFailoverBadNodeExpiration is ignored
   [junit4]   2> 15758 INFO  (TEST-RollingRestartTest.test-seed#[E7C8D9B9A63EB0]) [    ] o.a.s.c.SolrXmlConfig MBean server found: com.sun.jmx.mbeanserver.JmxMBeanServer@7ef3a863, but no JMX reporters were configured - adding default JMX reporter.
   [junit4]   2> 15763 INFO  (TEST-RollingRestartTest.test-seed#[E7C8D9B9A63EB0]) [    ] o.a.s.c.ZkContainer Zookeeper client=127.0.0.1:56510/solr
   [junit4]   2> 15768 INFO  (zkConnectionManagerCallback-44-thread-1) [    ] o.a.s.c.c.ConnectionManager zkClient has connected
   [junit4]   2> 15787 INFO  (zkConnectionManagerCallback-46-thread-1-processing-n:127.0.0.1:33615_bcb) [n:127.0.0.1:33615_bcb    ] o.a.s.c.c.ConnectionManager zkClient has connected
   [junit4]   2> 15805 INFO  (TEST-RollingRestartTest.test-seed#[E7C8D9B9A63EB0]) [n:127.0.0.1:33615_bcb    ] o.a.s.c.c.ZkStateReader Updated live nodes from ZooKeeper... (0) -> (2)
   [junit4]   2> 15810 INFO  (TEST-RollingRestartTest.test-seed#[E7C8D9B9A63EB0]) [n:127.0.0.1:33615_bcb    ] o.a.s.c.Overseer Overseer (id=null) closing
   [junit4]   2> 15816 INFO  (TEST-RollingRestartTest.test-seed#[E7C8D9B9A63EB0]) [n:127.0.0.1:33615_bcb    ] o.a.s.c.ZkController Register node as live in ZooKeeper:/live_nodes/127.0.0.1:33615_bcb
   [junit4]   2> 15819 INFO  (zkCallback-32-thread-1-processing-n:127.0.0.1:51556_bcb) [n:127.0.0.1:51556_bcb    ] o.a.s.c.c.ZkStateReader Updated live nodes from ZooKeeper... (2) -> (3)
   [junit4]   2> 15819 INFO  (zkCallback-11-thread-1-processing-n:127.0.0.1:36064_bcb) [n:127.0.0.1:36064_bcb    ] o.a.s.c.c.ZkStateReader Updated live nodes from ZooKeeper... (2) -> (3)
   [junit4]   2> 15820 INFO  (zkCallback-16-thread-1-processing-n:127.0.0.1:36064_bcb) [n:127.0.0.1:36064_bcb    ] o.a.s.c.c.ZkStateReader Updated live nodes from ZooKeeper... (2) -> (3)
   [junit4]   2> 15836 INFO  (zkCallback-45-thread-1-processing-n:127.0.0.1:33615_bcb) [n:127.0.0.1:33615_bcb    ] o.a.s.c.c.ZkStateReader Updated live nodes from ZooKeeper... (2) -> (3)
   [junit4]   2> 15843 INFO  (zkCallback-24-thread-1) [    ] o.a.s.c.c.ZkStateReader Updated live nodes from ZooKeeper... (2) -> (3)
   [junit4]   2> 15847 INFO  (zkCallback-37-thread-1-processing-n:127.0.0.1:51556_bcb) [n:127.0.0.1:51556_bcb    ] o.a.s.c.c.ZkStateReader Updated live nodes from ZooKeeper... (2) -> (3)
   [junit4]   2> 16091 INFO  (TEST-RollingRestartTest.test-seed#[E7C8D9B9A63EB0]) [n:127.0.0.1:33615_bcb    ] o.a.s.m.r.SolrJmxReporter JMX monitoring for 'solr.node' (registry 'solr.node') enabled at server: com.sun.jmx.mbeanserver.JmxMBeanServer@7ef3a863
   [junit4]   2> 16210 INFO  (TEST-RollingRestartTest.test-seed#[E7C8D9B9A63EB0]) [n:127.0.0.1:33615_bcb    ] o.a.s.m.r.SolrJmxReporter JMX monitoring for 'solr.jvm' (registry 'solr.jvm') enabled at server: com.sun.jmx.mbeanserver.JmxMBeanServer@7ef3a863
   [junit4]   2> 16211 INFO  (TEST-RollingRestartTest.test-seed#[E7C8D9B9A63EB0]) [n:127.0.0.1:33615_bcb    ] o.a.s.m.r.SolrJmxReporter JMX monitoring for 'solr.jetty' (registry 'solr.jetty') enabled at server: com.sun.jmx.mbeanserver.JmxMBeanServer@7ef3a863
   [junit4]   2> 16227 INFO  (TEST-RollingRestartTest.test-seed#[E7C8D9B9A63EB0]) [n:127.0.0.1:33615_bcb    ] o.a.s.c.CorePropertiesLocator Found 0 core definitions underneath /x1/jenkins/jenkins-slave/workspace/Lucene-Solr-NightlyTests-7.x/checkout/solr/build/solr-core/test/J2/temp/solr.cloud.RollingRestartTest_E7C8D9B9A63EB0-001/shard-2-001/cores
   [junit4]   2> 16242 INFO  (zkConnectionManagerCallback-51-thread-1-processing-n:127.0.0.1:33615_bcb) [n:127.0.0.1:33615_bcb    ] o.a.s.c.c.ConnectionManager zkClient has connected
   [junit4]   2> 16245 INFO  (TEST-RollingRestartTest.test-seed#[E7C8D9B9A63EB0]) [n:127.0.0.1:33615_bcb    ] o.a.s.c.c.ZkStateReader Updated live nodes from ZooKeeper... (0) -> (3)
   [junit4]   2> 16247 INFO  (TEST-RollingRestartTest.test-seed#[E7C8D9B9A63EB0]) [n:127.0.0.1:33615_bcb    ] o.a.s.c.s.i.ZkClientClusterStateProvider Cluster at 127.0.0.1:56510/solr ready
   [junit4]   2> 16355 INFO  (qtp1614862627-113) [n:127.0.0.1:33615_bcb    ] o.a.s.h.a.CollectionsHandler Invoked Collection Action :addreplica with params node=127.0.0.1:33615_bcb&action=ADDREPLICA&collection=collection1&shard=shard1&type=NRT&wt=javabin&version=2 and sendToOCPQueue=true
   [junit4]   2> 16360 INFO  (OverseerCollectionConfigSetProcessor-73455879711358980-127.0.0.1:36064_bcb-n_0000000000) [n:127.0.0.1:36064_bcb    ] o.a.s.c.OverseerTaskQueue Response ZK path: /overseer/collection-queue-work/qnr-0000000004 doesn't exist.  Requestor may have disconnected from ZooKeeper
   [junit4]   2> 16364 INFO  (OverseerThreadFactory-8-thread-4-processing-n:127.0.0.1:36064_bcb) [n:127.0.0.1:36064_bcb    ] o.a.s.c.a.c.AddReplicaCmd Node Identified 127.0.0.1:33615_bcb for creating new replica
   [junit4]   2> 16370 INFO  (qtp1614862627-118) [n:127.0.0.1:33615_bcb    ] o.a.s.h.a.CoreAdminOperation core create command qt=/admin/cores&collection.configName=conf1&name=collection1_shard1_replica_n43&action=CREATE&collection=collection1&shard=shard1&wt=javabin&version=2&replicaType=NRT
   [junit4]   2> 16371 INFO  (qtp1614862627-118) [n:127.0.0.1:33615_bcb    ] o.a.s.c.TransientSolrCoreCacheDefault Allocating transient cache for 4 transient cores
   [junit4]   2> 16478 INFO  (zkCallback-32-thread-1-processing-n:127.0.0.1:51556_bcb) [n:127.0.0.1:51556_bcb    ] o.a.s.c.c.ZkStateReader A cluster state change: [WatchedEvent state:SyncConnected type:NodeDataChanged path:/collections/collection1/state.json] for collection [collection1] has occurred - updating... (live nodes size: [3])
   [junit4]   2> 16478 INFO  (zkCallback-45-thread-1-processing-n:127.0.0.1:33615_bcb) [n:127.0.0.1:33615_bcb    ] o.a.s.c.c.ZkStateReader A cluster state change: [WatchedEvent state:SyncConnected type:NodeDataChanged path:/collections/collection1/state.json] for collection [collection1] has occurred - updating... (live nodes size: [3])
   [junit4]   2> 17424 INFO  (qtp1614862627-118) [n:127.0.0.1:33615_bcb c:collection1 s:shard1  x:collection1_shard1_replica_n43] o.a.s.c.SolrConfig Using Lucene MatchVersion: 7.4.0
   [junit4]   2> 17465 INFO  (qtp1614862627-118) [n:127.0.0.1:33615_bcb c:collection1 s:shard1  x:collection1_shard1_replica_n43] o.a.s.s.IndexSchema [collection1_shard1_replica_n43] Schema name=test
   [junit4]   2> 17670 INFO  (qtp1614862627-118) [n:127.0.0.1:33615_bcb c:collection1 s:shard1  x:collection1_shard1_replica_n43] o.a.s.s.IndexSchema Loaded schema test/1.0 with uniqueid field id
   [junit4]   2> 17740 INFO  (qtp1614862627-118) [n:127.0.0.1:33615_bcb c:collection1 s:shard1  x:collection1_shard1_replica_n43] o.a.s.c.CoreContainer Creating SolrCore 'collection1_shard1_replica_n43' using configuration from collection collection1, trusted=true
   [junit4]   2> 17742 INFO  (qtp1614862627-118) [n:127.0.0.1:33615_bcb c:collection1 s:shard1  x:collection1_shard1_replica_n43] o.a.s.m.r.SolrJmxReporter JMX monitoring for 'solr.core.collection1.shard1.replica_n43' (registry 'solr.core.collection1.shard1.replica_n43') enabled at server: com.sun.jmx.mbeanserver.JmxMBeanServer@7ef3a863
   [junit4]   2> 17743 INFO  (qtp1614862627-118) [n:127.0.0.1:33615_bcb c:collection1 s:shard1  x:collection1_shard1_replica_n43] o.a.s.c.SolrCore solr.RecoveryStrategy.Builder
   [junit4]   2> 17743 INFO  (qtp1614862627-118) [n:127.0.0.1:33615_bcb c:collection1 s:shard1  x:collection1_shard1_replica_n43] o.a.s.c.SolrCore [[collection1_shard1_replica_n43] ] Opening new SolrCore at [/x1/jenkins/jenkins-slave/workspace/Lucene-Solr-NightlyTests-7.x/checkout/solr/build/solr-core/test/J2/temp/solr.cloud.RollingRestartTest_E7C8D9B9A63EB0-001/shard-2-001/cores/collection1_shard1_replica_n43], dataDir=[/x1/jenkins/jenkins-slave/workspace/Lucene-Solr-NightlyTests-7.x/checkout/solr/build/solr-core/test/J2/temp/solr.cloud.RollingRestartTest_E7C8D9B9A63EB0-001/shard-2-001/cores/collection1_shard1_replica_n43/data/]
   [junit4]   2> 17768 INFO  (qtp1614862627-118) [n:127.0.0.1:33615_bcb c:collection1 s:shard1  x:collection1_shard1_replica_n43] o.a.s.u.RandomMergePolicy RandomMergePolicy wrapping class org.apache.lucene.index.LogDocMergePolicy: [LogDocMergePolicy: minMergeSize=1000, mergeFactor=18, maxMergeSize=9223372036854775807, maxMergeSizeForForcedMerge=9223372036854775807, calibrateSizeByDeletes=false, maxMergeDocs=2147483647, maxCFSSegmentSizeMB=8.796093022207999E12, noCFSRatio=0.26551317155982646]
   [junit4]   2> 17802 WARN  (qtp1614862627-118) [n:127.0.0.1:33615_bcb c:collection1 s:shard1  x:collection1_shard1_replica_n43] o.a.s.c.RequestHandlers INVALID paramSet a in requestHandler {type = requestHandler,name = /dump,class = DumpRequestHandler,attributes = {initParams=a, name=/dump, class=DumpRequestHandler},args = {defaults={a=A,b=B}}}
   [junit4]   2> 17954 INFO  (qtp1614862627-118) [n:127.0.0.1:33615_bcb c:collection1 s:shard1  x:collection1_shard1_replica_n43] o.a.s.u.UpdateHandler Using UpdateLog implementation: org.apache.solr.update.UpdateLog
   [junit4]   2> 17954 INFO  (qtp1614862627-118) [n:127.0.0.1:33615_bcb c:collection1 s:shard1  x:collection1_shard1_replica_n43] o.a.s.u.UpdateLog Initializing UpdateLog: dataDir= defaultSyncLevel=FLUSH numRecordsToKeep=100 maxNumLogsToKeep=10 numVersionBuckets=65536
   [junit4]   2> 17957 INFO  (qtp1614862627-118) [n:127.0.0.1:33615_bcb c:collection1 s:shard1  x:collection1_shard1_replica_n43] o.a.s.u.CommitTracker Hard AutoCommit: disabled
   [junit4]   2> 17957 INFO  (qtp1614862627-118) [n:127.0.0.1:33615_bcb c:collection1 s:shard1  x:collection1_shard1_replica_n43] o.a.s.u.CommitTracker Soft AutoCommit: disabled
   [junit4]   2> 17960 INFO  (qtp1614862627-118) [n:127.0.0.1:33615_bcb c:collection1 s:shard1  x:collection1_shard1_replica_n43] o.a.s.u.RandomMergePolicy RandomMergePolicy wrapping class org.apache.lucene.index.TieredMergePolicy: [TieredMergePolicy: maxMergeAtOnce=16, maxMergeAtOnceExplicit=33, maxMergedSegmentMB=0.70703125, floorSegmentMB=1.1787109375, forceMergeDeletesPctAllowed=17.885234616518897, segmentsPerTier=20.0, maxCFSSegmentSizeMB=8.796093022207999E12, noCFSRatio=0.2553250261423684
   [junit4]   2> 17971 INFO  (qtp1614862627-118) [n:127.0.0.1:33615_bcb c:collection1 s:shard1  x:collection1_shard1_replica_n43] o.a.s.s.SolrIndexSearcher Opening [Searcher@3160536c[collection1_shard1_replica_n43] main]
   [junit4]   2> 17974 INFO  (qtp1614862627-118) [n:127.0.0.1:33615_bcb c:collection1 s:shard1  x:collection1_shard1_replica_n43] o.a.s.r.ManagedResourceStorage Configured ZooKeeperStorageIO with znodeBase: /configs/conf1
   [junit4]   2> 17975 INFO  (qtp1614862627-118) [n:127.0.0.1:33615_bcb c:collection1 s:shard1  x:collection1_shard1_replica_n43] o.a.s.r.ManagedResourceStorage Loaded null at path _rest_managed.json using ZooKeeperStorageIO:path=/configs/conf1
   [junit4]   2> 17976 INFO  (qtp1614862627-118) [n:127.0.0.1:33615_bcb c:collection1 s:shard1  x:collection1_shard1_replica_n43] o.a.s.h.ReplicationHandler Commits will be reserved for 10000ms.
   [junit4]   2> 17977 INFO  (qtp1614862627-118) [n:127.0.0.1:33615_bcb c:collection1 s:shard1  x:collection1_shard1_replica_n43] o.a.s.u.UpdateLog Could not find max version in index or recent updates, using new clock 1594972450138882048
   [junit4]   2> 17982 INFO  (searcherExecutor-33-thread-1-processing-n:127.0.0.1:33615_bcb x:collection1_shard1_replica_n43 s:shard1 c:co

[...truncated too long message...]

:654)
   [junit4]    > 	at org.apache.solr.client.solrj.impl.HttpSolrClient.request(HttpSolrClient.java:255)
   [junit4]    > 	at org.apache.solr.client.solrj.impl.HttpSolrClient.request(HttpSolrClient.java:244)
   [junit4]    > 	at org.apache.solr.client.solrj.impl.LBHttpSolrClient.doRequest(LBHttpSolrClient.java:483)
   [junit4]    > 	at org.apache.solr.client.solrj.impl.LBHttpSolrClient.request(LBHttpSolrClient.java:413)
   [junit4]    > 	at org.apache.solr.client.solrj.impl.CloudSolrClient.sendRequest(CloudSolrClient.java:1105)
   [junit4]    > 	at org.apache.solr.client.solrj.impl.CloudSolrClient.requestWithRetryOnStaleState(CloudSolrClient.java:885)
   [junit4]    > 	at org.apache.solr.client.solrj.impl.CloudSolrClient.request(CloudSolrClient.java:818)
   [junit4]    > 	at org.apache.solr.client.solrj.SolrRequest.process(SolrRequest.java:194)
   [junit4]    > 	at org.apache.solr.client.solrj.SolrClient.commit(SolrClient.java:484)
   [junit4]    > 	at org.apache.solr.client.solrj.SolrClient.commit(SolrClient.java:463)
   [junit4]    > 	at org.apache.solr.cloud.AbstractFullDistribZkTestBase.commit(AbstractFullDistribZkTestBase.java:1591)
   [junit4]    > 	at org.apache.solr.update.TestInPlaceUpdatesDistrib.docValuesUpdateTest(TestInPlaceUpdatesDistrib.java:352)
   [junit4]    > 	at org.apache.solr.update.TestInPlaceUpdatesDistrib.test(TestInPlaceUpdatesDistrib.java:144)
   [junit4]    > 	at org.apache.solr.BaseDistributedSearchTestCase$ShardsRepeatRule$ShardsFixedStatement.callStatement(BaseDistributedSearchTestCase.java:993)
   [junit4]    > 	at org.apache.solr.BaseDistributedSearchTestCase$ShardsRepeatRule$ShardsStatement.evaluate(BaseDistributedSearchTestCase.java:968)
   [junit4]    > 	at java.lang.Thread.run(Thread.java:748)
   [junit4]    > Caused by: java.net.SocketTimeoutException: Read timed out
   [junit4]    > 	at java.net.SocketInputStream.socketRead0(Native Method)
   [junit4]    > 	at java.net.SocketInputStream.socketRead(SocketInputStream.java:116)
   [junit4]    > 	at java.net.SocketInputStream.read(SocketInputStream.java:171)
   [junit4]    > 	at java.net.SocketInputStream.read(SocketInputStream.java:141)
   [junit4]    > 	at sun.security.ssl.InputRecord.readFully(InputRecord.java:465)
   [junit4]    > 	at sun.security.ssl.InputRecord.read(InputRecord.java:503)
   [junit4]    > 	at sun.security.ssl.SSLSocketImpl.readRecord(SSLSocketImpl.java:983)
   [junit4]    > 	at sun.security.ssl.SSLSocketImpl.readDataRecord(SSLSocketImpl.java:940)
   [junit4]    > 	at sun.security.ssl.AppInputStream.read(AppInputStream.java:105)
   [junit4]    > 	at org.apache.http.impl.io.SessionInputBufferImpl.streamRead(SessionInputBufferImpl.java:137)
   [junit4]    > 	at org.apache.http.impl.io.SessionInputBufferImpl.fillBuffer(SessionInputBufferImpl.java:153)
   [junit4]    > 	at org.apache.http.impl.io.SessionInputBufferImpl.readLine(SessionInputBufferImpl.java:282)
   [junit4]    > 	at org.apache.http.impl.conn.DefaultHttpResponseParser.parseHead(DefaultHttpResponseParser.java:138)
   [junit4]    > 	at org.apache.http.impl.conn.DefaultHttpResponseParser.parseHead(DefaultHttpResponseParser.java:56)
   [junit4]    > 	at org.apache.http.impl.io.AbstractMessageParser.parse(AbstractMessageParser.java:259)
   [junit4]    > 	at org.apache.http.impl.DefaultBHttpClientConnection.receiveResponseHeader(DefaultBHttpClientConnection.java:163)
   [junit4]    > 	at org.apache.http.impl.conn.CPoolProxy.receiveResponseHeader(CPoolProxy.java:165)
   [junit4]    > 	at org.apache.http.protocol.HttpRequestExecutor.doReceiveResponse(HttpRequestExecutor.java:273)
   [junit4]    > 	at org.apache.http.protocol.HttpRequestExecutor.execute(HttpRequestExecutor.java:125)
   [junit4]    > 	at org.apache.http.impl.execchain.MainClientExec.execute(MainClientExec.java:272)
   [junit4]    > 	at org.apache.http.impl.execchain.ProtocolExec.execute(ProtocolExec.java:185)
   [junit4]    > 	at org.apache.http.impl.execchain.RetryExec.execute(RetryExec.java:89)
   [junit4]    > 	at org.apache.http.impl.execchain.RedirectExec.execute(RedirectExec.java:111)
   [junit4]    > 	at org.apache.http.impl.client.InternalHttpClient.doExecute(InternalHttpClient.java:185)
   [junit4]    > 	at org.apache.http.impl.client.CloseableHttpClient.execute(CloseableHttpClient.java:83)
   [junit4]    > 	at org.apache.http.impl.client.CloseableHttpClient.execute(CloseableHttpClient.java:56)
   [junit4]    > 	at org.apache.solr.client.solrj.impl.HttpSolrClient.executeMethod(HttpSolrClient.java:542)
   [junit4]    > 	... 54 more
   [junit4]   2> 4025032 INFO  (SUITE-TestInPlaceUpdatesDistrib-seed#[E7C8D9B9A63EB0]-worker) [    ] o.a.s.SolrTestCaseJ4 ###deleteCore
   [junit4]   2> 4025032 INFO  (SUITE-TestInPlaceUpdatesDistrib-seed#[E7C8D9B9A63EB0]-worker) [    ] o.a.s.c.CoreContainer Shutting down CoreContainer instance=1000510426
   [junit4]   2> 4025032 INFO  (SUITE-TestInPlaceUpdatesDistrib-seed#[E7C8D9B9A63EB0]-worker) [    ] o.a.s.m.SolrMetricManager Closing metric reporters for registry=solr.node, tag=null
   [junit4]   2> 4025032 INFO  (SUITE-TestInPlaceUpdatesDistrib-seed#[E7C8D9B9A63EB0]-worker) [    ] o.a.s.m.r.SolrJmxReporter Closing reporter [org.apache.solr.metrics.reporters.SolrJmxReporter@1614d578: rootName = null, domain = solr.node, service url = null, agent id = null] for registry solr.node / com.codahale.metrics.MetricRegistry@f82ee6f
   [junit4]   2> 4025033 INFO  (SUITE-TestInPlaceUpdatesDistrib-seed#[E7C8D9B9A63EB0]-worker) [    ] o.a.s.m.SolrMetricManager Closing metric reporters for registry=solr.jvm, tag=null
   [junit4]   2> 4025033 INFO  (SUITE-TestInPlaceUpdatesDistrib-seed#[E7C8D9B9A63EB0]-worker) [    ] o.a.s.m.r.SolrJmxReporter Closing reporter [org.apache.solr.metrics.reporters.SolrJmxReporter@2d09807f: rootName = null, domain = solr.jvm, service url = null, agent id = null] for registry solr.jvm / com.codahale.metrics.MetricRegistry@360b9d03
   [junit4]   2> 4025034 INFO  (SUITE-TestInPlaceUpdatesDistrib-seed#[E7C8D9B9A63EB0]-worker) [    ] o.a.s.m.SolrMetricManager Closing metric reporters for registry=solr.jetty, tag=null
   [junit4]   2> 4025034 INFO  (SUITE-TestInPlaceUpdatesDistrib-seed#[E7C8D9B9A63EB0]-worker) [    ] o.a.s.m.r.SolrJmxReporter Closing reporter [org.apache.solr.metrics.reporters.SolrJmxReporter@2e5cc939: rootName = null, domain = solr.jetty, service url = null, agent id = null] for registry solr.jetty / com.codahale.metrics.MetricRegistry@3f26df05
   [junit4]   2> 4025038 INFO  (coreCloseExecutor-2362-thread-1) [    x:collection1] o.a.s.c.SolrCore [collection1]  CLOSING SolrCore org.apache.solr.core.SolrCore@49df8037
   [junit4]   2> 4025038 INFO  (coreCloseExecutor-2362-thread-1) [    x:collection1] o.a.s.m.SolrMetricManager Closing metric reporters for registry=solr.core.collection1, tag=1239384119
   [junit4]   2> 4025038 INFO  (coreCloseExecutor-2362-thread-1) [    x:collection1] o.a.s.m.r.SolrJmxReporter Closing reporter [org.apache.solr.metrics.reporters.SolrJmxReporter@12cf6801: rootName = null, domain = solr.core.collection1, service url = null, agent id = null] for registry solr.core.collection1 / com.codahale.metrics.MetricRegistry@1702be3a
   [junit4]   2> NOTE: leaving temporary files on disk at: /x1/jenkins/jenkins-slave/workspace/Lucene-Solr-NightlyTests-7.x/checkout/solr/build/solr-core/test/J2/temp/solr.update.TestInPlaceUpdatesDistrib_E7C8D9B9A63EB0-001
   [junit4]   2> Mar 15, 2018 4:31:08 AM com.carrotsearch.randomizedtesting.ThreadLeakControl checkThreadLeaks
   [junit4]   2> WARNING: Will linger awaiting termination of 1 leaked thread(s).
   [junit4]   2> NOTE: test params are: codec=Asserting(Lucene70): {title_s=Lucene50(blocksize=128), id=PostingsFormat(name=LuceneFixedGap), id_field_copy_that_does_not_support_in_place_update_s=Lucene50(blocksize=128)}, docValues:{inplace_updatable_float=DocValuesFormat(name=Direct), id_i=DocValuesFormat(name=Lucene70), _version_=DocValuesFormat(name=Direct), id=DocValuesFormat(name=Memory), inplace_updatable_int_with_default=DocValuesFormat(name=Direct), inplace_updatable_float_with_default=DocValuesFormat(name=Lucene70)}, maxPointsInLeafNode=177, maxMBSortInHeap=7.81782720409266, sim=RandomSimilarity(queryNorm=true): {}, locale=ar-QA, timezone=Australia/ACT
   [junit4]   2> NOTE: Linux 3.13.0-88-generic amd64/Oracle Corporation 1.8.0_144 (64-bit)/cpus=4,threads=1,free=44270640,total=532676608
   [junit4]   2> NOTE: All tests run in this JVM: [RollingRestartTest, TestDFISimilarityFactory, TestLeaderElectionZkExpiry, CoreAdminHandlerTest, TestGraphTermsQParserPlugin, ResponseBuilderTest, NumericFieldsTest, SpellPossibilityIteratorTest, CollectionsAPIDistributedZkTest, TestInPlaceUpdatesDistrib]
   [junit4] Completed [493/783 (4!)] on J2 in 3261.01s, 1 test, 1 error <<< FAILURES!

[...truncated 987 lines...]
   [junit4] JVM J0: stdout was not empty, see: /x1/jenkins/jenkins-slave/workspace/Lucene-Solr-NightlyTests-7.x/checkout/solr/build/solr-core/test/temp/junit4-J0-20180315_032359_5582097829267728724174.sysout
   [junit4] >>> JVM J0 emitted unexpected output (verbatim) ----
   [junit4] java.lang.OutOfMemoryError: Java heap space
   [junit4] Dumping heap to /x1/jenkins/jenkins-slave/workspace/Lucene-Solr-NightlyTests-7.x/checkout/heapdumps/java_pid12681.hprof ...
   [junit4] Heap dump file created [450683725 bytes in 0.917 secs]
   [junit4] <<< JVM J0: EOF ----

[...truncated 9292 lines...]
BUILD FAILED
/x1/jenkins/jenkins-slave/workspace/Lucene-Solr-NightlyTests-7.x/checkout/build.xml:636: The following error occurred while executing this line:
/x1/jenkins/jenkins-slave/workspace/Lucene-Solr-NightlyTests-7.x/checkout/build.xml:570: Some of the tests produced a heap dump, but did not fail. Maybe a suppressed OutOfMemoryError? Dumps created:
* java_pid12681.hprof

Total time: 273 minutes 59 seconds
Build step 'Invoke Ant' marked build as failure
Archiving artifacts
Recording test results
Email was triggered for: Failure - Any
Sending email for trigger: Failure - Any

Mime
View raw message