lucene-dev mailing list archives

Site index · List index
Message view « Date » · « Thread »
Top « Date » · « Thread »
From Policeman Jenkins Server <jenk...@thetaphi.de>
Subject [JENKINS] Lucene-Solr-master-Windows (64bit/jdk1.8.0_144) - Build # 7232 - Still Unstable!
Date Wed, 21 Mar 2018 10:54:14 GMT
Build: https://jenkins.thetaphi.de/job/Lucene-Solr-master-Windows/7232/
Java: 64bit/jdk1.8.0_144 -XX:-UseCompressedOops -XX:+UseSerialGC

2 tests failed.
FAILED:  org.apache.solr.common.util.TestTimeSource.testEpochTime

Error Message:
SimTimeSource:50.0 time diff=42869200

Stack Trace:
java.lang.AssertionError: SimTimeSource:50.0 time diff=42869200
	at __randomizedtesting.SeedInfo.seed([F88BF72C7688292C:C0E78409E2588B6A]:0)
	at org.junit.Assert.fail(Assert.java:93)
	at org.junit.Assert.assertTrue(Assert.java:43)
	at org.apache.solr.common.util.TestTimeSource.doTestEpochTime(TestTimeSource.java:48)
	at org.apache.solr.common.util.TestTimeSource.testEpochTime(TestTimeSource.java:32)
	at sun.reflect.NativeMethodAccessorImpl.invoke0(Native Method)
	at sun.reflect.NativeMethodAccessorImpl.invoke(NativeMethodAccessorImpl.java:62)
	at sun.reflect.DelegatingMethodAccessorImpl.invoke(DelegatingMethodAccessorImpl.java:43)
	at java.lang.reflect.Method.invoke(Method.java:498)
	at com.carrotsearch.randomizedtesting.RandomizedRunner.invoke(RandomizedRunner.java:1737)
	at com.carrotsearch.randomizedtesting.RandomizedRunner$8.evaluate(RandomizedRunner.java:934)
	at com.carrotsearch.randomizedtesting.RandomizedRunner$9.evaluate(RandomizedRunner.java:970)
	at com.carrotsearch.randomizedtesting.RandomizedRunner$10.evaluate(RandomizedRunner.java:984)
	at com.carrotsearch.randomizedtesting.rules.SystemPropertiesRestoreRule$1.evaluate(SystemPropertiesRestoreRule.java:57)
	at org.apache.lucene.util.TestRuleSetupTeardownChained$1.evaluate(TestRuleSetupTeardownChained.java:49)
	at org.apache.lucene.util.AbstractBeforeAfterRule$1.evaluate(AbstractBeforeAfterRule.java:45)
	at org.apache.lucene.util.TestRuleThreadAndTestName$1.evaluate(TestRuleThreadAndTestName.java:48)
	at org.apache.lucene.util.TestRuleIgnoreAfterMaxFailures$1.evaluate(TestRuleIgnoreAfterMaxFailures.java:64)
	at org.apache.lucene.util.TestRuleMarkFailure$1.evaluate(TestRuleMarkFailure.java:47)
	at com.carrotsearch.randomizedtesting.rules.StatementAdapter.evaluate(StatementAdapter.java:36)
	at com.carrotsearch.randomizedtesting.ThreadLeakControl$StatementRunner.run(ThreadLeakControl.java:368)
	at com.carrotsearch.randomizedtesting.ThreadLeakControl.forkTimeoutingTask(ThreadLeakControl.java:817)
	at com.carrotsearch.randomizedtesting.ThreadLeakControl$3.evaluate(ThreadLeakControl.java:468)
	at com.carrotsearch.randomizedtesting.RandomizedRunner.runSingleTest(RandomizedRunner.java:943)
	at com.carrotsearch.randomizedtesting.RandomizedRunner$5.evaluate(RandomizedRunner.java:829)
	at com.carrotsearch.randomizedtesting.RandomizedRunner$6.evaluate(RandomizedRunner.java:879)
	at com.carrotsearch.randomizedtesting.RandomizedRunner$7.evaluate(RandomizedRunner.java:890)
	at com.carrotsearch.randomizedtesting.rules.StatementAdapter.evaluate(StatementAdapter.java:36)
	at com.carrotsearch.randomizedtesting.rules.SystemPropertiesRestoreRule$1.evaluate(SystemPropertiesRestoreRule.java:57)
	at org.apache.lucene.util.AbstractBeforeAfterRule$1.evaluate(AbstractBeforeAfterRule.java:45)
	at com.carrotsearch.randomizedtesting.rules.StatementAdapter.evaluate(StatementAdapter.java:36)
	at org.apache.lucene.util.TestRuleStoreClassName$1.evaluate(TestRuleStoreClassName.java:41)
	at com.carrotsearch.randomizedtesting.rules.NoShadowingOrOverridesOnMethodsRule$1.evaluate(NoShadowingOrOverridesOnMethodsRule.java:40)
	at com.carrotsearch.randomizedtesting.rules.NoShadowingOrOverridesOnMethodsRule$1.evaluate(NoShadowingOrOverridesOnMethodsRule.java:40)
	at com.carrotsearch.randomizedtesting.rules.StatementAdapter.evaluate(StatementAdapter.java:36)
	at com.carrotsearch.randomizedtesting.rules.StatementAdapter.evaluate(StatementAdapter.java:36)
	at com.carrotsearch.randomizedtesting.rules.StatementAdapter.evaluate(StatementAdapter.java:36)
	at org.apache.lucene.util.TestRuleAssertionsRequired$1.evaluate(TestRuleAssertionsRequired.java:53)
	at org.apache.lucene.util.TestRuleMarkFailure$1.evaluate(TestRuleMarkFailure.java:47)
	at org.apache.lucene.util.TestRuleIgnoreAfterMaxFailures$1.evaluate(TestRuleIgnoreAfterMaxFailures.java:64)
	at org.apache.lucene.util.TestRuleIgnoreTestSuites$1.evaluate(TestRuleIgnoreTestSuites.java:54)
	at com.carrotsearch.randomizedtesting.rules.StatementAdapter.evaluate(StatementAdapter.java:36)
	at com.carrotsearch.randomizedtesting.ThreadLeakControl$StatementRunner.run(ThreadLeakControl.java:368)
	at java.lang.Thread.run(Thread.java:748)


FAILED:  org.apache.solr.common.util.TestTimeSource.testEpochTime

Error Message:
SimTimeSource:50.0 time diff=13557200

Stack Trace:
java.lang.AssertionError: SimTimeSource:50.0 time diff=13557200
	at __randomizedtesting.SeedInfo.seed([F88BF72C7688292C:C0E78409E2588B6A]:0)
	at org.junit.Assert.fail(Assert.java:93)
	at org.junit.Assert.assertTrue(Assert.java:43)
	at org.apache.solr.common.util.TestTimeSource.doTestEpochTime(TestTimeSource.java:48)
	at org.apache.solr.common.util.TestTimeSource.testEpochTime(TestTimeSource.java:32)
	at sun.reflect.NativeMethodAccessorImpl.invoke0(Native Method)
	at sun.reflect.NativeMethodAccessorImpl.invoke(NativeMethodAccessorImpl.java:62)
	at sun.reflect.DelegatingMethodAccessorImpl.invoke(DelegatingMethodAccessorImpl.java:43)
	at java.lang.reflect.Method.invoke(Method.java:498)
	at com.carrotsearch.randomizedtesting.RandomizedRunner.invoke(RandomizedRunner.java:1737)
	at com.carrotsearch.randomizedtesting.RandomizedRunner$8.evaluate(RandomizedRunner.java:934)
	at com.carrotsearch.randomizedtesting.RandomizedRunner$9.evaluate(RandomizedRunner.java:970)
	at com.carrotsearch.randomizedtesting.RandomizedRunner$10.evaluate(RandomizedRunner.java:984)
	at com.carrotsearch.randomizedtesting.rules.SystemPropertiesRestoreRule$1.evaluate(SystemPropertiesRestoreRule.java:57)
	at org.apache.lucene.util.TestRuleSetupTeardownChained$1.evaluate(TestRuleSetupTeardownChained.java:49)
	at org.apache.lucene.util.AbstractBeforeAfterRule$1.evaluate(AbstractBeforeAfterRule.java:45)
	at org.apache.lucene.util.TestRuleThreadAndTestName$1.evaluate(TestRuleThreadAndTestName.java:48)
	at org.apache.lucene.util.TestRuleIgnoreAfterMaxFailures$1.evaluate(TestRuleIgnoreAfterMaxFailures.java:64)
	at org.apache.lucene.util.TestRuleMarkFailure$1.evaluate(TestRuleMarkFailure.java:47)
	at com.carrotsearch.randomizedtesting.rules.StatementAdapter.evaluate(StatementAdapter.java:36)
	at com.carrotsearch.randomizedtesting.ThreadLeakControl$StatementRunner.run(ThreadLeakControl.java:368)
	at com.carrotsearch.randomizedtesting.ThreadLeakControl.forkTimeoutingTask(ThreadLeakControl.java:817)
	at com.carrotsearch.randomizedtesting.ThreadLeakControl$3.evaluate(ThreadLeakControl.java:468)
	at com.carrotsearch.randomizedtesting.RandomizedRunner.runSingleTest(RandomizedRunner.java:943)
	at com.carrotsearch.randomizedtesting.RandomizedRunner$5.evaluate(RandomizedRunner.java:829)
	at com.carrotsearch.randomizedtesting.RandomizedRunner$6.evaluate(RandomizedRunner.java:879)
	at com.carrotsearch.randomizedtesting.RandomizedRunner$7.evaluate(RandomizedRunner.java:890)
	at com.carrotsearch.randomizedtesting.rules.StatementAdapter.evaluate(StatementAdapter.java:36)
	at com.carrotsearch.randomizedtesting.rules.SystemPropertiesRestoreRule$1.evaluate(SystemPropertiesRestoreRule.java:57)
	at org.apache.lucene.util.AbstractBeforeAfterRule$1.evaluate(AbstractBeforeAfterRule.java:45)
	at com.carrotsearch.randomizedtesting.rules.StatementAdapter.evaluate(StatementAdapter.java:36)
	at org.apache.lucene.util.TestRuleStoreClassName$1.evaluate(TestRuleStoreClassName.java:41)
	at com.carrotsearch.randomizedtesting.rules.NoShadowingOrOverridesOnMethodsRule$1.evaluate(NoShadowingOrOverridesOnMethodsRule.java:40)
	at com.carrotsearch.randomizedtesting.rules.NoShadowingOrOverridesOnMethodsRule$1.evaluate(NoShadowingOrOverridesOnMethodsRule.java:40)
	at com.carrotsearch.randomizedtesting.rules.StatementAdapter.evaluate(StatementAdapter.java:36)
	at com.carrotsearch.randomizedtesting.rules.StatementAdapter.evaluate(StatementAdapter.java:36)
	at com.carrotsearch.randomizedtesting.rules.StatementAdapter.evaluate(StatementAdapter.java:36)
	at org.apache.lucene.util.TestRuleAssertionsRequired$1.evaluate(TestRuleAssertionsRequired.java:53)
	at org.apache.lucene.util.TestRuleMarkFailure$1.evaluate(TestRuleMarkFailure.java:47)
	at org.apache.lucene.util.TestRuleIgnoreAfterMaxFailures$1.evaluate(TestRuleIgnoreAfterMaxFailures.java:64)
	at org.apache.lucene.util.TestRuleIgnoreTestSuites$1.evaluate(TestRuleIgnoreTestSuites.java:54)
	at com.carrotsearch.randomizedtesting.rules.StatementAdapter.evaluate(StatementAdapter.java:36)
	at com.carrotsearch.randomizedtesting.ThreadLeakControl$StatementRunner.run(ThreadLeakControl.java:368)
	at java.lang.Thread.run(Thread.java:748)




Build Log:
[...truncated 1855 lines...]
   [junit4] JVM J1: stdout was not empty, see: C:\Users\jenkins\workspace\Lucene-Solr-master-Windows\lucene\build\core\test\temp\junit4-J1-20180321_091054_7554638880443250505572.sysout
   [junit4] >>> JVM J1 emitted unexpected output (verbatim) ----
   [junit4] codec: Asserting, pf: FST50, dvf: Asserting
   [junit4] <<< JVM J1: EOF ----

[...truncated 13890 lines...]
   [junit4] Suite: org.apache.solr.common.util.TestTimeSource
   [junit4]   2> 219001 INFO  (SUITE-TestTimeSource-seed#[F88BF72C7688292C]-worker) [ 
  ] o.a.s.SolrTestCaseJ4 SecureRandom sanity checks: test.solr.allowed.securerandom=null &
java.security.egd=file:/dev/./urandom
   [junit4]   2> Creating dataDir: C:\Users\jenkins\workspace\Lucene-Solr-master-Windows\solr\build\solr-solrj\test\J0\temp\solr.common.util.TestTimeSource_F88BF72C7688292C-001\init-core-data-001
   [junit4]   2> 219002 WARN  (SUITE-TestTimeSource-seed#[F88BF72C7688292C]-worker) [ 
  ] o.a.s.SolrTestCaseJ4 startTrackingSearchers: numOpens=15 numCloses=15
   [junit4]   2> 219002 INFO  (SUITE-TestTimeSource-seed#[F88BF72C7688292C]-worker) [ 
  ] o.a.s.SolrTestCaseJ4 Using PointFields (NUMERIC_POINTS_SYSPROP=true) w/NUMERIC_DOCVALUES_SYSPROP=false
   [junit4]   2> 219005 INFO  (SUITE-TestTimeSource-seed#[F88BF72C7688292C]-worker) [ 
  ] o.a.s.SolrTestCaseJ4 Randomized ssl (false) and clientAuth (false) via: @org.apache.solr.util.RandomizeSSL(reason=,
value=NaN, ssl=NaN, clientAuth=NaN)
   [junit4]   2> 219006 INFO  (TEST-TestTimeSource.testEpochTime-seed#[F88BF72C7688292C])
[    ] o.a.s.SolrTestCaseJ4 ###Starting testEpochTime
   [junit4]   2> 229031 INFO  (TEST-TestTimeSource.testEpochTime-seed#[F88BF72C7688292C])
[    ] o.a.s.SolrTestCaseJ4 ###Ending testEpochTime
   [junit4]   2> NOTE: reproduce with: ant test  -Dtestcase=TestTimeSource -Dtests.method=testEpochTime
-Dtests.seed=F88BF72C7688292C -Dtests.slow=true -Dtests.locale=uk-UA -Dtests.timezone=Africa/Kigali
-Dtests.asserts=true -Dtests.file.encoding=Cp1252
   [junit4] FAILURE 10.0s J0 | TestTimeSource.testEpochTime <<<
   [junit4]    > Throwable #1: java.lang.AssertionError: SimTimeSource:50.0 time diff=13557200
   [junit4]    > 	at __randomizedtesting.SeedInfo.seed([F88BF72C7688292C:C0E78409E2588B6A]:0)
   [junit4]    > 	at org.apache.solr.common.util.TestTimeSource.doTestEpochTime(TestTimeSource.java:48)
   [junit4]    > 	at org.apache.solr.common.util.TestTimeSource.testEpochTime(TestTimeSource.java:32)
   [junit4]    > 	at java.lang.Thread.run(Thread.java:748)
   [junit4]   2> NOTE: leaving temporary files on disk at: C:\Users\jenkins\workspace\Lucene-Solr-master-Windows\solr\build\solr-solrj\test\J0\temp\solr.common.util.TestTimeSource_F88BF72C7688292C-001
   [junit4]   2> NOTE: test params are: codec=Asserting(Lucene70): {}, docValues:{}, maxPointsInLeafNode=1875,
maxMBSortInHeap=6.859846451558684, sim=Asserting(org.apache.lucene.search.similarities.AssertingSimilarity@1af560b5),
locale=uk-UA, timezone=Africa/Kigali
   [junit4]   2> NOTE: Windows 10 10.0 amd64/Oracle Corporation 1.8.0_144 (64-bit)/cpus=3,threads=1,free=30534568,total=208289792
   [junit4]   2> NOTE: All tests run in this JVM: [NamedListTest, TestDelegationTokenResponse,
TestEmbeddedSolrServer, TestJsonRecordReader, TestSolrProperties, TestRetryUtil, ModifiableSolrParamsTest,
TestHash, TestV1toV2ApiMapper, TestUpdateRequestCodec, HyperbolicSineEvaluatorTest, TestDelegationTokenRequest,
TestLBHttpSolrClient, UsingSolrJRefGuideExamplesTest, TestXMLEscaping, CumulativeProbabilityEvaluatorTest,
NormalDistributionEvaluatorTest, HttpSolrClientBuilderTest, TestCloudSolrClientConnections,
TestSpellCheckResponse, CloudSolrClientBuilderTest, EmpiricalDistributionEvaluatorTest, ReverseEvaluatorTest,
TermsResponseTest, SelectWithEvaluatorsTest, GreaterThanEvaluatorTest, HttpSolrClientSSLAuthConPoolTest,
LengthEvaluatorTest, StreamExpressionToExpessionTest, TestJavaBinCodec, TestBatchUpdate, NotEvaluatorTest,
SubtractEvaluatorTest, ExclusiveOrEvaluatorTest, SineEvaluatorTest, TestToleratedUpdateError,
SolrExampleStreamingTest, SolrExampleJettyTest, SolrExampleEmbeddedTest, TestNamedListCodec,
TestDocumentObjectBinder, TestFastInputStream, SolrDocumentTest, FieldAnalysisResponseTest,
GetByIdTest, TestPolicy, BasicHttpSolrClientTest, ConcurrentUpdateSolrClientBuilderTest, HttpSolrClientConPoolTest,
LBHttpSolrClientBuilderTest, GraphExpressionTest, GraphTest, JdbcTest, JDBCStreamTest, StreamExpressionToExplanationTest,
StreamingTest, AddEvaluatorTest, AndEvaluatorTest, AppendEvaluatorTest, ArcSineEvaluatorTest,
ArcTangentEvaluatorTest, ArrayEvaluatorTest, AscEvaluatorTest, CeilingEvaluatorTest, CoalesceEvaluatorTest,
CorrelationEvaluatorTest, CosineEvaluatorTest, CubedRootEvaluatorTest, FieldValueEvaluatorTest,
FloorEvaluatorTest, HyperbolicTangentEvaluatorTest, LessThanEvaluatorTest, MultiplyEvaluatorTest,
OrEvaluatorTest, PowerEvaluatorTest, RecursiveEvaluatorTest, RegressionEvaluatorTest, SquareRootEvaluatorTest,
TangentEvaluatorTest, UniformDistributionEvaluatorTest, UuidEvaluatorTest, StreamExpressionParserTest,
ConcatOperationTest, SchemaTest, TestCollectionAdminRequest, TestConfigSetAdminRequest, NoOpResponseParserTest,
TestClusteringResponse, TestSuggesterResponse, SolrZkClientTest, TestCollectionStateWatchers,
CommonAdminParamsTest, ShardParamsTest, TestTimeSource]
   [junit4] Completed [144/147 (1!)] on J0 in 10.05s, 1 test, 1 failure <<< FAILURES!

[...truncated 48607 lines...]
[repro] Jenkins log URL: https://jenkins.thetaphi.de/job/Lucene-Solr-master-Windows/7232/consoleText

[repro] Revision: d4e69c5cd868d0f5b71da0f4b23c2cd61d1b0ea0

[repro] Ant options: "-Dargs=-XX:-UseCompressedOops -XX:+UseSerialGC"

[repro] ant clean

[...truncated 6 lines...]
[repro] Test suites by module:
[repro]    solr\solrj
[repro]       TestTimeSource
[repro] ant compile-test

[...truncated 2467 lines...]
[repro] ant test-nocompile -Dtests.dups=5 -Dtests.maxfailures=5 -Dtests.class="*.TestTimeSource"
-Dtests.showOutput=onerror "-Dargs=-XX:-UseCompressedOops -XX:+UseSerialGC" -Dtests.seed=F88BF72C7688292C
-Dtests.slow=true -Dtests.locale=uk-UA -Dtests.timezone=Africa/Kigali -Dtests.asserts=true
-Dtests.file.encoding=Cp1252

[...truncated 32 lines...]
   [junit4] Suite: org.apache.solr.common.util.TestTimeSource
   [junit4]   2> SLF4J: Class path contains multiple SLF4J bindings.
   [junit4]   2> SLF4J: Found binding in [jar:file:/C:/Users/jenkins/workspace/Lucene-Solr-master-Windows/solr/solrj/test-lib/slf4j-log4j12-1.7.24.jar!/org/slf4j/impl/StaticLoggerBinder.class]
   [junit4]   2> SLF4J: Found binding in [jar:file:/C:/Users/jenkins/workspace/Lucene-Solr-master-Windows/solr/core/lib/slf4j-log4j12-1.7.24.jar!/org/slf4j/impl/StaticLoggerBinder.class]
   [junit4]   2> SLF4J: See http://www.slf4j.org/codes.html#multiple_bindings for an explanation.
   [junit4]   2> SLF4J: Actual binding is of type [org.slf4j.impl.Log4jLoggerFactory]
   [junit4]   2> 0    INFO  (SUITE-TestTimeSource-seed#[F88BF72C7688292C]-worker) [   
] o.a.s.SolrTestCaseJ4 SecureRandom sanity checks: test.solr.allowed.securerandom=null &
java.security.egd=file:/dev/./urandom
   [junit4]   2> Creating dataDir: C:\Users\jenkins\workspace\Lucene-Solr-master-Windows\solr\build\solr-solrj\test\J0\temp\solr.common.util.TestTimeSource_F88BF72C7688292C-001\init-core-data-001
   [junit4]   2> 354  INFO  (SUITE-TestTimeSource-seed#[F88BF72C7688292C]-worker) [   
] o.a.s.SolrTestCaseJ4 Using PointFields (NUMERIC_POINTS_SYSPROP=true) w/NUMERIC_DOCVALUES_SYSPROP=false
   [junit4]   2> 488  INFO  (SUITE-TestTimeSource-seed#[F88BF72C7688292C]-worker) [   
] o.e.j.u.log Logging initialized @8732ms to org.eclipse.jetty.util.log.Slf4jLog
   [junit4]   2> 499  INFO  (SUITE-TestTimeSource-seed#[F88BF72C7688292C]-worker) [   
] o.a.s.SolrTestCaseJ4 Randomized ssl (false) and clientAuth (false) via: @org.apache.solr.util.RandomizeSSL(reason=,
value=NaN, ssl=NaN, clientAuth=NaN)
   [junit4]   2> 540  INFO  (TEST-TestTimeSource.testEpochTime-seed#[F88BF72C7688292C])
[    ] o.a.s.SolrTestCaseJ4 ###Starting testEpochTime
   [junit4]   2> 10568 INFO  (TEST-TestTimeSource.testEpochTime-seed#[F88BF72C7688292C])
[    ] o.a.s.SolrTestCaseJ4 ###Ending testEpochTime
   [junit4]   2> NOTE: reproduce with: ant test  -Dtestcase=TestTimeSource -Dtests.method=testEpochTime
-Dtests.seed=F88BF72C7688292C -Dtests.slow=true -Dtests.badapples=true -Dtests.locale=uk-UA
-Dtests.timezone=Africa/Kigali -Dtests.asserts=true -Dtests.file.encoding=Cp1252
   [junit4] FAILURE 10.1s J0 | TestTimeSource.testEpochTime <<<
   [junit4]    > Throwable #1: java.lang.AssertionError: SimTimeSource:50.0 time diff=42869200
   [junit4]    > 	at __randomizedtesting.SeedInfo.seed([F88BF72C7688292C:C0E78409E2588B6A]:0)
   [junit4]    > 	at org.apache.solr.common.util.TestTimeSource.doTestEpochTime(TestTimeSource.java:48)
   [junit4]    > 	at org.apache.solr.common.util.TestTimeSource.testEpochTime(TestTimeSource.java:32)
   [junit4]    > 	at java.lang.Thread.run(Thread.java:748)
   [junit4]   2> NOTE: leaving temporary files on disk at: C:\Users\jenkins\workspace\Lucene-Solr-master-Windows\solr\build\solr-solrj\test\J0\temp\solr.common.util.TestTimeSource_F88BF72C7688292C-001
   [junit4]   2> NOTE: test params are: codec=Asserting(Lucene70): {}, docValues:{}, maxPointsInLeafNode=1875,
maxMBSortInHeap=6.859846451558684, sim=Asserting(org.apache.lucene.search.similarities.AssertingSimilarity@6e87da42),
locale=uk-UA, timezone=Africa/Kigali
   [junit4]   2> NOTE: Windows 10 10.0 amd64/Oracle Corporation 1.8.0_144 (64-bit)/cpus=3,threads=1,free=65230936,total=97320960
   [junit4]   2> NOTE: All tests run in this JVM: [TestTimeSource]
   [junit4] Completed [1/5 (1!)] on J0 in 17.58s, 1 test, 1 failure <<< FAILURES!

[...truncated 27 lines...]
BUILD FAILED
C:\Users\jenkins\workspace\Lucene-Solr-master-Windows\lucene\common-build.xml:1561: The following
error occurred while executing this line:
C:\Users\jenkins\workspace\Lucene-Solr-master-Windows\lucene\common-build.xml:1085: There
were test failures: 5 suites, 5 tests, 1 failure [seed: F88BF72C7688292C]

Total time: 40 seconds

[repro] Setting last failure code to 1

[repro] Failures:
[repro]   1/5 failed: org.apache.solr.common.util.TestTimeSource
[repro] Exiting with code 1

C:\Users\jenkins\workspace\Lucene-Solr-master-Windows>IF EXIST lucene\build move /y lucene\build
lucene\build.repro 
        1 dir(s) moved.

C:\Users\jenkins\workspace\Lucene-Solr-master-Windows>IF EXIST solr\build move /y solr\build
solr\build.repro 
        1 dir(s) moved.

C:\Users\jenkins\workspace\Lucene-Solr-master-Windows>IF EXIST lucene\build.orig move /y
lucene\build.orig lucene\build 
        1 dir(s) moved.

C:\Users\jenkins\workspace\Lucene-Solr-master-Windows>IF EXIST solr\build.orig move /y
solr\build.orig solr\build 
        1 dir(s) moved.

C:\Users\jenkins\workspace\Lucene-Solr-master-Windows>exit 0 
Archiving artifacts
Setting ANT_1_8_2_HOME=C:\Users\jenkins\tools\hudson.tasks.Ant_AntInstallation\ANT_1.8.2
[WARNINGS] Parsing warnings in console log with parser Java Compiler (javac)
Setting ANT_1_8_2_HOME=C:\Users\jenkins\tools\hudson.tasks.Ant_AntInstallation\ANT_1.8.2
Setting ANT_1_8_2_HOME=C:\Users\jenkins\tools\hudson.tasks.Ant_AntInstallation\ANT_1.8.2
<Git Blamer> Using GitBlamer to create author and commit information for all warnings.
<Git Blamer> GIT_COMMIT=d4e69c5cd868d0f5b71da0f4b23c2cd61d1b0ea0, workspace=C:\Users\jenkins\workspace\Lucene-Solr-master-Windows
[WARNINGS] Computing warning deltas based on reference build #7231
Recording test results
Setting ANT_1_8_2_HOME=C:\Users\jenkins\tools\hudson.tasks.Ant_AntInstallation\ANT_1.8.2
Build step 'Publish JUnit test result report' changed build result to UNSTABLE
Email was triggered for: Unstable (Test Failures)
Sending email for trigger: Unstable (Test Failures)
Setting ANT_1_8_2_HOME=C:\Users\jenkins\tools\hudson.tasks.Ant_AntInstallation\ANT_1.8.2
Setting ANT_1_8_2_HOME=C:\Users\jenkins\tools\hudson.tasks.Ant_AntInstallation\ANT_1.8.2
Setting ANT_1_8_2_HOME=C:\Users\jenkins\tools\hudson.tasks.Ant_AntInstallation\ANT_1.8.2
Setting ANT_1_8_2_HOME=C:\Users\jenkins\tools\hudson.tasks.Ant_AntInstallation\ANT_1.8.2

Mime
View raw message