lucene-dev mailing list archives

Site index · List index
Message view « Date » · « Thread »
Top « Date » · « Thread »
From Policeman Jenkins Server <jenk...@thetaphi.de>
Subject [JENKINS] Lucene-Solr-7.x-Windows (32bit/jdk1.8.0_144) - Build # 497 - Still Unstable!
Date Sun, 11 Mar 2018 11:21:39 GMT
Build: https://jenkins.thetaphi.de/job/Lucene-Solr-7.x-Windows/497/
Java: 32bit/jdk1.8.0_144 -server -XX:+UseSerialGC

9 tests failed.
FAILED:  org.apache.solr.cloud.ChaosMonkeyNothingIsSafeTest.test

Error Message:
Timeout occured while waiting response from server at: http://127.0.0.1:51953/collection1

Stack Trace:
org.apache.solr.client.solrj.SolrServerException: Timeout occured while waiting response from server at: http://127.0.0.1:51953/collection1
	at __randomizedtesting.SeedInfo.seed([74D23F9805C08E60:FC860042AB3CE398]:0)
	at org.apache.solr.client.solrj.impl.HttpSolrClient.executeMethod(HttpSolrClient.java:654)
	at org.apache.solr.client.solrj.impl.HttpSolrClient.request(HttpSolrClient.java:255)
	at org.apache.solr.client.solrj.impl.HttpSolrClient.request(HttpSolrClient.java:244)
	at org.apache.solr.client.solrj.impl.LBHttpSolrClient.doRequest(LBHttpSolrClient.java:483)
	at org.apache.solr.client.solrj.impl.LBHttpSolrClient.request(LBHttpSolrClient.java:413)
	at org.apache.solr.client.solrj.impl.CloudSolrClient.sendRequest(CloudSolrClient.java:1105)
	at org.apache.solr.client.solrj.impl.CloudSolrClient.requestWithRetryOnStaleState(CloudSolrClient.java:885)
	at org.apache.solr.client.solrj.impl.CloudSolrClient.request(CloudSolrClient.java:818)
	at org.apache.solr.client.solrj.SolrRequest.process(SolrRequest.java:194)
	at org.apache.solr.client.solrj.SolrClient.commit(SolrClient.java:484)
	at org.apache.solr.client.solrj.SolrClient.commit(SolrClient.java:463)
	at org.apache.solr.cloud.AbstractFullDistribZkTestBase.commit(AbstractFullDistribZkTestBase.java:1591)
	at org.apache.solr.cloud.ChaosMonkeyNothingIsSafeTest.test(ChaosMonkeyNothingIsSafeTest.java:212)
	at sun.reflect.NativeMethodAccessorImpl.invoke0(Native Method)
	at sun.reflect.NativeMethodAccessorImpl.invoke(NativeMethodAccessorImpl.java:62)
	at sun.reflect.DelegatingMethodAccessorImpl.invoke(DelegatingMethodAccessorImpl.java:43)
	at java.lang.reflect.Method.invoke(Method.java:498)
	at com.carrotsearch.randomizedtesting.RandomizedRunner.invoke(RandomizedRunner.java:1737)
	at com.carrotsearch.randomizedtesting.RandomizedRunner$8.evaluate(RandomizedRunner.java:934)
	at com.carrotsearch.randomizedtesting.RandomizedRunner$9.evaluate(RandomizedRunner.java:970)
	at com.carrotsearch.randomizedtesting.RandomizedRunner$10.evaluate(RandomizedRunner.java:984)
	at org.apache.solr.BaseDistributedSearchTestCase$ShardsRepeatRule$ShardsFixedStatement.callStatement(BaseDistributedSearchTestCase.java:993)
	at org.apache.solr.BaseDistributedSearchTestCase$ShardsRepeatRule$ShardsStatement.evaluate(BaseDistributedSearchTestCase.java:968)
	at com.carrotsearch.randomizedtesting.rules.SystemPropertiesRestoreRule$1.evaluate(SystemPropertiesRestoreRule.java:57)
	at org.apache.lucene.util.TestRuleSetupTeardownChained$1.evaluate(TestRuleSetupTeardownChained.java:49)
	at org.apache.lucene.util.AbstractBeforeAfterRule$1.evaluate(AbstractBeforeAfterRule.java:45)
	at org.apache.lucene.util.TestRuleThreadAndTestName$1.evaluate(TestRuleThreadAndTestName.java:48)
	at org.apache.lucene.util.TestRuleIgnoreAfterMaxFailures$1.evaluate(TestRuleIgnoreAfterMaxFailures.java:64)
	at org.apache.lucene.util.TestRuleMarkFailure$1.evaluate(TestRuleMarkFailure.java:47)
	at com.carrotsearch.randomizedtesting.rules.StatementAdapter.evaluate(StatementAdapter.java:36)
	at com.carrotsearch.randomizedtesting.ThreadLeakControl$StatementRunner.run(ThreadLeakControl.java:368)
	at com.carrotsearch.randomizedtesting.ThreadLeakControl.forkTimeoutingTask(ThreadLeakControl.java:817)
	at com.carrotsearch.randomizedtesting.ThreadLeakControl$3.evaluate(ThreadLeakControl.java:468)
	at com.carrotsearch.randomizedtesting.RandomizedRunner.runSingleTest(RandomizedRunner.java:943)
	at com.carrotsearch.randomizedtesting.RandomizedRunner$5.evaluate(RandomizedRunner.java:829)
	at com.carrotsearch.randomizedtesting.RandomizedRunner$6.evaluate(RandomizedRunner.java:879)
	at com.carrotsearch.randomizedtesting.RandomizedRunner$7.evaluate(RandomizedRunner.java:890)
	at com.carrotsearch.randomizedtesting.rules.StatementAdapter.evaluate(StatementAdapter.java:36)
	at com.carrotsearch.randomizedtesting.rules.SystemPropertiesRestoreRule$1.evaluate(SystemPropertiesRestoreRule.java:57)
	at org.apache.lucene.util.AbstractBeforeAfterRule$1.evaluate(AbstractBeforeAfterRule.java:45)
	at com.carrotsearch.randomizedtesting.rules.StatementAdapter.evaluate(StatementAdapter.java:36)
	at org.apache.lucene.util.TestRuleStoreClassName$1.evaluate(TestRuleStoreClassName.java:41)
	at com.carrotsearch.randomizedtesting.rules.NoShadowingOrOverridesOnMethodsRule$1.evaluate(NoShadowingOrOverridesOnMethodsRule.java:40)
	at com.carrotsearch.randomizedtesting.rules.NoShadowingOrOverridesOnMethodsRule$1.evaluate(NoShadowingOrOverridesOnMethodsRule.java:40)
	at com.carrotsearch.randomizedtesting.rules.StatementAdapter.evaluate(StatementAdapter.java:36)
	at com.carrotsearch.randomizedtesting.rules.StatementAdapter.evaluate(StatementAdapter.java:36)
	at com.carrotsearch.randomizedtesting.rules.StatementAdapter.evaluate(StatementAdapter.java:36)
	at org.apache.lucene.util.TestRuleAssertionsRequired$1.evaluate(TestRuleAssertionsRequired.java:53)
	at org.apache.lucene.util.TestRuleMarkFailure$1.evaluate(TestRuleMarkFailure.java:47)
	at org.apache.lucene.util.TestRuleIgnoreAfterMaxFailures$1.evaluate(TestRuleIgnoreAfterMaxFailures.java:64)
	at org.apache.lucene.util.TestRuleIgnoreTestSuites$1.evaluate(TestRuleIgnoreTestSuites.java:54)
	at com.carrotsearch.randomizedtesting.rules.StatementAdapter.evaluate(StatementAdapter.java:36)
	at com.carrotsearch.randomizedtesting.ThreadLeakControl$StatementRunner.run(ThreadLeakControl.java:368)
	at java.lang.Thread.run(Thread.java:748)
Caused by: java.net.SocketTimeoutException: Read timed out
	at java.net.SocketInputStream.socketRead0(Native Method)
	at java.net.SocketInputStream.socketRead(SocketInputStream.java:116)
	at java.net.SocketInputStream.read(SocketInputStream.java:171)
	at java.net.SocketInputStream.read(SocketInputStream.java:141)
	at org.apache.http.impl.io.SessionInputBufferImpl.streamRead(SessionInputBufferImpl.java:137)
	at org.apache.http.impl.io.SessionInputBufferImpl.fillBuffer(SessionInputBufferImpl.java:153)
	at org.apache.http.impl.io.SessionInputBufferImpl.readLine(SessionInputBufferImpl.java:282)
	at org.apache.http.impl.conn.DefaultHttpResponseParser.parseHead(DefaultHttpResponseParser.java:138)
	at org.apache.http.impl.conn.DefaultHttpResponseParser.parseHead(DefaultHttpResponseParser.java:56)
	at org.apache.http.impl.io.AbstractMessageParser.parse(AbstractMessageParser.java:259)
	at org.apache.http.impl.DefaultBHttpClientConnection.receiveResponseHeader(DefaultBHttpClientConnection.java:163)
	at org.apache.http.impl.conn.CPoolProxy.receiveResponseHeader(CPoolProxy.java:165)
	at org.apache.http.protocol.HttpRequestExecutor.doReceiveResponse(HttpRequestExecutor.java:273)
	at org.apache.http.protocol.HttpRequestExecutor.execute(HttpRequestExecutor.java:125)
	at org.apache.http.impl.execchain.MainClientExec.execute(MainClientExec.java:272)
	at org.apache.http.impl.execchain.ProtocolExec.execute(ProtocolExec.java:185)
	at org.apache.http.impl.execchain.RetryExec.execute(RetryExec.java:89)
	at org.apache.http.impl.execchain.RedirectExec.execute(RedirectExec.java:111)
	at org.apache.http.impl.client.InternalHttpClient.doExecute(InternalHttpClient.java:185)
	at org.apache.http.impl.client.CloseableHttpClient.execute(CloseableHttpClient.java:83)
	at org.apache.http.impl.client.CloseableHttpClient.execute(CloseableHttpClient.java:56)
	at org.apache.solr.client.solrj.impl.HttpSolrClient.executeMethod(HttpSolrClient.java:542)
	... 53 more


FAILED:  junit.framework.TestSuite.org.apache.solr.cloud.ChaosMonkeyNothingIsSafeTest

Error Message:
4 threads leaked from SUITE scope at org.apache.solr.cloud.ChaosMonkeyNothingIsSafeTest:     1) Thread[id=114, name=Connection evictor, state=TIMED_WAITING, group=TGRP-ChaosMonkeyNothingIsSafeTest]         at java.lang.Thread.sleep(Native Method)         at org.apache.http.impl.client.IdleConnectionEvictor$1.run(IdleConnectionEvictor.java:66)         at java.lang.Thread.run(Thread.java:748)    2) Thread[id=116, name=TEST-ChaosMonkeyNothingIsSafeTest.test-seed#[74D23F9805C08E60]-EventThread, state=WAITING, group=TGRP-ChaosMonkeyNothingIsSafeTest]         at sun.misc.Unsafe.park(Native Method)         at java.util.concurrent.locks.LockSupport.park(LockSupport.java:175)         at java.util.concurrent.locks.AbstractQueuedSynchronizer$ConditionObject.await(AbstractQueuedSynchronizer.java:2039)         at java.util.concurrent.LinkedBlockingQueue.take(LinkedBlockingQueue.java:442)         at org.apache.zookeeper.ClientCnxn$EventThread.run(ClientCnxn.java:502)    3) Thread[id=115, name=TEST-ChaosMonkeyNothingIsSafeTest.test-seed#[74D23F9805C08E60]-SendThread(127.0.0.1:51860), state=TIMED_WAITING, group=TGRP-ChaosMonkeyNothingIsSafeTest]         at java.lang.Thread.sleep(Native Method)         at org.apache.zookeeper.client.StaticHostProvider.next(StaticHostProvider.java:105)         at org.apache.zookeeper.ClientCnxn$SendThread.startConnect(ClientCnxn.java:1000)         at org.apache.zookeeper.ClientCnxn$SendThread.run(ClientCnxn.java:1063)    4) Thread[id=117, name=zkConnectionManagerCallback-25-thread-1, state=WAITING, group=TGRP-ChaosMonkeyNothingIsSafeTest]         at sun.misc.Unsafe.park(Native Method)         at java.util.concurrent.locks.LockSupport.park(LockSupport.java:175)         at java.util.concurrent.locks.AbstractQueuedSynchronizer$ConditionObject.await(AbstractQueuedSynchronizer.java:2039)         at java.util.concurrent.LinkedBlockingQueue.take(LinkedBlockingQueue.java:442)         at java.util.concurrent.ThreadPoolExecutor.getTask(ThreadPoolExecutor.java:1074)         at java.util.concurrent.ThreadPoolExecutor.runWorker(ThreadPoolExecutor.java:1134)         at java.util.concurrent.ThreadPoolExecutor$Worker.run(ThreadPoolExecutor.java:624)         at java.lang.Thread.run(Thread.java:748)

Stack Trace:
com.carrotsearch.randomizedtesting.ThreadLeakError: 4 threads leaked from SUITE scope at org.apache.solr.cloud.ChaosMonkeyNothingIsSafeTest: 
   1) Thread[id=114, name=Connection evictor, state=TIMED_WAITING, group=TGRP-ChaosMonkeyNothingIsSafeTest]
        at java.lang.Thread.sleep(Native Method)
        at org.apache.http.impl.client.IdleConnectionEvictor$1.run(IdleConnectionEvictor.java:66)
        at java.lang.Thread.run(Thread.java:748)
   2) Thread[id=116, name=TEST-ChaosMonkeyNothingIsSafeTest.test-seed#[74D23F9805C08E60]-EventThread, state=WAITING, group=TGRP-ChaosMonkeyNothingIsSafeTest]
        at sun.misc.Unsafe.park(Native Method)
        at java.util.concurrent.locks.LockSupport.park(LockSupport.java:175)
        at java.util.concurrent.locks.AbstractQueuedSynchronizer$ConditionObject.await(AbstractQueuedSynchronizer.java:2039)
        at java.util.concurrent.LinkedBlockingQueue.take(LinkedBlockingQueue.java:442)
        at org.apache.zookeeper.ClientCnxn$EventThread.run(ClientCnxn.java:502)
   3) Thread[id=115, name=TEST-ChaosMonkeyNothingIsSafeTest.test-seed#[74D23F9805C08E60]-SendThread(127.0.0.1:51860), state=TIMED_WAITING, group=TGRP-ChaosMonkeyNothingIsSafeTest]
        at java.lang.Thread.sleep(Native Method)
        at org.apache.zookeeper.client.StaticHostProvider.next(StaticHostProvider.java:105)
        at org.apache.zookeeper.ClientCnxn$SendThread.startConnect(ClientCnxn.java:1000)
        at org.apache.zookeeper.ClientCnxn$SendThread.run(ClientCnxn.java:1063)
   4) Thread[id=117, name=zkConnectionManagerCallback-25-thread-1, state=WAITING, group=TGRP-ChaosMonkeyNothingIsSafeTest]
        at sun.misc.Unsafe.park(Native Method)
        at java.util.concurrent.locks.LockSupport.park(LockSupport.java:175)
        at java.util.concurrent.locks.AbstractQueuedSynchronizer$ConditionObject.await(AbstractQueuedSynchronizer.java:2039)
        at java.util.concurrent.LinkedBlockingQueue.take(LinkedBlockingQueue.java:442)
        at java.util.concurrent.ThreadPoolExecutor.getTask(ThreadPoolExecutor.java:1074)
        at java.util.concurrent.ThreadPoolExecutor.runWorker(ThreadPoolExecutor.java:1134)
        at java.util.concurrent.ThreadPoolExecutor$Worker.run(ThreadPoolExecutor.java:624)
        at java.lang.Thread.run(Thread.java:748)
	at __randomizedtesting.SeedInfo.seed([74D23F9805C08E60]:0)


FAILED:  junit.framework.TestSuite.org.apache.solr.cloud.ChaosMonkeyNothingIsSafeTest

Error Message:
There are still zombie threads that couldn't be terminated:    1) Thread[id=115, name=TEST-ChaosMonkeyNothingIsSafeTest.test-seed#[74D23F9805C08E60]-SendThread(127.0.0.1:51860), state=TIMED_WAITING, group=TGRP-ChaosMonkeyNothingIsSafeTest]         at java.lang.Thread.sleep(Native Method)         at org.apache.zookeeper.ClientCnxn$SendThread.run(ClientCnxn.java:1054)    2) Thread[id=117, name=zkConnectionManagerCallback-25-thread-1, state=WAITING, group=TGRP-ChaosMonkeyNothingIsSafeTest]         at sun.misc.Unsafe.park(Native Method)         at java.util.concurrent.locks.LockSupport.park(LockSupport.java:175)         at java.util.concurrent.locks.AbstractQueuedSynchronizer$ConditionObject.await(AbstractQueuedSynchronizer.java:2039)         at java.util.concurrent.LinkedBlockingQueue.take(LinkedBlockingQueue.java:442)         at java.util.concurrent.ThreadPoolExecutor.getTask(ThreadPoolExecutor.java:1074)         at java.util.concurrent.ThreadPoolExecutor.runWorker(ThreadPoolExecutor.java:1134)         at java.util.concurrent.ThreadPoolExecutor$Worker.run(ThreadPoolExecutor.java:624)         at java.lang.Thread.run(Thread.java:748)

Stack Trace:
com.carrotsearch.randomizedtesting.ThreadLeakError: There are still zombie threads that couldn't be terminated:
   1) Thread[id=115, name=TEST-ChaosMonkeyNothingIsSafeTest.test-seed#[74D23F9805C08E60]-SendThread(127.0.0.1:51860), state=TIMED_WAITING, group=TGRP-ChaosMonkeyNothingIsSafeTest]
        at java.lang.Thread.sleep(Native Method)
        at org.apache.zookeeper.ClientCnxn$SendThread.run(ClientCnxn.java:1054)
   2) Thread[id=117, name=zkConnectionManagerCallback-25-thread-1, state=WAITING, group=TGRP-ChaosMonkeyNothingIsSafeTest]
        at sun.misc.Unsafe.park(Native Method)
        at java.util.concurrent.locks.LockSupport.park(LockSupport.java:175)
        at java.util.concurrent.locks.AbstractQueuedSynchronizer$ConditionObject.await(AbstractQueuedSynchronizer.java:2039)
        at java.util.concurrent.LinkedBlockingQueue.take(LinkedBlockingQueue.java:442)
        at java.util.concurrent.ThreadPoolExecutor.getTask(ThreadPoolExecutor.java:1074)
        at java.util.concurrent.ThreadPoolExecutor.runWorker(ThreadPoolExecutor.java:1134)
        at java.util.concurrent.ThreadPoolExecutor$Worker.run(ThreadPoolExecutor.java:624)
        at java.lang.Thread.run(Thread.java:748)
	at __randomizedtesting.SeedInfo.seed([74D23F9805C08E60]:0)


FAILED:  org.apache.solr.cloud.ChaosMonkeyNothingIsSafeTest.test

Error Message:
Timeout occured while waiting response from server at: http://127.0.0.1:51969/collection1

Stack Trace:
org.apache.solr.client.solrj.SolrServerException: Timeout occured while waiting response from server at: http://127.0.0.1:51969/collection1
	at __randomizedtesting.SeedInfo.seed([74D23F9805C08E60:FC860042AB3CE398]:0)
	at org.apache.solr.client.solrj.impl.HttpSolrClient.executeMethod(HttpSolrClient.java:654)
	at org.apache.solr.client.solrj.impl.HttpSolrClient.request(HttpSolrClient.java:255)
	at org.apache.solr.client.solrj.impl.HttpSolrClient.request(HttpSolrClient.java:244)
	at org.apache.solr.client.solrj.impl.LBHttpSolrClient.doRequest(LBHttpSolrClient.java:483)
	at org.apache.solr.client.solrj.impl.LBHttpSolrClient.request(LBHttpSolrClient.java:413)
	at org.apache.solr.client.solrj.impl.CloudSolrClient.sendRequest(CloudSolrClient.java:1105)
	at org.apache.solr.client.solrj.impl.CloudSolrClient.requestWithRetryOnStaleState(CloudSolrClient.java:885)
	at org.apache.solr.client.solrj.impl.CloudSolrClient.request(CloudSolrClient.java:818)
	at org.apache.solr.client.solrj.SolrRequest.process(SolrRequest.java:194)
	at org.apache.solr.client.solrj.SolrClient.commit(SolrClient.java:484)
	at org.apache.solr.client.solrj.SolrClient.commit(SolrClient.java:463)
	at org.apache.solr.cloud.AbstractFullDistribZkTestBase.commit(AbstractFullDistribZkTestBase.java:1591)
	at org.apache.solr.cloud.ChaosMonkeyNothingIsSafeTest.test(ChaosMonkeyNothingIsSafeTest.java:212)
	at sun.reflect.NativeMethodAccessorImpl.invoke0(Native Method)
	at sun.reflect.NativeMethodAccessorImpl.invoke(NativeMethodAccessorImpl.java:62)
	at sun.reflect.DelegatingMethodAccessorImpl.invoke(DelegatingMethodAccessorImpl.java:43)
	at java.lang.reflect.Method.invoke(Method.java:498)
	at com.carrotsearch.randomizedtesting.RandomizedRunner.invoke(RandomizedRunner.java:1737)
	at com.carrotsearch.randomizedtesting.RandomizedRunner$8.evaluate(RandomizedRunner.java:934)
	at com.carrotsearch.randomizedtesting.RandomizedRunner$9.evaluate(RandomizedRunner.java:970)
	at com.carrotsearch.randomizedtesting.RandomizedRunner$10.evaluate(RandomizedRunner.java:984)
	at org.apache.solr.BaseDistributedSearchTestCase$ShardsRepeatRule$ShardsFixedStatement.callStatement(BaseDistributedSearchTestCase.java:993)
	at org.apache.solr.BaseDistributedSearchTestCase$ShardsRepeatRule$ShardsStatement.evaluate(BaseDistributedSearchTestCase.java:968)
	at com.carrotsearch.randomizedtesting.rules.SystemPropertiesRestoreRule$1.evaluate(SystemPropertiesRestoreRule.java:57)
	at org.apache.lucene.util.TestRuleSetupTeardownChained$1.evaluate(TestRuleSetupTeardownChained.java:49)
	at org.apache.lucene.util.AbstractBeforeAfterRule$1.evaluate(AbstractBeforeAfterRule.java:45)
	at org.apache.lucene.util.TestRuleThreadAndTestName$1.evaluate(TestRuleThreadAndTestName.java:48)
	at org.apache.lucene.util.TestRuleIgnoreAfterMaxFailures$1.evaluate(TestRuleIgnoreAfterMaxFailures.java:64)
	at org.apache.lucene.util.TestRuleMarkFailure$1.evaluate(TestRuleMarkFailure.java:47)
	at com.carrotsearch.randomizedtesting.rules.StatementAdapter.evaluate(StatementAdapter.java:36)
	at com.carrotsearch.randomizedtesting.ThreadLeakControl$StatementRunner.run(ThreadLeakControl.java:368)
	at com.carrotsearch.randomizedtesting.ThreadLeakControl.forkTimeoutingTask(ThreadLeakControl.java:817)
	at com.carrotsearch.randomizedtesting.ThreadLeakControl$3.evaluate(ThreadLeakControl.java:468)
	at com.carrotsearch.randomizedtesting.RandomizedRunner.runSingleTest(RandomizedRunner.java:943)
	at com.carrotsearch.randomizedtesting.RandomizedRunner$5.evaluate(RandomizedRunner.java:829)
	at com.carrotsearch.randomizedtesting.RandomizedRunner$6.evaluate(RandomizedRunner.java:879)
	at com.carrotsearch.randomizedtesting.RandomizedRunner$7.evaluate(RandomizedRunner.java:890)
	at com.carrotsearch.randomizedtesting.rules.StatementAdapter.evaluate(StatementAdapter.java:36)
	at com.carrotsearch.randomizedtesting.rules.SystemPropertiesRestoreRule$1.evaluate(SystemPropertiesRestoreRule.java:57)
	at org.apache.lucene.util.AbstractBeforeAfterRule$1.evaluate(AbstractBeforeAfterRule.java:45)
	at com.carrotsearch.randomizedtesting.rules.StatementAdapter.evaluate(StatementAdapter.java:36)
	at org.apache.lucene.util.TestRuleStoreClassName$1.evaluate(TestRuleStoreClassName.java:41)
	at com.carrotsearch.randomizedtesting.rules.NoShadowingOrOverridesOnMethodsRule$1.evaluate(NoShadowingOrOverridesOnMethodsRule.java:40)
	at com.carrotsearch.randomizedtesting.rules.NoShadowingOrOverridesOnMethodsRule$1.evaluate(NoShadowingOrOverridesOnMethodsRule.java:40)
	at com.carrotsearch.randomizedtesting.rules.StatementAdapter.evaluate(StatementAdapter.java:36)
	at com.carrotsearch.randomizedtesting.rules.StatementAdapter.evaluate(StatementAdapter.java:36)
	at com.carrotsearch.randomizedtesting.rules.StatementAdapter.evaluate(StatementAdapter.java:36)
	at org.apache.lucene.util.TestRuleAssertionsRequired$1.evaluate(TestRuleAssertionsRequired.java:53)
	at org.apache.lucene.util.TestRuleMarkFailure$1.evaluate(TestRuleMarkFailure.java:47)
	at org.apache.lucene.util.TestRuleIgnoreAfterMaxFailures$1.evaluate(TestRuleIgnoreAfterMaxFailures.java:64)
	at org.apache.lucene.util.TestRuleIgnoreTestSuites$1.evaluate(TestRuleIgnoreTestSuites.java:54)
	at com.carrotsearch.randomizedtesting.rules.StatementAdapter.evaluate(StatementAdapter.java:36)
	at com.carrotsearch.randomizedtesting.ThreadLeakControl$StatementRunner.run(ThreadLeakControl.java:368)
	at java.lang.Thread.run(Thread.java:748)
Caused by: java.net.SocketTimeoutException: Read timed out
	at java.net.SocketInputStream.socketRead0(Native Method)
	at java.net.SocketInputStream.socketRead(SocketInputStream.java:116)
	at java.net.SocketInputStream.read(SocketInputStream.java:171)
	at java.net.SocketInputStream.read(SocketInputStream.java:141)
	at org.apache.http.impl.io.SessionInputBufferImpl.streamRead(SessionInputBufferImpl.java:137)
	at org.apache.http.impl.io.SessionInputBufferImpl.fillBuffer(SessionInputBufferImpl.java:153)
	at org.apache.http.impl.io.SessionInputBufferImpl.readLine(SessionInputBufferImpl.java:282)
	at org.apache.http.impl.conn.DefaultHttpResponseParser.parseHead(DefaultHttpResponseParser.java:138)
	at org.apache.http.impl.conn.DefaultHttpResponseParser.parseHead(DefaultHttpResponseParser.java:56)
	at org.apache.http.impl.io.AbstractMessageParser.parse(AbstractMessageParser.java:259)
	at org.apache.http.impl.DefaultBHttpClientConnection.receiveResponseHeader(DefaultBHttpClientConnection.java:163)
	at org.apache.http.impl.conn.CPoolProxy.receiveResponseHeader(CPoolProxy.java:165)
	at org.apache.http.protocol.HttpRequestExecutor.doReceiveResponse(HttpRequestExecutor.java:273)
	at org.apache.http.protocol.HttpRequestExecutor.execute(HttpRequestExecutor.java:125)
	at org.apache.http.impl.execchain.MainClientExec.execute(MainClientExec.java:272)
	at org.apache.http.impl.execchain.ProtocolExec.execute(ProtocolExec.java:185)
	at org.apache.http.impl.execchain.RetryExec.execute(RetryExec.java:89)
	at org.apache.http.impl.execchain.RedirectExec.execute(RedirectExec.java:111)
	at org.apache.http.impl.client.InternalHttpClient.doExecute(InternalHttpClient.java:185)
	at org.apache.http.impl.client.CloseableHttpClient.execute(CloseableHttpClient.java:83)
	at org.apache.http.impl.client.CloseableHttpClient.execute(CloseableHttpClient.java:56)
	at org.apache.solr.client.solrj.impl.HttpSolrClient.executeMethod(HttpSolrClient.java:542)
	... 53 more


FAILED:  junit.framework.TestSuite.org.apache.solr.cloud.ChaosMonkeyNothingIsSafeTest

Error Message:
4 threads leaked from SUITE scope at org.apache.solr.cloud.ChaosMonkeyNothingIsSafeTest:     1) Thread[id=113, name=Connection evictor, state=TIMED_WAITING, group=TGRP-ChaosMonkeyNothingIsSafeTest]         at java.lang.Thread.sleep(Native Method)         at org.apache.http.impl.client.IdleConnectionEvictor$1.run(IdleConnectionEvictor.java:66)         at java.lang.Thread.run(Thread.java:748)    2) Thread[id=115, name=TEST-ChaosMonkeyNothingIsSafeTest.test-seed#[74D23F9805C08E60]-EventThread, state=WAITING, group=TGRP-ChaosMonkeyNothingIsSafeTest]         at sun.misc.Unsafe.park(Native Method)         at java.util.concurrent.locks.LockSupport.park(LockSupport.java:175)         at java.util.concurrent.locks.AbstractQueuedSynchronizer$ConditionObject.await(AbstractQueuedSynchronizer.java:2039)         at java.util.concurrent.LinkedBlockingQueue.take(LinkedBlockingQueue.java:442)         at org.apache.zookeeper.ClientCnxn$EventThread.run(ClientCnxn.java:502)    3) Thread[id=114, name=TEST-ChaosMonkeyNothingIsSafeTest.test-seed#[74D23F9805C08E60]-SendThread(127.0.0.1:51857), state=TIMED_WAITING, group=TGRP-ChaosMonkeyNothingIsSafeTest]         at java.lang.Thread.sleep(Native Method)         at org.apache.zookeeper.ClientCnxn$SendThread.run(ClientCnxn.java:1054)    4) Thread[id=116, name=zkConnectionManagerCallback-25-thread-1, state=WAITING, group=TGRP-ChaosMonkeyNothingIsSafeTest]         at sun.misc.Unsafe.park(Native Method)         at java.util.concurrent.locks.LockSupport.park(LockSupport.java:175)         at java.util.concurrent.locks.AbstractQueuedSynchronizer$ConditionObject.await(AbstractQueuedSynchronizer.java:2039)         at java.util.concurrent.LinkedBlockingQueue.take(LinkedBlockingQueue.java:442)         at java.util.concurrent.ThreadPoolExecutor.getTask(ThreadPoolExecutor.java:1074)         at java.util.concurrent.ThreadPoolExecutor.runWorker(ThreadPoolExecutor.java:1134)         at java.util.concurrent.ThreadPoolExecutor$Worker.run(ThreadPoolExecutor.java:624)         at java.lang.Thread.run(Thread.java:748)

Stack Trace:
com.carrotsearch.randomizedtesting.ThreadLeakError: 4 threads leaked from SUITE scope at org.apache.solr.cloud.ChaosMonkeyNothingIsSafeTest: 
   1) Thread[id=113, name=Connection evictor, state=TIMED_WAITING, group=TGRP-ChaosMonkeyNothingIsSafeTest]
        at java.lang.Thread.sleep(Native Method)
        at org.apache.http.impl.client.IdleConnectionEvictor$1.run(IdleConnectionEvictor.java:66)
        at java.lang.Thread.run(Thread.java:748)
   2) Thread[id=115, name=TEST-ChaosMonkeyNothingIsSafeTest.test-seed#[74D23F9805C08E60]-EventThread, state=WAITING, group=TGRP-ChaosMonkeyNothingIsSafeTest]
        at sun.misc.Unsafe.park(Native Method)
        at java.util.concurrent.locks.LockSupport.park(LockSupport.java:175)
        at java.util.concurrent.locks.AbstractQueuedSynchronizer$ConditionObject.await(AbstractQueuedSynchronizer.java:2039)
        at java.util.concurrent.LinkedBlockingQueue.take(LinkedBlockingQueue.java:442)
        at org.apache.zookeeper.ClientCnxn$EventThread.run(ClientCnxn.java:502)
   3) Thread[id=114, name=TEST-ChaosMonkeyNothingIsSafeTest.test-seed#[74D23F9805C08E60]-SendThread(127.0.0.1:51857), state=TIMED_WAITING, group=TGRP-ChaosMonkeyNothingIsSafeTest]
        at java.lang.Thread.sleep(Native Method)
        at org.apache.zookeeper.ClientCnxn$SendThread.run(ClientCnxn.java:1054)
   4) Thread[id=116, name=zkConnectionManagerCallback-25-thread-1, state=WAITING, group=TGRP-ChaosMonkeyNothingIsSafeTest]
        at sun.misc.Unsafe.park(Native Method)
        at java.util.concurrent.locks.LockSupport.park(LockSupport.java:175)
        at java.util.concurrent.locks.AbstractQueuedSynchronizer$ConditionObject.await(AbstractQueuedSynchronizer.java:2039)
        at java.util.concurrent.LinkedBlockingQueue.take(LinkedBlockingQueue.java:442)
        at java.util.concurrent.ThreadPoolExecutor.getTask(ThreadPoolExecutor.java:1074)
        at java.util.concurrent.ThreadPoolExecutor.runWorker(ThreadPoolExecutor.java:1134)
        at java.util.concurrent.ThreadPoolExecutor$Worker.run(ThreadPoolExecutor.java:624)
        at java.lang.Thread.run(Thread.java:748)
	at __randomizedtesting.SeedInfo.seed([74D23F9805C08E60]:0)


FAILED:  junit.framework.TestSuite.org.apache.solr.cloud.ChaosMonkeyNothingIsSafeTest

Error Message:
There are still zombie threads that couldn't be terminated:    1) Thread[id=114, name=TEST-ChaosMonkeyNothingIsSafeTest.test-seed#[74D23F9805C08E60]-SendThread(127.0.0.1:51857), state=TIMED_WAITING, group=TGRP-ChaosMonkeyNothingIsSafeTest]         at java.lang.Thread.sleep(Native Method)         at org.apache.zookeeper.ClientCnxn$SendThread.run(ClientCnxn.java:1054)    2) Thread[id=116, name=zkConnectionManagerCallback-25-thread-1, state=WAITING, group=TGRP-ChaosMonkeyNothingIsSafeTest]         at sun.misc.Unsafe.park(Native Method)         at java.util.concurrent.locks.LockSupport.park(LockSupport.java:175)         at java.util.concurrent.locks.AbstractQueuedSynchronizer$ConditionObject.await(AbstractQueuedSynchronizer.java:2039)         at java.util.concurrent.LinkedBlockingQueue.take(LinkedBlockingQueue.java:442)         at java.util.concurrent.ThreadPoolExecutor.getTask(ThreadPoolExecutor.java:1074)         at java.util.concurrent.ThreadPoolExecutor.runWorker(ThreadPoolExecutor.java:1134)         at java.util.concurrent.ThreadPoolExecutor$Worker.run(ThreadPoolExecutor.java:624)         at java.lang.Thread.run(Thread.java:748)

Stack Trace:
com.carrotsearch.randomizedtesting.ThreadLeakError: There are still zombie threads that couldn't be terminated:
   1) Thread[id=114, name=TEST-ChaosMonkeyNothingIsSafeTest.test-seed#[74D23F9805C08E60]-SendThread(127.0.0.1:51857), state=TIMED_WAITING, group=TGRP-ChaosMonkeyNothingIsSafeTest]
        at java.lang.Thread.sleep(Native Method)
        at org.apache.zookeeper.ClientCnxn$SendThread.run(ClientCnxn.java:1054)
   2) Thread[id=116, name=zkConnectionManagerCallback-25-thread-1, state=WAITING, group=TGRP-ChaosMonkeyNothingIsSafeTest]
        at sun.misc.Unsafe.park(Native Method)
        at java.util.concurrent.locks.LockSupport.park(LockSupport.java:175)
        at java.util.concurrent.locks.AbstractQueuedSynchronizer$ConditionObject.await(AbstractQueuedSynchronizer.java:2039)
        at java.util.concurrent.LinkedBlockingQueue.take(LinkedBlockingQueue.java:442)
        at java.util.concurrent.ThreadPoolExecutor.getTask(ThreadPoolExecutor.java:1074)
        at java.util.concurrent.ThreadPoolExecutor.runWorker(ThreadPoolExecutor.java:1134)
        at java.util.concurrent.ThreadPoolExecutor$Worker.run(ThreadPoolExecutor.java:624)
        at java.lang.Thread.run(Thread.java:748)
	at __randomizedtesting.SeedInfo.seed([74D23F9805C08E60]:0)


FAILED:  org.apache.solr.cloud.ChaosMonkeyNothingIsSafeTest.test

Error Message:
Timeout occured while waiting response from server at: http://127.0.0.1:59623/collection1

Stack Trace:
org.apache.solr.client.solrj.SolrServerException: Timeout occured while waiting response from server at: http://127.0.0.1:59623/collection1
	at __randomizedtesting.SeedInfo.seed([74D23F9805C08E60:FC860042AB3CE398]:0)
	at org.apache.solr.client.solrj.impl.HttpSolrClient.executeMethod(HttpSolrClient.java:654)
	at org.apache.solr.client.solrj.impl.HttpSolrClient.request(HttpSolrClient.java:255)
	at org.apache.solr.client.solrj.impl.HttpSolrClient.request(HttpSolrClient.java:244)
	at org.apache.solr.client.solrj.impl.LBHttpSolrClient.doRequest(LBHttpSolrClient.java:483)
	at org.apache.solr.client.solrj.impl.LBHttpSolrClient.request(LBHttpSolrClient.java:413)
	at org.apache.solr.client.solrj.impl.CloudSolrClient.sendRequest(CloudSolrClient.java:1105)
	at org.apache.solr.client.solrj.impl.CloudSolrClient.requestWithRetryOnStaleState(CloudSolrClient.java:885)
	at org.apache.solr.client.solrj.impl.CloudSolrClient.request(CloudSolrClient.java:818)
	at org.apache.solr.client.solrj.SolrRequest.process(SolrRequest.java:194)
	at org.apache.solr.client.solrj.SolrClient.commit(SolrClient.java:484)
	at org.apache.solr.client.solrj.SolrClient.commit(SolrClient.java:463)
	at org.apache.solr.cloud.AbstractFullDistribZkTestBase.commit(AbstractFullDistribZkTestBase.java:1591)
	at org.apache.solr.cloud.ChaosMonkeyNothingIsSafeTest.test(ChaosMonkeyNothingIsSafeTest.java:212)
	at sun.reflect.NativeMethodAccessorImpl.invoke0(Native Method)
	at sun.reflect.NativeMethodAccessorImpl.invoke(NativeMethodAccessorImpl.java:62)
	at sun.reflect.DelegatingMethodAccessorImpl.invoke(DelegatingMethodAccessorImpl.java:43)
	at java.lang.reflect.Method.invoke(Method.java:498)
	at com.carrotsearch.randomizedtesting.RandomizedRunner.invoke(RandomizedRunner.java:1737)
	at com.carrotsearch.randomizedtesting.RandomizedRunner$8.evaluate(RandomizedRunner.java:934)
	at com.carrotsearch.randomizedtesting.RandomizedRunner$9.evaluate(RandomizedRunner.java:970)
	at com.carrotsearch.randomizedtesting.RandomizedRunner$10.evaluate(RandomizedRunner.java:984)
	at org.apache.solr.BaseDistributedSearchTestCase$ShardsRepeatRule$ShardsFixedStatement.callStatement(BaseDistributedSearchTestCase.java:993)
	at org.apache.solr.BaseDistributedSearchTestCase$ShardsRepeatRule$ShardsStatement.evaluate(BaseDistributedSearchTestCase.java:968)
	at com.carrotsearch.randomizedtesting.rules.SystemPropertiesRestoreRule$1.evaluate(SystemPropertiesRestoreRule.java:57)
	at org.apache.lucene.util.TestRuleSetupTeardownChained$1.evaluate(TestRuleSetupTeardownChained.java:49)
	at org.apache.lucene.util.AbstractBeforeAfterRule$1.evaluate(AbstractBeforeAfterRule.java:45)
	at org.apache.lucene.util.TestRuleThreadAndTestName$1.evaluate(TestRuleThreadAndTestName.java:48)
	at org.apache.lucene.util.TestRuleIgnoreAfterMaxFailures$1.evaluate(TestRuleIgnoreAfterMaxFailures.java:64)
	at org.apache.lucene.util.TestRuleMarkFailure$1.evaluate(TestRuleMarkFailure.java:47)
	at com.carrotsearch.randomizedtesting.rules.StatementAdapter.evaluate(StatementAdapter.java:36)
	at com.carrotsearch.randomizedtesting.ThreadLeakControl$StatementRunner.run(ThreadLeakControl.java:368)
	at com.carrotsearch.randomizedtesting.ThreadLeakControl.forkTimeoutingTask(ThreadLeakControl.java:817)
	at com.carrotsearch.randomizedtesting.ThreadLeakControl$3.evaluate(ThreadLeakControl.java:468)
	at com.carrotsearch.randomizedtesting.RandomizedRunner.runSingleTest(RandomizedRunner.java:943)
	at com.carrotsearch.randomizedtesting.RandomizedRunner$5.evaluate(RandomizedRunner.java:829)
	at com.carrotsearch.randomizedtesting.RandomizedRunner$6.evaluate(RandomizedRunner.java:879)
	at com.carrotsearch.randomizedtesting.RandomizedRunner$7.evaluate(RandomizedRunner.java:890)
	at com.carrotsearch.randomizedtesting.rules.StatementAdapter.evaluate(StatementAdapter.java:36)
	at com.carrotsearch.randomizedtesting.rules.SystemPropertiesRestoreRule$1.evaluate(SystemPropertiesRestoreRule.java:57)
	at org.apache.lucene.util.AbstractBeforeAfterRule$1.evaluate(AbstractBeforeAfterRule.java:45)
	at com.carrotsearch.randomizedtesting.rules.StatementAdapter.evaluate(StatementAdapter.java:36)
	at org.apache.lucene.util.TestRuleStoreClassName$1.evaluate(TestRuleStoreClassName.java:41)
	at com.carrotsearch.randomizedtesting.rules.NoShadowingOrOverridesOnMethodsRule$1.evaluate(NoShadowingOrOverridesOnMethodsRule.java:40)
	at com.carrotsearch.randomizedtesting.rules.NoShadowingOrOverridesOnMethodsRule$1.evaluate(NoShadowingOrOverridesOnMethodsRule.java:40)
	at com.carrotsearch.randomizedtesting.rules.StatementAdapter.evaluate(StatementAdapter.java:36)
	at com.carrotsearch.randomizedtesting.rules.StatementAdapter.evaluate(StatementAdapter.java:36)
	at com.carrotsearch.randomizedtesting.rules.StatementAdapter.evaluate(StatementAdapter.java:36)
	at org.apache.lucene.util.TestRuleAssertionsRequired$1.evaluate(TestRuleAssertionsRequired.java:53)
	at org.apache.lucene.util.TestRuleMarkFailure$1.evaluate(TestRuleMarkFailure.java:47)
	at org.apache.lucene.util.TestRuleIgnoreAfterMaxFailures$1.evaluate(TestRuleIgnoreAfterMaxFailures.java:64)
	at org.apache.lucene.util.TestRuleIgnoreTestSuites$1.evaluate(TestRuleIgnoreTestSuites.java:54)
	at com.carrotsearch.randomizedtesting.rules.StatementAdapter.evaluate(StatementAdapter.java:36)
	at com.carrotsearch.randomizedtesting.ThreadLeakControl$StatementRunner.run(ThreadLeakControl.java:368)
	at java.lang.Thread.run(Thread.java:748)
Caused by: java.net.SocketTimeoutException: Read timed out
	at java.net.SocketInputStream.socketRead0(Native Method)
	at java.net.SocketInputStream.socketRead(SocketInputStream.java:116)
	at java.net.SocketInputStream.read(SocketInputStream.java:171)
	at java.net.SocketInputStream.read(SocketInputStream.java:141)
	at org.apache.http.impl.io.SessionInputBufferImpl.streamRead(SessionInputBufferImpl.java:137)
	at org.apache.http.impl.io.SessionInputBufferImpl.fillBuffer(SessionInputBufferImpl.java:153)
	at org.apache.http.impl.io.SessionInputBufferImpl.readLine(SessionInputBufferImpl.java:282)
	at org.apache.http.impl.conn.DefaultHttpResponseParser.parseHead(DefaultHttpResponseParser.java:138)
	at org.apache.http.impl.conn.DefaultHttpResponseParser.parseHead(DefaultHttpResponseParser.java:56)
	at org.apache.http.impl.io.AbstractMessageParser.parse(AbstractMessageParser.java:259)
	at org.apache.http.impl.DefaultBHttpClientConnection.receiveResponseHeader(DefaultBHttpClientConnection.java:163)
	at org.apache.http.impl.conn.CPoolProxy.receiveResponseHeader(CPoolProxy.java:165)
	at org.apache.http.protocol.HttpRequestExecutor.doReceiveResponse(HttpRequestExecutor.java:273)
	at org.apache.http.protocol.HttpRequestExecutor.execute(HttpRequestExecutor.java:125)
	at org.apache.http.impl.execchain.MainClientExec.execute(MainClientExec.java:272)
	at org.apache.http.impl.execchain.ProtocolExec.execute(ProtocolExec.java:185)
	at org.apache.http.impl.execchain.RetryExec.execute(RetryExec.java:89)
	at org.apache.http.impl.execchain.RedirectExec.execute(RedirectExec.java:111)
	at org.apache.http.impl.client.InternalHttpClient.doExecute(InternalHttpClient.java:185)
	at org.apache.http.impl.client.CloseableHttpClient.execute(CloseableHttpClient.java:83)
	at org.apache.http.impl.client.CloseableHttpClient.execute(CloseableHttpClient.java:56)
	at org.apache.solr.client.solrj.impl.HttpSolrClient.executeMethod(HttpSolrClient.java:542)
	... 53 more


FAILED:  junit.framework.TestSuite.org.apache.solr.cloud.ChaosMonkeyNothingIsSafeTest

Error Message:
4 threads leaked from SUITE scope at org.apache.solr.cloud.ChaosMonkeyNothingIsSafeTest:     1) Thread[id=23524, name=zkConnectionManagerCallback-7230-thread-1, state=WAITING, group=TGRP-ChaosMonkeyNothingIsSafeTest]         at sun.misc.Unsafe.park(Native Method)         at java.util.concurrent.locks.LockSupport.park(LockSupport.java:175)         at java.util.concurrent.locks.AbstractQueuedSynchronizer$ConditionObject.await(AbstractQueuedSynchronizer.java:2039)         at java.util.concurrent.LinkedBlockingQueue.take(LinkedBlockingQueue.java:442)         at java.util.concurrent.ThreadPoolExecutor.getTask(ThreadPoolExecutor.java:1074)         at java.util.concurrent.ThreadPoolExecutor.runWorker(ThreadPoolExecutor.java:1134)         at java.util.concurrent.ThreadPoolExecutor$Worker.run(ThreadPoolExecutor.java:624)         at java.lang.Thread.run(Thread.java:748)    2) Thread[id=23522, name=TEST-ChaosMonkeyNothingIsSafeTest.test-seed#[74D23F9805C08E60]-SendThread(127.0.0.1:59573), state=TIMED_WAITING, group=TGRP-ChaosMonkeyNothingIsSafeTest]         at java.lang.Thread.sleep(Native Method)         at org.apache.zookeeper.client.StaticHostProvider.next(StaticHostProvider.java:105)         at org.apache.zookeeper.ClientCnxn$SendThread.startConnect(ClientCnxn.java:1000)         at org.apache.zookeeper.ClientCnxn$SendThread.run(ClientCnxn.java:1063)    3) Thread[id=23521, name=Connection evictor, state=TIMED_WAITING, group=TGRP-ChaosMonkeyNothingIsSafeTest]         at java.lang.Thread.sleep(Native Method)         at org.apache.http.impl.client.IdleConnectionEvictor$1.run(IdleConnectionEvictor.java:66)         at java.lang.Thread.run(Thread.java:748)    4) Thread[id=23523, name=TEST-ChaosMonkeyNothingIsSafeTest.test-seed#[74D23F9805C08E60]-EventThread, state=WAITING, group=TGRP-ChaosMonkeyNothingIsSafeTest]         at sun.misc.Unsafe.park(Native Method)         at java.util.concurrent.locks.LockSupport.park(LockSupport.java:175)         at java.util.concurrent.locks.AbstractQueuedSynchronizer$ConditionObject.await(AbstractQueuedSynchronizer.java:2039)         at java.util.concurrent.LinkedBlockingQueue.take(LinkedBlockingQueue.java:442)         at org.apache.zookeeper.ClientCnxn$EventThread.run(ClientCnxn.java:502)

Stack Trace:
com.carrotsearch.randomizedtesting.ThreadLeakError: 4 threads leaked from SUITE scope at org.apache.solr.cloud.ChaosMonkeyNothingIsSafeTest: 
   1) Thread[id=23524, name=zkConnectionManagerCallback-7230-thread-1, state=WAITING, group=TGRP-ChaosMonkeyNothingIsSafeTest]
        at sun.misc.Unsafe.park(Native Method)
        at java.util.concurrent.locks.LockSupport.park(LockSupport.java:175)
        at java.util.concurrent.locks.AbstractQueuedSynchronizer$ConditionObject.await(AbstractQueuedSynchronizer.java:2039)
        at java.util.concurrent.LinkedBlockingQueue.take(LinkedBlockingQueue.java:442)
        at java.util.concurrent.ThreadPoolExecutor.getTask(ThreadPoolExecutor.java:1074)
        at java.util.concurrent.ThreadPoolExecutor.runWorker(ThreadPoolExecutor.java:1134)
        at java.util.concurrent.ThreadPoolExecutor$Worker.run(ThreadPoolExecutor.java:624)
        at java.lang.Thread.run(Thread.java:748)
   2) Thread[id=23522, name=TEST-ChaosMonkeyNothingIsSafeTest.test-seed#[74D23F9805C08E60]-SendThread(127.0.0.1:59573), state=TIMED_WAITING, group=TGRP-ChaosMonkeyNothingIsSafeTest]
        at java.lang.Thread.sleep(Native Method)
        at org.apache.zookeeper.client.StaticHostProvider.next(StaticHostProvider.java:105)
        at org.apache.zookeeper.ClientCnxn$SendThread.startConnect(ClientCnxn.java:1000)
        at org.apache.zookeeper.ClientCnxn$SendThread.run(ClientCnxn.java:1063)
   3) Thread[id=23521, name=Connection evictor, state=TIMED_WAITING, group=TGRP-ChaosMonkeyNothingIsSafeTest]
        at java.lang.Thread.sleep(Native Method)
        at org.apache.http.impl.client.IdleConnectionEvictor$1.run(IdleConnectionEvictor.java:66)
        at java.lang.Thread.run(Thread.java:748)
   4) Thread[id=23523, name=TEST-ChaosMonkeyNothingIsSafeTest.test-seed#[74D23F9805C08E60]-EventThread, state=WAITING, group=TGRP-ChaosMonkeyNothingIsSafeTest]
        at sun.misc.Unsafe.park(Native Method)
        at java.util.concurrent.locks.LockSupport.park(LockSupport.java:175)
        at java.util.concurrent.locks.AbstractQueuedSynchronizer$ConditionObject.await(AbstractQueuedSynchronizer.java:2039)
        at java.util.concurrent.LinkedBlockingQueue.take(LinkedBlockingQueue.java:442)
        at org.apache.zookeeper.ClientCnxn$EventThread.run(ClientCnxn.java:502)
	at __randomizedtesting.SeedInfo.seed([74D23F9805C08E60]:0)


FAILED:  junit.framework.TestSuite.org.apache.solr.cloud.ChaosMonkeyNothingIsSafeTest

Error Message:
There are still zombie threads that couldn't be terminated:    1) Thread[id=23524, name=zkConnectionManagerCallback-7230-thread-1, state=WAITING, group=TGRP-ChaosMonkeyNothingIsSafeTest]         at sun.misc.Unsafe.park(Native Method)         at java.util.concurrent.locks.LockSupport.park(LockSupport.java:175)         at java.util.concurrent.locks.AbstractQueuedSynchronizer$ConditionObject.await(AbstractQueuedSynchronizer.java:2039)         at java.util.concurrent.LinkedBlockingQueue.take(LinkedBlockingQueue.java:442)         at java.util.concurrent.ThreadPoolExecutor.getTask(ThreadPoolExecutor.java:1074)         at java.util.concurrent.ThreadPoolExecutor.runWorker(ThreadPoolExecutor.java:1134)         at java.util.concurrent.ThreadPoolExecutor$Worker.run(ThreadPoolExecutor.java:624)         at java.lang.Thread.run(Thread.java:748)    2) Thread[id=23522, name=TEST-ChaosMonkeyNothingIsSafeTest.test-seed#[74D23F9805C08E60]-SendThread(127.0.0.1:59573), state=TIMED_WAITING, group=TGRP-ChaosMonkeyNothingIsSafeTest]         at java.lang.Thread.sleep(Native Method)         at org.apache.zookeeper.ClientCnxn$SendThread.run(ClientCnxn.java:1054)

Stack Trace:
com.carrotsearch.randomizedtesting.ThreadLeakError: There are still zombie threads that couldn't be terminated:
   1) Thread[id=23524, name=zkConnectionManagerCallback-7230-thread-1, state=WAITING, group=TGRP-ChaosMonkeyNothingIsSafeTest]
        at sun.misc.Unsafe.park(Native Method)
        at java.util.concurrent.locks.LockSupport.park(LockSupport.java:175)
        at java.util.concurrent.locks.AbstractQueuedSynchronizer$ConditionObject.await(AbstractQueuedSynchronizer.java:2039)
        at java.util.concurrent.LinkedBlockingQueue.take(LinkedBlockingQueue.java:442)
        at java.util.concurrent.ThreadPoolExecutor.getTask(ThreadPoolExecutor.java:1074)
        at java.util.concurrent.ThreadPoolExecutor.runWorker(ThreadPoolExecutor.java:1134)
        at java.util.concurrent.ThreadPoolExecutor$Worker.run(ThreadPoolExecutor.java:624)
        at java.lang.Thread.run(Thread.java:748)
   2) Thread[id=23522, name=TEST-ChaosMonkeyNothingIsSafeTest.test-seed#[74D23F9805C08E60]-SendThread(127.0.0.1:59573), state=TIMED_WAITING, group=TGRP-ChaosMonkeyNothingIsSafeTest]
        at java.lang.Thread.sleep(Native Method)
        at org.apache.zookeeper.ClientCnxn$SendThread.run(ClientCnxn.java:1054)
	at __randomizedtesting.SeedInfo.seed([74D23F9805C08E60]:0)




Build Log:
[...truncated 13807 lines...]
   [junit4] Suite: org.apache.solr.cloud.ChaosMonkeyNothingIsSafeTest
   [junit4]   2> Creating dataDir: C:\Users\jenkins\workspace\Lucene-Solr-7.x-Windows\solr\build\solr-core\test\J1\temp\solr.cloud.ChaosMonkeyNothingIsSafeTest_74D23F9805C08E60-001\init-core-data-001
   [junit4]   2> 1856426 INFO  (SUITE-ChaosMonkeyNothingIsSafeTest-seed#[74D23F9805C08E60]-worker) [    ] o.a.s.SolrTestCaseJ4 Using PointFields (NUMERIC_POINTS_SYSPROP=true) w/NUMERIC_DOCVALUES_SYSPROP=true
   [junit4]   2> 1856429 INFO  (SUITE-ChaosMonkeyNothingIsSafeTest-seed#[74D23F9805C08E60]-worker) [    ] o.a.s.SolrTestCaseJ4 Randomized ssl (false) and clientAuth (false) via: @org.apache.solr.SolrTestCaseJ4$SuppressSSL(bugUrl=https://issues.apache.org/jira/browse/SOLR-5776)
   [junit4]   2> 1856429 INFO  (SUITE-ChaosMonkeyNothingIsSafeTest-seed#[74D23F9805C08E60]-worker) [    ] o.a.s.SolrTestCaseJ4 SecureRandom sanity checks: test.solr.allowed.securerandom=null & java.security.egd=file:/dev/./urandom
   [junit4]   2> 1856429 INFO  (SUITE-ChaosMonkeyNothingIsSafeTest-seed#[74D23F9805C08E60]-worker) [    ] o.a.s.BaseDistributedSearchTestCase Setting hostContext system property: /
   [junit4]   2> 1856431 INFO  (TEST-ChaosMonkeyNothingIsSafeTest.test-seed#[74D23F9805C08E60]) [    ] o.a.s.c.ZkTestServer STARTING ZK TEST SERVER
   [junit4]   2> 1856432 INFO  (Thread-4512) [    ] o.a.s.c.ZkTestServer client port:0.0.0.0/0.0.0.0:0
   [junit4]   2> 1856432 INFO  (Thread-4512) [    ] o.a.s.c.ZkTestServer Starting server
   [junit4]   2> 1856438 ERROR (Thread-4512) [    ] o.a.z.s.ZooKeeperServer ZKShutdownHandler is not registered, so ZooKeeper server won't take any action on ERROR or SHUTDOWN server state changes
   [junit4]   2> 1856533 INFO  (TEST-ChaosMonkeyNothingIsSafeTest.test-seed#[74D23F9805C08E60]) [    ] o.a.s.c.ZkTestServer start zk server on port:59573
   [junit4]   2> 1856537 INFO  (zkConnectionManagerCallback-7207-thread-1) [    ] o.a.s.c.c.ConnectionManager zkClient has connected
   [junit4]   2> 1856543 INFO  (zkConnectionManagerCallback-7209-thread-1) [    ] o.a.s.c.c.ConnectionManager zkClient has connected
   [junit4]   2> 1856553 INFO  (TEST-ChaosMonkeyNothingIsSafeTest.test-seed#[74D23F9805C08E60]) [    ] o.a.s.c.AbstractZkTestCase put C:\Users\jenkins\workspace\Lucene-Solr-7.x-Windows\solr\core\src\test-files\solr\collection1\conf\solrconfig-tlog.xml to /configs/conf1/solrconfig.xml
   [junit4]   2> 1856559 INFO  (TEST-ChaosMonkeyNothingIsSafeTest.test-seed#[74D23F9805C08E60]) [    ] o.a.s.c.AbstractZkTestCase put C:\Users\jenkins\workspace\Lucene-Solr-7.x-Windows\solr\core\src\test-files\solr\collection1\conf\schema15.xml to /configs/conf1/schema.xml
   [junit4]   2> 1856561 INFO  (TEST-ChaosMonkeyNothingIsSafeTest.test-seed#[74D23F9805C08E60]) [    ] o.a.s.c.AbstractZkTestCase put C:\Users\jenkins\workspace\Lucene-Solr-7.x-Windows\solr\core\src\test-files\solr\collection1\conf\solrconfig.snippet.randomindexconfig.xml to /configs/conf1/solrconfig.snippet.randomindexconfig.xml
   [junit4]   2> 1856563 INFO  (TEST-ChaosMonkeyNothingIsSafeTest.test-seed#[74D23F9805C08E60]) [    ] o.a.s.c.AbstractZkTestCase put C:\Users\jenkins\workspace\Lucene-Solr-7.x-Windows\solr\core\src\test-files\solr\collection1\conf\stopwords.txt to /configs/conf1/stopwords.txt
   [junit4]   2> 1856565 INFO  (TEST-ChaosMonkeyNothingIsSafeTest.test-seed#[74D23F9805C08E60]) [    ] o.a.s.c.AbstractZkTestCase put C:\Users\jenkins\workspace\Lucene-Solr-7.x-Windows\solr\core\src\test-files\solr\collection1\conf\protwords.txt to /configs/conf1/protwords.txt
   [junit4]   2> 1856566 INFO  (TEST-ChaosMonkeyNothingIsSafeTest.test-seed#[74D23F9805C08E60]) [    ] o.a.s.c.AbstractZkTestCase put C:\Users\jenkins\workspace\Lucene-Solr-7.x-Windows\solr\core\src\test-files\solr\collection1\conf\currency.xml to /configs/conf1/currency.xml
   [junit4]   2> 1856568 INFO  (TEST-ChaosMonkeyNothingIsSafeTest.test-seed#[74D23F9805C08E60]) [    ] o.a.s.c.AbstractZkTestCase put C:\Users\jenkins\workspace\Lucene-Solr-7.x-Windows\solr\core\src\test-files\solr\collection1\conf\enumsConfig.xml to /configs/conf1/enumsConfig.xml
   [junit4]   2> 1856570 INFO  (TEST-ChaosMonkeyNothingIsSafeTest.test-seed#[74D23F9805C08E60]) [    ] o.a.s.c.AbstractZkTestCase put C:\Users\jenkins\workspace\Lucene-Solr-7.x-Windows\solr\core\src\test-files\solr\collection1\conf\open-exchange-rates.json to /configs/conf1/open-exchange-rates.json
   [junit4]   2> 1856570 INFO  (TEST-ChaosMonkeyNothingIsSafeTest.test-seed#[74D23F9805C08E60]) [    ] o.a.s.c.AbstractZkTestCase put C:\Users\jenkins\workspace\Lucene-Solr-7.x-Windows\solr\core\src\test-files\solr\collection1\conf\mapping-ISOLatin1Accent.txt to /configs/conf1/mapping-ISOLatin1Accent.txt
   [junit4]   2> 1856572 INFO  (TEST-ChaosMonkeyNothingIsSafeTest.test-seed#[74D23F9805C08E60]) [    ] o.a.s.c.AbstractZkTestCase put C:\Users\jenkins\workspace\Lucene-Solr-7.x-Windows\solr\core\src\test-files\solr\collection1\conf\old_synonyms.txt to /configs/conf1/old_synonyms.txt
   [junit4]   2> 1856574 INFO  (TEST-ChaosMonkeyNothingIsSafeTest.test-seed#[74D23F9805C08E60]) [    ] o.a.s.c.AbstractZkTestCase put C:\Users\jenkins\workspace\Lucene-Solr-7.x-Windows\solr\core\src\test-files\solr\collection1\conf\synonyms.txt to /configs/conf1/synonyms.txt
   [junit4]   2> 1856578 INFO  (TEST-ChaosMonkeyNothingIsSafeTest.test-seed#[74D23F9805C08E60]) [    ] o.a.s.c.AbstractFullDistribZkTestBase Will use TLOG replicas unless explicitly asked otherwise
   [junit4]   2> 1857267 INFO  (TEST-ChaosMonkeyNothingIsSafeTest.test-seed#[74D23F9805C08E60]) [    ] o.e.j.s.Server jetty-9.4.8.v20171121, build timestamp: 2017-11-22T04:27:37+07:00, git hash: 82b8fb23f757335bb3329d540ce37a2a2615f0a8
   [junit4]   2> 1857267 INFO  (TEST-ChaosMonkeyNothingIsSafeTest.test-seed#[74D23F9805C08E60]) [    ] o.e.j.s.session DefaultSessionIdManager workerName=node0
   [junit4]   2> 1857267 INFO  (TEST-ChaosMonkeyNothingIsSafeTest.test-seed#[74D23F9805C08E60]) [    ] o.e.j.s.session No SessionScavenger set, using defaults
   [junit4]   2> 1857268 INFO  (TEST-ChaosMonkeyNothingIsSafeTest.test-seed#[74D23F9805C08E60]) [    ] o.e.j.s.session Scavenging every 660000ms
   [junit4]   2> 1857268 INFO  (TEST-ChaosMonkeyNothingIsSafeTest.test-seed#[74D23F9805C08E60]) [    ] o.e.j.s.h.ContextHandler Started o.e.j.s.ServletContextHandler@14ec6eb{/,null,AVAILABLE}
   [junit4]   2> 1857269 INFO  (TEST-ChaosMonkeyNothingIsSafeTest.test-seed#[74D23F9805C08E60]) [    ] o.e.j.s.AbstractConnector Started ServerConnector@102f2d9{HTTP/1.1,[http/1.1]}{127.0.0.1:59580}
   [junit4]   2> 1857269 INFO  (TEST-ChaosMonkeyNothingIsSafeTest.test-seed#[74D23F9805C08E60]) [    ] o.e.j.s.Server Started @1865657ms
   [junit4]   2> 1857269 INFO  (TEST-ChaosMonkeyNothingIsSafeTest.test-seed#[74D23F9805C08E60]) [    ] o.a.s.c.s.e.JettySolrRunner Jetty properties: {solr.data.dir=C:\Users\jenkins\workspace\Lucene-Solr-7.x-Windows\solr\build\solr-core\test\J1\temp\solr.cloud.ChaosMonkeyNothingIsSafeTest_74D23F9805C08E60-001\tempDir-001/control/data, replicaType=NRT, hostContext=/, hostPort=59580, coreRootDirectory=C:\Users\jenkins\workspace\Lucene-Solr-7.x-Windows\solr\build\solr-core\test\J1\..\..\..\..\..\..\..\..\..\Users\jenkins\workspace\Lucene-Solr-7.x-Windows\solr\build\solr-core\test\J1\temp\solr.cloud.ChaosMonkeyNothingIsSafeTest_74D23F9805C08E60-001\control-001\cores}
   [junit4]   2> 1857269 ERROR (TEST-ChaosMonkeyNothingIsSafeTest.test-seed#[74D23F9805C08E60]) [    ] o.a.s.u.StartupLoggingUtils Missing Java Option solr.log.dir. Logging may be missing or incomplete.
   [junit4]   2> 1857269 INFO  (TEST-ChaosMonkeyNothingIsSafeTest.test-seed#[74D23F9805C08E60]) [    ] o.a.s.s.SolrDispatchFilter  ___      _       Welcome to Apache Solr™ version 7.3.0
   [junit4]   2> 1857269 INFO  (TEST-ChaosMonkeyNothingIsSafeTest.test-seed#[74D23F9805C08E60]) [    ] o.a.s.s.SolrDispatchFilter / __| ___| |_ _   Starting in cloud mode on port null
   [junit4]   2> 1857269 INFO  (TEST-ChaosMonkeyNothingIsSafeTest.test-seed#[74D23F9805C08E60]) [    ] o.a.s.s.SolrDispatchFilter \__ \/ _ \ | '_|  Install dir: null
   [junit4]   2> 1857269 INFO  (TEST-ChaosMonkeyNothingIsSafeTest.test-seed#[74D23F9805C08E60]) [    ] o.a.s.s.SolrDispatchFilter |___/\___/_|_|    Start time: 2018-03-11T10:55:37.521Z
   [junit4]   2> 1857269 INFO  (zkConnectionManagerCallback-7211-thread-1) [    ] o.a.s.c.c.ConnectionManager zkClient has connected
   [junit4]   2> 1857275 INFO  (TEST-ChaosMonkeyNothingIsSafeTest.test-seed#[74D23F9805C08E60]) [    ] o.a.s.s.SolrDispatchFilter Loading solr.xml from SolrHome (not found in ZooKeeper)
   [junit4]   2> 1857275 INFO  (TEST-ChaosMonkeyNothingIsSafeTest.test-seed#[74D23F9805C08E60]) [    ] o.a.s.c.SolrXmlConfig Loading container configuration from C:\Users\jenkins\workspace\Lucene-Solr-7.x-Windows\solr\build\solr-core\test\J1\temp\solr.cloud.ChaosMonkeyNothingIsSafeTest_74D23F9805C08E60-001\control-001\solr.xml
   [junit4]   2> 1857282 INFO  (TEST-ChaosMonkeyNothingIsSafeTest.test-seed#[74D23F9805C08E60]) [    ] o.a.s.c.SolrXmlConfig Configuration parameter autoReplicaFailoverWorkLoopDelay is ignored
   [junit4]   2> 1857282 INFO  (TEST-ChaosMonkeyNothingIsSafeTest.test-seed#[74D23F9805C08E60]) [    ] o.a.s.c.SolrXmlConfig Configuration parameter autoReplicaFailoverBadNodeExpiration is ignored
   [junit4]   2> 1857283 INFO  (TEST-ChaosMonkeyNothingIsSafeTest.test-seed#[74D23F9805C08E60]) [    ] o.a.s.c.SolrXmlConfig MBean server found: com.sun.jmx.mbeanserver.JmxMBeanServer@a8410e, but no JMX reporters were configured - adding default JMX reporter.
   [junit4]   2> 1857287 INFO  (TEST-ChaosMonkeyNothingIsSafeTest.test-seed#[74D23F9805C08E60]) [    ] o.a.s.c.ZkContainer Zookeeper client=127.0.0.1:59573/solr
   [junit4]   2> 1857289 INFO  (zkConnectionManagerCallback-7215-thread-1) [    ] o.a.s.c.c.ConnectionManager zkClient has connected
   [junit4]   2> 1857292 INFO  (zkConnectionManagerCallback-7217-thread-1-processing-n:127.0.0.1:59580_) [n:127.0.0.1:59580_    ] o.a.s.c.c.ConnectionManager zkClient has connected
   [junit4]   2> 1857386 INFO  (TEST-ChaosMonkeyNothingIsSafeTest.test-seed#[74D23F9805C08E60]) [n:127.0.0.1:59580_    ] o.a.s.c.Overseer Overseer (id=null) closing
   [junit4]   2> 1857387 INFO  (TEST-ChaosMonkeyNothingIsSafeTest.test-seed#[74D23F9805C08E60]) [n:127.0.0.1:59580_    ] o.a.s.c.OverseerElectionContext I am going to be the leader 127.0.0.1:59580_
   [junit4]   2> 1857388 INFO  (TEST-ChaosMonkeyNothingIsSafeTest.test-seed#[74D23F9805C08E60]) [n:127.0.0.1:59580_    ] o.a.s.c.Overseer Overseer (id=72114491814182916-127.0.0.1:59580_-n_0000000000) starting
   [junit4]   2> 1857396 INFO  (zkConnectionManagerCallback-7222-thread-1-processing-n:127.0.0.1:59580_) [n:127.0.0.1:59580_    ] o.a.s.c.c.ConnectionManager zkClient has connected
   [junit4]   2> 1857398 INFO  (TEST-ChaosMonkeyNothingIsSafeTest.test-seed#[74D23F9805C08E60]) [n:127.0.0.1:59580_    ] o.a.s.c.s.i.ZkClientClusterStateProvider Cluster at 127.0.0.1:59573/solr ready
   [junit4]   2> 1857399 INFO  (TEST-ChaosMonkeyNothingIsSafeTest.test-seed#[74D23F9805C08E60]) [n:127.0.0.1:59580_    ] o.a.s.c.ZkController Register node as live in ZooKeeper:/live_nodes/127.0.0.1:59580_
   [junit4]   2> 1857402 INFO  (OverseerStateUpdate-72114491814182916-127.0.0.1:59580_-n_0000000000) [n:127.0.0.1:59580_    ] o.a.s.c.c.ZkStateReader Updated live nodes from ZooKeeper... (0) -> (1)
   [junit4]   2> 1857404 INFO  (zkCallback-7221-thread-1-processing-n:127.0.0.1:59580_) [n:127.0.0.1:59580_    ] o.a.s.c.c.ZkStateReader Updated live nodes from ZooKeeper... (0) -> (1)
   [junit4]   2> 1857551 INFO  (TEST-ChaosMonkeyNothingIsSafeTest.test-seed#[74D23F9805C08E60]) [n:127.0.0.1:59580_    ] o.a.s.m.r.SolrJmxReporter JMX monitoring for 'solr.node' (registry 'solr.node') enabled at server: com.sun.jmx.mbeanserver.JmxMBeanServer@a8410e
   [junit4]   2> 1857556 INFO  (TEST-ChaosMonkeyNothingIsSafeTest.test-seed#[74D23F9805C08E60]) [n:127.0.0.1:59580_    ] o.a.s.m.r.SolrJmxReporter JMX monitoring for 'solr.jvm' (registry 'solr.jvm') enabled at server: com.sun.jmx.mbeanserver.JmxMBeanServer@a8410e
   [junit4]   2> 1857557 INFO  (TEST-ChaosMonkeyNothingIsSafeTest.test-seed#[74D23F9805C08E60]) [n:127.0.0.1:59580_    ] o.a.s.m.r.SolrJmxReporter JMX monitoring for 'solr.jetty' (registry 'solr.jetty') enabled at server: com.sun.jmx.mbeanserver.JmxMBeanServer@a8410e
   [junit4]   2> 1857559 INFO  (TEST-ChaosMonkeyNothingIsSafeTest.test-seed#[74D23F9805C08E60]) [n:127.0.0.1:59580_    ] o.a.s.c.CorePropertiesLocator Found 0 core definitions underneath C:\Users\jenkins\workspace\Lucene-Solr-7.x-Windows\solr\build\solr-core\test\J1\..\..\..\..\..\..\..\..\..\Users\jenkins\workspace\Lucene-Solr-7.x-Windows\solr\build\solr-core\test\J1\temp\solr.cloud.ChaosMonkeyNothingIsSafeTest_74D23F9805C08E60-001\control-001\cores
   [junit4]   2> 1857584 INFO  (zkConnectionManagerCallback-7226-thread-1) [    ] o.a.s.c.c.ConnectionManager zkClient has connected
   [junit4]   2> 1857585 INFO  (TEST-ChaosMonkeyNothingIsSafeTest.test-seed#[74D23F9805C08E60]) [    ] o.a.s.c.c.ZkStateReader Updated live nodes from ZooKeeper... (0) -> (1)
   [junit4]   2> 1857586 INFO  (TEST-ChaosMonkeyNothingIsSafeTest.test-seed#[74D23F9805C08E60]) [    ] o.a.s.c.s.i.ZkClientClusterStateProvider Cluster at 127.0.0.1:59573/solr ready
   [junit4]   2> 1857588 INFO  (qtp15531146-23474) [n:127.0.0.1:59580_    ] o.a.s.h.a.CollectionsHandler Invoked Collection Action :create with params replicationFactor=1&collection.configName=conf1&name=control_collection&nrtReplicas=1&action=CREATE&numShards=1&createNodeSet=127.0.0.1:59580_&wt=javabin&version=2 and sendToOCPQueue=true
   [junit4]   2> 1857590 INFO  (OverseerThreadFactory-8974-thread-1-processing-n:127.0.0.1:59580_) [n:127.0.0.1:59580_    ] o.a.s.c.a.c.CreateCollectionCmd Create collection control_collection
   [junit4]   2> 1857696 INFO  (qtp15531146-23478) [n:127.0.0.1:59580_    ] o.a.s.h.a.CoreAdminOperation core create command qt=/admin/cores&collection.configName=conf1&newCollection=true&name=control_collection_shard1_replica_n1&action=CREATE&numShards=1&collection=control_collection&shard=shard1&wt=javabin&version=2&replicaType=NRT
   [junit4]   2> 1857697 INFO  (qtp15531146-23478) [n:127.0.0.1:59580_    ] o.a.s.c.TransientSolrCoreCacheDefault Allocating transient cache for 4 transient cores
   [junit4]   2> 1857803 INFO  (zkCallback-7216-thread-1-processing-n:127.0.0.1:59580_) [n:127.0.0.1:59580_    ] o.a.s.c.c.ZkStateReader A cluster state change: [WatchedEvent state:SyncConnected type:NodeDataChanged path:/collections/control_collection/state.json] for collection [control_collection] has occurred - updating... (live nodes size: [1])
   [junit4]   2> 1858728 INFO  (qtp15531146-23478) [n:127.0.0.1:59580_ c:control_collection s:shard1  x:control_collection_shard1_replica_n1] o.a.s.c.SolrConfig Using Lucene MatchVersion: 7.3.0
   [junit4]   2> 1858759 INFO  (qtp15531146-23478) [n:127.0.0.1:59580_ c:control_collection s:shard1  x:control_collection_shard1_replica_n1] o.a.s.s.IndexSchema [control_collection_shard1_replica_n1] Schema name=test
   [junit4]   2> 1858871 INFO  (qtp15531146-23478) [n:127.0.0.1:59580_ c:control_collection s:shard1  x:control_collection_shard1_replica_n1] o.a.s.s.IndexSchema Loaded schema test/1.6 with uniqueid field id
   [junit4]   2> 1858911 INFO  (qtp15531146-23478) [n:127.0.0.1:59580_ c:control_collection s:shard1  x:control_collection_shard1_replica_n1] o.a.s.c.CoreContainer Creating SolrCore 'control_collection_shard1_replica_n1' using configuration from collection control_collection, trusted=true
   [junit4]   2> 1858912 INFO  (qtp15531146-23478) [n:127.0.0.1:59580_ c:control_collection s:shard1  x:control_collection_shard1_replica_n1] o.a.s.m.r.SolrJmxReporter JMX monitoring for 'solr.core.control_collection.shard1.replica_n1' (registry 'solr.core.control_collection.shard1.replica_n1') enabled at server: com.sun.jmx.mbeanserver.JmxMBeanServer@a8410e
   [junit4]   2> 1858912 INFO  (qtp15531146-23478) [n:127.0.0.1:59580_ c:control_collection s:shard1  x:control_collection_shard1_replica_n1] o.a.s.c.SolrCore solr.RecoveryStrategy.Builder
   [junit4]   2> 1858912 INFO  (qtp15531146-23478) [n:127.0.0.1:59580_ c:control_collection s:shard1  x:control_collection_shard1_replica_n1] o.a.s.c.SolrCore [[control_collection_shard1_replica_n1] ] Opening new SolrCore at [C:\Users\jenkins\workspace\Lucene-Solr-7.x-Windows\solr\build\solr-core\test\J1\temp\solr.cloud.ChaosMonkeyNothingIsSafeTest_74D23F9805C08E60-001\control-001\cores\control_collection_shard1_replica_n1], dataDir=[C:\Users\jenkins\workspace\Lucene-Solr-7.x-Windows\solr\build\solr-core\test\J1\..\..\..\..\..\..\..\..\..\Users\jenkins\workspace\Lucene-Solr-7.x-Windows\solr\build\solr-core\test\J1\temp\solr.cloud.ChaosMonkeyNothingIsSafeTest_74D23F9805C08E60-001\control-001\cores\control_collection_shard1_replica_n1\data\]
   [junit4]   2> 1858915 INFO  (qtp15531146-23478) [n:127.0.0.1:59580_ c:control_collection s:shard1  x:control_collection_shard1_replica_n1] o.a.s.u.RandomMergePolicy RandomMergePolicy wrapping class org.apache.lucene.index.TieredMergePolicy: [TieredMergePolicy: maxMergeAtOnce=42, maxMergeAtOnceExplicit=16, maxMergedSegmentMB=48.6884765625, floorSegmentMB=1.6279296875, forceMergeDeletesPctAllowed=25.27951720093537, segmentsPerTier=34.0, maxCFSSegmentSizeMB=8.796093022207999E12, noCFSRatio=0.0
   [junit4]   2> 1858975 WARN  (qtp15531146-23478) [n:127.0.0.1:59580_ c:control_collection s:shard1  x:control_collection_shard1_replica_n1] o.a.s.c.RequestHandlers INVALID paramSet a in requestHandler {type = requestHandler,name = /dump,class = DumpRequestHandler,attributes = {initParams=a, name=/dump, class=DumpRequestHandler},args = {defaults={a=A,b=B}}}
   [junit4]   2> 1859096 INFO  (qtp15531146-23478) [n:127.0.0.1:59580_ c:control_collection s:shard1  x:control_collection_shard1_replica_n1] o.a.s.u.UpdateHandler Using UpdateLog implementation: org.apache.solr.update.UpdateLog
   [junit4]   2> 1859096 INFO  (qtp15531146-23478) [n:127.0.0.1:59580_ c:control_collection s:shard1  x:control_collection_shard1_replica_n1] o.a.s.u.UpdateLog Initializing UpdateLog: dataDir= defaultSyncLevel=FLUSH numRecordsToKeep=100 maxNumLogsToKeep=10 numVersionBuckets=65536
   [junit4]   2> 1859099 INFO  (qtp15531146-23478) [n:127.0.0.1:59580_ c:control_collection s:shard1  x:control_collection_shard1_replica_n1] o.a.s.u.CommitTracker Hard AutoCommit: if uncommited for 15000ms; 
   [junit4]   2> 1859099 INFO  (qtp15531146-23478) [n:127.0.0.1:59580_ c:control_collection s:shard1  x:control_collection_shard1_replica_n1] o.a.s.u.CommitTracker Soft AutoCommit: disabled
   [junit4]   2> 1859105 INFO  (qtp15531146-23478) [n:127.0.0.1:59580_ c:control_collection s:shard1  x:control_collection_shard1_replica_n1] o.a.s.u.RandomMergePolicy RandomMergePolicy wrapping class org.apache.lucene.index.TieredMergePolicy: [TieredMergePolicy: maxMergeAtOnce=31, maxMergeAtOnceExplicit=42, maxMergedSegmentMB=21.572265625, floorSegmentMB=1.3662109375, forceMergeDeletesPctAllowed=22.14429203456718, segmentsPerTier=49.0, maxCFSSegmentSizeMB=8.796093022207999E12, noCFSRatio=0.3185157059596685
   [junit4]   2> 1859105 INFO  (qtp15531146-23478) [n:127.0.0.1:59580_ c:control_collection s:shard1  x:control_collection_shard1_replica_n1] o.a.s.s.SolrIndexSearcher Opening [Searcher@142e695[control_collection_shard1_replica_n1] main]
   [junit4]   2> 1859107 INFO  (qtp15531146-23478) [n:127.0.0.1:59580_ c:control_collection s:shard1  x:control_collection_shard1_replica_n1] o.a.s.r.ManagedResourceStorage Configured ZooKeeperStorageIO with znodeBase: /configs/conf1
   [junit4]   2> 1859107 INFO  (qtp15531146-23478) [n:127.0.0.1:59580_ c:control_collection s:shard1  x:control_collection_shard1_replica_n1] o.a.s.r.ManagedResourceStorage Loaded null at path _rest_managed.json using ZooKeeperStorageIO:path=/configs/conf1
   [junit4]   2> 1859107 INFO  (qtp15531146-23478) [n:127.0.0.1:59580_ c:control_collection s:shard1  x:control_collection_shard1_replica_n1] o.a.s.h.ReplicationHandler Commits will be reserved for 10000ms.
   [junit4]   2> 1859108 INFO  (searcherExecutor-8977-thread-1-processing-n:127.0.0.1:59580_ x:control_collection_shard1_replica_n1 s:shard1 c:control_collection) [n:127.0.0.1:59580_ c:control_collection s:shard1  x:control_collection_shard1_replica_n1] o.a.s.c.SolrCore [control_collection_shard1_replica_n1] Registered new searcher Searcher@142e695[control_collection_shard1_replica_n1] main{ExitableDirectoryReader(UninvertingDirectoryReader())}
   [junit4]   2> 1859109 INFO  (qtp15531146-23478) [n:127.0.0.1:59580_ c:control_collection s:shard1  x:control_collection_shard1_replica_n1] o.a.s.u.UpdateLog Could not find max version in index or recent updates, using new clock 1594638455916199936
   [junit4]   2> 1859115 INFO  (qtp15531146-23478) [n:127.0.0.1:59580_ c:control_collection s:shard1  x:control_collection_shard1_replica_n1] o.a.s.c.ZkShardTerms Successful update terms at /collections/control_collection/terms/shard1 to Terms{values={core_node2=0}, version=0}
   [junit4]   2> 1859120 INFO  (qtp15531146-23478) [n:127.0.0.1:59580_ c:control_collection s:shard1  x:control_collection_shard1_replica_n1] o.a.s.c.ShardLeaderElectionContext Enough replicas found to continue.
   [junit4]   2> 1859121 INFO  (qtp15531146-23478) [n:127.0.0.1:59580_ c:control_collection s:shard1  x:control_collection_shard1_replica_n1] o.a.s.c.ShardLeaderElectionContext I may be the new leader - try and sync
   [junit4]   2> 1859121 INFO  (qtp15531146-23478) [n:127.0.0.1:59580_ c:control_collection s:shard1  x:control_collection_shard1_replica_n1] o.a.s.c.SyncStrategy Sync replicas to http://127.0.0.1:59580/control_collection_shard1_replica_n1/
   [junit4]   2> 1859121 INFO  (qtp15531146-23478) [n:127.0.0.1:59580_ c:control_collection s:shard1  x:control_collection_shard1_replica_n1] o.a.s.c.SyncStrategy Sync Success - now sync replicas to me
   [junit4]   2> 1859121 INFO  (qtp15531146-23478) [n:127.0.0.1:59580_ c:control_collection s:shard1  x:control_collection_shard1_replica_n1] o.a.s.c.SyncStrategy http://127.0.0.1:59580/control_collection_shard1_replica_n1/ has no replicas
   [junit4]   2> 1859121 INFO  (qtp15531146-23478) [n:127.0.0.1:59580_ c:control_collection s:shard1  x:control_collection_shard1_replica_n1] o.a.s.c.ShardLeaderElectionContext Found all replicas participating in election, clear LIR
   [junit4]   2> 1859125 INFO  (qtp15531146-23478) [n:127.0.0.1:59580_ c:control_collection s:shard1  x:control_collection_shard1_replica_n1] o.a.s.c.ShardLeaderElectionContext I am the new leader: http://127.0.0.1:59580/control_collection_shard1_replica_n1/ shard1
   [junit4]   2> 1859228 INFO  (zkCallback-7216-thread-2-processing-n:127.0.0.1:59580_) [n:127.0.0.1:59580_    ] o.a.s.c.c.ZkStateReader A cluster state change: [WatchedEvent state:SyncConnected type:NodeDataChanged path:/collections/control_collection/state.json] for collection [control_collection] has occurred - updating... (live nodes size: [1])
   [junit4]   2> 1859276 INFO  (qtp15531146-23478) [n:127.0.0.1:59580_ c:control_collection s:shard1  x:control_collection_shard1_replica_n1] o.a.s.c.ZkController I am the leader, no recovery necessary
   [junit4]   2> 1859280 INFO  (qtp15531146-23478) [n:127.0.0.1:59580_ c:control_collection s:shard1  x:control_collection_shard1_replica_n1] o.a.s.s.HttpSolrCall [admin] webapp=null path=/admin/cores params={qt=/admin/cores&collection.configName=conf1&newCollection=true&name=control_collection_shard1_replica_n1&action=CREATE&numShards=1&collection=control_collection&shard=shard1&wt=javabin&version=2&replicaType=NRT} status=0 QTime=1584
   [junit4]   2> 1859283 INFO  (qtp15531146-23474) [n:127.0.0.1:59580_    ] o.a.s.h.a.CollectionsHandler Wait for new collection to be active for at most 30 seconds. Check all shard replicas
   [junit4]   2> 1859382 INFO  (zkCallback-7216-thread-2-processing-n:127.0.0.1:59580_) [n:127.0.0.1:59580_    ] o.a.s.c.c.ZkStateReader A cluster state change: [WatchedEvent state:SyncConnected type:NodeDataChanged path:/collections/control_collection/state.json] for collection [control_collection] has occurred - updating... (live nodes size: [1])
   [junit4]   2> 1859591 INFO  (OverseerCollectionConfigSetProcessor-72114491814182916-127.0.0.1:59580_-n_0000000000) [n:127.0.0.1:59580_    ] o.a.s.c.OverseerTaskQueue Response ZK path: /overseer/collection-queue-work/qnr-0000000000 doesn't exist.  Requestor may have disconnected from ZooKeeper
   [junit4]   2> 1860284 INFO  (qtp15531146-23474) [n:127.0.0.1:59580_    ] o.a.s.s.HttpSolrCall [admin] webapp=null path=/admin/collections params={replicationFactor=1&collection.configName=conf1&name=control_collection&nrtReplicas=1&action=CREATE&numShards=1&createNodeSet=127.0.0.1:59580_&wt=javabin&version=2} status=0 QTime=2695
   [junit4]   2> 1860285 WARN  (NIOServerCxn.Factory:0.0.0.0/0.0.0.0:0) [    ] o.a.z.s.NIOServerCnxn Unable to read additional data from client sessionid 0x10033bf8bbe0006, likely client has closed socket
   [junit4]   2> 1860294 INFO  (zkConnectionManagerCallback-7230-thread-1) [    ] o.a.s.c.c.ConnectionManager zkClient has connected
   [junit4]   2> 1860296 INFO  (TEST-ChaosMonkeyNothingIsSafeTest.test-seed#[74D23F9805C08E60]) [    ] o.a.s.c.c.ZkStateReader Updated live nodes from ZooKeeper... (0) -> (1)
   [junit4]   2> 1860297 INFO  (TEST-ChaosMonkeyNothingIsSafeTest.test-seed#[74D23F9805C08E60]) [    ] o.a.s.c.s.i.ZkClientClusterStateProvider Cluster at 127.0.0.1:59573/solr ready
   [junit4]   2> 1860297 INFO  (TEST-ChaosMonkeyNothingIsSafeTest.test-seed#[74D23F9805C08E60]) [    ] o.a.s.c.ChaosMonkey monkey: init - expire sessions:false cause connection loss:false
   [junit4]   2> 1860298 INFO  (qtp15531146-23478) [n:127.0.0.1:59580_    ] o.a.s.h.a.CollectionsHandler Invoked Collection Action :create with params replicationFactor=1&collection.configName=conf1&name=collection1&nrtReplicas=1&action=CREATE&numShards=1&createNodeSet=&stateFormat=1&wt=javabin&version=2 and sendToOCPQueue=true
   [junit4]   2> 1860300 INFO  (OverseerThreadFactory-8974-thread-2-processing-n:127.0.0.1:59580_) [n:127.0.0.1:59580_    ] o.a.s.c.a.c.CreateCollectionCmd Create collection collection1
   [junit4]   2> 1860302 WARN  (OverseerThreadFactory-8974-thread-2-processing-n:127.0.0.1:59580_) [n:127.0.0.1:59580_    ] o.a.s.c.a.c.CreateCollectionCmd It is unusual to create a collection (collection1) without cores.
   [junit4]   2> 1860537 INFO  (qtp15531146-23478) [n:127.0.0.1:59580_    ] o.a.s.h.a.CollectionsHandler Wait for new collection to be active for at most 30 seconds. Check all shard replicas
   [junit4]   2> 1860537 INFO  (qtp15531146-23478) [n:127.0.0.1:59580_    ] o.a.s.s.HttpSolrCall [admin] webapp=null path=/admin/collections params={replicationFactor=1&collection.configName=conf1&name=collection1&nrtReplicas=1&action=CREATE&numShards=1&createNodeSet=&stateFormat=1&wt=javabin&version=2} status=0 QTime=239
   [junit4]   2> 1861313 INFO  (TEST-ChaosMonkeyNothingIsSafeTest.test-seed#[74D23F9805C08E60]) [    ] o.a.s.c.AbstractFullDistribZkTestBase create jetty 1 in directory C:\Users\jenkins\workspace\Lucene-Solr-7.x-Windows\solr\build\solr-core\test\J1\temp\solr.cloud.ChaosMonkeyNothingIsSafeTest_74D23F9805C08E60-001\shard-1-001 of type TLOG
   [junit4]   2> 1861314 INFO  (TEST-ChaosMonkeyNothingIsSafeTest.test-seed#[74D23F9805C08E60]) [    ] o.e.j.s.Server jetty-9.4.8.v20171121, build timestamp: 2017-11-22T04:27:37+07:00, git hash: 82b8fb23f757335bb3329d540ce37a2a2615f0a8
   [junit4]   2> 1861314 INFO  (TEST-ChaosMonkeyNothingIsSafeTest.test-seed#[74D23F9805C08E60]) [    ] o.e.j.s.session DefaultSessionIdManager workerName=node0
   [junit4]   2> 1861314 INFO  (TEST-ChaosMonkeyNothingIsSafeTest.test-seed#[74D23F9805C08E60]) [    ] o.e.j.s.session No SessionScavenger set, using defaults
   [junit4]   2> 1861314 INFO  (TEST-ChaosMonkeyNothingIsSafeTest.test-seed#[74D23F9805C08E60]) [    ] o.e.j.s.session Scavenging every 660000ms
   [junit4]   2> 1861314 INFO  (TEST-ChaosMonkeyNothingIsSafeTest.test-seed#[74D23F9805C08E60]) [    ] o.e.j.s.h.ContextHandler Started o.e.j.s.ServletContextHandler@19d080c{/,null,AVAILABLE}
   [junit4]   2> 1861315 INFO  (TEST-ChaosMonkeyNothingIsSafeTest.test-seed#[74D23F9805C08E60]) [    ] o.e.j.s.AbstractConnector Started ServerConnector@cc96e8{HTTP/1.1,[http/1.1]}{127.0.0.1:59606}
   [junit4]   2> 1861315 INFO  (TEST-ChaosMonkeyNothingIsSafeTest.test-seed#[74D23F9805C08E60]) [    ] o.e.j.s.Server Started @1869704ms
   [junit4]   2> 1861315 INFO  (TEST-ChaosMonkeyNothingIsSafeTest.test-seed#[74D23F9805C08E60]) [    ] o.a.s.c.s.e.JettySolrRunner Jetty properties: {solr.data.dir=C:\Users\jenkins\workspace\Lucene-Solr-7.x-Windows\solr\build\solr-core\test\J1\temp\solr.cloud.ChaosMonkeyNothingIsSafeTest_74D23F9805C08E60-001\tempDir-001/jetty1, replicaType=TLOG, solrconfig=solrconfig.xml, hostContext=/, hostPort=59606, coreRootDirectory=C:\Users\jenkins\workspace\Lucene-Solr-7.x-Windows\solr\build\solr-core\test\J1\..\..\..\..\..\..\..\..\..\Users\jenkins\workspace\Lucene-Solr-7.x-Windows\solr\build\solr-core\test\J1\temp\solr.cloud.ChaosMonkeyNothingIsSafeTest_74D23F9805C08E60-001\shard-1-001\cores}
   [junit4]   2> 1861316 ERROR (TEST-ChaosMonkeyNothingIsSafeTest.test-seed#[74D23F9805C08E60]) [    ] o.a.s.u.StartupLoggingUtils Missing Java Option solr.log.dir. Logging may be missing or incomplete.
   [junit4]   2> 1861316 INFO  (TEST-ChaosMonkeyNothingIsSafeTest.test-seed#[74D23F9805C08E60]) [    ] o.a.s.s.SolrDispatchFilter  ___      _       Welcome to Apache Solr™ version 7.3.0
   [junit4]   2> 1861316 INFO  (TEST-ChaosMonkeyNothingIsSafeTest.test-seed#[74D23F9805C08E60]) [    ] o.a.s.s.SolrDispatchFilter / __| ___| |_ _   Starting in cloud mode on port null
   [junit4]   2> 1861316 INFO  (TEST-ChaosMonkeyNothingIsSafeTest.test-seed#[74D23F9805C08E60]) [    ] o.a.s.s.SolrDispatchFilter \__ \/ _ \ | '_|  Install dir: null
   [junit4]   2> 1861316 INFO  (TEST-ChaosMonkeyNothingIsSafeTest.test-seed#[74D23F9805C08E60]) [    ] o.a.s.s.SolrDispatchFilter |___/\___/_|_|    Start time: 2018-03-11T10:55:41.568Z
   [junit4]   2> 1861319 INFO  (zkConnectionManagerCallback-7232-thread-1) [    ] o.a.s.c.c.ConnectionManager zkClient has connected
   [junit4]   2> 1861321 WARN  (NIOServerCxn.Factory:0.0.0.0/0.0.0.0:0) [    ] o.a.z.s.NIOServerCnxn Unable to read additional data from client sessionid 0x10033bf8bbe0008, likely client has closed socket
   [junit4]   2> 1861321 INFO  (TEST-ChaosMonkeyNothingIsSafeTest.test-seed#[74D23F9805C08E60]) [    ] o.a.s.s.SolrDispatchFilter Loading solr.xml from SolrHome (not found in ZooKeeper)
   [junit4]   2> 1861321 INFO  (TEST-ChaosMonkeyNothingIsSafeTest.test-seed#[74D23F9805C08E60]) [    ] o.a.s.c.SolrXmlConfig Loading container configuration from C:\Users\jenkins\workspace\Lucene-Solr-7.x-Windows\solr\build\solr-core\test\J1\temp\solr.cloud.ChaosMonkeyNothingIsSafeTest_74D23F9805C08E60-001\shard-1-001\solr.xml
   [junit4]   2> 1861330 INFO  (TEST-ChaosMonkeyNothingIsSafeTest.test-seed#[74D23F9805C08E60]) [    ] o.a.s.c.SolrXmlConfig Configuration parameter autoReplicaFailoverWorkLoopDelay is ignored
   [junit4]   2> 1861330 INFO  (TEST-ChaosMonkeyNothingIsSafeTest.test-seed#[74D23F9805C08E60]) [    ] o.a.s.c.SolrXmlConfig Configuration parameter autoReplicaFailoverBadNodeExpiration is ignored
   [junit4]   2> 1861330 INFO  (TEST-ChaosMonkeyNothingIsSafeTest.test-seed#[74D23F9805C08E60]) [    ] o.a.s.c.SolrXmlConfig MBean server found: com.sun.jmx.mbeanserver.JmxMBeanServer@a8410e, but no JMX reporters were configured - adding default JMX reporter.
   [junit4]   2> 1861336 INFO  (TEST-ChaosMonkeyNothingIsSafeTest.test-seed#[74D23F9805C08E60]) [    ] o.a.s.c.ZkContainer Zookeeper client=127.0.0.1:59573/solr
   [junit4]   2> 1861337 INFO  (zkConnectionManagerCallback-7236-thread-1) [    ] o.a.s.c.c.ConnectionManager zkClient has connected
   [junit4]   2> 1861341 INFO  (zkConnectionManagerCallback-7238-thread-1-processing-n:127.0.0.1:59606_) [n:127.0.0.1:59606_    ] o.a.s.c.c.ConnectionManager zkClient has connected
   [junit4]   2> 1861348 INFO  (TEST-ChaosMonkeyNothingIsSafeTest.test-seed#[74D23F9805C08E60]) [n:127.0.0.1:59606_    ] o.a.s.c.c.ZkStateReader Updated live nodes from ZooKeeper... (0) -> (1)
   [junit4]   2> 1861348 INFO  (TEST-ChaosMonkeyNothingIsSafeTest.test-seed#[74D23F9805C08E60]) [n:127.0.0.1:59606_    ] o.a.s.c.Overseer Overseer (id=null) closing
   [junit4]   2> 1861353 INFO  (TEST-ChaosMonkeyNothingIsSafeTest.test-seed#[74D23F9805C08E60]) [n:127.0.0.1:59606_    ] o.a.s.c.ZkController Register node as live in ZooKeeper:/live_nodes/127.0.0.1:59606_
   [junit4]   2> 1861354 INFO  (zkCallback-7216-thread-2-processing-n:127.0.0.1:59580_) [n:127.0.0.1:59580_    ] o.a.s.c.c.ZkStateReader Updated live nodes from ZooKeeper... (1) -> (2)
   [junit4]   2> 1861354 INFO  (zkCallback-7221-thread-1-processing-n:127.0.0.1:59580_) [n:127.0.0.1:59580_    ] o.a.s.c.c.ZkStateReader Updated live nodes from ZooKeeper... (1) -> (2)
   [junit4]   2> 1861354 INFO  (zkCallback-7229-thread-1) [    ] o.a.s.c.c.ZkStateReader Updated live nodes from ZooKeeper... (1) -> (2)
   [junit4]   2> 1861355 INFO  (zkCallback-7237-thread-1-processing-n:127.0.0.1:59606_) [n:127.0.0.1:59606_    ] o.a.s.c.c.ZkStateReader Updated live nodes from ZooKeeper... (1) -> (2)
   [junit4]   2> 1861470 INFO  (TEST-ChaosMonkeyNothingIsSafeTest.test-seed#[74D23F9805C08E60]) [n:127.0.0.1:59606_    ] o.a.s.m.r.SolrJmxReporter JMX monitoring for 'solr.node' (registry 'solr.node') enabled at server: com.sun.jmx.mbeanserver.JmxMBeanServer@a8410e
   [junit4]   2> 1861493 INFO  (TEST-ChaosMonkeyNothingIsSafeTest.test-seed#[74D23F9805C08E60]) [n:127.0.0.1:59606_    ] o.a.s.m.r.SolrJmxReporter JMX monitoring for 'solr.jvm' (registry 'solr.jvm') enabled at server: com.sun.jmx.mbeanserver.JmxMBeanServer@a8410e
   [junit4]   2> 1861494 INFO  (TEST-ChaosMonkeyNothingIsSafeTest.test-seed#[74D23F9805C08E60]) [n:127.0.0.1:59606_    ] o.a.s.m.r.SolrJmxReporter JMX monitoring for 'solr.jetty' (registry 'solr.jetty') enabled at server: com.sun.jmx.mbeanserver.JmxMBeanServer@a8410e
   [junit4]   2> 1861496 INFO  (TEST-ChaosMonkeyNothingIsSafeTest.test-seed#[74D23F9805C08E60]) [n:127.0.0.1:59606_    ] o.a.s.c.CorePropertiesLocator Found 0 core definitions underneath C:\Users\jenkins\workspace\Lucene-Solr-7.x-Windows\solr\build\solr-core\test\J1\..\..\..\..\..\..\..\..\..\Users\jenkins\workspace\Lucene-Solr-7.x-Windows\solr\build\solr-core\test\J1\temp\solr.cloud.ChaosMonkeyNothingIsSafeTest_74D23F9805C08E60-001\shard-1-001\cores
   [junit4]   2> 1861501 INFO  (zkConnectionManagerCallback-7243-thread-1-processing-n:127.0.0.1:59606_) [n:127.0.0.1:59606_    ] o.a.s.c.c.ConnectionManager zkClient has connected
   [junit4]   2> 1861503 INFO  (TEST-ChaosMonkeyNothingIsSafeTest.test-seed#[74D23F9805C08E60]) [n:127.0.0.1:59606_    ] o.a.s.c.c.ZkStateReader Updated live nodes from ZooKeeper... (0) -> (2)
   [junit4]   2> 1861504 INFO  (TEST-ChaosMonkeyNothingIsSafeTest.test-seed#[74D23F9805C08E60]) [n:127.0.0.1:59606_    ] o.a.s.c.s.i.ZkClientClusterStateProvider Cluster at 127.0.0.1:59573/solr ready
   [junit4]   2> 1861531 INFO  (qtp15531146-23476) [n:127.0.0.1:59580_    ] o.a.s.h.a.CollectionsHandler Invoked Collection Action :addreplica with params node=127.0.0.1:59606_&action=ADDREPLICA&collection=collection1&shard=shard1&type=TLOG&wt=javabin&version=2 and sendToOCPQueue=true
   [junit4]   2> 1861534 INFO  (OverseerCollectionConfigSetProcessor-72114491814182916-127.0.0.1:59580_-n_0000000000) [n:127.0.0.1:59580_    ] o.a.s.c.OverseerTaskQueue Response ZK path: /overseer/collection-queue-work/qnr-0000000002 doesn't exist.  Requestor may have disconnected from ZooKeeper
   [junit4]   2> 1861535 INFO  (OverseerThreadFactory-8974-thread-3-processing-n:127.0.0.1:59580_) [n:127.0.0.1:59580_    ] o.a.s.c.a.c.AddReplicaCmd Node Identified 127.0.0.1:59606_ for creating new replica
   [junit4]   2> 1861538 INFO  (qtp29058675-23528) [n:127.0.0.1:59606_    ] o.a.s.h.a.CoreAdminOperation core create command qt=/admin/cores&collection.configName=conf1&name=collection1_shard1_replica_t21&action=CREATE&collection=collection1&shard=shard1&wt=javabin&version=2&replicaType=TLOG
   [junit4]   2> 1861539 INFO  (qtp29058675-23528) [n:127.0.0.1:59606_    ] o.a.s.c.TransientSolrCoreCacheDefault Allocating transient cache for 4 transient cores
   [junit4]   2> 1862565 INFO  (qtp29058675-23528) [n:127.0.0.1:59606_ c:collection1 s:shard1  x:collection1_shard1_replica_t21] o.a.s.c.SolrConfig Using Lucene MatchVersion: 7.3.0
   [junit4]   2> 1862575 INFO  (qtp29058675-23528) [n:127.0.0.1:59606_ c:collection1 s:shard1  x:collection1_shard1_replica_t21] o.a.s.s.IndexSchema [collection1_shard1_replica_t21] Schema name=test
   [junit4]   2> 1862647 INFO  (qtp29058675-23528) [n:127.0.0.1:59606_ c:collection1 s:shard1  x:collection1_shard1_replica_t21] o.a.s.s.IndexSchema Loaded schema test/1.6 with uniqueid field id
   [junit4]   2> 1862659 INFO  (qtp29058675-23528) [n:127.0.0.1:59606_ c:collection1 s:shard1  x:collection1_shard1_replica_t21] o.a.s.c.CoreContainer Creating SolrCore 'collection1_shard1_replica_t21' using configuration from collection collection1, trusted=true
   [junit4]   2> 1862660 INFO  (qtp29058675-23528) [n:127.0.0.1:59606_ c:collection1 s:shard1  x:collection1_shard1_replica_t21] o.a.s.m.r.SolrJmxReporter JMX monitoring for 'solr.core.collection1.shard1.replica_t21' (registry 'solr.core.collection1.shard1.replica_t21') enabled at server: com.sun.jmx.mbeanserver.JmxMBeanServer@a8410e
   [junit4]   2> 1862660 INFO  (qtp29058675-23528) [n:127.0.0.1:59606_ c:collection1 s:shard1  x:collection1_shard1_replica_t21] o.a.s.c.SolrCore solr.RecoveryStrategy.Builder
   [junit4]   2> 1862660 INFO  (qtp29058675-23528) [n:127.0.0.1:59606_ c:collection1 s:shard1  x:collection1_shard1_replica_t21] o.a.s.c.SolrCore [[collection1_shard1_replica_t21] ] Opening new SolrCore at [C:\Users\jenkins\workspace\Lucene-Solr-7.x-Windows\solr\build\solr-core\test\J1\temp\solr.cloud.ChaosMonkeyNothingIsSafeTest_74D23F9805C08E60-001\shard-1-001\cores\collection1_shard1_replica_t21], dataDir=[C:\Users\jenkins\workspace\Lucene-Solr-7.x-Windows\solr\build\solr-core\test\J1\..\..\..\..\..\..\..\..\..\Users\jenkins\workspace\Lucene-Solr-7.x-Windows\solr\build\solr-core\test\J1\temp\solr.cloud.ChaosMonkeyNothingIsSafeTest_74D23F9805C08E60-001\shard-1-001\cores\collection1_shard1_replica_t21\data\]
   [junit4]   2> 1862666 INFO  (qtp29058675-23528) [n:127.0.0.1:59606_ c:collection1 s:shard1  x:collection1_shard1_replica_t21] o.a.s.u.RandomMergePolicy RandomMergePolicy wrapping class org.apache.lucene.index.TieredMergePolicy: [TieredMergePolicy: maxMergeAtOnce=42, maxMergeAtOnceExplicit=16, maxMergedSegmentMB=48.6884765625, floorSegmentMB=1.6279296875, forceMergeDeletesPctAllowed=25.27951720093537, segmentsPerTier=34.0, maxCFSSegmentSizeMB=8.796093022207999E12, noCFSRatio=0.0
   [junit4]   2> 1862688 WARN  (qtp29058675-23528) [n:127.0.0.1:59606_ c:collection1 s:shard1  x:collection1_shard1_replica_t21] o.a.s.c.RequestHandlers INVALID paramSet a in requestHandler {type = requestHandler,name = /dump,class = DumpRequestHandler,attributes = {initParams=a, name=/dump, class=DumpRequestHandler},args = {defaults={a=A,b=B}}}
   [junit4]   2> 1862783 INFO  (qtp29058675-23528) [n:127.0.0.1:59606_ c:collection1 s:shard1  x:collection1_shard1_replica_t21] o.a.s.u.UpdateHandler Using UpdateLog implementation: org.apache.solr.update.UpdateLog
   [junit4]   2> 1862783 INFO  (qtp29058675-23528) [n:127.0.0.1:59606_ c:collection1 s:shard1  x:collection1_shard1_replica_t21] o.a.s.u.UpdateLog Initializing UpdateLog: dataDir= defaultSyncLevel=FLUSH numRecordsToKeep=100 maxNumLogsToKeep=10 numVersionBuckets=65536
   [junit4]   2> 1862785 INFO  (qtp29058675-23528) [n:127.0.0.1:59606_ c:collection1 s:shard1  x:collection1_shard1_replica_t21] o.a.s.u.CommitTracker Hard AutoCommit: if uncommited for 15000ms; 
   [junit4]   2> 1862785 INFO  (qtp29058675-23528) [n:127.0.0.1:59606_ c:collection1 s:shard1  x:collection1_shard1_replica_t21] o.a.s.u.CommitTracker Soft AutoCommit: disabled
   [junit4]   2> 1862787 INFO  (qtp29058675-23528) [n:127.0.0.1:59606_ c:collection1 s:shard1  x:collection1_shard1_replica_t21] o.a.s.u.RandomMergePolicy RandomMergePolicy wrapping class org.apache.lucene.index.TieredMergePolicy: [TieredMergePolicy: maxMergeAtOnce=31, maxMergeAtOnceExplicit=42, maxMergedSegmentMB=21.572265625, floorSegmentMB=1.3662109375, forceMergeDeletesPctAllowed=22.14429203456718, segmentsPerTier=49.0, maxCFSSegmentSizeMB=8.796093022207999E12, noCFSRatio=0.3185157059596685
   [junit4]   2> 1862787 INFO  (qtp29058675-23528) [n:127.0.0.1:59606_ c:collection1 s:shard1  x:collection1_shard1_replica_t21] o.a.s.s.SolrIndexSearcher Opening [Searcher@17efcc8[collection1_shard1_replica_t21] main]
   [junit4]   2> 1862788 INFO  (qtp29058675-23528) [n:127.0.0.1:59606_ c:collection1 s:shard1  x:collection1_shard1_replica_t21] o.a.s.r.ManagedResourceStorage Configured ZooKeeperStorageIO with znodeBase: /configs/conf1
   [junit4]   2> 1862789 INFO  (qtp29058675-23528) [n:127.0.0.1:59606_ c:collection1 s:shard1  x:collection1_shard1_replica_t21] o.a.s.r.ManagedResourceStorage Loaded null at path _rest_managed.json using ZooKeeperStorageIO:path=/configs/conf1
   [junit4]   2> 1862789 INFO  (qtp29058675-23528) [n:127.0.0.1:59606_ c:collection1 s:shard1  x:collection1_shard1_replica_t21] o.a.s.h.ReplicationHandler Commits will be reserved for 10000ms.
   [junit4]   2> 1862790 INFO  (searcherExecutor-8988-thread-1-processing-n:127.0.0.1:59606_ x:collection1_shard1_replica_t21 s:shard1 c:collection1) [n:127.0.0.1:59606_ c:collection1 s:shard1  x:collection1_shard1_replica_t21] o.a.s.c.SolrCore [collection1_shard1_replica_t21] Registered new searcher Searcher@17efcc8[collection1_shard1_replica_t21] main{ExitableDirectoryReader(UninvertingDirectoryReader())}
   [junit4]   2> 1862790 INFO  (qtp29058675-23528) [n:127.0.0.1:59606_ c:collection1 s:shard1  x:collection1_shard1_replica_t21] o.a.s.u.UpdateLog Could not find max version in index or recent updates, using new clock 1594638459776008192
   [junit4]   2> 1862796 INFO  (qtp29058675-23528) [n:127.0.0.1:59606_ c:collection1 s:shard1  x:collection1_shard1_replica_t21] o.a.s.c.ZkShardTerms Successful update terms at /collections/collection1/terms/shard1 to Terms{values={core_node22=0}, version=0}
   [junit4]   2> 1862798 INFO  (qtp29058675-23528) [n:127.0.0.1:59606_ c:collection1 s:shard1  x:collection1_shard1_replica_t21] o.a.s.c.ShardLeaderElectionContext Enough replicas found to continue.
   [junit4]   2> 1862798 INFO  (qtp29058675-23528) [n:127.0.0.1:59606_ c:collection1 s:shard1  x:collection1_shard1_replica_t21] o.a.s.c.ShardLeaderElectionContext I may be the new leader - try and sync
   [junit4]   2> 1862799 INFO  (qtp29058675-23528) [n:127.0.0.1:59606_ c:collection1 s:shard1  x:collection1_shard1_replica_t21] o.a.s.c.SyncStrategy Sync replicas to http://127.0.0.1:59606/collection1_shard1_replica_t21/
   [junit4]   2> 1862799 INFO  (qtp29058675-23528) [n:127.0.0.1:59606_ c:collection1 s:shard1  x:collection1_shard1_replica_t21] o.a.s.c.SyncStrategy Sync Success - now sync replicas to me
   [junit4]   2> 1862799 INFO  (qtp29058675-23528) [n:127.0.0.1:59606_ c:collection1 s:shard1  x:collection1_shard1_replica_t21] o.a.s.c.SyncStrategy http://127.0.0.1:59606/collection1_shard1_replica_t21/ has no replicas
   [junit4]   2> 1862799 INFO  (qtp29058675-23528) [n:127.0.0.1:59606_ c:collection1 s:shard1  x:collection1_shard1_replica_t21] o.a.s.c.ShardLeaderElectionContext Found all replicas participating in election, clear LIR
   [junit4]   2> 1862799 INFO  (qtp29058675-23528) [n:127.0.0.1:59606_ c:collection1 s:shard1  x:collection1_shard1_replica_t21] o.a.s.c.ZkController collection1_shard1_replica_t21 stopping background replication from leader
   [junit4]   2> 1862802 INFO  (qtp29058675-23528) [n:127.0.0.1:59606_ c:collection1 s:shard1  x:collection1_shard1_replica_t21] o.a.s.c.ShardLeaderElectionContext I am the new leader: http://127.0.0.1:59606/collection1_shard1_replica_t21/ shard1
   [junit4]   2> 1862953 INFO  (qtp29058675-23528) [n:127.0.0.1:59606_ c:collection1 s:shard1  x:collection1_shard1_replica_t21] o.a.s.c.ZkController I am the leader, no recovery necessary
   [junit4]   2> 1862956 INFO  (qtp29058675-23528) [n:127.0.0.1:59606_ c:collection1 s:shard1  x:collection1_shard1_replica_t21] o.a.s.s.HttpSolrCall [admin] webapp=null path=/admin/cores params={qt=/admin/cores&collection.configName=conf1&name=collection1_shard1_replica_t21&action=CREATE&collection=collection1&shard=shard1&wt=javabin&version=2&replicaType=TLOG} status=0 QTime=1418
   [junit4]   2> 1862958 INFO  (qtp15531146-23476) [n:127.0.0.1:59580_    ] o.a.s.s.HttpSolrCall [admin] webapp=null path=/admin/collections params={node=127.0.0.1:59606_&action=ADDREPLICA&collection=collection1&shard=shard1&type=TLOG&wt=javabin&version=2} status=0 QTime=1426
   [junit4]   2> 1863509 INFO  (TEST-ChaosMonkeyNothingIsSafeTest.test-seed#[74D23F9805C08E60]) [    ] o.a.s.c.AbstractFullDistribZkTestBase create jetty 2 in directory C:\Users\jenkins\workspace\Lucene-Solr-7.x-Windows\solr\build\solr-core\test\J1\temp\solr.cloud.ChaosMonkeyNothingIsSafeTest_74D23F9805C08E60-001\shard-2-001 of type TLOG
   [junit4]   2> 1863510 INFO  (TEST-ChaosMonkeyNothingI

[...truncated too long message...]

WARN  (TEST-ChaosMonkeyNothingIsSafeTest.test-seed#[74D23F9805C08E60]-SendThread(127.0.0.1:51860)) [    ] o.a.z.ClientCnxn Session 0x10033d4b8ae0007 for server null, unexpected error, closing socket connection and attempting reconnect
   [junit4]   2> java.nio.channels.ClosedByInterruptException
   [junit4]   2> 	at java.nio.channels.spi.AbstractInterruptibleChannel.end(AbstractInterruptibleChannel.java:202)
   [junit4]   2> 	at sun.nio.ch.SocketChannelImpl.finishConnect(SocketChannelImpl.java:753)
   [junit4]   2> 	at org.apache.zookeeper.ClientCnxnSocketNIO.doTransport(ClientCnxnSocketNIO.java:361)
   [junit4]   2> 	at org.apache.zookeeper.ClientCnxn$SendThread.run(ClientCnxn.java:1144)
   [junit4]   2> Mar 11, 2018 11:21:03 AM com.carrotsearch.randomizedtesting.ThreadLeakControl tryToInterruptAll
   [junit4]   2> SEVERE: There are still zombie threads that couldn't be terminated:
   [junit4]   2>    1) Thread[id=115, name=TEST-ChaosMonkeyNothingIsSafeTest.test-seed#[74D23F9805C08E60]-SendThread(127.0.0.1:51860), state=TIMED_WAITING, group=TGRP-ChaosMonkeyNothingIsSafeTest]
   [junit4]   2>         at java.lang.Thread.sleep(Native Method)
   [junit4]   2>         at org.apache.zookeeper.ClientCnxn$SendThread.run(ClientCnxn.java:1054)
   [junit4]   2>    2) Thread[id=117, name=zkConnectionManagerCallback-25-thread-1, state=WAITING, group=TGRP-ChaosMonkeyNothingIsSafeTest]
   [junit4]   2>         at sun.misc.Unsafe.park(Native Method)
   [junit4]   2>         at java.util.concurrent.locks.LockSupport.park(LockSupport.java:175)
   [junit4]   2>         at java.util.concurrent.locks.AbstractQueuedSynchronizer$ConditionObject.await(AbstractQueuedSynchronizer.java:2039)
   [junit4]   2>         at java.util.concurrent.LinkedBlockingQueue.take(LinkedBlockingQueue.java:442)
   [junit4]   2>         at java.util.concurrent.ThreadPoolExecutor.getTask(ThreadPoolExecutor.java:1074)
   [junit4]   2>         at java.util.concurrent.ThreadPoolExecutor.runWorker(ThreadPoolExecutor.java:1134)
   [junit4]   2>         at java.util.concurrent.ThreadPoolExecutor$Worker.run(ThreadPoolExecutor.java:624)
   [junit4]   2>         at java.lang.Thread.run(Thread.java:748)
   [junit4]   2> NOTE: test params are: codec=Asserting(Lucene70): {rnd_b=FST50, a_t=FSTOrd50, id=FST50}, docValues:{_version_=DocValuesFormat(name=Memory), a_i=DocValuesFormat(name=Lucene70)}, maxPointsInLeafNode=1544, maxMBSortInHeap=6.74994803372889, sim=RandomSimilarity(queryNorm=false): {}, locale=hr, timezone=Africa/Abidjan
   [junit4]   2> NOTE: Windows 10 10.0 x86/Oracle Corporation 1.8.0_144 (32-bit)/cpus=3,threads=3,free=20966544,total=82202624
   [junit4]   2> NOTE: All tests run in this JVM: [ChaosMonkeyNothingIsSafeTest]
   [junit4]   2> NOTE: reproduce with: ant test  -Dtestcase=ChaosMonkeyNothingIsSafeTest -Dtests.seed=74D23F9805C08E60 -Dtests.slow=true -Dtests.badapples=true -Dtests.locale=hr -Dtests.timezone=Africa/Abidjan -Dtests.asserts=true -Dtests.file.encoding=Cp1252
   [junit4] ERROR   0.00s J1 | ChaosMonkeyNothingIsSafeTest (suite) <<<
   [junit4]    > Throwable #1: com.carrotsearch.randomizedtesting.ThreadLeakError: 4 threads leaked from SUITE scope at org.apache.solr.cloud.ChaosMonkeyNothingIsSafeTest: 
   [junit4]    >    1) Thread[id=114, name=Connection evictor, state=TIMED_WAITING, group=TGRP-ChaosMonkeyNothingIsSafeTest]
   [junit4]    >         at java.lang.Thread.sleep(Native Method)
   [junit4]    >         at org.apache.http.impl.client.IdleConnectionEvictor$1.run(IdleConnectionEvictor.java:66)
   [junit4]    >         at java.lang.Thread.run(Thread.java:748)
   [junit4]    >    2) Thread[id=116, name=TEST-ChaosMonkeyNothingIsSafeTest.test-seed#[74D23F9805C08E60]-EventThread, state=WAITING, group=TGRP-ChaosMonkeyNothingIsSafeTest]
   [junit4]    >         at sun.misc.Unsafe.park(Native Method)
   [junit4]    >         at java.util.concurrent.locks.LockSupport.park(LockSupport.java:175)
   [junit4]    >         at java.util.concurrent.locks.AbstractQueuedSynchronizer$ConditionObject.await(AbstractQueuedSynchronizer.java:2039)
   [junit4]    >         at java.util.concurrent.LinkedBlockingQueue.take(LinkedBlockingQueue.java:442)
   [junit4]    >         at org.apache.zookeeper.ClientCnxn$EventThread.run(ClientCnxn.java:502)
   [junit4]    >    3) Thread[id=115, name=TEST-ChaosMonkeyNothingIsSafeTest.test-seed#[74D23F9805C08E60]-SendThread(127.0.0.1:51860), state=TIMED_WAITING, group=TGRP-ChaosMonkeyNothingIsSafeTest]
   [junit4]    >         at java.lang.Thread.sleep(Native Method)
   [junit4]    >         at org.apache.zookeeper.client.StaticHostProvider.next(StaticHostProvider.java:105)
   [junit4]    >         at org.apache.zookeeper.ClientCnxn$SendThread.startConnect(ClientCnxn.java:1000)
   [junit4]    >         at org.apache.zookeeper.ClientCnxn$SendThread.run(ClientCnxn.java:1063)
   [junit4]    >    4) Thread[id=117, name=zkConnectionManagerCallback-25-thread-1, state=WAITING, group=TGRP-ChaosMonkeyNothingIsSafeTest]
   [junit4]    >         at sun.misc.Unsafe.park(Native Method)
   [junit4]    >         at java.util.concurrent.locks.LockSupport.park(LockSupport.java:175)
   [junit4]    >         at java.util.concurrent.locks.AbstractQueuedSynchronizer$ConditionObject.await(AbstractQueuedSynchronizer.java:2039)
   [junit4]    >         at java.util.concurrent.LinkedBlockingQueue.take(LinkedBlockingQueue.java:442)
   [junit4]    >         at java.util.concurrent.ThreadPoolExecutor.getTask(ThreadPoolExecutor.java:1074)
   [junit4]    >         at java.util.concurrent.ThreadPoolExecutor.runWorker(ThreadPoolExecutor.java:1134)
   [junit4]    >         at java.util.concurrent.ThreadPoolExecutor$Worker.run(ThreadPoolExecutor.java:624)
   [junit4]    >         at java.lang.Thread.run(Thread.java:748)
   [junit4]    > 	at __randomizedtesting.SeedInfo.seed([74D23F9805C08E60]:0)Throwable #2: com.carrotsearch.randomizedtesting.ThreadLeakError: There are still zombie threads that couldn't be terminated:
   [junit4]    >    1) Thread[id=115, name=TEST-ChaosMonkeyNothingIsSafeTest.test-seed#[74D23F9805C08E60]-SendThread(127.0.0.1:51860), state=TIMED_WAITING, group=TGRP-ChaosMonkeyNothingIsSafeTest]
   [junit4]    >         at java.lang.Thread.sleep(Native Method)
   [junit4]    >         at org.apache.zookeeper.ClientCnxn$SendThread.run(ClientCnxn.java:1054)
   [junit4]    >    2) Thread[id=117, name=zkConnectionManagerCallback-25-thread-1, state=WAITING, group=TGRP-ChaosMonkeyNothingIsSafeTest]
   [junit4]    >         at sun.misc.Unsafe.park(Native Method)
   [junit4]    >         at java.util.concurrent.locks.LockSupport.park(LockSupport.java:175)
   [junit4]    >         at java.util.concurrent.locks.AbstractQueuedSynchronizer$ConditionObject.await(AbstractQueuedSynchronizer.java:2039)
   [junit4]    >         at java.util.concurrent.LinkedBlockingQueue.take(LinkedBlockingQueue.java:442)
   [junit4]    >         at java.util.concurrent.ThreadPoolExecutor.getTask(ThreadPoolExecutor.java:1074)
   [junit4]    >         at java.util.concurrent.ThreadPoolExecutor.runWorker(ThreadPoolExecutor.java:1134)
   [junit4]    >         at java.util.concurrent.ThreadPoolExecutor$Worker.run(ThreadPoolExecutor.java:624)
   [junit4]    >         at java.lang.Thread.run(Thread.java:748)
   [junit4]    > 	at __randomizedtesting.SeedInfo.seed([74D23F9805C08E60]:0)
   [junit4] Completed [5/5 (2!)] on J1 in 146.15s, 1 test, 3 errors <<< FAILURES!

[...truncated 13 lines...]
BUILD FAILED
C:\Users\jenkins\workspace\Lucene-Solr-7.x-Windows\lucene\common-build.xml:1561: The following error occurred while executing this line:
C:\Users\jenkins\workspace\Lucene-Solr-7.x-Windows\lucene\common-build.xml:1085: There were test failures: 5 suites, 5 tests, 4 suite-level errors, 2 errors, 3 ignored [seed: 74D23F9805C08E60]

Total time: 2 minutes 29 seconds

[repro] Setting last failure code to 1

[repro] Failures:
[repro]   2/5 failed: org.apache.solr.cloud.ChaosMonkeyNothingIsSafeTest
[repro] Exiting with code 1

C:\Users\jenkins\workspace\Lucene-Solr-7.x-Windows>IF EXIST lucene\build move /y lucene\build lucene\build.repro 
        1 dir(s) moved.

C:\Users\jenkins\workspace\Lucene-Solr-7.x-Windows>IF EXIST solr\build move /y solr\build solr\build.repro 
        1 dir(s) moved.

C:\Users\jenkins\workspace\Lucene-Solr-7.x-Windows>IF EXIST lucene\build.orig move /y lucene\build.orig lucene\build 
        1 dir(s) moved.

C:\Users\jenkins\workspace\Lucene-Solr-7.x-Windows>IF EXIST solr\build.orig move /y solr\build.orig solr\build 
        1 dir(s) moved.

C:\Users\jenkins\workspace\Lucene-Solr-7.x-Windows>exit 0 
Archiving artifacts
Setting ANT_1_8_2_HOME=C:\Users\jenkins\tools\hudson.tasks.Ant_AntInstallation\ANT_1.8.2
[WARNINGS] Parsing warnings in console log with parser Java Compiler (javac)
Setting ANT_1_8_2_HOME=C:\Users\jenkins\tools\hudson.tasks.Ant_AntInstallation\ANT_1.8.2
Setting ANT_1_8_2_HOME=C:\Users\jenkins\tools\hudson.tasks.Ant_AntInstallation\ANT_1.8.2
<Git Blamer> Using GitBlamer to create author and commit information for all warnings.
<Git Blamer> GIT_COMMIT=3ecefe1d0e4d0cbeb6e4393fa2339210f8eb612d, workspace=C:\Users\jenkins\workspace\Lucene-Solr-7.x-Windows
[WARNINGS] Computing warning deltas based on reference build #496
Recording test results
Setting ANT_1_8_2_HOME=C:\Users\jenkins\tools\hudson.tasks.Ant_AntInstallation\ANT_1.8.2
Build step 'Publish JUnit test result report' changed build result to UNSTABLE
Email was triggered for: Unstable (Test Failures)
Sending email for trigger: Unstable (Test Failures)
Setting ANT_1_8_2_HOME=C:\Users\jenkins\tools\hudson.tasks.Ant_AntInstallation\ANT_1.8.2
Setting ANT_1_8_2_HOME=C:\Users\jenkins\tools\hudson.tasks.Ant_AntInstallation\ANT_1.8.2
Setting ANT_1_8_2_HOME=C:\Users\jenkins\tools\hudson.tasks.Ant_AntInstallation\ANT_1.8.2
Setting ANT_1_8_2_HOME=C:\Users\jenkins\tools\hudson.tasks.Ant_AntInstallation\ANT_1.8.2

Mime
View raw message