lucene-dev mailing list archives

Site index · List index
Message view « Date » · « Thread »
Top « Date » · « Thread »
From Apache Jenkins Server <jenk...@builds.apache.org>
Subject [JENKINS] Lucene-Solr-BadApples-Tests-master - Build # 2 - Still Unstable
Date Thu, 01 Mar 2018 20:42:58 GMT
Build: https://builds.apache.org/job/Lucene-Solr-BadApples-Tests-master/2/

4 tests failed.
FAILED:  org.apache.solr.ltr.TestLTRReRankingPipeline.testDifferentTopN

Error Message:
expected:<1.0> but was:<0.0>

Stack Trace:
java.lang.AssertionError: expected:<1.0> but was:<0.0>
	at __randomizedtesting.SeedInfo.seed([ADF49C77C6243E25:5C55EE27F39FF4B7]:0)
	at org.junit.Assert.fail(Assert.java:93)
	at org.junit.Assert.failNotEquals(Assert.java:647)
	at org.junit.Assert.assertEquals(Assert.java:443)
	at org.junit.Assert.assertEquals(Assert.java:512)
	at org.apache.solr.ltr.TestLTRReRankingPipeline.testDifferentTopN(TestLTRReRankingPipeline.java:256)
	at sun.reflect.NativeMethodAccessorImpl.invoke0(Native Method)
	at sun.reflect.NativeMethodAccessorImpl.invoke(NativeMethodAccessorImpl.java:62)
	at sun.reflect.DelegatingMethodAccessorImpl.invoke(DelegatingMethodAccessorImpl.java:43)
	at java.lang.reflect.Method.invoke(Method.java:498)
	at com.carrotsearch.randomizedtesting.RandomizedRunner.invoke(RandomizedRunner.java:1737)
	at com.carrotsearch.randomizedtesting.RandomizedRunner$8.evaluate(RandomizedRunner.java:934)
	at com.carrotsearch.randomizedtesting.RandomizedRunner$9.evaluate(RandomizedRunner.java:970)
	at com.carrotsearch.randomizedtesting.RandomizedRunner$10.evaluate(RandomizedRunner.java:984)
	at org.apache.lucene.util.TestRuleSetupTeardownChained$1.evaluate(TestRuleSetupTeardownChained.java:49)
	at org.apache.lucene.util.AbstractBeforeAfterRule$1.evaluate(AbstractBeforeAfterRule.java:45)
	at org.apache.lucene.util.TestRuleThreadAndTestName$1.evaluate(TestRuleThreadAndTestName.java:48)
	at org.apache.lucene.util.TestRuleIgnoreAfterMaxFailures$1.evaluate(TestRuleIgnoreAfterMaxFailures.java:64)
	at org.apache.lucene.util.TestRuleMarkFailure$1.evaluate(TestRuleMarkFailure.java:47)
	at com.carrotsearch.randomizedtesting.rules.StatementAdapter.evaluate(StatementAdapter.java:36)
	at com.carrotsearch.randomizedtesting.ThreadLeakControl$StatementRunner.run(ThreadLeakControl.java:368)
	at com.carrotsearch.randomizedtesting.ThreadLeakControl.forkTimeoutingTask(ThreadLeakControl.java:817)
	at com.carrotsearch.randomizedtesting.ThreadLeakControl$3.evaluate(ThreadLeakControl.java:468)
	at com.carrotsearch.randomizedtesting.RandomizedRunner.runSingleTest(RandomizedRunner.java:943)
	at com.carrotsearch.randomizedtesting.RandomizedRunner$5.evaluate(RandomizedRunner.java:829)
	at com.carrotsearch.randomizedtesting.RandomizedRunner$6.evaluate(RandomizedRunner.java:879)
	at com.carrotsearch.randomizedtesting.RandomizedRunner$7.evaluate(RandomizedRunner.java:890)
	at org.apache.lucene.util.AbstractBeforeAfterRule$1.evaluate(AbstractBeforeAfterRule.java:45)
	at com.carrotsearch.randomizedtesting.rules.StatementAdapter.evaluate(StatementAdapter.java:36)
	at org.apache.lucene.util.TestRuleStoreClassName$1.evaluate(TestRuleStoreClassName.java:41)
	at com.carrotsearch.randomizedtesting.rules.NoShadowingOrOverridesOnMethodsRule$1.evaluate(NoShadowingOrOverridesOnMethodsRule.java:40)
	at com.carrotsearch.randomizedtesting.rules.NoShadowingOrOverridesOnMethodsRule$1.evaluate(NoShadowingOrOverridesOnMethodsRule.java:40)
	at com.carrotsearch.randomizedtesting.rules.StatementAdapter.evaluate(StatementAdapter.java:36)
	at com.carrotsearch.randomizedtesting.rules.StatementAdapter.evaluate(StatementAdapter.java:36)
	at com.carrotsearch.randomizedtesting.rules.StatementAdapter.evaluate(StatementAdapter.java:36)
	at org.apache.lucene.util.TestRuleAssertionsRequired$1.evaluate(TestRuleAssertionsRequired.java:53)
	at org.apache.lucene.util.TestRuleMarkFailure$1.evaluate(TestRuleMarkFailure.java:47)
	at org.apache.lucene.util.TestRuleIgnoreAfterMaxFailures$1.evaluate(TestRuleIgnoreAfterMaxFailures.java:64)
	at org.apache.lucene.util.TestRuleIgnoreTestSuites$1.evaluate(TestRuleIgnoreTestSuites.java:54)
	at com.carrotsearch.randomizedtesting.rules.StatementAdapter.evaluate(StatementAdapter.java:36)
	at com.carrotsearch.randomizedtesting.ThreadLeakControl$StatementRunner.run(ThreadLeakControl.java:368)
	at java.lang.Thread.run(Thread.java:748)


FAILED:  org.apache.solr.cloud.ZkControllerTest.testPublishAndWaitForDownStates

Error Message:
The ZkController.publishAndWaitForDownStates should have timed out but it didn't

Stack Trace:
java.lang.AssertionError: The ZkController.publishAndWaitForDownStates should have timed out but it didn't
	at __randomizedtesting.SeedInfo.seed([E1D4D541C688ADB6:C6DBB9AD671FE289]:0)
	at org.junit.Assert.fail(Assert.java:93)
	at org.junit.Assert.assertTrue(Assert.java:43)
	at org.apache.solr.cloud.ZkControllerTest.testPublishAndWaitForDownStates(ZkControllerTest.java:306)
	at sun.reflect.NativeMethodAccessorImpl.invoke0(Native Method)
	at sun.reflect.NativeMethodAccessorImpl.invoke(NativeMethodAccessorImpl.java:62)
	at sun.reflect.DelegatingMethodAccessorImpl.invoke(DelegatingMethodAccessorImpl.java:43)
	at java.lang.reflect.Method.invoke(Method.java:498)
	at com.carrotsearch.randomizedtesting.RandomizedRunner.invoke(RandomizedRunner.java:1737)
	at com.carrotsearch.randomizedtesting.RandomizedRunner$8.evaluate(RandomizedRunner.java:934)
	at com.carrotsearch.randomizedtesting.RandomizedRunner$9.evaluate(RandomizedRunner.java:970)
	at com.carrotsearch.randomizedtesting.RandomizedRunner$10.evaluate(RandomizedRunner.java:984)
	at com.carrotsearch.randomizedtesting.rules.SystemPropertiesRestoreRule$1.evaluate(SystemPropertiesRestoreRule.java:57)
	at org.apache.lucene.util.TestRuleSetupTeardownChained$1.evaluate(TestRuleSetupTeardownChained.java:49)
	at org.apache.lucene.util.AbstractBeforeAfterRule$1.evaluate(AbstractBeforeAfterRule.java:45)
	at org.apache.lucene.util.TestRuleThreadAndTestName$1.evaluate(TestRuleThreadAndTestName.java:48)
	at org.apache.lucene.util.TestRuleIgnoreAfterMaxFailures$1.evaluate(TestRuleIgnoreAfterMaxFailures.java:64)
	at org.apache.lucene.util.TestRuleMarkFailure$1.evaluate(TestRuleMarkFailure.java:47)
	at com.carrotsearch.randomizedtesting.rules.StatementAdapter.evaluate(StatementAdapter.java:36)
	at com.carrotsearch.randomizedtesting.ThreadLeakControl$StatementRunner.run(ThreadLeakControl.java:368)
	at com.carrotsearch.randomizedtesting.ThreadLeakControl.forkTimeoutingTask(ThreadLeakControl.java:817)
	at com.carrotsearch.randomizedtesting.ThreadLeakControl$3.evaluate(ThreadLeakControl.java:468)
	at com.carrotsearch.randomizedtesting.RandomizedRunner.runSingleTest(RandomizedRunner.java:943)
	at com.carrotsearch.randomizedtesting.RandomizedRunner$5.evaluate(RandomizedRunner.java:829)
	at com.carrotsearch.randomizedtesting.RandomizedRunner$6.evaluate(RandomizedRunner.java:879)
	at com.carrotsearch.randomizedtesting.RandomizedRunner$7.evaluate(RandomizedRunner.java:890)
	at com.carrotsearch.randomizedtesting.rules.StatementAdapter.evaluate(StatementAdapter.java:36)
	at com.carrotsearch.randomizedtesting.rules.SystemPropertiesRestoreRule$1.evaluate(SystemPropertiesRestoreRule.java:57)
	at org.apache.lucene.util.AbstractBeforeAfterRule$1.evaluate(AbstractBeforeAfterRule.java:45)
	at com.carrotsearch.randomizedtesting.rules.StatementAdapter.evaluate(StatementAdapter.java:36)
	at org.apache.lucene.util.TestRuleStoreClassName$1.evaluate(TestRuleStoreClassName.java:41)
	at com.carrotsearch.randomizedtesting.rules.NoShadowingOrOverridesOnMethodsRule$1.evaluate(NoShadowingOrOverridesOnMethodsRule.java:40)
	at com.carrotsearch.randomizedtesting.rules.NoShadowingOrOverridesOnMethodsRule$1.evaluate(NoShadowingOrOverridesOnMethodsRule.java:40)
	at com.carrotsearch.randomizedtesting.rules.StatementAdapter.evaluate(StatementAdapter.java:36)
	at com.carrotsearch.randomizedtesting.rules.StatementAdapter.evaluate(StatementAdapter.java:36)
	at com.carrotsearch.randomizedtesting.rules.StatementAdapter.evaluate(StatementAdapter.java:36)
	at org.apache.lucene.util.TestRuleAssertionsRequired$1.evaluate(TestRuleAssertionsRequired.java:53)
	at org.apache.lucene.util.TestRuleMarkFailure$1.evaluate(TestRuleMarkFailure.java:47)
	at org.apache.lucene.util.TestRuleIgnoreAfterMaxFailures$1.evaluate(TestRuleIgnoreAfterMaxFailures.java:64)
	at org.apache.lucene.util.TestRuleIgnoreTestSuites$1.evaluate(TestRuleIgnoreTestSuites.java:54)
	at com.carrotsearch.randomizedtesting.rules.StatementAdapter.evaluate(StatementAdapter.java:36)
	at com.carrotsearch.randomizedtesting.ThreadLeakControl$StatementRunner.run(ThreadLeakControl.java:368)
	at java.lang.Thread.run(Thread.java:748)


FAILED:  org.apache.solr.core.TestJmxIntegration.testJmxOnCoreReload

Error Message:
Number of registered MBeans is not the same as info registry size expected:<107> but was:<0>

Stack Trace:
java.lang.AssertionError: Number of registered MBeans is not the same as info registry size expected:<107> but was:<0>
	at __randomizedtesting.SeedInfo.seed([E1D4D541C688ADB6:E36D0E2DB5CB717B]:0)
	at org.junit.Assert.fail(Assert.java:93)
	at org.junit.Assert.failNotEquals(Assert.java:647)
	at org.junit.Assert.assertEquals(Assert.java:128)
	at org.junit.Assert.assertEquals(Assert.java:472)
	at org.apache.solr.core.TestJmxIntegration.testJmxOnCoreReload(TestJmxIntegration.java:180)
	at sun.reflect.NativeMethodAccessorImpl.invoke0(Native Method)
	at sun.reflect.NativeMethodAccessorImpl.invoke(NativeMethodAccessorImpl.java:62)
	at sun.reflect.DelegatingMethodAccessorImpl.invoke(DelegatingMethodAccessorImpl.java:43)
	at java.lang.reflect.Method.invoke(Method.java:498)
	at com.carrotsearch.randomizedtesting.RandomizedRunner.invoke(RandomizedRunner.java:1737)
	at com.carrotsearch.randomizedtesting.RandomizedRunner$8.evaluate(RandomizedRunner.java:934)
	at com.carrotsearch.randomizedtesting.RandomizedRunner$9.evaluate(RandomizedRunner.java:970)
	at com.carrotsearch.randomizedtesting.RandomizedRunner$10.evaluate(RandomizedRunner.java:984)
	at com.carrotsearch.randomizedtesting.rules.SystemPropertiesRestoreRule$1.evaluate(SystemPropertiesRestoreRule.java:57)
	at org.apache.lucene.util.TestRuleSetupTeardownChained$1.evaluate(TestRuleSetupTeardownChained.java:49)
	at org.apache.lucene.util.AbstractBeforeAfterRule$1.evaluate(AbstractBeforeAfterRule.java:45)
	at org.apache.lucene.util.TestRuleThreadAndTestName$1.evaluate(TestRuleThreadAndTestName.java:48)
	at org.apache.lucene.util.TestRuleIgnoreAfterMaxFailures$1.evaluate(TestRuleIgnoreAfterMaxFailures.java:64)
	at org.apache.lucene.util.TestRuleMarkFailure$1.evaluate(TestRuleMarkFailure.java:47)
	at com.carrotsearch.randomizedtesting.rules.StatementAdapter.evaluate(StatementAdapter.java:36)
	at com.carrotsearch.randomizedtesting.ThreadLeakControl$StatementRunner.run(ThreadLeakControl.java:368)
	at com.carrotsearch.randomizedtesting.ThreadLeakControl.forkTimeoutingTask(ThreadLeakControl.java:817)
	at com.carrotsearch.randomizedtesting.ThreadLeakControl$3.evaluate(ThreadLeakControl.java:468)
	at com.carrotsearch.randomizedtesting.RandomizedRunner.runSingleTest(RandomizedRunner.java:943)
	at com.carrotsearch.randomizedtesting.RandomizedRunner$5.evaluate(RandomizedRunner.java:829)
	at com.carrotsearch.randomizedtesting.RandomizedRunner$6.evaluate(RandomizedRunner.java:879)
	at com.carrotsearch.randomizedtesting.RandomizedRunner$7.evaluate(RandomizedRunner.java:890)
	at com.carrotsearch.randomizedtesting.rules.StatementAdapter.evaluate(StatementAdapter.java:36)
	at com.carrotsearch.randomizedtesting.rules.SystemPropertiesRestoreRule$1.evaluate(SystemPropertiesRestoreRule.java:57)
	at org.apache.lucene.util.AbstractBeforeAfterRule$1.evaluate(AbstractBeforeAfterRule.java:45)
	at com.carrotsearch.randomizedtesting.rules.StatementAdapter.evaluate(StatementAdapter.java:36)
	at org.apache.lucene.util.TestRuleStoreClassName$1.evaluate(TestRuleStoreClassName.java:41)
	at com.carrotsearch.randomizedtesting.rules.NoShadowingOrOverridesOnMethodsRule$1.evaluate(NoShadowingOrOverridesOnMethodsRule.java:40)
	at com.carrotsearch.randomizedtesting.rules.NoShadowingOrOverridesOnMethodsRule$1.evaluate(NoShadowingOrOverridesOnMethodsRule.java:40)
	at com.carrotsearch.randomizedtesting.rules.StatementAdapter.evaluate(StatementAdapter.java:36)
	at com.carrotsearch.randomizedtesting.rules.StatementAdapter.evaluate(StatementAdapter.java:36)
	at com.carrotsearch.randomizedtesting.rules.StatementAdapter.evaluate(StatementAdapter.java:36)
	at org.apache.lucene.util.TestRuleAssertionsRequired$1.evaluate(TestRuleAssertionsRequired.java:53)
	at org.apache.lucene.util.TestRuleMarkFailure$1.evaluate(TestRuleMarkFailure.java:47)
	at org.apache.lucene.util.TestRuleIgnoreAfterMaxFailures$1.evaluate(TestRuleIgnoreAfterMaxFailures.java:64)
	at org.apache.lucene.util.TestRuleIgnoreTestSuites$1.evaluate(TestRuleIgnoreTestSuites.java:54)
	at com.carrotsearch.randomizedtesting.rules.StatementAdapter.evaluate(StatementAdapter.java:36)
	at com.carrotsearch.randomizedtesting.ThreadLeakControl$StatementRunner.run(ThreadLeakControl.java:368)
	at java.lang.Thread.run(Thread.java:748)


FAILED:  org.apache.solr.handler.TestReplicationHandler.doTestIndexFetchOnMasterRestart

Error Message:
IOException occured when talking to server at: http://127.0.0.1:59024/solr/collection1

Stack Trace:
org.apache.solr.client.solrj.SolrServerException: IOException occured when talking to server at: http://127.0.0.1:59024/solr/collection1
	at __randomizedtesting.SeedInfo.seed([E1D4D541C688ADB6:392311A56D536FEA]:0)
	at org.apache.solr.client.solrj.impl.HttpSolrClient.executeMethod(HttpSolrClient.java:657)
	at org.apache.solr.client.solrj.impl.HttpSolrClient.request(HttpSolrClient.java:255)
	at org.apache.solr.client.solrj.impl.HttpSolrClient.request(HttpSolrClient.java:244)
	at org.apache.solr.client.solrj.SolrRequest.process(SolrRequest.java:194)
	at org.apache.solr.client.solrj.SolrClient.add(SolrClient.java:173)
	at org.apache.solr.client.solrj.SolrClient.add(SolrClient.java:138)
	at org.apache.solr.client.solrj.SolrClient.add(SolrClient.java:152)
	at org.apache.solr.handler.TestReplicationHandler.index(TestReplicationHandler.java:180)
	at org.apache.solr.handler.TestReplicationHandler.doTestIndexFetchOnMasterRestart(TestReplicationHandler.java:643)
	at sun.reflect.NativeMethodAccessorImpl.invoke0(Native Method)
	at sun.reflect.NativeMethodAccessorImpl.invoke(NativeMethodAccessorImpl.java:62)
	at sun.reflect.DelegatingMethodAccessorImpl.invoke(DelegatingMethodAccessorImpl.java:43)
	at java.lang.reflect.Method.invoke(Method.java:498)
	at com.carrotsearch.randomizedtesting.RandomizedRunner.invoke(RandomizedRunner.java:1737)
	at com.carrotsearch.randomizedtesting.RandomizedRunner$8.evaluate(RandomizedRunner.java:934)
	at com.carrotsearch.randomizedtesting.RandomizedRunner$9.evaluate(RandomizedRunner.java:970)
	at com.carrotsearch.randomizedtesting.RandomizedRunner$10.evaluate(RandomizedRunner.java:984)
	at com.carrotsearch.randomizedtesting.rules.SystemPropertiesRestoreRule$1.evaluate(SystemPropertiesRestoreRule.java:57)
	at org.apache.lucene.util.TestRuleSetupTeardownChained$1.evaluate(TestRuleSetupTeardownChained.java:49)
	at org.apache.lucene.util.AbstractBeforeAfterRule$1.evaluate(AbstractBeforeAfterRule.java:45)
	at org.apache.lucene.util.TestRuleThreadAndTestName$1.evaluate(TestRuleThreadAndTestName.java:48)
	at org.apache.lucene.util.TestRuleIgnoreAfterMaxFailures$1.evaluate(TestRuleIgnoreAfterMaxFailures.java:64)
	at org.apache.lucene.util.TestRuleMarkFailure$1.evaluate(TestRuleMarkFailure.java:47)
	at com.carrotsearch.randomizedtesting.rules.StatementAdapter.evaluate(StatementAdapter.java:36)
	at com.carrotsearch.randomizedtesting.ThreadLeakControl$StatementRunner.run(ThreadLeakControl.java:368)
	at com.carrotsearch.randomizedtesting.ThreadLeakControl.forkTimeoutingTask(ThreadLeakControl.java:817)
	at com.carrotsearch.randomizedtesting.ThreadLeakControl$3.evaluate(ThreadLeakControl.java:468)
	at com.carrotsearch.randomizedtesting.RandomizedRunner.runSingleTest(RandomizedRunner.java:943)
	at com.carrotsearch.randomizedtesting.RandomizedRunner$5.evaluate(RandomizedRunner.java:829)
	at com.carrotsearch.randomizedtesting.RandomizedRunner$6.evaluate(RandomizedRunner.java:879)
	at com.carrotsearch.randomizedtesting.RandomizedRunner$7.evaluate(RandomizedRunner.java:890)
	at com.carrotsearch.randomizedtesting.rules.StatementAdapter.evaluate(StatementAdapter.java:36)
	at com.carrotsearch.randomizedtesting.rules.SystemPropertiesRestoreRule$1.evaluate(SystemPropertiesRestoreRule.java:57)
	at org.apache.lucene.util.AbstractBeforeAfterRule$1.evaluate(AbstractBeforeAfterRule.java:45)
	at com.carrotsearch.randomizedtesting.rules.StatementAdapter.evaluate(StatementAdapter.java:36)
	at org.apache.lucene.util.TestRuleStoreClassName$1.evaluate(TestRuleStoreClassName.java:41)
	at com.carrotsearch.randomizedtesting.rules.NoShadowingOrOverridesOnMethodsRule$1.evaluate(NoShadowingOrOverridesOnMethodsRule.java:40)
	at com.carrotsearch.randomizedtesting.rules.NoShadowingOrOverridesOnMethodsRule$1.evaluate(NoShadowingOrOverridesOnMethodsRule.java:40)
	at com.carrotsearch.randomizedtesting.rules.StatementAdapter.evaluate(StatementAdapter.java:36)
	at com.carrotsearch.randomizedtesting.rules.StatementAdapter.evaluate(StatementAdapter.java:36)
	at com.carrotsearch.randomizedtesting.rules.StatementAdapter.evaluate(StatementAdapter.java:36)
	at org.apache.lucene.util.TestRuleAssertionsRequired$1.evaluate(TestRuleAssertionsRequired.java:53)
	at org.apache.lucene.util.TestRuleMarkFailure$1.evaluate(TestRuleMarkFailure.java:47)
	at org.apache.lucene.util.TestRuleIgnoreAfterMaxFailures$1.evaluate(TestRuleIgnoreAfterMaxFailures.java:64)
	at org.apache.lucene.util.TestRuleIgnoreTestSuites$1.evaluate(TestRuleIgnoreTestSuites.java:54)
	at com.carrotsearch.randomizedtesting.rules.StatementAdapter.evaluate(StatementAdapter.java:36)
	at com.carrotsearch.randomizedtesting.ThreadLeakControl$StatementRunner.run(ThreadLeakControl.java:368)
	at java.lang.Thread.run(Thread.java:748)
Caused by: org.apache.http.NoHttpResponseException: 127.0.0.1:59024 failed to respond
	at org.apache.http.impl.conn.DefaultHttpResponseParser.parseHead(DefaultHttpResponseParser.java:141)
	at org.apache.http.impl.conn.DefaultHttpResponseParser.parseHead(DefaultHttpResponseParser.java:56)
	at org.apache.http.impl.io.AbstractMessageParser.parse(AbstractMessageParser.java:259)
	at org.apache.http.impl.DefaultBHttpClientConnection.receiveResponseHeader(DefaultBHttpClientConnection.java:163)
	at org.apache.http.impl.conn.CPoolProxy.receiveResponseHeader(CPoolProxy.java:165)
	at org.apache.http.protocol.HttpRequestExecutor.doReceiveResponse(HttpRequestExecutor.java:273)
	at org.apache.http.protocol.HttpRequestExecutor.execute(HttpRequestExecutor.java:125)
	at org.apache.http.impl.execchain.MainClientExec.execute(MainClientExec.java:272)
	at org.apache.http.impl.execchain.ProtocolExec.execute(ProtocolExec.java:185)
	at org.apache.http.impl.execchain.RetryExec.execute(RetryExec.java:89)
	at org.apache.http.impl.execchain.RedirectExec.execute(RedirectExec.java:111)
	at org.apache.http.impl.client.InternalHttpClient.doExecute(InternalHttpClient.java:185)
	at org.apache.http.impl.client.CloseableHttpClient.execute(CloseableHttpClient.java:83)
	at org.apache.http.impl.client.CloseableHttpClient.execute(CloseableHttpClient.java:56)
	at org.apache.solr.client.solrj.impl.HttpSolrClient.executeMethod(HttpSolrClient.java:542)
	... 47 more




Build Log:
[...truncated 12211 lines...]
   [junit4] Suite: org.apache.solr.core.TestJmxIntegration
   [junit4]   2> Creating dataDir: /x1/jenkins/jenkins-slave/workspace/Lucene-Solr-BadApples-Tests-master/solr/build/solr-core/test/J2/temp/solr.core.TestJmxIntegration_E1D4D541C688ADB6-001/init-core-data-001
   [junit4]   2> 235509 INFO  (SUITE-TestJmxIntegration-seed#[E1D4D541C688ADB6]-worker) [    ] o.a.s.SolrTestCaseJ4 Using PointFields (NUMERIC_POINTS_SYSPROP=true) w/NUMERIC_DOCVALUES_SYSPROP=false
   [junit4]   2> 235510 INFO  (SUITE-TestJmxIntegration-seed#[E1D4D541C688ADB6]-worker) [    ] o.a.s.SolrTestCaseJ4 Randomized ssl (true) and clientAuth (false) via: @org.apache.solr.util.RandomizeSSL(reason=, ssl=NaN, value=NaN, clientAuth=NaN)
   [junit4]   2> 235511 INFO  (SUITE-TestJmxIntegration-seed#[E1D4D541C688ADB6]-worker) [    ] o.a.s.SolrTestCaseJ4 SecureRandom sanity checks: test.solr.allowed.securerandom=null & java.security.egd=file:/dev/./urandom
   [junit4]   2> 235512 INFO  (SUITE-TestJmxIntegration-seed#[E1D4D541C688ADB6]-worker) [    ] o.a.s.SolrTestCaseJ4 ####initCore
   [junit4]   2> 235512 INFO  (SUITE-TestJmxIntegration-seed#[E1D4D541C688ADB6]-worker) [    ] o.a.s.c.SolrResourceLoader [null] Added 2 libs to classloader, from paths: [/x1/jenkins/jenkins-slave/workspace/Lucene-Solr-BadApples-Tests-master/solr/core/src/test-files/solr/collection1/lib, /x1/jenkins/jenkins-slave/workspace/Lucene-Solr-BadApples-Tests-master/solr/core/src/test-files/solr/collection1/lib/classes]
   [junit4]   2> 235545 INFO  (SUITE-TestJmxIntegration-seed#[E1D4D541C688ADB6]-worker) [    ] o.a.s.c.SolrConfig Using Lucene MatchVersion: 8.0.0
   [junit4]   2> 235585 INFO  (SUITE-TestJmxIntegration-seed#[E1D4D541C688ADB6]-worker) [    ] o.a.s.s.IndexSchema [null] Schema name=test
   [junit4]   2> 235694 INFO  (SUITE-TestJmxIntegration-seed#[E1D4D541C688ADB6]-worker) [    ] o.a.s.s.IndexSchema Loaded schema test/1.0 with uniqueid field id
   [junit4]   2> 235736 INFO  (SUITE-TestJmxIntegration-seed#[E1D4D541C688ADB6]-worker) [    ] o.a.s.m.r.SolrJmxReporter JMX monitoring for 'solr.node' (registry 'solr.node') enabled at server: com.sun.jmx.mbeanserver.JmxMBeanServer@712f6f51
   [junit4]   2> 235746 INFO  (SUITE-TestJmxIntegration-seed#[E1D4D541C688ADB6]-worker) [    ] o.a.s.m.r.SolrJmxReporter JMX monitoring for 'solr.jvm' (registry 'solr.jvm') enabled at server: com.sun.jmx.mbeanserver.JmxMBeanServer@712f6f51
   [junit4]   2> 235746 INFO  (SUITE-TestJmxIntegration-seed#[E1D4D541C688ADB6]-worker) [    ] o.a.s.m.r.SolrJmxReporter JMX monitoring for 'solr.jetty' (registry 'solr.jetty') enabled at server: com.sun.jmx.mbeanserver.JmxMBeanServer@712f6f51
   [junit4]   2> 235757 INFO  (coreLoadExecutor-1371-thread-1) [    ] o.a.s.c.TransientSolrCoreCacheDefault Allocating transient cache for 2147483647 transient cores
   [junit4]   2> 235758 INFO  (coreLoadExecutor-1371-thread-1) [    x:collection1] o.a.s.c.SolrResourceLoader [null] Added 2 libs to classloader, from paths: [/x1/jenkins/jenkins-slave/workspace/Lucene-Solr-BadApples-Tests-master/solr/core/src/test-files/solr/collection1/lib, /x1/jenkins/jenkins-slave/workspace/Lucene-Solr-BadApples-Tests-master/solr/core/src/test-files/solr/collection1/lib/classes]
   [junit4]   2> 235786 INFO  (coreLoadExecutor-1371-thread-1) [    x:collection1] o.a.s.c.SolrConfig Using Lucene MatchVersion: 8.0.0
   [junit4]   2> 235808 INFO  (coreLoadExecutor-1371-thread-1) [    x:collection1] o.a.s.s.IndexSchema [collection1] Schema name=test
   [junit4]   2> 235908 INFO  (coreLoadExecutor-1371-thread-1) [    x:collection1] o.a.s.s.IndexSchema Loaded schema test/1.0 with uniqueid field id
   [junit4]   2> 235915 INFO  (coreLoadExecutor-1371-thread-1) [    x:collection1] o.a.s.c.CoreContainer Creating SolrCore 'collection1' using configuration from instancedir /x1/jenkins/jenkins-slave/workspace/Lucene-Solr-BadApples-Tests-master/solr/core/src/test-files/solr/collection1, trusted=true
   [junit4]   2> 235915 INFO  (coreLoadExecutor-1371-thread-1) [    x:collection1] o.a.s.m.r.SolrJmxReporter JMX monitoring for 'solr.core.collection1' (registry 'solr.core.collection1') enabled at server: com.sun.jmx.mbeanserver.JmxMBeanServer@712f6f51
   [junit4]   2> 235915 INFO  (coreLoadExecutor-1371-thread-1) [    x:collection1] o.a.s.c.SolrCore solr.RecoveryStrategy.Builder
   [junit4]   2> 235915 INFO  (coreLoadExecutor-1371-thread-1) [    x:collection1] o.a.s.c.SolrCore [[collection1] ] Opening new SolrCore at [/x1/jenkins/jenkins-slave/workspace/Lucene-Solr-BadApples-Tests-master/solr/core/src/test-files/solr/collection1], dataDir=[/x1/jenkins/jenkins-slave/workspace/Lucene-Solr-BadApples-Tests-master/solr/build/solr-core/test/J2/temp/solr.core.TestJmxIntegration_E1D4D541C688ADB6-001/init-core-data-001/]
   [junit4]   2> 235917 INFO  (coreLoadExecutor-1371-thread-1) [    x:collection1] o.a.s.u.RandomMergePolicy RandomMergePolicy wrapping class org.apache.lucene.index.TieredMergePolicy: [TieredMergePolicy: maxMergeAtOnce=41, maxMergeAtOnceExplicit=11, maxMergedSegmentMB=64.2666015625, floorSegmentMB=1.654296875, forceMergeDeletesPctAllowed=29.07805846074607, segmentsPerTier=41.0, maxCFSSegmentSizeMB=8.796093022207999E12, noCFSRatio=1.0
   [junit4]   2> 235968 INFO  (coreLoadExecutor-1371-thread-1) [    x:collection1] o.a.s.u.UpdateHandler Using UpdateLog implementation: org.apache.solr.update.UpdateLog
   [junit4]   2> 235968 INFO  (coreLoadExecutor-1371-thread-1) [    x:collection1] o.a.s.u.UpdateLog Initializing UpdateLog: dataDir= defaultSyncLevel=FLUSH numRecordsToKeep=100 maxNumLogsToKeep=10 numVersionBuckets=65536
   [junit4]   2> 235969 INFO  (coreLoadExecutor-1371-thread-1) [    x:collection1] o.a.s.u.CommitTracker Hard AutoCommit: disabled
   [junit4]   2> 235969 INFO  (coreLoadExecutor-1371-thread-1) [    x:collection1] o.a.s.u.CommitTracker Soft AutoCommit: disabled
   [junit4]   2> 235970 INFO  (coreLoadExecutor-1371-thread-1) [    x:collection1] o.a.s.u.RandomMergePolicy RandomMergePolicy wrapping class org.apache.lucene.index.TieredMergePolicy: [TieredMergePolicy: maxMergeAtOnce=42, maxMergeAtOnceExplicit=28, maxMergedSegmentMB=20.2578125, floorSegmentMB=0.56640625, forceMergeDeletesPctAllowed=19.065844587162204, segmentsPerTier=31.0, maxCFSSegmentSizeMB=8.796093022207999E12, noCFSRatio=0.0
   [junit4]   2> 235971 INFO  (coreLoadExecutor-1371-thread-1) [    x:collection1] o.a.s.s.SolrIndexSearcher Opening [Searcher@39a826f[collection1] main]
   [junit4]   2> 235972 INFO  (coreLoadExecutor-1371-thread-1) [    x:collection1] o.a.s.h.c.SpellCheckComponent Initializing spell checkers
   [junit4]   2> 235984 INFO  (coreLoadExecutor-1371-thread-1) [    x:collection1] o.a.s.s.DirectSolrSpellChecker init: {name=direct,classname=DirectSolrSpellChecker,field=lowerfilt,minQueryLength=3}
   [junit4]   2> 236023 INFO  (coreLoadExecutor-1371-thread-1) [    x:collection1] o.a.s.h.ReplicationHandler Commits will be reserved for 10000ms.
   [junit4]   2> 236024 INFO  (searcherExecutor-1372-thread-1-processing-x:collection1) [    x:collection1] o.a.s.h.c.SpellCheckComponent Loading spell index for spellchecker: default
   [junit4]   2> 236024 INFO  (coreLoadExecutor-1371-thread-1) [    x:collection1] o.a.s.u.UpdateLog Could not find max version in index or recent updates, using new clock 1593765683000246272
   [junit4]   2> 236024 INFO  (searcherExecutor-1372-thread-1-processing-x:collection1) [    x:collection1] o.a.s.h.c.SpellCheckComponent Loading spell index for spellchecker: direct
   [junit4]   2> 236024 INFO  (searcherExecutor-1372-thread-1-processing-x:collection1) [    x:collection1] o.a.s.h.c.SpellCheckComponent Loading spell index for spellchecker: wordbreak
   [junit4]   2> 236025 INFO  (searcherExecutor-1372-thread-1-processing-x:collection1) [    x:collection1] o.a.s.h.c.SpellCheckComponent Loading spell index for spellchecker: multipleFields
   [junit4]   2> 236025 INFO  (searcherExecutor-1372-thread-1-processing-x:collection1) [    x:collection1] o.a.s.h.c.SpellCheckComponent Loading spell index for spellchecker: jarowinkler
   [junit4]   2> 236025 INFO  (searcherExecutor-1372-thread-1-processing-x:collection1) [    x:collection1] o.a.s.h.c.SpellCheckComponent Loading spell index for spellchecker: external
   [junit4]   2> 236025 INFO  (searcherExecutor-1372-thread-1-processing-x:collection1) [    x:collection1] o.a.s.h.c.SpellCheckComponent Loading spell index for spellchecker: freq
   [junit4]   2> 236026 INFO  (searcherExecutor-1372-thread-1-processing-x:collection1) [    x:collection1] o.a.s.h.c.SpellCheckComponent Loading spell index for spellchecker: fqcn
   [junit4]   2> 236026 INFO  (searcherExecutor-1372-thread-1-processing-x:collection1) [    x:collection1] o.a.s.h.c.SpellCheckComponent Loading spell index for spellchecker: perDict
   [junit4]   2> 236027 INFO  (searcherExecutor-1372-thread-1-processing-x:collection1) [    x:collection1] o.a.s.c.SolrCore [collection1] Registered new searcher Searcher@39a826f[collection1] main{ExitableDirectoryReader(UninvertingDirectoryReader())}
   [junit4]   2> 236031 INFO  (SUITE-TestJmxIntegration-seed#[E1D4D541C688ADB6]-worker) [    ] o.a.s.SolrTestCaseJ4 ####initCore end
   [junit4]   2> 236034 INFO  (TEST-TestJmxIntegration.testJmxRegistration-seed#[E1D4D541C688ADB6]) [    ] o.a.s.SolrTestCaseJ4 ###Starting testJmxRegistration
   [junit4]   2> 236148 INFO  (TEST-TestJmxIntegration.testJmxRegistration-seed#[E1D4D541C688ADB6]) [    ] o.a.s.SolrTestCaseJ4 ###Ending testJmxRegistration
   [junit4]   2> 236156 INFO  (TEST-TestJmxIntegration.testJmxOnCoreReload-seed#[E1D4D541C688ADB6]) [    ] o.a.s.SolrTestCaseJ4 ###Starting testJmxOnCoreReload
   [junit4]   2> 236172 INFO  (TEST-TestJmxIntegration.testJmxOnCoreReload-seed#[E1D4D541C688ADB6]) [    ] o.a.s.c.TestJmxIntegration Before Reload: Size of infoRegistry: 107 MBeans: 0
   [junit4]   2> 236172 INFO  (TEST-TestJmxIntegration.testJmxOnCoreReload-seed#[E1D4D541C688ADB6]) [    ] o.a.s.SolrTestCaseJ4 ###Ending testJmxOnCoreReload
   [junit4]   2> NOTE: reproduce with: ant test  -Dtestcase=TestJmxIntegration -Dtests.method=testJmxOnCoreReload -Dtests.seed=E1D4D541C688ADB6 -Dtests.multiplier=2 -Dtests.slow=true -Dtests.badapples=true -Dtests.locale=vi-VN -Dtests.timezone=Indian/Chagos -Dtests.asserts=true -Dtests.file.encoding=UTF-8
   [junit4] FAILURE 0.03s J2 | TestJmxIntegration.testJmxOnCoreReload <<<
   [junit4]    > Throwable #1: java.lang.AssertionError: Number of registered MBeans is not the same as info registry size expected:<107> but was:<0>
   [junit4]    > 	at __randomizedtesting.SeedInfo.seed([E1D4D541C688ADB6:E36D0E2DB5CB717B]:0)
   [junit4]    > 	at org.apache.solr.core.TestJmxIntegration.testJmxOnCoreReload(TestJmxIntegration.java:180)
   [junit4]    > 	at java.lang.Thread.run(Thread.java:748)
   [junit4]   2> 236176 INFO  (TEST-TestJmxIntegration.testJmxUpdate-seed#[E1D4D541C688ADB6]) [    ] o.a.s.SolrTestCaseJ4 ###Starting testJmxUpdate
   [junit4]   2> 236184 INFO  (TEST-TestJmxIntegration.testJmxUpdate-seed#[E1D4D541C688ADB6]) [    ] o.a.s.c.TestJmxIntegration Mbeans in server: [solr:dom1=core,dom2=collection1,category=QUERY,scope=/terms,name=serverErrors, solr:dom1=core,dom2=collection1,category=QUERY,scope=/dismax,name=handlerStart, solr:dom1=jvm,name0=memory,name1=pools,name2=PS-Survivor-Space,name=max, java.lang:type=Threading, solr:dom1=core,dom2=collection1,category=QUERY,scope=/mock,name=requests, solr:dom1=node,category=QUERY,scope=/admin/metrics/collector,name=handlerStart, solr:dom1=node,category=ADMIN,scope=/admin/metrics,name=requests, solr:dom1=core,dom2=collection1,category=ADMIN,scope=/admin/mbeans,name=shardRequests, solr:dom1=core,dom2=collection1,category=QUERY,scope=/mock,name=errors, solr:dom1=jvm,name0=os,name=systemLoadAverage, solr:dom1=core,dom2=collection1,category=QUERY,scope=/get,name=errors, solr:dom1=core,dom2=collection1,category=QUERY,scope=/spellCheckCompRH1,name=requestTimes, solr:dom1=core,dom2=collection1,category=QUERY,scope=/defaults,name=serverErrors, solr:dom1=core,dom2=collection1,category=QUERY,scope=/search-facet-def,name=requestTimes, solr:dom1=core,dom2=collection1,category=UPDATE,scope=update,name=requestTimes, solr:dom1=core,dom2=collection1,category=UPDATE,scope=/update,name=timeouts, solr:dom1=node,category=ADMIN,scope=/admin/health,name=requestTimes, solr:dom1=core,dom2=collection1,category=QUERY,scope=/spellCheckWithWordbreak,name=shardRequests, solr:dom1=node,category=UPDATE,scope=updateShardHandler,name=threadPool.updateExecutor.running, solr:dom1=node,category=QUERY,scope=httpShardHandler,name=threadPool.httpShardExecutor.duration, solr:dom1=core,dom2=collection1,category=QUERY,scope=/mock,name=handlerStart, solr:dom1=node,category=ADMIN,scope=/admin/metrics,name=serverErrors, solr:dom1=core,dom2=collection1,category=UPDATE,scope=/update,name=handlerStart, solr:dom1=jvm,name0=buffers,name1=mapped,name=TotalCapacity, solr:dom1=node,category=ADMIN,scope=/admin/health,name=errors, solr:dom1=core,dom2=collection1,category=UPDATE,scope=/update,name=totalTime, solr:dom1=core,dom2=collection1,category=ADMIN,scope=/admin/luke,name=requests, solr:dom1=core,dom2=collection1,category=QUERY,scope=/search-facet-def,name=timeouts, solr:dom1=core,dom2=collection1,category=UPDATE,scope=updateHandler,name=rollbacks, solr:dom1=node,category=UPDATE,scope=updateShardHandler,name=threadPool.recoveryExecutor.submitted, solr:dom1=node,category=ADMIN,scope=/admin/cores,name=serverErrors, solr:dom1=core,dom2=collection1,category=QUERY,scope=/stream,name=requestTimes, solr:dom1=core,dom2=collection1,category=ADMIN,scope=/admin/system,name=shardRequests, solr:dom1=core,dom2=collection1,category=QUERY,scope=/dismax,name=clientErrors, solr:dom1=node,category=CONTAINER,scope=threadPool,name=coreContainerWorkExecutor.running, solr:dom1=core,dom2=collection1,category=QUERY,scope=/graph,name=clientErrors, solr:dom1=core,dom2=collection1,category=UPDATE,scope=/update/json,name=timeouts, solr:dom1=core,dom2=collection1,category=QUERY,scope=/terms,name=timeouts, solr:dom1=core,dom2=collection1,category=QUERY,scope=/mltrh,name=shardRequests, solr:dom1=node,category=ADMIN,scope=/admin/collections,name=requestTimes, solr:dom1=core,dom2=collection1,category=SEARCHER,scope=searcher,name=reader, solr:dom1=core,dom2=collection1,category=HIGHLIGHTER,scope=SolrFragmenter,name=gap.requests, solr:dom1=core,dom2=collection1,category=QUERY,scope=/export,name=requestTimes, solr:dom1=core,dom2=collection1,category=HIGHLIGHTER,scope=SolrBoundaryScanner,name=breakIterator.requests, solr:dom1=node,category=ADMIN,scope=/admin/authorization,name=requestTimes, solr:dom1=core,dom2=collection1,category=QUERY,scope=/debug/dump,name=shardRequests, solr:dom1=node,category=ADMIN,scope=/admin/collections,name=handlerStart, solr:dom1=core,dom2=collection1,category=ADMIN,scope=/admin/segments,name=totalTime, solr:dom1=node,category=ADMIN,scope=/admin/autoscaling/history,name=clientErrors, solr:dom1=core,dom2=collection1,category=ADMIN,scope=/admin/ping,name=errors, solr:dom1=jvm,name0=memory,name1=pools,name2=PS-Survivor-Space,name=usage, solr:dom1=jvm,name0=memory,name1=pools,name2=Compressed-Class-Space,name=max, solr:dom1=core,dom2=collection1,category=ADMIN,scope=/schema,name=clientErrors, solr:dom1=jvm,name0=memory,name1=pools,name2=PS-Old-Gen,name=init, solr:dom1=core,dom2=collection1,category=QUERY,scope=/stream,name=timeouts, solr:dom1=core,dom2=collection1,category=UPDATE,scope=updateHandler,name=errors, solr:dom1=core,dom2=collection1,category=ADMIN,scope=/admin/file,name=errors, solr:dom1=core,dom2=collection1,category=QUERY,scope=/sql,name=requests, solr:dom1=core,dom2=collection1,category=ADMIN,scope=/admin/logging,name=shardRequests, solr:dom1=core,dom2=collection1,category=TLOG,name=state, solr:dom1=core,dom2=collection1,category=CORE,scope=fs,name=spins, solr:dom1=jvm,name0=buffers,name1=direct,name=MemoryUsed, solr:dom1=jvm,name0=classes,name=unloaded, solr:dom1=jvm,name0=threads,name1=waiting,name=count, solr:dom1=core,dom2=collection1,category=QUERY,scope=/search-facet-def,name=errors, solr:dom1=node,category=ADMIN,scope=/admin/cores,name=threadPool.parallelCoreAdminExecutor.submitted, solr:dom1=core,dom2=collection1,category=TLOG,scope=replay,name=remaining.bytes, solr:dom1=core,dom2=collection1,category=ADMIN,scope=/admin/properties,name=timeouts, solr:dom1=node,category=CONTAINER,scope=cores,name=loaded, solr:dom1=core,dom2=collection1,category=ADMIN,scope=/schema,name=handlerStart, solr:dom1=node,category=ADMIN,scope=/admin/autoscaling/history,name=timeouts, solr:dom1=node,category=ADMIN,scope=/admin/authorization,name=handlerStart, solr:dom1=core,dom2=collection1,category=ADMIN,scope=/admin/luke,name=shardRequests, solr:dom1=core,dom2=collection1,category=QUERY,scope=/mltrh,name=totalTime, solr:dom1=core,dom2=collection1,category=UPDATE,scope=/update,name=clientErrors, solr:dom1=core,dom2=collection1,category=QUERY,scope=/search-facet-invariants,name=clientErrors, solr:dom1=core,dom2=collection1,category=QUERY,scope=/export,name=totalTime, solr:dom1=core,dom2=collection1,category=SEARCHER,scope=new,name=errors, solr:dom1=core,dom2=collection1,category=QUERY,scope=/sql,name=timeouts, solr:dom1=core,dom2=collection1,category=ADMIN,scope=/config,name=clientErrors, solr:dom1=core,dom2=collection1,category=UPDATE,scope=/update/csv,name=handlerStart, solr:dom1=node,category=QUERY,scope=httpShardHandler,name=threadPool.httpShardExecutor.completed, solr:dom1=core,dom2=collection1,category=QUERY,scope=/debug/dump,name=clientErrors, solr:dom1=core,dom2=collection1,category=REPLICATION,scope=/replication,name=handlerStart, solr:dom1=core,dom2=collection1,category=QUERY,scope=/graph,name=serverErrors, solr:dom1=core,dom2=collection1,category=QUERY,scope=/spellCheckWithWordbreak_Direct,name=serverErrors, java.lang:type=Runtime, solr:dom1=core,dom2=collection1,category=UPDATE,scope=updateHandler,name=cumulativeDeletesById, solr:dom1=core,dom2=collection1,category=QUERY,scope=/defaults,name=timeouts, solr:dom1=core,dom2=collection1,category=UPDATE,scope=updateHandler,name=cumulativeDeletesByQuery, solr:dom1=core,dom2=collection1,category=QUERY,scope=/dismax,name=timeouts, solr:dom1=node,category=ADMIN,scope=/admin/authorization,name=errors, solr:dom1=node,category=UPDATE,scope=updateShardHandler,name=threadPool.recoveryExecutor.duration, solr:dom1=core,dom2=collection1,category=QUERY,scope=/spellCheckWithWordbreak_Direct,name=timeouts, solr:dom1=core,dom2=collection1,category=CORE,scope=fs,name=totalSpace, solr:dom1=core,dom2=collection1,category=QUERY,scope=/spellCheckCompRH_Direct,name=clientErrors, solr:dom1=core,dom2=collection1,category=QUERY,scope=/terms,name=clientErrors, solr:dom1=core,dom2=collection1,category=ADMIN,scope=/admin/mbeans,name=serverErrors, solr:dom1=core,dom2=collection1,category=QUERY,scope=/search-facet-def,name=handlerStart, solr:dom1=node,category=CONTAINER,scope=threadPool,name=coreContainerWorkExecutor.duration, solr:dom1=core,dom2=collection1,category=QUERY,scope=/spellCheckWithWordbreak_Direct,name=requests, solr:dom1=node,category=ADMIN,scope=/admin/zookeeper,name=clientErrors, solr:dom1=core,dom2=collection1,category=ADMIN,scope=/admin/segments,name=timeouts, solr:dom1=core,dom2=collection1,category=QUERY,scope=/spellCheckWithWordbreak_Direct,name=clientErrors, solr:dom1=node,category=CONTAINER,scope=cores,name=unloaded, solr:dom1=node,category=ADMIN,scope=/admin/metrics,name=requestTimes, solr:dom1=core,dom2=collection1,category=QUERY,scope=/search-facet-invariants,name=serverErrors, java.lang:type=MemoryPool,name=PS Eden Space, solr:dom1=node,category=ADMIN,scope=/admin/metrics,name=timeouts, solr:dom1=core,dom2=collection1,category=CORE,scope=fs,name=usableSpace, solr:dom1=jvm,name0=os,name=totalPhysicalMemorySize, solr:dom1=core,dom2=collection1,category=QUERY,scope=/spellCheckCompRH,name=serverErrors, solr:dom1=jvm,name0=os,name=totalSwapSpaceSize, solr:dom1=jvm,name0=memory,name1=pools,name2=Code-Cache,name=init, solr:dom1=core,dom2=collection1,category=UPDATE,scope=updateHandler,name=cumulativeErrors, java.lang:type=MemoryPool,name=PS Survivor Space, solr:dom1=node,category=QUERY,scope=/admin/metrics/collector,name=requestTimes, solr:dom1=core,dom2=collection1,category=QUERY,scope=/spellCheckCompRH,name=errors, solr:dom1=core,dom2=collection1,category=QUERY,scope=/mlt,name=handlerStart, solr:dom1=jvm,name0=os,name=availableProcessors, solr:dom1=node,category=UPDATE,scope=updateShardHandler,name=threadPool.recoveryExecutor.running, solr:dom1=core,dom2=collection1,category=QUERY,scope=/spellCheckWithWordbreak,name=timeouts, solr:dom1=core,dom2=collection1,category=UPDATE,scope=/update,name=requestTimes, solr:dom1=core,dom2=collection1,category=QUERY,scope=/spellCheckWithWordbreak,name=errors, solr:dom1=jvm,name0=memory,name1=pools,name2=Compressed-Class-Space,name=used, solr:dom1=node,category=CONTAINER,scope=fs,name=path, solr:dom1=node,category=ADMIN,scope=/admin/zookeeper,name=timeouts, solr:dom1=jvm,name0=threads,name=count, solr:dom1=node,category=ADMIN,scope=/admin/authorization,name=timeouts, solr:dom1=core,dom2=collection1,category=SEARCHER,scope=searcher,name=caching, solr:dom1=node,category=ADMIN,scope=/admin/health,name=serverErrors, solr:dom1=core,dom2=collection1,category=QUERY,scope=/mock,name=serverErrors, solr:dom1=jvm,name0=memory,name1=total,name=used, solr:dom1=jvm,name0=memory,name1=pools,name2=Code-Cache,name=usage, solr:dom1=core,dom2=collection1,category=HIGHLIGHTER,scope=SolrFormatter,name=html.requests, solr:dom1=node,category=CONTAINER,scope=fs,name=spins, solr:dom1=node,category=ADMIN,scope=/admin/cores,name=clientErrors, solr:dom1=core,dom2=collection1,category=UPDATE,scope=updateHandler,name=deletesByQuery, solr:dom1=core,dom2=collection1,category=ADMIN,scope=/schema,name=timeouts, solr:dom1=core,dom2=collection1,category=UPDATE,scope=/update/json/docs,name=serverErrors, solr:dom1=jvm,name0=threads,name1=new,name=count, solr:dom1=core,dom2=collection1,category=QUERY,scope=/spellCheckWithWordbreak,name=handlerStart, solr:dom1=core,dom2=collection1,category=TLOG,scope=replay,name=ops, solr:dom1=core,dom2=collection1,category=UPDATE,scope=/update,name=shardRequests, solr:dom1=core,dom2=collection1,category=QUERY,scope=/spellCheckCompRH1,name=handlerStart, solr:dom1=core,dom2=collection1,category=ADMIN,scope=/admin/threads,name=serverErrors, solr:dom1=core,dom2=collection1,category=ADMIN,scope=/admin/logging,name=serverErrors, solr:dom1=core,dom2=collection1,category=ADMIN,scope=/admin/ping,name=requests, solr:dom1=core,dom2=collection1,category=QUERY,scope=/export,name=timeouts, solr:dom1=jvm,name0=memory,name1=pools,name2=PS-Old-Gen,name=committed, solr:dom1=node,category=ADMIN,scope=/admin/autoscaling/history,name=totalTime, solr:dom1=core,dom2=collection1,category=SEARCHER,scope=searcher,name=openedAt, solr:dom1=core,dom2=collection1,category=QUERY,scope=/stream,name=clientErrors, solr:dom1=core,dom2=collection1,category=QUERY,scope=/mlt,name=requestTimes, solr:dom1=node,category=ADMIN,scope=/admin/configs,name=errors, solr:dom1=core,dom2=collection1,category=QUERY,scope=/mock,name=initCount, solr:dom1=core,dom2=collection1,category=UPDATE,scope=update,name=errors, solr:dom1=core,dom2=collection1,category=UPDATE,scope=update,name=clientErrors, solr:dom1=core,dom2=collection1,category=QUERY,scope=/spellCheckWithWordbreak,name=requests, solr:dom1=node,category=ADMIN,scope=/admin/cores,name=handlerStart, solr:dom1=node,category=QUERY,scope=httpShardHandler,name=leasedConnections, solr:dom1=core,dom2=collection1,category=QUERY,scope=/select,name=requests, solr:dom1=core,dom2=collection1,category=UPDATE,scope=updateHandler,name=softAutoCommits, solr:dom1=jvm,name0=memory,name1=non-heap,name=used, solr:dom1=node,category=ADMIN,scope=/admin/metrics,name=handlerStart, solr:dom1=core,dom2=collection1,category=ADMIN,scope=/admin/segments,name=serverErrors, solr:dom1=core,dom2=collection1,category=UPDATE,scope=update,name=shardRequests, solr:dom1=node,category=ADMIN,scope=/admin/collections,name=clientErrors, java.lang:type=MemoryPool,name=Code Cache, solr:dom1=core,dom2=collection1,category=CORE,name=refCount, java.nio:type=BufferPool,name=direct, solr:dom1=core,dom2=collection1,category=UPDATE,scope=/update/json,name=totalTime, solr:dom1=node,category=ADMIN,scope=/admin/collections,name=errors, solr:dom1=jvm,name0=threads,name1=daemon,name=count, solr:dom1=node,category=ADMIN,scope=/admin/zookeeper,name=serverErrors, solr:dom1=node,category=CONTAINER,scope=fs,name=coreRoot.path, solr:dom1=core,dom2=collection1,category=ADMIN,scope=/admin/segments,name=errors, solr:dom1=node,category=ADMIN,scope=/admin/health,name=shardRequests, solr:dom1=jvm,name0=memory,name1=non-heap,name=init, solr:dom1=node,category=ADMIN,scope=/admin/configs,name=requests, solr:dom1=core,dom2=collection1,category=QUERY,scope=/sql,name=requestTimes, solr:dom1=core,dom2=collection1,category=CACHE,scope=searcher,name=queryResultCache, solr:dom1=core,dom2=collection1,category=QUERY,scope=/spellCheckCompRH,name=requestTimes, solr:dom1=core,dom2=collection1,category=QUERY,scope=/search-facet-invariants,name=totalTime, solr:dom1=node,category=ADMIN,scope=/admin/autoscaling/history,name=handlerStart, solr:dom1=core,dom2=collection1,category=SEARCHER,scope=searcher,name=searcherName, solr:dom1=core,dom2=collection1,category=QUERY,scope=/spellCheckCompRH_Direct,name=handlerStart, solr:dom1=core,dom2=collection1,category=QUERY,scope=/dismax,name=requests, solr:dom1=jvm,name0=memory,name1=heap,name=max, solr:dom1=core,dom2=collection1,category=QUERY,scope=/defaults,name=shardRequests, solr:dom1=node,category=CONTAINER,scope=threadPool,name=coreLoadExecutor.duration, solr:dom1=core,dom2=collection1,category=UPDATE,scope=/update/csv,name=shardRequests, solr:dom1=core,dom2=collection1,category=REPLICATION,scope=/replication,name=serverErrors, solr:dom1=core,dom2=collection1,category=UPDATE,scope=update,name=timeouts, solr:dom1=core,dom2=collection1,category=ADMIN,scope=/admin/luke,name=errors, solr:dom1=node,category=ADMIN,scope=/admin/cores,name=requests, solr:dom1=core,dom2=collection1,category=ADMIN,scope=/admin/mbeans,name=requestTimes, solr:dom1=core,dom2=collection1,category=ADMIN,scope=/admin/file,name=timeouts, solr:dom1=core,dom2=collection1,category=REPLICATION,scope=/replication,name=indexSize, solr:dom1=core,dom2=collection1,category=ADMIN,scope=/admin/ping,name=shardRequests, solr:dom1=node,category=ADMIN,scope=/admin/zookeeper,name=errors, solr:dom1=core,dom2=collection1,category=ADMIN,scope=/admin/ping,name=timeouts, solr:dom1=node,category=ADMIN,scope=/admin/cores,name=requestTimes, solr:dom1=core,dom2=collection1,category=QUERY,scope=/graph,name=requests, solr:dom1=core,dom2=collection1,category=ADMIN,scope=/schema,name=shardRequests, solr:dom1=node,category=ADMIN,scope=/admin/configs,name=shardRequests, solr:dom1=jvm,name0=buffers,name1=mapped,name=Count, solr:dom1=core,dom2=collection1,category=ADMIN,scope=/schema,name=requestTimes, solr:dom1=core,dom2=collection1,category=QUERY,scope=/defaults,name=errors, solr:dom1=core,dom2=collection1,category=ADMIN,scope=/admin/segments,name=requests, solr:dom1=core,dom2=collection1,category=ADMIN,scope=/admin/file,name=shardRequests, solr:dom1=co
   [junit4]   2> re,dom2=collection1,category=QUERY,scope=/search-facet-invariants,name=timeouts, solr:dom1=core,dom2=collection1,category=UPDATE,scope=update,name=totalTime, solr:dom1=core,dom2=collection1,category=UPDATE,scope=update,name=requests, solr:dom1=core,dom2=collection1,category=QUERY,scope=/spellCheckCompRH1,name=clientErrors, solr:dom1=core,dom2=collection1,category=UPDATE,scope=/update/json/docs,name=clientErrors, solr:dom1=core,dom2=collection1,category=ADMIN,scope=/admin/properties,name=serverErrors, java.lang:type=Compilation, solr:dom1=node,category=UPDATE,scope=updateShardHandler,name=threadPool.updateExecutor.submitted, solr:dom1=jvm,name0=memory,name1=pools,name2=Compressed-Class-Space,name=committed, solr:dom1=node,category=ADMIN,scope=/admin/autoscaling/history,name=requests, solr:dom1=node,category=QUERY,scope=/admin/metrics/collector,name=serverErrors, solr:dom1=core,dom2=collection1,category=TLOG,scope=buffered,name=ops, solr:dom1=core,dom2=collection1,category=REPLICATION,scope=/replication,name=timeouts, solr:dom1=core,dom2=collection1,category=UPDATE,scope=updateHandler,name=adds, solr:dom1=core,dom2=collection1,category=ADMIN,scope=/admin/properties,name=errors, solr:dom1=jvm,name0=os,name=version, solr:dom1=core,dom2=collection1,category=UPDATE,scope=update,name=serverErrors, solr:dom1=node,category=UPDATE,scope=updateShardHandler,name=pendingConnections, solr:dom1=jvm,name0=memory,name1=pools,name2=Metaspace,name=usage, solr:dom1=core,dom2=collection1,category=CACHE,scope=searcher,name=documentCache, solr:dom1=node,category=ADMIN,scope=/admin/authorization,name=shardRequests, solr:dom1=core,dom2=collection1,category=ADMIN,scope=/admin/plugins,name=totalTime, solr:dom1=core,dom2=collection1,category=QUERY,scope=/graph,name=handlerStart, solr:dom1=core,dom2=collection1,category=QUERY,scope=/mlt,name=errors, solr:dom1=core,dom2=collection1,category=QUERY,scope=/spellCheckWithWordbreak_Direct,name=handlerStart, java.lang:type=MemoryPool,name=Compressed Class Space, solr:dom1=core,dom2=collection1,category=QUERY,scope=/terms,name=requestTimes, solr:dom1=core,dom2=collection1,category=ADMIN,scope=/schema,name=errors, solr:dom1=core,dom2=collection1,category=QUERY,scope=/spellCheckCompRH_Direct,name=totalTime, solr:dom1=core,dom2=collection1,category=UPDATE,scope=/update/csv,name=clientErrors, solr:dom1=core,dom2=collection1,category=ADMIN,scope=/admin/properties,name=totalTime, solr:dom1=core,dom2=collection1,category=UPDATE,scope=/update/csv,name=requests, solr:dom1=jvm,name0=os,name=committedVirtualMemorySize, solr:dom1=core,dom2=collection1,category=QUERY,scope=/tvrh,name=errors, solr:dom1=jvm,name0=memory,name1=pools,name2=PS-Old-Gen,name=usage, solr:dom1=core,dom2=collection1,category=QUERY,scope=/terms,name=requests, solr:dom1=jvm,name0=memory,name1=non-heap,name=max, solr:dom1=jvm,name0=os,name=maxFileDescriptorCount, solr:dom1=core,dom2=collection1,category=HIGHLIGHTER,scope=SolrFragmentsBuilder,name=simple.requests, solr:dom1=core,dom2=collection1,category=CORE,name=coreName, solr:dom1=node,category=CONTAINER,scope=threadPool,name=coreLoadExecutor.running, solr:dom1=core,dom2=collection1,category=QUERY,scope=/sql,name=handlerStart, solr:dom1=jvm,name0=memory,name1=heap,name=used, solr:dom1=core,dom2=collection1,category=CACHE,scope=searcher,name=perSegFilter, solr:dom1=core,dom2=collection1,category=ADMIN,scope=/admin/logging,name=requests, solr:dom1=node,category=ADMIN,scope=/admin/health,name=totalTime, solr:dom1=core,dom2=collection1,category=QUERY,scope=/sql,name=errors, solr:dom1=core,dom2=collection1,category=REPLICATION,scope=/replication,name=confFilesToReplicate, solr:dom1=core,dom2=collection1,category=UPDATE,scope=/update/json/docs,name=requests, solr:dom1=core,dom2=collection1,category=ADMIN,scope=/admin/luke,name=totalTime, solr:dom1=node,category=CONTAINER,scope=fs,name=coreRoot.usableSpace, solr:dom1=jvm,name0=os,name=systemCpuLoad, solr:dom1=core,dom2=collection1,category=HIGHLIGHTER,scope=SolrFragListBuilder,name=default.requests, solr:dom1=node,category=ADMIN,scope=/admin/info,name=shardRequests, solr:dom1=core,dom2=collection1,category=UPDATE,scope=updateHandler,name=splits, solr:dom1=core,dom2=collection1,category=QUERY,scope=/terms,name=handlerStart, solr:dom1=core,dom2=collection1,category=REPLICATION,scope=/replication,name=fetcher, solr:dom1=core,dom2=collection1,category=QUERY,scope=/spellCheckCompRH_Direct,name=requestTimes, solr:dom1=jvm,name0=threads,name1=blocked,name=count, solr:dom1=core,dom2=collection1,category=QUERY,scope=/graph,name=timeouts, solr:dom1=node,category=ADMIN,scope=/admin/zookeeper,name=requestTimes, solr:dom1=node,category=ADMIN,scope=/admin/autoscaling/history,name=shardRequests, solr:dom1=core,dom2=collection1,category=REPLICATION,scope=/replication,name=totalTime, solr:dom1=core,dom2=collection1,category=HIGHLIGHTER,scope=SolrBoundaryScanner,name=default.requests, solr:dom1=jvm,name0=gc,name1=PS-MarkSweep,name=time, solr:dom1=node,category=ADMIN,scope=/admin/collections,name=requests, solr:dom1=node,category=ADMIN,scope=/admin/configs,name=totalTime, solr:dom1=core,dom2=collection1,category=TLOG,scope=applyingBuffered,name=ops, solr:dom1=node,category=ADMIN,scope=/admin/info,name=handlerStart, solr:dom1=core,dom2=collection1,category=QUERY,scope=/search-facet-def,name=totalTime, solr:dom1=jvm,name0=buffers,name1=direct,name=TotalCapacity, solr:dom1=node,category=ADMIN,scope=/admin/autoscaling/history,name=serverErrors, solr:dom1=core,dom2=collection1,category=ADMIN,scope=/admin/properties,name=clientErrors, solr:dom1=core,dom2=collection1,category=UPDATE,scope=update,name=handlerStart, solr:dom1=core,dom2=collection1,category=REPLICATION,scope=/replication,name=generation, solr:dom1=core,dom2=collection1,category=UPDATE,scope=/update/csv,name=timeouts, solr:dom1=core,dom2=collection1,category=QUERY,scope=/mltrh,name=errors, java.lang:type=OperatingSystem, solr:dom1=core,dom2=collection1,category=ADMIN,scope=/admin/luke,name=timeouts, solr:dom1=core,dom2=collection1,category=QUERY,scope=/tvrh,name=handlerStart, solr:dom1=core,dom2=collection1,category=ADMIN,scope=/admin/threads,name=totalTime, solr:dom1=core,dom2=collection1,category=UPDATE,scope=/update/json/docs,name=timeouts, solr:dom1=node,category=ADMIN,scope=/admin/metrics,name=shardRequests, solr:dom1=core,dom2=collection1,category=QUERY,scope=/mock,name=clientErrors, solr:dom1=jvm,name0=threads,name1=terminated,name=count, java.lang:type=MemoryManager,name=Metaspace Manager, solr:dom1=core,dom2=collection1,category=ADMIN,scope=/admin/mbeans,name=handlerStart, solr:dom1=node,category=QUERY,scope=/admin/metrics/collector,name=timeouts, solr:dom1=core,dom2=collection1,category=QUERY,scope=/spellCheckCompRH1,name=shardRequests, solr:dom1=node,category=QUERY,scope=/admin/metrics/collector,name=shardRequests, solr:dom1=node,category=ADMIN,scope=/admin/metrics,name=totalTime, solr:dom1=core,dom2=collection1,category=QUERY,scope=/spellCheckCompRH1,name=errors, solr:dom1=node,category=ADMIN,scope=/admin/zookeeper,name=handlerStart, solr:dom1=node,category=ADMIN,scope=/admin/health,name=requests, solr:dom1=core,dom2=collection1,category=TLOG,scope=replay,name=remaining.logs, solr:dom1=core,dom2=collection1,category=ADMIN,scope=/admin/system,name=requestTimes, solr:dom1=core,dom2=collection1,category=CORE,scope=fs,name=path, solr:dom1=node,category=CONTAINER,scope=threadPool,name=coreContainerWorkExecutor.completed, solr:dom1=core,dom2=collection1,category=ADMIN,scope=/admin/properties,name=requests, solr:dom1=core,dom2=collection1,category=QUERY,scope=/sql,name=serverErrors, solr:dom1=core,dom2=collection1,category=QUERY,scope=/sql,name=totalTime, solr:dom1=core,dom2=collection1,category=ADMIN,scope=/admin/logging,name=totalTime, solr:dom1=node,category=ADMIN,scope=/admin/cores,name=threadPool.parallelCoreAdminExecutor.duration, solr:dom1=core,dom2=collection1,category=ADMIN,scope=/admin/luke,name=serverErrors, solr:dom1=core,dom2=collection1,category=QUERY,scope=/spellCheckCompRH,name=totalTime, solr:dom1=core,dom2=collection1,category=UPDATE,scope=/update/json/docs,name=totalTime, solr:dom1=jvm,name0=memory,name1=pools,name2=PS-Eden-Space,name=max, solr:dom1=jvm,name0=memory,name1=pools,name2=PS-Old-Gen,name=used, solr:dom1=core,dom2=collection1,category=REPLICATION,scope=/replication,name=shardRequests, solr:dom1=core,dom2=collection1,category=QUERY,scope=/spellCheckWithWordbreak,name=serverErrors, solr:dom1=core,dom2=collection1,category=INDEX,name=sizeInBytes, solr:dom1=jvm,name0=memory,name1=pools,name2=Metaspace,name=max, solr:dom1=core,dom2=collection1,category=QUERY,scope=/tvrh,name=shardRequests, solr:dom1=node,category=ADMIN,scope=/admin/info,name=requestTimes, solr:dom1=core,dom2=collection1,category=UPDATE,scope=updateHandler,name=commits, solr:dom1=core,dom2=collection1,category=REPLICATION,scope=/replication,name=isSlave, solr:dom1=core,dom2=collection1,category=ADMIN,scope=/admin/threads,name=requests, solr:dom1=core,dom2=collection1,category=QUERY,scope=/sql,name=clientErrors, solr:dom1=core,dom2=collection1,category=ADMIN,scope=/schema,name=serverErrors, solr:dom1=core,dom2=collection1,category=UPDATE,scope=updateHandler,name=cumulativeAdds, solr:dom1=node,category=ADMIN,scope=/admin/authorization,name=clientErrors, solr:dom1=core,dom2=collection1,category=ADMIN,scope=/admin/segments,name=shardRequests, solr:dom1=core,dom2=collection1,category=QUERY,scope=/mock,name=timeouts, solr:dom1=core,dom2=collection1,category=QUERY,scope=/mlt,name=serverErrors, solr:dom1=core,dom2=collection1,category=QUERY,scope=/select,name=timeouts, solr:dom1=core,dom2=collection1,category=ADMIN,scope=/admin/mbeans,name=timeouts, solr:dom1=core,dom2=collection1,category=ADMIN,scope=/admin/logging,name=timeouts, solr:dom1=core,dom2=collection1,category=QUERY,scope=/mltrh,name=clientErrors, solr:dom1=jvm,name0=os,name=freeSwapSpaceSize, solr:dom1=core,dom2=collection1,category=QUERY,scope=/get,name=totalTime, java.lang:type=MemoryManager,name=CodeCacheManager, solr:dom1=core,dom2=collection1,category=QUERY,scope=/stream,name=requests, solr:dom1=node,category=QUERY,scope=httpShardHandler,name=availableConnections, solr:dom1=core,dom2=collection1,category=REPLICATION,scope=/replication,name=indexPath, solr:dom1=core,dom2=collection1,category=ADMIN,scope=/admin/threads,name=handlerStart, solr:dom1=core,dom2=collection1,category=QUERY,scope=/debug/dump,name=requestTimes, solr:dom1=jvm,name0=memory,name1=pools,name2=PS-Eden-Space,name=committed, solr:dom1=core,dom2=collection1,category=QUERY,scope=/export,name=requests, solr:dom1=node,category=ADMIN,scope=/admin/configs,name=handlerStart, solr:dom1=core,dom2=collection1,category=QUERY,scope=/debug/dump,name=totalTime, solr:dom1=core,dom2=collection1,category=REPLICATION,scope=/replication,name=requestTimes, solr:dom1=jvm,name0=memory,name1=pools,name2=PS-Old-Gen,name=used-after-gc, solr:dom1=node,category=ADMIN,scope=/admin/collections,name=timeouts, java.lang:type=GarbageCollector,name=PS Scavenge, solr:dom1=core,dom2=collection1,category=ADMIN,scope=/admin/system,name=timeouts, solr:dom1=core,dom2=collection1,category=QUERY,scope=/graph,name=totalTime, solr:dom1=node,category=ADMIN,scope=/admin/info,name=clientErrors, solr:dom1=jvm,name0=memory,name1=heap,name=usage, solr:dom1=core,dom2=collection1,category=INDEX,name=size, solr:dom1=core,dom2=collection1,category=ADMIN,scope=/admin/plugins,name=requestTimes, java.nio:type=BufferPool,name=mapped, solr:dom1=jvm,name0=memory,name1=pools,name2=PS-Eden-Space,name=used-after-gc, com.sun.management:type=DiagnosticCommand, solr:dom1=core,dom2=collection1,category=REPLICATION,scope=/replication,name=replicationEnabled, solr:dom1=core,dom2=collection1,category=ADMIN,scope=/config,name=serverErrors, solr:dom1=core,dom2=collection1,category=SEARCHER,scope=new,name=maxReached, solr:dom1=node,category=ADMIN,scope=/admin/info,name=totalTime, solr:dom1=core,dom2=collection1,category=ADMIN,scope=/admin/plugins,name=clientErrors, solr:dom1=node,category=ADMIN,scope=/admin/cores,name=threadPool.parallelCoreAdminExecutor.running, solr:dom1=jvm,name0=os,name=arch, solr:dom1=node,category=UPDATE,scope=updateShardHandler,name=threadPool.updateExecutor.duration, solr:dom1=core,dom2=collection1,category=UPDATE,scope=/update/csv,name=serverErrors, solr:dom1=core,dom2=collection1,category=QUERY,scope=/mock,name=shardRequests, solr:dom1=core,dom2=collection1,category=QUERY,scope=/search-facet-def,name=requests, solr:dom1=jvm,name0=memory,name1=pools,name2=Compressed-Class-Space,name=init, solr:dom1=jvm,name0=os,name=name, solr:dom1=core,dom2=collection1,category=QUERY,scope=/search-facet-def,name=serverErrors, solr:dom1=node,category=ADMIN,scope=/admin/health,name=handlerStart, solr:dom1=core,dom2=collection1,category=SEARCHER,scope=searcher,name=maxDoc, solr:dom1=jvm,name0=os,name=processCpuLoad, solr:dom1=core,dom2=collection1,category=UPDATE,scope=/update/json,name=errors, solr:dom1=jvm,name0=memory,name1=pools,name2=Metaspace,name=committed, solr:dom1=core,dom2=collection1,category=HIGHLIGHTER,scope=SolrFragmentsBuilder,name=scoreOrder.requests, solr:dom1=node,category=CONTAINER,scope=fs,name=usableSpace, solr:dom1=core,dom2=collection1,category=QUERY,scope=/spellCheckCompRH1,name=serverErrors, solr:dom1=node,category=ADMIN,scope=/admin/metrics,name=errors, solr:dom1=core,dom2=collection1,category=UPDATE,scope=updateHandler,name=merges, solr:dom1=node,category=ADMIN,scope=/admin/health,name=clientErrors, solr:dom1=node,category=QUERY,scope=/admin/metrics/collector,name=totalTime, solr:dom1=core,dom2=collection1,category=ADMIN,scope=/admin/ping,name=totalTime, solr:dom1=core,dom2=collection1,category=QUERY,scope=/tvrh,name=serverErrors, solr:dom1=node,category=CONTAINER,scope=version,name=specification, solr:dom1=core,dom2=collection1,category=ADMIN,scope=/admin/plugins,name=errors, solr:dom1=core,dom2=collection1,category=QUERY,scope=/sql,name=shardRequests, solr:dom1=jvm,name0=threads,name1=timed_waiting,name=count, solr:dom1=core,dom2=collection1,category=CORE,name=instanceDir, solr:dom1=core,dom2=collection1,category=UPDATE,scope=/update/csv,name=errors, solr:dom1=core,dom2=collection1,category=QUERY,scope=/tvrh,name=clientErrors, solr:dom1=core,dom2=collection1,category=ADMIN,scope=/admin/file,name=totalTime, solr:dom1=core,dom2=collection1,category=QUERY,scope=/dismax,name=serverErrors, solr:dom1=core,dom2=collection1,category=ADMIN,scope=/admin/plugins,name=handlerStart, solr:dom1=core,dom2=collection1,category=SEARCHER,scope=searcher,name=deletedDocs, solr:dom1=core,dom2=collection1,category=UPDATE,scope=/update/json,name=clientErrors, solr:dom1=core,dom2=collection1,category=QUERY,scope=/spellCheckCompRH1,name=timeouts, solr:dom1=jvm,name0=memory,name1=pools,name2=Metaspace,name=used, solr:dom1=node,category=ADMIN,scope=/admin/info,name=timeouts, solr:dom1=core,dom2=collection1,category=ADMIN,scope=/config,name=requestTimes, solr:dom1=core,dom2=collection1,category=ADMIN,scope=/admin/system,name=handlerStart, solr:dom1=core,dom2=collection1,category=ADMIN,scope=/admin/threads,name=requestTimes, solr:dom1=core,dom2=collection1,category=QUERY,scope=/mltrh,name=serverErrors, JMImplementation:type=MBeanServerDelegate, solr:dom1=core,dom2=collection1,category=SEARCHER,scope=searcher,name=readerDir, solr:dom1=node,category=ADMIN,scope=/admin/autoscaling/history,name=requestTimes, solr:dom1=core,dom2=collection1,category=UPDATE,scope=/update,name=serverErrors, solr:dom1=node,category=ADMIN,scope=/admin/zookeeper,name=requests, solr:dom1=node,category=UPDATE,scope=updateShardHandler,name=threadPool.recoveryExecutor.completed, solr:dom1=core,dom2=collection1,category=QUERY,scope=/spellCheckCompRH,name=handlerStart, solr:dom1=core,dom2=collection1,category=UPDATE,scope=updateHandler,name=deletesById, solr:dom1=core,dom2=collection1,category=ADMIN,scope=/admin/mbeans,name=requests, solr:dom1=core,dom2=collection1,category=ADMIN,scope=/admin/mbeans,name=errors, solr:dom1=core,dom2=collection1,category=SEARCHER,scope=new,name=time, solr:dom1=core,dom2=collection1,category=QUERY,scope=/mlt,name=shardRequests, solr:dom1=node,category=ADMIN,scope=/admin/collections,name=totalTime, java.lang:type=ClassLoading, solr:dom1=core,dom2=collection1,category=ADMIN,scope=/admin/plugins,name=requests, s
   [junit4]   2> olr:dom1=core,dom2=collection1,category=ADMIN,scope=/admin/ping,name=clientErrors, solr:dom1=core,dom2=collection1,category=ADMIN,scope=/admin/file,name=clientErrors, solr:dom1=core,dom2=collection1,category=QUERY,scope=/select,name=requestTimes, solr:dom1=node,category=CONTAINER,scope=threadPool,name=coreContainerWorkExecutor.submitted, java.lang:type=MemoryPool,name=Metaspace, solr:dom1=core,dom2=collection1,category=REPLICATION,scope=/replication,name=clientErrors, solr:dom1=node,category=ADMIN,scope=/admin/health,name=timeouts, solr:dom1=core,dom2=collection1,category=UPDATE,scope=updateHandler,name=expungeDeletes, solr:dom1=core,dom2=collection1,category=QUERY,scope=/spellCheckWithWordbreak,name=clientErrors, solr:dom1=core,dom2=collection1,category=QUERY,scope=/debug/dump,name=serverErrors, solr:dom1=core,dom2=collection1,category=QUERY,scope=/tvrh,name=requestTimes, solr:dom1=core,dom2=collection1,category=CACHE,scope=core,name=fieldCache, solr:dom1=core,dom2=collection1,category=QUERY,scope=/spellCheckCompRH_Direct,name=timeouts, solr:dom1=node,category=ADMIN,scope=/admin/zookeeper,name=shardRequests, solr:dom1=core,dom2=collection1,category=CACHE,scope=searcher,name=fieldValueCache, solr:dom1=core,dom2=collection1,category=QUERY,scope=/terms,name=totalTime, solr:dom1=core,dom2=collection1,category=QUERY,scope=/select,name=handlerStart, solr:dom1=jvm,name0=memory,name1=pools,name2=Code-Cache,name=max, solr:dom1=core,dom2=collection1,category=ADMIN,scope=/admin/file,name=serverErrors, solr:dom1=core,dom2=collection1,category=ADMIN,scope=/admin/logging,name=clientErrors, solr:dom1=core,dom2=collection1,category=UPDATE,scope=updateHandler,name=autoCommits, solr:dom1=node,category=ADMIN,scope=/admin/authorization,name=requests, solr:dom1=core,dom2=collection1,category=UPDATE,scope=/update/csv,name=requestTimes, solr:dom1=node,category=ADMIN,scope=/admin/cores,name=timeouts, solr:dom1=jvm,name0=memory,name1=pools,name2=PS-Survivor-Space,name=committed, solr:dom1=core,dom2=collection1,category=ADMIN,scope=/admin/segments,name=handlerStart, solr:dom1=jvm,name0=gc,name1=PS-MarkSweep,name=count, solr:dom1=node,category=CONTAINER,scope=fs,name=totalSpace, solr:dom1=core,dom2=collection1,category=ADMIN,scope=/admin/ping,name=serverErrors, solr:dom1=core,dom2=collection1,category=QUERY,scope=/spellCheckCompRH_Direct,name=errors, solr:dom1=core,dom2=collection1,category=HIGHLIGHTER,scope=SolrFragmenter,name=default.requests, solr:dom1=core,dom2=collection1,category=QUERY,scope=/tvrh,name=requests, solr:dom1=node,category=ADMIN,scope=/admin/info,name=requests, solr:dom1=node,category=ADMIN,scope=/admin/configs,name=timeouts, solr:dom1=jvm,name0=os,name=freePhysicalMemorySize, solr:dom1=core,dom2=collection1,category=QUERY,scope=/spellCheckCompRH,name=shardRequests, solr:dom1=core,dom2=collection1,category=ADMIN,scope=/admin/threads,name=clientErrors, solr:dom1=node,category=ADMIN,scope=/admin/cores,name=threadPool.parallelCoreAdminExecutor.completed, solr:dom1=core,dom2=collection1,category=QUERY,scope=/defaults,name=clientErrors, solr:dom1=core,dom2=collection1,category=QUERY,scope=/spellCheckCompRH_Direct,name=shardRequests, solr:dom1=core,dom2=collection1,category=REPLICATION,scope=/replication,name=errors, solr:dom1=core,dom2=collection1,category=SEARCHER,scope=new,name=warmup, solr:dom1=core,dom2=collection1,category=QUERY,scope=/get,name=requests, solr:dom1=core,dom2=collection1,category=QUERY,scope=/mlt,name=clientErrors, solr_34009:dom1=solr,dom2=jvm,name0=system,name=properties, solr:dom1=core,dom2=collection1,category=QUERY,scope=/mltrh,name=timeouts, solr:dom1=core,dom2=collection1,category=QUERY,scope=/spellCheckCompRH_Direct,name=requests, solr:dom1=node,category=QUERY,scope=httpShardHandler,name=maxConnections, solr:dom1=core,dom2=collection1,category=QUERY,scope=/defaults,name=totalTime, solr:dom1=core,dom2=collection1,category=QUERY,scope=/terms,name=shardRequests, solr:dom1=core,dom2=collection1,category=ADMIN,scope=/schema,name=totalTime, solr:dom1=core,dom2=collection1,category=HIGHLIGHTER,scope=SolrFragmentsBuilder,name=default.requests, solr:dom1=core,dom2=collection1,category=QUERY,scope=/spellCheckWithWordbreak_Direct,name=shardRequests, solr:dom1=core,dom2=collection1,category=UPDATE,scope=updateHandler,name=docsPending, solr:dom1=node,category=ADMIN,scope=/admin/zookeeper,name=totalTime, solr:dom1=jvm,name0=memory,name1=pools,name2=PS-Survivor-Space,name=used-after-gc, solr:dom1=core,dom2=collection1,category=QUERY,scope=/mock,name=totalTime, solr:dom1=core,dom2=collection1,category=QUERY,scope=/mlt,name=totalTime, solr:dom1=jvm,name0=system,name=properties, solr:dom1=core,dom2=collection1,category=REPLICATION,scope=/replication,name=isMaster, solr:dom1=core,dom2=collection1,category=ADMIN,scope=/admin/logging,name=handlerStart, solr:dom1=node,category=ADMIN,scope=/admin/collections,name=serverErrors, solr:dom1=core,dom2=collection1,category=UPDATE,scope=/update/json,name=serverErrors, solr:dom1=core,dom2=collection1,category=HIGHLIGHTER,scope=SolrEncoder,name=default.requests, solr:dom1=core,dom2=collection1,category=QUERY,scope=/mltrh,name=requests, solr:dom1=core,dom2=collection1,category=ADMIN,scope=/config,name=shardRequests, solr:dom1=core,dom2=collection1,category=ADMIN,scope=/admin/mbeans,name=clientErrors, solr:dom1=core,dom2=collection1,category=QUERY,scope=/spellCheckCompRH1,name=totalTime, solr:dom1=core,dom2=collection1,category=UPDATE,scope=/update/json,name=requestTimes, solr:dom1=core,dom2=collection1,category=QUERY,scope=/graph,name=requestTimes, solr:dom1=core,dom2=collection1,category=QUERY,scope=/export,name=clientErrors, solr:dom1=core,dom2=collection1,category=ADMIN,scope=/admin/logging,name=requestTimes, solr:dom1=jvm,name0=memory,name1=total,name=max, solr:dom1=core,dom2=collection1,category=CORE,name=aliases, solr:dom1=core,dom2=collection1,category=QUERY,scope=/select,name=errors, solr:dom1=jvm,name0=memory,name1=pools,name2=Code-Cache,name=used, solr:dom1=core,dom2=collection1,category=ADMIN,scope=/admin/plugins,name=timeouts, solr:dom1=core,dom2=collection1,category=QUERY,scope=/debug/dump,name=errors, solr:dom1=core,dom2=collection1,category=SEARCHER,scope=searcher,name=registeredAt, solr:dom1=core,dom2=collection1,category=REPLICATION,scope=/replication,name=requests, solr:dom1=core,dom2=collection1,category=QUERY,scope=/get,name=timeouts, solr:dom1=core,dom2=collection1,category=QUERY,scope=/get,name=handlerStart, solr:dom1=jvm,name0=memory,name1=pools,name2=Compressed-Class-Space,name=usage, solr:dom1=node,category=ADMIN,scope=/admin/info,name=serverErrors, solr:dom1=core,dom2=collection1,category=REPLICATION,scope=/replication,name=replicateAfter, solr:dom1=core,dom2=collection1,category=QUERY,scope=/mltrh,name=handlerStart, solr:dom1=core,dom2=collection1,category=ADMIN,scope=/admin/file,name=requests, solr:dom1=core,dom2=collection1,category=CACHE,scope=searcher,name=filterCache, solr:dom1=node,category=ADMIN,scope=/admin/collections,name=shardRequests, solr:dom1=core,dom2=collection1,category=ADMIN,scope=/admin/segments,name=clientErrors, solr:dom1=core,dom2=collection1,category=ADMIN,scope=/config,name=timeouts, solr:dom1=core,dom2=collection1,category=QUERY,scope=/export,name=handlerStart, solr:dom1=jvm,name0=memory,name1=pools,name2=PS-Survivor-Space,name=used, solr:dom1=core,dom2=collection1,category=CORE,name=startTime, java.lang:type=MemoryPool,name=PS Old Gen, solr:dom1=core,dom2=collection1,category=UPDATE,scope=/update/json/docs,name=requestTimes, solr:dom1=jvm,name0=gc,name1=PS-Scavenge,name=time, solr:dom1=node,category=CONTAINER,scope=threadPool,name=coreLoadExecutor.completed, solr:dom1=core,dom2=collection1,category=ADMIN,scope=/admin/properties,name=handlerStart, solr:dom1=jvm,name0=memory,name1=pools,name2=PS-Survivor-Space,name=init, solr:dom1=core,dom2=collection1,category=HIGHLIGHTER,scope=SolrBoundaryScanner,name=simple.requests, solr:dom1=core,dom2=collection1,category=QUERY,scope=/search-facet-invariants,name=requestTimes, solr:dom1=core,dom2=collection1,category=ADMIN,scope=/admin/ping,name=requestTimes, solr:dom1=core,dom2=collection1,category=QUERY,scope=/defaults,name=requests, solr:dom1=core,dom2=collection1,category=ADMIN,scope=/admin/file,name=requestTimes, solr:dom1=core,dom2=collection1,category=UPDATE,scope=/update,name=errors, solr:dom1=core,dom2=collection1,category=QUERY,scope=/select,name=serverErrors, solr:dom1=core,dom2=collection1,category=UPDATE,scope=/update/json,name=shardRequests, solr:dom1=node,category=UPDATE,scope=updateShardHandler,name=maxConnections, solr:dom1=core,dom2=collection1,category=QUERY,scope=/spellCheckCompRH,name=clientErrors, solr:dom1=node,category=UPDATE,scope=updateShardHandler,name=availableConnections, solr:dom1=core,dom2=collection1,category=QUERY,scope=/mltrh,name=requestTimes, solr:dom1=node,category=ADMIN,scope=/admin/configs,name=serverErrors, solr:dom1=core,dom2=collection1,category=SEARCHER,name=new, solr:dom1=core,dom2=collection1,category=QUERY,scope=/select,name=shardRequests, solr:dom1=node,category=CONTAINER,scope=version,name=implementation, com.sun.management:type=HotSpotDiagnostic, solr:dom1=core,dom2=collection1,category=QUERY,scope=/export,name=serverErrors, solr:dom1=core,dom2=collection1,category=ADMIN,scope=/admin/threads,name=shardRequests, solr:dom1=core,dom2=collection1,category=QUERY,scope=/spellCheckCompRH,name=requests, solr:dom1=core,dom2=collection1,category=ADMIN,scope=/admin/luke,name=clientErrors, solr:dom1=core,dom2=collection1,category=QUERY,scope=/mlt,name=requests, solr:dom1=core,dom2=collection1,category=UPDATE,scope=/update/json/docs,name=errors, solr:dom1=node,category=CONTAINER,scope=threadPool,name=coreLoadExecutor.submitted, solr:dom1=jvm,name0=memory,name1=non-heap,name=committed, solr:dom1=jvm,name0=buffers,name1=mapped,name=MemoryUsed, solr:dom1=core,dom2=collection1,category=ADMIN,scope=/schema,name=requests, solr:dom1=core,dom2=collection1,category=UPDATE,scope=/update/json/docs,name=shardRequests, solr:dom1=core,dom2=collection1,category=QUERY,scope=/terms,name=errors, solr:dom1=core,dom2=collection1,category=ADMIN,scope=/admin/system,name=clientErrors, java.util.logging:type=Logging, solr:dom1=jvm,name0=memory,name1=pools,name2=Metaspace,name=init, solr:dom1=node,category=ADMIN,scope=/admin/cores,name=shardRequests, solr:dom1=core,dom2=collection1,category=QUERY,scope=/dismax,name=totalTime, solr:dom1=jvm,name0=buffers,name1=direct,name=Count, solr:dom1=core,dom2=collection1,category=QUERY,scope=/search-facet-def,name=shardRequests, solr:dom1=core,dom2=collection1,category=QUERY,scope=/select,name=totalTime, solr:dom1=jvm,name0=os,name=processCpuTime, solr:dom1=core,dom2=collection1,category=QUERY,scope=/get,name=serverErrors, solr:dom1=core,dom2=collection1,category=ADMIN,scope=/admin/ping,name=handlerStart, solr:dom1=core,dom2=collection1,category=QUERY,scope=/dismax,name=requestTimes, solr:dom1=core,dom2=collection1,category=ADMIN,scope=/admin/plugins,name=serverErrors, solr:dom1=core,dom2=collection1,category=QUERY,scope=/spellCheckWithWordbreak,name=totalTime, solr:dom1=core,dom2=collection1,category=ADMIN,scope=/admin/system,name=totalTime, solr:dom1=core,dom2=collection1,category=ADMIN,scope=/config,name=handlerStart, solr:dom1=core,dom2=collection1,category=QUERY,scope=/stream,name=errors, solr:dom1=core,dom2=collection1,category=ADMIN,scope=/admin/segments,name=requestTimes, solr:dom1=jvm,name0=memory,name1=heap,name=committed, solr:dom1=core,dom2=collection1,category=ADMIN,scope=/admin/file,name=handlerStart, solr:dom1=jvm,name0=threads,name1=deadlock,name=count, solr:dom1=core,dom2=collection1,category=QUERY,scope=/defaults,name=requestTimes, solr:dom1=core,dom2=collection1,category=QUERY,scope=/spellCheckCompRH1,name=requests, solr:dom1=core,dom2=collection1,category=QUERY,scope=/search-facet-invariants,name=errors, solr:dom1=core,dom2=collection1,category=QUERY,scope=/graph,name=errors, solr:dom1=core,dom2=collection1,category=SEARCHER,scope=searcher,name=warmupTime, solr:dom1=jvm,name0=threads,name1=runnable,name=count, solr:dom1=node,category=ADMIN,scope=/admin/metrics,name=clientErrors, solr:dom1=core,dom2=collection1,category=ADMIN,scope=/config,name=errors, solr:dom1=core,dom2=collection1,category=QUERY,scope=/spellCheckWithWordbreak_Direct,name=requestTimes, solr:dom1=core,dom2=collection1,category=SEARCHER,scope=searcher,name=indexVersion, solr:dom1=jvm,name0=memory,name1=heap,name=init, solr:dom1=core,dom2=collection1,category=SEARCHER,scope=searcher,name=numDocs, solr:dom1=core,dom2=collection1,category=TLOG,scope=copyOverOldUpdates,name=ops, solr:dom1=core,dom2=collection1,category=QUERY,scope=/spellCheckWithWordbreak,name=requestTimes, solr:dom1=node,category=ADMIN,scope=/admin/authorization,name=serverErrors, solr:dom1=core,dom2=collection1,category=QUERY,scope=/stream,name=shardRequests, solr:dom1=core,dom2=collection1,category=HIGHLIGHTER,scope=SolrFormatter,name=default.requests, solr:dom1=core,dom2=collection1,category=QUERY,scope=/export,name=errors, solr:dom1=core,dom2=collection1,category=CORE,name=indexDir, solr:dom1=core,dom2=collection1,category=QUERY,scope=/dismax,name=errors, solr:dom1=node,category=ADMIN,scope=/admin/cores,name=totalTime, solr:dom1=core,dom2=collection1,category=HIGHLIGHTER,scope=SolrFragmenter,name=regex.requests, solr:dom1=node,category=ADMIN,scope=/admin/configs,name=requestTimes, solr:dom1=core,dom2=collection1,category=QUERY,scope=/select,name=clientErrors, solr:dom1=core,dom2=collection1,category=QUERY,scope=/get,name=requestTimes, solr:dom1=node,category=QUERY,scope=/admin/metrics/collector,name=clientErrors, solr:dom1=core,dom2=collection1,category=ADMIN,scope=/config,name=requests, solr:dom1=node,category=UPDATE,scope=updateShardHandler,name=threadPool.updateExecutor.completed, java.lang:type=GarbageCollector,name=PS MarkSweep, solr:dom1=core,dom2=collection1,category=QUERY,scope=/get,name=clientErrors, solr:dom1=node,category=ADMIN,scope=/admin/authorization,name=totalTime, solr:dom1=node,category=ADMIN,scope=/admin/cores,name=errors, solr:dom1=core,dom2=collection1,category=UPDATE,scope=/update/json,name=handlerStart, solr:dom1=core,dom2=collection1,category=ADMIN,scope=/admin/threads,name=timeouts, solr:dom1=node,category=QUERY,scope=httpShardHandler,name=threadPool.httpShardExecutor.submitted, solr:dom1=core,dom2=collection1,category=ADMIN,scope=/admin/system,name=errors, solr:dom1=node,category=QUERY,scope=httpShardHandler,name=threadPool.httpShardExecutor.running, solr:dom1=core,dom2=collection1,category=QUERY,scope=/debug/dump,name=handlerStart, solr:dom1=node,category=CONTAINER,scope=fs,name=coreRoot.totalSpace, solr:dom1=core,dom2=collection1,category=ADMIN,scope=/admin/system,name=requests, solr:dom1=core,dom2=collection1,category=UPDATE,scope=/update/csv,name=totalTime, solr:dom1=jvm,name0=memory,name1=pools,name2=PS-Eden-Space,name=usage, solr:dom1=core,dom2=collection1,category=UPDATE,scope=/update/json/docs,name=handlerStart, solr:dom1=node,category=ADMIN,scope=/admin/autoscaling/history,name=errors, solr:dom1=core,dom2=collection1,category=QUERY,scope=/debug/dump,name=requests, solr:dom1=core,dom2=collection1,category=ADMIN,scope=/admin/luke,name=handlerStart, solr:dom1=core,dom2=collection1,category=QUERY,scope=/search-facet-invariants,name=handlerStart, solr:dom1=node,category=CONTAINER,scope=cores,name=lazy, solr:dom1=node,category=QUERY,scope=/admin/metrics/collector,name=errors, solr:dom1=core,dom2=collection1,category=UPDATE,scope=/update,name=requests, solr:dom1=core,dom2=collection1,category=QUERY,scope=/defaults,name=handlerStart, solr:dom1=core,dom2=collection1,category=QUERY,scope=/search-facet-invariants,name=requests, solr:dom1=jvm,name0=memory,name1=pools,name2=PS-Eden-Space,name=used, solr:dom1=core,dom2=collection1,category=UPDATE,scope=updateHandler,name=optimizes, solr:dom1=core,dom2=collection1,category=QUERY,scope=/search-facet-invariants,name=shardRequests, solr:dom1=core,dom2=collection1,category=ADMIN,scope=/admin/properties,name=requestTimes, solr:dom1=core,dom2=collection1,category=REPLICATION,scope=/replication,name=indexVersion, solr:dom1=jvm,name0=memory,name1=pools,name2=PS-Eden-Space,name=init, solr:dom1=core,dom2=collection1,category=QUERY,scope=/tvrh,name=totalTime, solr:dom1=jvm,name0=os,nam
   [junit4]   2> e=openFileDescriptorCount, solr:dom1=node,category=QUERY,scope=httpShardHandler,name=pendingConnections, solr:dom1=jvm,name0=memory,name1=pools,name2=Code-Cache,name=committed, solr:dom1=core,dom2=collection1,category=QUERY,scope=/mlt,name=timeouts, solr:dom1=core,dom2=collection1,category=QUERY,scope=/dismax,name=shardRequests, solr:dom1=node,category=ADMIN,scope=/admin/configs,name=clientErrors, solr:dom1=core,dom2=collection1,category=ADMIN,scope=/admin/threads,name=errors, solr:dom1=node,category=CACHE,name=fieldCache, solr:dom1=core,dom2=collection1,category=QUERY,scope=/stream,name=handlerStart, solr:dom1=core,dom2=collection1,category=ADMIN,scope=/admin/mbeans,name=totalTime, solr:dom1=core,dom2=collection1,category=UPDATE,scope=/update/json,name=requests, solr:dom1=core,dom2=collection1,category=QUERY,scope=/spellCheckWithWordbreak_Direct,name=totalTime, solr:dom1=jvm,name0=memory,name1=total,name=committed, solr:dom1=core,dom2=collection1,category=ADMIN,scope=/admin/plugins,name=shardRequests, solr:dom1=core,dom2=collection1,category=QUERY,scope=/mock,name=requestTimes, solr:dom1=core,dom2=collection1,category=QUERY,scope=/export,name=shardRequests, solr:dom1=core,dom2=collection1,category=ADMIN,scope=/admin/properties,name=shardRequests, solr:dom1=node,category=QUERY,scope=/admin/metrics/collector,name=requests, solr:dom1=core,dom2=collection1,category=QUERY,scope=/stream,name=serverErrors, solr:dom1=core,dom2=collection1,category=QUERY,scope=/debug/dump,name=timeouts, solr:dom1=node,category=CONTAINER,scope=fs,name=coreRoot.spins, solr:dom1=core,dom2=collection1,category=ADMIN,scope=/admin/system,name=serverErrors, solr:dom1=jvm,name0=threads,name=deadlocks, solr:dom1=core,dom2=collection1,category=QUERY,scope=/get,name=shardRequests, solr:dom1=core,dom2=collection1,category=QUERY,scope=/spellCheckCompRH_Direct,name=serverErrors, solr:dom1=core,dom2=collection1,category=QUERY,scope=/spellCheckWithWordbreak_Direct,name=errors, solr:dom1=core,dom2=collection1,category=ADMIN,scope=/config,name=totalTime, solr:dom1=jvm,name0=memory,name1=non-heap,name=usage, solr:dom1=jvm,name0=memory,name1=pools,name2=PS-Old-Gen,name=max, solr:dom1=jvm,name0=classes,name=loaded, solr:dom1=core,dom2=collection1,category=QUERY,scope=/tvrh,name=timeouts, solr:dom1=core,dom2=collection1,category=QUERY,scope=/stream,name=totalTime, java.lang:type=Memory, solr:dom1=jvm,name0=memory,name1=total,name=init, solr:dom1=jvm,name0=gc,name1=PS-Scavenge,name=count, solr:dom1=core,dom2=collection1,category=ADMIN,scope=/admin/logging,name=errors, solr:dom1=node,category=UPDATE,scope=updateShardHandler,name=leasedConnections, solr:dom1=core,dom2=collection1,category=ADMIN,scope=/admin/luke,name=requestTimes, solr:dom1=node,category=ADMIN,scope=/admin/info,name=errors, solr:dom1=core,dom2=collection1,category=QUERY,scope=/spellCheckCompRH,name=timeouts, solr:dom1=core,dom2=collection1,category=QUERY,scope=/search-facet-def,name=clientErrors, solr:dom1=core,dom2=collection1,category=HIGHLIGHTER,scope=SolrFragListBuilder,name=simple.requests, solr:dom1=core,dom2=collection1,category=QUERY,scope=/graph,name=shardRequests]
   [junit4]   2> 236192 INFO  (TEST-TestJmxIntegration.testJmxUpdate-seed#[E1D4D541C688ADB6]) [    ] o.a.s.u.p.LogUpdateProcessorFactory [collection1]  webapp=null path=null params={}{add=[1 (1593765683174309888)]} 0 2
   [junit4]   2> 236194 INFO  (TEST-TestJmxIntegration.testJmxUpdate-seed#[E1D4D541C688ADB6]) [    ] o.a.s.u.DirectUpdateHandler2 start commit{_version_=1593765683178504192,optimize=false,openSearcher=true,waitSearcher=true,expungeDeletes=false,softCommit=false,prepareCommit=false}
   [junit4]   2> 236195 INFO  (TEST-TestJmxIntegration.testJmxUpdate-seed#[E1D4D541C688ADB6]) [    ] o.a.s.u.SolrIndexWriter Calling setCommitData with IW:org.apache.solr.update.SolrIndexWriter@1ebe73e8 commitCommandVersion:1593765683178504192
   [junit4]   2> 236202 INFO  (TEST-TestJmxIntegration.testJmxUpdate-seed#[E1D4D541C688ADB6]) [    ] o.a.s.s.SolrIndexSearcher Opening [Searcher@45ab3c73[collection1] main]
   [junit4]   2> 236204 INFO  (TEST-TestJmxIntegration.testJmxUpdate-seed#[E1D4D541C688ADB6]) [    ] o.a.s.u.DirectUpdateHandler2 end_commit_flush
   [junit4]   2> 236205 INFO  (searcherExecutor-1372-thread-1) [    ] o.a.s.c.SolrCore [collection1] Registered new searcher Searcher@45ab3c73[collection1] main{ExitableDirectoryReader(UninvertingDirectoryReader(Uninverting(_0(8.0.0):c1)))}
   [junit4]   2> 236205 INFO  (TEST-TestJmxIntegration.testJmxUpdate-seed#[E1D4D541C688ADB6]) [    ] o.a.s.u.p.LogUpdateProcessorFactory [collection1]  webapp=null path=null params={}{commit=} 0 10
   [junit4]   2> 236205 INFO  (TEST-TestJmxIntegration.testJmxUpdate-seed#[E1D4D541C688ADB6]) [    ] o.a.s.SolrTestCaseJ4 ###Ending testJmxUpdate
   [junit4]   2> 236206 INFO  (SUITE-TestJmxIntegration-seed#[E1D4D541C688ADB6]-worker) [    ] o.a.s.SolrTestCaseJ4 ###deleteCore
   [junit4]   2> 236206 INFO  (SUITE-TestJmxIntegration-seed#[E1D4D541C688ADB6]-worker) [    ] o.a.s.c.CoreContainer Shutting down CoreContainer instance=1653174573
   [junit4]   2> 236206 INFO  (SUITE-TestJmxIntegration-seed#[E1D4D541C688ADB6]-worker) [    ] o.a.s.m.SolrMetricManager Closing metric reporters for registry=solr.node, tag=null
   [junit4]   2> 236206 INFO  (SUITE-TestJmxIntegration-seed#[E1D4D541C688ADB6]-worker) [    ] o.a.s.m.r.SolrJmxReporter Closing reporter [org.apache.solr.metrics.reporters.SolrJmxReporter@7e706b0f: rootName = null, domain = solr.node, service url = null, agent id = null] for registry solr.node / com.codahale.metrics.MetricRegistry@1c272917
   [junit4]   2> 236209 INFO  (SUITE-TestJmxIntegration-seed#[E1D4D541C688ADB6]-worker) [    ] o.a.s.m.SolrMetricManager Closing metric reporters for registry=solr.jvm, tag=null
   [junit4]   2> 236209 INFO  (SUITE-TestJmxIntegration-seed#[E1D4D541C688ADB6]-worker) [    ] o.a.s.m.r.SolrJmxReporter Closing reporter [org.apache.solr.metrics.reporters.SolrJmxReporter@37b32cf5: rootName = null, domain = solr.jvm, service url = null, agent id = null] for registry solr.jvm / com.codahale.metrics.MetricRegistry@4ea0b30c
   [junit4]   2> 236212 INFO  (SUITE-TestJmxIntegration-seed#[E1D4D541C688ADB6]-worker) [    ] o.a.s.m.SolrMetricManager Closing metric reporters for registry=solr.jetty, tag=null
   [junit4]   2> 236212 INFO  (SUITE-TestJmxIntegration-seed#[E1D4D541C688ADB6]-worker) [    ] o.a.s.m.r.SolrJmxReporter Closing reporter [org.apache.solr.metrics.reporters.SolrJmxReporter@59f6dfec: rootName = null, domain = solr.jetty, service url = null, agent id = null] for registry solr.jetty / com.codahale.metrics.MetricRegistry@5868dc76
   [junit4]   2> 236214 INFO  (coreCloseExecutor-1377-thread-1) [    x:collection1] o.a.s.c.SolrCore [collection1]  CLOSING SolrCore org.apache.solr.core.SolrCore@6d6fbbef
   [junit4]   2> 236214 INFO  (coreCloseExecutor-1377-thread-1) [    x:collection1] o.a.s.m.SolrMetricManager Closing metric reporters for registry=solr.core.collection1, tag=1836039151
   [junit4]   2> 236214 INFO  (coreCloseExecutor-1377-thread-1) [    x:collection1] o.a.s.m.r.SolrJmxReporter Closing reporter [org.apache.solr.metrics.reporters.SolrJmxReporter@34919495: rootName = null, domain = solr.core.collection1, service url = null, agent id = null] for registry solr.core.collection1 / com.codahale.metrics.MetricRegistry@71084a61
   [junit4]   2> NOTE: leaving temporary files on disk at: /x1/jenkins/jenkins-slave/workspace/Lucene-Solr-BadApples-Tests-master/solr/build/solr-core/test/J2/temp/solr.core.TestJmxIntegration_E1D4D541C688ADB6-001
   [junit4]   2> NOTE: test params are: codec=CheapBastard, sim=Asserting(org.apache.lucene.search.similarities.AssertingSimilarity@44138b5e), locale=vi-VN, timezone=Indian/Chagos
   [junit4]   2> NOTE: Linux 3.13.0-88-generic amd64/Oracle Corporation 1.8.0_144 (64-bit)/cpus=4,threads=1,free=279225600,total=503840768
   [junit4]   2> NOTE: All tests run in this JVM: [TestSchemaNameResource, BJQParserTest, TestLazyCores, LeaderFailoverAfterPartitionTest, DistributedFacetSimpleRefinementLongTailTest, CleanupOldIndexTest, TestJavabinTupleStreamParser, ResponseLogComponentTest, TestRandomRequestDistribution, SpatialHeatmapFacetsTest, OverriddenZkACLAndCredentialsProvidersTest, SolrShardReporterTest, SolrCloudExampleTest, InfixSuggestersTest, CdcrRequestHandlerTest, TestUtils, HdfsThreadLeakTest, TestJmxIntegration]
   [junit4] Completed [52/778 (1!)] on J2 in 0.75s, 3 tests, 1 failure <<< FAILURES!

[...truncated 1049 lines...]
   [junit4] Suite: org.apache.solr.cloud.ZkControllerTest
   [junit4]   2> Creating dataDir: /x1/jenkins/jenkins-slave/workspace/Lucene-Solr-BadApples-Tests-master/solr/build/solr-core/test/J1/temp/solr.cloud.ZkControllerTest_E1D4D541C688ADB6-001/init-core-data-001
   [junit4]   2> 1265939 WARN  (SUITE-ZkControllerTest-seed#[E1D4D541C688ADB6]-worker) [    ] o.a.s.SolrTestCaseJ4 startTrackingSearchers: numOpens=2 numCloses=2
   [junit4]   2> 1265939 INFO  (SUITE-ZkControllerTest-seed#[E1D4D541C688ADB6]-worker) [    ] o.a.s.SolrTestCaseJ4 Using PointFields (NUMERIC_POINTS_SYSPROP=true) w/NUMERIC_DOCVALUES_SYSPROP=false
   [junit4]   2> 1265941 INFO  (SUITE-ZkControllerTest-seed#[E1D4D541C688ADB6]-worker) [    ] o.a.s.SolrTestCaseJ4 Randomized ssl (false) and clientAuth (false) via: @org.apache.solr.SolrTestCaseJ4$SuppressSSL(bugUrl=None)
   [junit4]   2> 1265941 INFO  (SUITE-ZkControllerTest-seed#[E1D4D541C688ADB6]-worker) [    ] o.a.s.SolrTestCaseJ4 SecureRandom sanity checks: test.solr.allowed.securerandom=null & java.security.egd=file:/dev/./urandom
   [junit4]   2> 1265958 INFO  (TEST-ZkControllerTest.testPublishAndWaitForDownStates-seed#[E1D4D541C688ADB6]) [    ] o.a.s.SolrTestCaseJ4 ###Starting testPublishAndWaitForDownStates
   [junit4]   2> 1265958 INFO  (TEST-ZkControllerTest.testPublishAndWaitForDownStates-seed#[E1D4D541C688ADB6]) [    ] o.a.s.c.ZkTestServer STARTING ZK TEST SERVER
   [junit4]   2> 1265958 INFO  (Thread-3982) [    ] o.a.s.c.ZkTestServer client port:0.0.0.0/0.0.0.0:0
   [junit4]   2> 1265958 INFO  (Thread-3982) [    ] o.a.s.c.ZkTestServer Starting server
   [junit4]   2> 1265972 ERROR (Thread-3982) [    ] o.a.z.s.ZooKeeperServer ZKShutdownHandler is not registered, so ZooKeeper server won't take any action on ERROR or SHUTDOWN server state changes
   [junit4]   2> 1266058 INFO  (TEST-ZkControllerTest.testPublishAndWaitForDownStates-seed#[E1D4D541C688ADB6]) [    ] o.a.s.c.ZkTestServer start zk server on port:41475
   [junit4]   2> 1266071 INFO  (zkConnectionManage

[...truncated too long message...]

 x:collection1] o.a.s.c.SolrCore [collection1]  CLOSING SolrCore org.apache.solr.core.SolrCore@6028e653
   [junit4]   2> 1407339 INFO  (coreCloseExecutor-6302-thread-1) [    x:collection1] o.a.s.m.SolrMetricManager Closing metric reporters for registry=solr.core.collection1, tag=1613293139
   [junit4]   2> 1407340 INFO  (coreCloseExecutor-6302-thread-1) [    x:collection1] o.a.s.m.r.SolrJmxReporter Closing reporter [org.apache.solr.metrics.reporters.SolrJmxReporter@5ffa10a3: rootName = null, domain = solr.core.collection1, service url = null, agent id = null] for registry solr.core.collection1 / com.codahale.metrics.MetricRegistry@6e3c619e
   [junit4]   2> 1407347 INFO  (TEST-TestReplicationHandler.testEmptyCommits-seed#[E1D4D541C688ADB6]) [    ] o.e.j.s.h.ContextHandler Stopped o.e.j.s.ServletContextHandler@4a505acd{/solr,null,UNAVAILABLE}
   [junit4]   2> 1407347 INFO  (TEST-TestReplicationHandler.testEmptyCommits-seed#[E1D4D541C688ADB6]) [    ] o.e.j.s.session Stopped scavenging
   [junit4]   2> 1407348 INFO  (TEST-TestReplicationHandler.testEmptyCommits-seed#[E1D4D541C688ADB6]) [    ] o.e.j.s.AbstractConnector Stopped ServerConnector@248bd79a{HTTP/1.1,[http/1.1]}{127.0.0.1:0}
   [junit4]   2> 1407348 INFO  (TEST-TestReplicationHandler.testEmptyCommits-seed#[E1D4D541C688ADB6]) [    ] o.a.s.c.CoreContainer Shutting down CoreContainer instance=978649277
   [junit4]   2> 1407348 INFO  (TEST-TestReplicationHandler.testEmptyCommits-seed#[E1D4D541C688ADB6]) [    ] o.a.s.m.SolrMetricManager Closing metric reporters for registry=solr.node, tag=null
   [junit4]   2> 1407348 INFO  (TEST-TestReplicationHandler.testEmptyCommits-seed#[E1D4D541C688ADB6]) [    ] o.a.s.m.r.SolrJmxReporter Closing reporter [org.apache.solr.metrics.reporters.SolrJmxReporter@5fc306d6: rootName = null, domain = solr.node, service url = null, agent id = null] for registry solr.node / com.codahale.metrics.MetricRegistry@7ede7efb
   [junit4]   2> 1407355 INFO  (TEST-TestReplicationHandler.testEmptyCommits-seed#[E1D4D541C688ADB6]) [    ] o.a.s.m.SolrMetricManager Closing metric reporters for registry=solr.jvm, tag=null
   [junit4]   2> 1407355 INFO  (TEST-TestReplicationHandler.testEmptyCommits-seed#[E1D4D541C688ADB6]) [    ] o.a.s.m.r.SolrJmxReporter Closing reporter [org.apache.solr.metrics.reporters.SolrJmxReporter@45d5ee2f: rootName = null, domain = solr.jvm, service url = null, agent id = null] for registry solr.jvm / com.codahale.metrics.MetricRegistry@6f102808
   [junit4]   2> 1407360 INFO  (TEST-TestReplicationHandler.testEmptyCommits-seed#[E1D4D541C688ADB6]) [    ] o.a.s.m.SolrMetricManager Closing metric reporters for registry=solr.jetty, tag=null
   [junit4]   2> 1407360 INFO  (TEST-TestReplicationHandler.testEmptyCommits-seed#[E1D4D541C688ADB6]) [    ] o.a.s.m.r.SolrJmxReporter Closing reporter [org.apache.solr.metrics.reporters.SolrJmxReporter@405ddfb0: rootName = null, domain = solr.jetty, service url = null, agent id = null] for registry solr.jetty / com.codahale.metrics.MetricRegistry@57e247fd
   [junit4]   2> 1407361 INFO  (coreCloseExecutor-6304-thread-1) [    x:collection1] o.a.s.c.SolrCore [collection1]  CLOSING SolrCore org.apache.solr.core.SolrCore@510df07c
   [junit4]   2> 1407361 INFO  (coreCloseExecutor-6304-thread-1) [    x:collection1] o.a.s.m.SolrMetricManager Closing metric reporters for registry=solr.core.collection1, tag=1359868028
   [junit4]   2> 1407361 INFO  (coreCloseExecutor-6304-thread-1) [    x:collection1] o.a.s.m.r.SolrJmxReporter Closing reporter [org.apache.solr.metrics.reporters.SolrJmxReporter@77636dfb: rootName = null, domain = solr.core.collection1, service url = null, agent id = null] for registry solr.core.collection1 / com.codahale.metrics.MetricRegistry@231a8332
   [junit4]   2> 1407374 INFO  (TEST-TestReplicationHandler.testEmptyCommits-seed#[E1D4D541C688ADB6]) [    ] o.e.j.s.h.ContextHandler Stopped o.e.j.s.ServletContextHandler@35c06c66{/solr,null,UNAVAILABLE}
   [junit4]   2> 1407374 INFO  (TEST-TestReplicationHandler.testEmptyCommits-seed#[E1D4D541C688ADB6]) [    ] o.e.j.s.session Stopped scavenging
   [junit4]   2> NOTE: leaving temporary files on disk at: /x1/jenkins/jenkins-slave/workspace/Lucene-Solr-BadApples-Tests-master/solr/build/solr-core/test/J1/temp/solr.handler.TestReplicationHandler_E1D4D541C688ADB6-001
   [junit4]   2> NOTE: test params are: codec=Asserting(Lucene70): {name=PostingsFormat(name=LuceneVarGapDocFreqInterval), id=PostingsFormat(name=LuceneVarGapDocFreqInterval), newname=PostingsFormat(name=LuceneVarGapDocFreqInterval)}, docValues:{}, maxPointsInLeafNode=1759, maxMBSortInHeap=7.669005701888354, sim=Asserting(org.apache.lucene.search.similarities.AssertingSimilarity@308f4489), locale=es-AR, timezone=America/Bogota
   [junit4]   2> NOTE: Linux 3.13.0-88-generic amd64/Oracle Corporation 1.8.0_144 (64-bit)/cpus=4,threads=1,free=107845664,total=531103744
   [junit4]   2> NOTE: All tests run in this JVM: [TestSweetSpotSimilarityFactory, TestFieldCacheWithThreads, TestStressUserVersions, DocValuesNotIndexedTest, TestTlogReplica, DistributedMLTComponentTest, SoftAutoCommitTest, ReplicationFactorTest, CollectionStateFormat2Test, TestNRTOpen, OverseerTest, TestSimDistributedQueue, FacetPivotSmallTest, SchemaVersionSpecificBehaviorTest, TestLockTree, TestCollapseQParserPlugin, TestSystemIdResolver, TestCloudRecovery, HdfsChaosMonkeyNothingIsSafeTest, AutoScalingHandlerTest, TestSurroundQueryParser, DirectSolrConnectionTest, MoveReplicaTest, TestDistributedMap, TestSolrJ, TestExactStatsCache, TestPrepRecovery, TestSortByMinMaxFunction, SOLR749Test, TestHdfsCloudBackupRestore, TestStressRecovery, SystemInfoHandlerTest, TestRandomFlRTGCloud, TestShortCircuitedRequests, JavabinLoaderTest, TestMultiWordSynonyms, QueryElevationComponentTest, TestRTimerTree, TestUniqueKeyFieldResource, SolrCoreMetricManagerTest, SparseHLLTest, TestSolrCloudSnapshots, ConjunctionSolrSpellCheckerTest, TestJettySolrRunner, SpatialRPTFieldTypeTest, TestRecovery, TestNumericTerms64, TestCursorMarkWithoutUniqueKey, TestStressCloudBlindAtomicUpdates, JsonLoaderTest, MissingSegmentRecoveryTest, DistributedFacetExistsSmallTest, TestCustomDocTransformer, TestReversedWildcardFilterFactory, AnalysisErrorHandlingTest, TestCollectionAPIs, DocumentBuilderTest, TestManagedResourceStorage, TestFastLRUCache, TestGraphMLResponseWriter, LoggingHandlerTest, HdfsAutoAddReplicasIntegrationTest, CdcrBidirectionalTest, TestStressVersions, DOMUtilTest, TestTrie, BufferStoreTest, ConfigSetsAPITest, TestRequestForwarding, HdfsRecoverLeaseTest, TestSchemaSimilarityResource, ExitableDirectoryReaderTest, SolrMetricsIntegrationTest, TestAuthenticationFramework, SolrJmxReporterCloudTest, TestSimpleTextCodec, DeleteNodeTest, TestRequestStatusCollectionAPI, CSVRequestHandlerTest, ResponseBuilderTest, FieldMutatingUpdateProcessorTest, PolyFieldTest, CloneFieldUpdateProcessorFactoryTest, BasicZkTest, TestManagedSchema, NumberUtilsTest, SSLMigrationTest, AddReplicaTest, ConfigureRecoveryStrategyTest, TestFieldCacheSort, AlternateDirectoryTest, TestInPlaceUpdatesStandalone, QueryEqualityTest, SuggestComponentTest, TestElisionMultitermQuery, TestCloudSchemaless, TestClusterStateMutator, TestImplicitCoreProperties, PreAnalyzedFieldManagedSchemaCloudTest, TestSearchPerf, TolerantUpdateProcessorTest, TestSolr4Spatial, TestPointFields, TestHighFrequencyDictionaryFactory, TestFieldCollectionResource, CheckHdfsIndexTest, BasicFunctionalityTest, VMParamsZkACLAndCredentialsProvidersTest, TestExceedMaxTermLength, TestQueryUtils, PathHierarchyTokenizerFactoryTest, BasicAuthStandaloneTest, TestSolrQueryResponse, TestScoreJoinQPScore, SyncSliceTest, ShardRoutingCustomTest, CustomCollectionTest, TestFieldTypeResource, BigEndianAscendingWordSerializerTest, FastVectorHighlighterTest, CoreAdminRequestStatusTest, ZkControllerTest, TestBlendedInfixSuggestions, BlobRepositoryCloudTest, IndexSchemaTest, FileUtilsTest, QueryParsingTest, TestConfigSetProperties, DeleteStatusTest, UnloadDistributedZkTest, TestReplicationHandler]
   [junit4] Completed [398/778 (3!)] on J1 in 62.02s, 16 tests, 1 error <<< FAILURES!

[...truncated 8723 lines...]
   [junit4] Suite: org.apache.solr.ltr.TestLTRReRankingPipeline
   [junit4]   2> 3216 INFO  (TEST-TestLTRReRankingPipeline.testDifferentTopN-seed#[ADF49C77C6243E25]) [    ] o.a.s.l.TestLTRReRankingPipeline rerank 1 documents 
   [junit4]   2> 3218 INFO  (TEST-TestLTRReRankingPipeline.testDifferentTopN-seed#[ADF49C77C6243E25]) [    ] o.a.s.l.TestLTRReRankingPipeline doc 0 in pos 0
   [junit4]   2> NOTE: reproduce with: ant test  -Dtestcase=TestLTRReRankingPipeline -Dtests.method=testDifferentTopN -Dtests.seed=ADF49C77C6243E25 -Dtests.multiplier=2 -Dtests.slow=true -Dtests.badapples=true -Dtests.locale=es-CU -Dtests.timezone=Asia/Pyongyang -Dtests.asserts=true -Dtests.file.encoding=US-ASCII
   [junit4] FAILURE 0.07s J0 | TestLTRReRankingPipeline.testDifferentTopN <<<
   [junit4]    > Throwable #1: java.lang.AssertionError: expected:<1.0> but was:<0.0>
   [junit4]    > 	at __randomizedtesting.SeedInfo.seed([ADF49C77C6243E25:5C55EE27F39FF4B7]:0)
   [junit4]    > 	at org.apache.solr.ltr.TestLTRReRankingPipeline.testDifferentTopN(TestLTRReRankingPipeline.java:256)
   [junit4]    > 	at java.lang.Thread.run(Thread.java:748)
   [junit4]   2> NOTE: test params are: codec=Asserting(Lucene70): {field=PostingsFormat(name=Memory), id=FSTOrd50, final-score=FSTOrd50}, docValues:{final-score=DocValuesFormat(name=Memory)}, maxPointsInLeafNode=369, maxMBSortInHeap=5.569197192592912, sim=Asserting(org.apache.lucene.search.similarities.AssertingSimilarity@6a1c441e), locale=es-CU, timezone=Asia/Pyongyang
   [junit4]   2> NOTE: Linux 3.13.0-88-generic amd64/Oracle Corporation 1.8.0_144 (64-bit)/cpus=4,threads=1,free=217902472,total=240648192
   [junit4]   2> NOTE: All tests run in this JVM: [TestWrapperModel, TestLTRReRankingPipeline]
   [junit4] Completed [5/36 (1!)] on J0 in 0.81s, 3 tests, 1 failure <<< FAILURES!

[...truncated 40381 lines...]

Mime
View raw message