lucene-dev mailing list archives

Site index · List index
Message view « Date » · « Thread »
Top « Date » · « Thread »
From Policeman Jenkins Server <jenk...@thetaphi.de>
Subject [JENKINS] Lucene-Solr-7.x-Windows (32bit/jdk1.8.0_144) - Build # 492 - Still Unstable!
Date Fri, 09 Mar 2018 05:31:52 GMT
Build: https://jenkins.thetaphi.de/job/Lucene-Solr-7.x-Windows/492/
Java: 32bit/jdk1.8.0_144 -client -XX:+UseG1GC

10 tests failed.
FAILED:  junit.framework.TestSuite.org.apache.lucene.analysis.snowball.TestSnowballVocab

Error Message:
Could not remove the following files (in the order of attempts):    C:\Users\jenkins\workspace\Lucene-Solr-7.x-Windows\lucene\build\analysis\common\test\J0\temp\lucene.analysis.snowball.TestSnowballVocab_2F91D9FF381DA1DE-001\tempDir-011\romanian: java.nio.file.DirectoryNotEmptyException: C:\Users\jenkins\workspace\Lucene-Solr-7.x-Windows\lucene\build\analysis\common\test\J0\temp\lucene.analysis.snowball.TestSnowballVocab_2F91D9FF381DA1DE-001\tempDir-011\romanian    C:\Users\jenkins\workspace\Lucene-Solr-7.x-Windows\lucene\build\analysis\common\test\J0\temp\lucene.analysis.snowball.TestSnowballVocab_2F91D9FF381DA1DE-001\tempDir-011: java.nio.file.DirectoryNotEmptyException: C:\Users\jenkins\workspace\Lucene-Solr-7.x-Windows\lucene\build\analysis\common\test\J0\temp\lucene.analysis.snowball.TestSnowballVocab_2F91D9FF381DA1DE-001\tempDir-011 

Stack Trace:
java.io.IOException: Could not remove the following files (in the order of attempts):
   C:\Users\jenkins\workspace\Lucene-Solr-7.x-Windows\lucene\build\analysis\common\test\J0\temp\lucene.analysis.snowball.TestSnowballVocab_2F91D9FF381DA1DE-001\tempDir-011\romanian: java.nio.file.DirectoryNotEmptyException: C:\Users\jenkins\workspace\Lucene-Solr-7.x-Windows\lucene\build\analysis\common\test\J0\temp\lucene.analysis.snowball.TestSnowballVocab_2F91D9FF381DA1DE-001\tempDir-011\romanian
   C:\Users\jenkins\workspace\Lucene-Solr-7.x-Windows\lucene\build\analysis\common\test\J0\temp\lucene.analysis.snowball.TestSnowballVocab_2F91D9FF381DA1DE-001\tempDir-011: java.nio.file.DirectoryNotEmptyException: C:\Users\jenkins\workspace\Lucene-Solr-7.x-Windows\lucene\build\analysis\common\test\J0\temp\lucene.analysis.snowball.TestSnowballVocab_2F91D9FF381DA1DE-001\tempDir-011

	at __randomizedtesting.SeedInfo.seed([2F91D9FF381DA1DE]:0)
	at org.apache.lucene.util.IOUtils.rm(IOUtils.java:329)
	at org.apache.lucene.util.TestRuleTemporaryFilesCleanup.afterAlways(TestRuleTemporaryFilesCleanup.java:216)
	at com.carrotsearch.randomizedtesting.rules.TestRuleAdapter$1.afterAlways(TestRuleAdapter.java:31)
	at com.carrotsearch.randomizedtesting.rules.StatementAdapter.evaluate(StatementAdapter.java:43)
	at com.carrotsearch.randomizedtesting.rules.StatementAdapter.evaluate(StatementAdapter.java:36)
	at org.apache.lucene.util.TestRuleAssertionsRequired$1.evaluate(TestRuleAssertionsRequired.java:53)
	at org.apache.lucene.util.TestRuleMarkFailure$1.evaluate(TestRuleMarkFailure.java:47)
	at org.apache.lucene.util.TestRuleIgnoreAfterMaxFailures$1.evaluate(TestRuleIgnoreAfterMaxFailures.java:64)
	at org.apache.lucene.util.TestRuleIgnoreTestSuites$1.evaluate(TestRuleIgnoreTestSuites.java:54)
	at com.carrotsearch.randomizedtesting.rules.StatementAdapter.evaluate(StatementAdapter.java:36)
	at com.carrotsearch.randomizedtesting.ThreadLeakControl$StatementRunner.run(ThreadLeakControl.java:368)
	at java.lang.Thread.run(Thread.java:748)


FAILED:  junit.framework.TestSuite.org.apache.solr.ltr.TestLTRWithSort

Error Message:
Could not remove the following files (in the order of attempts):    C:\Users\jenkins\workspace\Lucene-Solr-7.x-Windows\solr\build\contrib\solr-ltr\test\J1\temp\solr.ltr.TestLTRWithSort_DF00BA1C211AC9F5-001\tempDir-003\cores\core\data: java.nio.file.DirectoryNotEmptyException: C:\Users\jenkins\workspace\Lucene-Solr-7.x-Windows\solr\build\contrib\solr-ltr\test\J1\temp\solr.ltr.TestLTRWithSort_DF00BA1C211AC9F5-001\tempDir-003\cores\core\data    C:\Users\jenkins\workspace\Lucene-Solr-7.x-Windows\solr\build\contrib\solr-ltr\test\J1\temp\solr.ltr.TestLTRWithSort_DF00BA1C211AC9F5-001\tempDir-003\cores\core: java.nio.file.DirectoryNotEmptyException: C:\Users\jenkins\workspace\Lucene-Solr-7.x-Windows\solr\build\contrib\solr-ltr\test\J1\temp\solr.ltr.TestLTRWithSort_DF00BA1C211AC9F5-001\tempDir-003\cores\core    C:\Users\jenkins\workspace\Lucene-Solr-7.x-Windows\solr\build\contrib\solr-ltr\test\J1\temp\solr.ltr.TestLTRWithSort_DF00BA1C211AC9F5-001\tempDir-003\cores: java.nio.file.DirectoryNotEmptyException: C:\Users\jenkins\workspace\Lucene-Solr-7.x-Windows\solr\build\contrib\solr-ltr\test\J1\temp\solr.ltr.TestLTRWithSort_DF00BA1C211AC9F5-001\tempDir-003\cores    C:\Users\jenkins\workspace\Lucene-Solr-7.x-Windows\solr\build\contrib\solr-ltr\test\J1\temp\solr.ltr.TestLTRWithSort_DF00BA1C211AC9F5-001\tempDir-003: java.nio.file.DirectoryNotEmptyException: C:\Users\jenkins\workspace\Lucene-Solr-7.x-Windows\solr\build\contrib\solr-ltr\test\J1\temp\solr.ltr.TestLTRWithSort_DF00BA1C211AC9F5-001\tempDir-003 

Stack Trace:
java.io.IOException: Could not remove the following files (in the order of attempts):
   C:\Users\jenkins\workspace\Lucene-Solr-7.x-Windows\solr\build\contrib\solr-ltr\test\J1\temp\solr.ltr.TestLTRWithSort_DF00BA1C211AC9F5-001\tempDir-003\cores\core\data: java.nio.file.DirectoryNotEmptyException: C:\Users\jenkins\workspace\Lucene-Solr-7.x-Windows\solr\build\contrib\solr-ltr\test\J1\temp\solr.ltr.TestLTRWithSort_DF00BA1C211AC9F5-001\tempDir-003\cores\core\data
   C:\Users\jenkins\workspace\Lucene-Solr-7.x-Windows\solr\build\contrib\solr-ltr\test\J1\temp\solr.ltr.TestLTRWithSort_DF00BA1C211AC9F5-001\tempDir-003\cores\core: java.nio.file.DirectoryNotEmptyException: C:\Users\jenkins\workspace\Lucene-Solr-7.x-Windows\solr\build\contrib\solr-ltr\test\J1\temp\solr.ltr.TestLTRWithSort_DF00BA1C211AC9F5-001\tempDir-003\cores\core
   C:\Users\jenkins\workspace\Lucene-Solr-7.x-Windows\solr\build\contrib\solr-ltr\test\J1\temp\solr.ltr.TestLTRWithSort_DF00BA1C211AC9F5-001\tempDir-003\cores: java.nio.file.DirectoryNotEmptyException: C:\Users\jenkins\workspace\Lucene-Solr-7.x-Windows\solr\build\contrib\solr-ltr\test\J1\temp\solr.ltr.TestLTRWithSort_DF00BA1C211AC9F5-001\tempDir-003\cores
   C:\Users\jenkins\workspace\Lucene-Solr-7.x-Windows\solr\build\contrib\solr-ltr\test\J1\temp\solr.ltr.TestLTRWithSort_DF00BA1C211AC9F5-001\tempDir-003: java.nio.file.DirectoryNotEmptyException: C:\Users\jenkins\workspace\Lucene-Solr-7.x-Windows\solr\build\contrib\solr-ltr\test\J1\temp\solr.ltr.TestLTRWithSort_DF00BA1C211AC9F5-001\tempDir-003

	at __randomizedtesting.SeedInfo.seed([DF00BA1C211AC9F5]:0)
	at org.apache.lucene.util.IOUtils.rm(IOUtils.java:329)
	at org.apache.lucene.util.TestRuleTemporaryFilesCleanup.afterAlways(TestRuleTemporaryFilesCleanup.java:216)
	at com.carrotsearch.randomizedtesting.rules.TestRuleAdapter$1.afterAlways(TestRuleAdapter.java:31)
	at com.carrotsearch.randomizedtesting.rules.StatementAdapter.evaluate(StatementAdapter.java:43)
	at com.carrotsearch.randomizedtesting.rules.StatementAdapter.evaluate(StatementAdapter.java:36)
	at org.apache.lucene.util.TestRuleAssertionsRequired$1.evaluate(TestRuleAssertionsRequired.java:53)
	at org.apache.lucene.util.TestRuleMarkFailure$1.evaluate(TestRuleMarkFailure.java:47)
	at org.apache.lucene.util.TestRuleIgnoreAfterMaxFailures$1.evaluate(TestRuleIgnoreAfterMaxFailures.java:64)
	at org.apache.lucene.util.TestRuleIgnoreTestSuites$1.evaluate(TestRuleIgnoreTestSuites.java:54)
	at com.carrotsearch.randomizedtesting.rules.StatementAdapter.evaluate(StatementAdapter.java:36)
	at com.carrotsearch.randomizedtesting.ThreadLeakControl$StatementRunner.run(ThreadLeakControl.java:368)
	at java.lang.Thread.run(Thread.java:748)


FAILED:  org.apache.solr.handler.TestSQLHandler.doTest

Error Message:
--> http://127.0.0.1:51618/collection1_shard2_replica_n41:Failed to execute sqlQuery 'select id, field_i, str_s from collection1 where (text='(XXXX)' OR text='XXXX') AND text='XXXX' order by field_i desc' against JDBC connection 'jdbc:calcitesolr:'. Error while executing SQL "select id, field_i, str_s from collection1 where (text='(XXXX)' OR text='XXXX') AND text='XXXX' order by field_i desc": java.io.IOException: java.util.concurrent.ExecutionException: java.io.IOException: --> http://127.0.0.1:51670/collection1_shard2_replica_n45/:can not sort on a field w/o docValues unless it is indexed and supports Uninversion: field_i

Stack Trace:
java.io.IOException: --> http://127.0.0.1:51618/collection1_shard2_replica_n41:Failed to execute sqlQuery 'select id, field_i, str_s from collection1 where (text='(XXXX)' OR text='XXXX') AND text='XXXX' order by field_i desc' against JDBC connection 'jdbc:calcitesolr:'.
Error while executing SQL "select id, field_i, str_s from collection1 where (text='(XXXX)' OR text='XXXX') AND text='XXXX' order by field_i desc": java.io.IOException: java.util.concurrent.ExecutionException: java.io.IOException: --> http://127.0.0.1:51670/collection1_shard2_replica_n45/:can not sort on a field w/o docValues unless it is indexed and supports Uninversion: field_i
	at __randomizedtesting.SeedInfo.seed([F1EED2A27545430F:56AA6A0618FE50B6]:0)
	at org.apache.solr.client.solrj.io.stream.SolrStream.read(SolrStream.java:222)
	at org.apache.solr.handler.TestSQLHandler.getTuples(TestSQLHandler.java:2522)
	at org.apache.solr.handler.TestSQLHandler.testBasicSelect(TestSQLHandler.java:124)
	at org.apache.solr.handler.TestSQLHandler.doTest(TestSQLHandler.java:82)
	at sun.reflect.NativeMethodAccessorImpl.invoke0(Native Method)
	at sun.reflect.NativeMethodAccessorImpl.invoke(NativeMethodAccessorImpl.java:62)
	at sun.reflect.DelegatingMethodAccessorImpl.invoke(DelegatingMethodAccessorImpl.java:43)
	at java.lang.reflect.Method.invoke(Method.java:498)
	at com.carrotsearch.randomizedtesting.RandomizedRunner.invoke(RandomizedRunner.java:1737)
	at com.carrotsearch.randomizedtesting.RandomizedRunner$8.evaluate(RandomizedRunner.java:934)
	at com.carrotsearch.randomizedtesting.RandomizedRunner$9.evaluate(RandomizedRunner.java:970)
	at com.carrotsearch.randomizedtesting.RandomizedRunner$10.evaluate(RandomizedRunner.java:984)
	at org.apache.solr.BaseDistributedSearchTestCase$ShardsRepeatRule$ShardsFixedStatement.callStatement(BaseDistributedSearchTestCase.java:993)
	at org.apache.solr.BaseDistributedSearchTestCase$ShardsRepeatRule$ShardsStatement.evaluate(BaseDistributedSearchTestCase.java:968)
	at com.carrotsearch.randomizedtesting.rules.SystemPropertiesRestoreRule$1.evaluate(SystemPropertiesRestoreRule.java:57)
	at org.apache.lucene.util.TestRuleSetupTeardownChained$1.evaluate(TestRuleSetupTeardownChained.java:49)
	at org.apache.lucene.util.AbstractBeforeAfterRule$1.evaluate(AbstractBeforeAfterRule.java:45)
	at org.apache.lucene.util.TestRuleThreadAndTestName$1.evaluate(TestRuleThreadAndTestName.java:48)
	at org.apache.lucene.util.TestRuleIgnoreAfterMaxFailures$1.evaluate(TestRuleIgnoreAfterMaxFailures.java:64)
	at org.apache.lucene.util.TestRuleMarkFailure$1.evaluate(TestRuleMarkFailure.java:47)
	at com.carrotsearch.randomizedtesting.rules.StatementAdapter.evaluate(StatementAdapter.java:36)
	at com.carrotsearch.randomizedtesting.ThreadLeakControl$StatementRunner.run(ThreadLeakControl.java:368)
	at com.carrotsearch.randomizedtesting.ThreadLeakControl.forkTimeoutingTask(ThreadLeakControl.java:817)
	at com.carrotsearch.randomizedtesting.ThreadLeakControl$3.evaluate(ThreadLeakControl.java:468)
	at com.carrotsearch.randomizedtesting.RandomizedRunner.runSingleTest(RandomizedRunner.java:943)
	at com.carrotsearch.randomizedtesting.RandomizedRunner$5.evaluate(RandomizedRunner.java:829)
	at com.carrotsearch.randomizedtesting.RandomizedRunner$6.evaluate(RandomizedRunner.java:879)
	at com.carrotsearch.randomizedtesting.RandomizedRunner$7.evaluate(RandomizedRunner.java:890)
	at com.carrotsearch.randomizedtesting.rules.StatementAdapter.evaluate(StatementAdapter.java:36)
	at com.carrotsearch.randomizedtesting.rules.SystemPropertiesRestoreRule$1.evaluate(SystemPropertiesRestoreRule.java:57)
	at org.apache.lucene.util.AbstractBeforeAfterRule$1.evaluate(AbstractBeforeAfterRule.java:45)
	at com.carrotsearch.randomizedtesting.rules.StatementAdapter.evaluate(StatementAdapter.java:36)
	at org.apache.lucene.util.TestRuleStoreClassName$1.evaluate(TestRuleStoreClassName.java:41)
	at com.carrotsearch.randomizedtesting.rules.NoShadowingOrOverridesOnMethodsRule$1.evaluate(NoShadowingOrOverridesOnMethodsRule.java:40)
	at com.carrotsearch.randomizedtesting.rules.NoShadowingOrOverridesOnMethodsRule$1.evaluate(NoShadowingOrOverridesOnMethodsRule.java:40)
	at com.carrotsearch.randomizedtesting.rules.StatementAdapter.evaluate(StatementAdapter.java:36)
	at com.carrotsearch.randomizedtesting.rules.StatementAdapter.evaluate(StatementAdapter.java:36)
	at com.carrotsearch.randomizedtesting.rules.StatementAdapter.evaluate(StatementAdapter.java:36)
	at org.apache.lucene.util.TestRuleAssertionsRequired$1.evaluate(TestRuleAssertionsRequired.java:53)
	at org.apache.lucene.util.TestRuleMarkFailure$1.evaluate(TestRuleMarkFailure.java:47)
	at org.apache.lucene.util.TestRuleIgnoreAfterMaxFailures$1.evaluate(TestRuleIgnoreAfterMaxFailures.java:64)
	at org.apache.lucene.util.TestRuleIgnoreTestSuites$1.evaluate(TestRuleIgnoreTestSuites.java:54)
	at com.carrotsearch.randomizedtesting.rules.StatementAdapter.evaluate(StatementAdapter.java:36)
	at com.carrotsearch.randomizedtesting.ThreadLeakControl$StatementRunner.run(ThreadLeakControl.java:368)
	at java.lang.Thread.run(Thread.java:748)


FAILED:  junit.framework.TestSuite.org.apache.solr.handler.TestSQLHandler

Error Message:
1 thread leaked from SUITE scope at org.apache.solr.handler.TestSQLHandler:     1) Thread[id=2669, name=Connection evictor, state=TIMED_WAITING, group=TGRP-TestSQLHandler]         at java.lang.Thread.sleep(Native Method)         at org.apache.http.impl.client.IdleConnectionEvictor$1.run(IdleConnectionEvictor.java:66)         at java.lang.Thread.run(Thread.java:748)

Stack Trace:
com.carrotsearch.randomizedtesting.ThreadLeakError: 1 thread leaked from SUITE scope at org.apache.solr.handler.TestSQLHandler: 
   1) Thread[id=2669, name=Connection evictor, state=TIMED_WAITING, group=TGRP-TestSQLHandler]
        at java.lang.Thread.sleep(Native Method)
        at org.apache.http.impl.client.IdleConnectionEvictor$1.run(IdleConnectionEvictor.java:66)
        at java.lang.Thread.run(Thread.java:748)
	at __randomizedtesting.SeedInfo.seed([F1EED2A27545430F]:0)


FAILED:  org.apache.solr.handler.TestSQLHandler.doTest

Error Message:
--> http://127.0.0.1:51687/collection1_shard2_replica_n41:Failed to execute sqlQuery 'select id, field_i, str_s from collection1 where (text='(XXXX)' OR text='XXXX') AND text='XXXX' order by field_i desc' against JDBC connection 'jdbc:calcitesolr:'. Error while executing SQL "select id, field_i, str_s from collection1 where (text='(XXXX)' OR text='XXXX') AND text='XXXX' order by field_i desc": java.io.IOException: java.util.concurrent.ExecutionException: java.io.IOException: --> http://127.0.0.1:51731/collection1_shard2_replica_n45/:can not sort on a field w/o docValues unless it is indexed and supports Uninversion: field_i

Stack Trace:
java.io.IOException: --> http://127.0.0.1:51687/collection1_shard2_replica_n41:Failed to execute sqlQuery 'select id, field_i, str_s from collection1 where (text='(XXXX)' OR text='XXXX') AND text='XXXX' order by field_i desc' against JDBC connection 'jdbc:calcitesolr:'.
Error while executing SQL "select id, field_i, str_s from collection1 where (text='(XXXX)' OR text='XXXX') AND text='XXXX' order by field_i desc": java.io.IOException: java.util.concurrent.ExecutionException: java.io.IOException: --> http://127.0.0.1:51731/collection1_shard2_replica_n45/:can not sort on a field w/o docValues unless it is indexed and supports Uninversion: field_i
	at __randomizedtesting.SeedInfo.seed([F1EED2A27545430F:56AA6A0618FE50B6]:0)
	at org.apache.solr.client.solrj.io.stream.SolrStream.read(SolrStream.java:222)
	at org.apache.solr.handler.TestSQLHandler.getTuples(TestSQLHandler.java:2522)
	at org.apache.solr.handler.TestSQLHandler.testBasicSelect(TestSQLHandler.java:124)
	at org.apache.solr.handler.TestSQLHandler.doTest(TestSQLHandler.java:82)
	at sun.reflect.NativeMethodAccessorImpl.invoke0(Native Method)
	at sun.reflect.NativeMethodAccessorImpl.invoke(NativeMethodAccessorImpl.java:62)
	at sun.reflect.DelegatingMethodAccessorImpl.invoke(DelegatingMethodAccessorImpl.java:43)
	at java.lang.reflect.Method.invoke(Method.java:498)
	at com.carrotsearch.randomizedtesting.RandomizedRunner.invoke(RandomizedRunner.java:1737)
	at com.carrotsearch.randomizedtesting.RandomizedRunner$8.evaluate(RandomizedRunner.java:934)
	at com.carrotsearch.randomizedtesting.RandomizedRunner$9.evaluate(RandomizedRunner.java:970)
	at com.carrotsearch.randomizedtesting.RandomizedRunner$10.evaluate(RandomizedRunner.java:984)
	at org.apache.solr.BaseDistributedSearchTestCase$ShardsRepeatRule$ShardsFixedStatement.callStatement(BaseDistributedSearchTestCase.java:993)
	at org.apache.solr.BaseDistributedSearchTestCase$ShardsRepeatRule$ShardsStatement.evaluate(BaseDistributedSearchTestCase.java:968)
	at com.carrotsearch.randomizedtesting.rules.SystemPropertiesRestoreRule$1.evaluate(SystemPropertiesRestoreRule.java:57)
	at org.apache.lucene.util.TestRuleSetupTeardownChained$1.evaluate(TestRuleSetupTeardownChained.java:49)
	at org.apache.lucene.util.AbstractBeforeAfterRule$1.evaluate(AbstractBeforeAfterRule.java:45)
	at org.apache.lucene.util.TestRuleThreadAndTestName$1.evaluate(TestRuleThreadAndTestName.java:48)
	at org.apache.lucene.util.TestRuleIgnoreAfterMaxFailures$1.evaluate(TestRuleIgnoreAfterMaxFailures.java:64)
	at org.apache.lucene.util.TestRuleMarkFailure$1.evaluate(TestRuleMarkFailure.java:47)
	at com.carrotsearch.randomizedtesting.rules.StatementAdapter.evaluate(StatementAdapter.java:36)
	at com.carrotsearch.randomizedtesting.ThreadLeakControl$StatementRunner.run(ThreadLeakControl.java:368)
	at com.carrotsearch.randomizedtesting.ThreadLeakControl.forkTimeoutingTask(ThreadLeakControl.java:817)
	at com.carrotsearch.randomizedtesting.ThreadLeakControl$3.evaluate(ThreadLeakControl.java:468)
	at com.carrotsearch.randomizedtesting.RandomizedRunner.runSingleTest(RandomizedRunner.java:943)
	at com.carrotsearch.randomizedtesting.RandomizedRunner$5.evaluate(RandomizedRunner.java:829)
	at com.carrotsearch.randomizedtesting.RandomizedRunner$6.evaluate(RandomizedRunner.java:879)
	at com.carrotsearch.randomizedtesting.RandomizedRunner$7.evaluate(RandomizedRunner.java:890)
	at com.carrotsearch.randomizedtesting.rules.StatementAdapter.evaluate(StatementAdapter.java:36)
	at com.carrotsearch.randomizedtesting.rules.SystemPropertiesRestoreRule$1.evaluate(SystemPropertiesRestoreRule.java:57)
	at org.apache.lucene.util.AbstractBeforeAfterRule$1.evaluate(AbstractBeforeAfterRule.java:45)
	at com.carrotsearch.randomizedtesting.rules.StatementAdapter.evaluate(StatementAdapter.java:36)
	at org.apache.lucene.util.TestRuleStoreClassName$1.evaluate(TestRuleStoreClassName.java:41)
	at com.carrotsearch.randomizedtesting.rules.NoShadowingOrOverridesOnMethodsRule$1.evaluate(NoShadowingOrOverridesOnMethodsRule.java:40)
	at com.carrotsearch.randomizedtesting.rules.NoShadowingOrOverridesOnMethodsRule$1.evaluate(NoShadowingOrOverridesOnMethodsRule.java:40)
	at com.carrotsearch.randomizedtesting.rules.StatementAdapter.evaluate(StatementAdapter.java:36)
	at com.carrotsearch.randomizedtesting.rules.StatementAdapter.evaluate(StatementAdapter.java:36)
	at com.carrotsearch.randomizedtesting.rules.StatementAdapter.evaluate(StatementAdapter.java:36)
	at org.apache.lucene.util.TestRuleAssertionsRequired$1.evaluate(TestRuleAssertionsRequired.java:53)
	at org.apache.lucene.util.TestRuleMarkFailure$1.evaluate(TestRuleMarkFailure.java:47)
	at org.apache.lucene.util.TestRuleIgnoreAfterMaxFailures$1.evaluate(TestRuleIgnoreAfterMaxFailures.java:64)
	at org.apache.lucene.util.TestRuleIgnoreTestSuites$1.evaluate(TestRuleIgnoreTestSuites.java:54)
	at com.carrotsearch.randomizedtesting.rules.StatementAdapter.evaluate(StatementAdapter.java:36)
	at com.carrotsearch.randomizedtesting.ThreadLeakControl$StatementRunner.run(ThreadLeakControl.java:368)
	at java.lang.Thread.run(Thread.java:748)


FAILED:  junit.framework.TestSuite.org.apache.solr.handler.TestSQLHandler

Error Message:
1 thread leaked from SUITE scope at org.apache.solr.handler.TestSQLHandler:     1) Thread[id=2700, name=Connection evictor, state=TIMED_WAITING, group=TGRP-TestSQLHandler]         at java.lang.Thread.sleep(Native Method)         at org.apache.http.impl.client.IdleConnectionEvictor$1.run(IdleConnectionEvictor.java:66)         at java.lang.Thread.run(Thread.java:748)

Stack Trace:
com.carrotsearch.randomizedtesting.ThreadLeakError: 1 thread leaked from SUITE scope at org.apache.solr.handler.TestSQLHandler: 
   1) Thread[id=2700, name=Connection evictor, state=TIMED_WAITING, group=TGRP-TestSQLHandler]
        at java.lang.Thread.sleep(Native Method)
        at org.apache.http.impl.client.IdleConnectionEvictor$1.run(IdleConnectionEvictor.java:66)
        at java.lang.Thread.run(Thread.java:748)
	at __randomizedtesting.SeedInfo.seed([F1EED2A27545430F]:0)


FAILED:  org.apache.solr.handler.TestSQLHandler.doTest

Error Message:
--> http://127.0.0.1:51862/collection1_shard2_replica_n41:Failed to execute sqlQuery 'select id, field_i, str_s from collection1 where (text='(XXXX)' OR text='XXXX') AND text='XXXX' order by field_i desc' against JDBC connection 'jdbc:calcitesolr:'. Error while executing SQL "select id, field_i, str_s from collection1 where (text='(XXXX)' OR text='XXXX') AND text='XXXX' order by field_i desc": java.io.IOException: java.util.concurrent.ExecutionException: java.io.IOException: --> http://127.0.0.1:51862/collection1_shard2_replica_n41/:can not sort on a field w/o docValues unless it is indexed and supports Uninversion: field_i

Stack Trace:
java.io.IOException: --> http://127.0.0.1:51862/collection1_shard2_replica_n41:Failed to execute sqlQuery 'select id, field_i, str_s from collection1 where (text='(XXXX)' OR text='XXXX') AND text='XXXX' order by field_i desc' against JDBC connection 'jdbc:calcitesolr:'.
Error while executing SQL "select id, field_i, str_s from collection1 where (text='(XXXX)' OR text='XXXX') AND text='XXXX' order by field_i desc": java.io.IOException: java.util.concurrent.ExecutionException: java.io.IOException: --> http://127.0.0.1:51862/collection1_shard2_replica_n41/:can not sort on a field w/o docValues unless it is indexed and supports Uninversion: field_i
	at __randomizedtesting.SeedInfo.seed([F1EED2A27545430F:56AA6A0618FE50B6]:0)
	at org.apache.solr.client.solrj.io.stream.SolrStream.read(SolrStream.java:222)
	at org.apache.solr.handler.TestSQLHandler.getTuples(TestSQLHandler.java:2522)
	at org.apache.solr.handler.TestSQLHandler.testBasicSelect(TestSQLHandler.java:124)
	at org.apache.solr.handler.TestSQLHandler.doTest(TestSQLHandler.java:82)
	at sun.reflect.NativeMethodAccessorImpl.invoke0(Native Method)
	at sun.reflect.NativeMethodAccessorImpl.invoke(NativeMethodAccessorImpl.java:62)
	at sun.reflect.DelegatingMethodAccessorImpl.invoke(DelegatingMethodAccessorImpl.java:43)
	at java.lang.reflect.Method.invoke(Method.java:498)
	at com.carrotsearch.randomizedtesting.RandomizedRunner.invoke(RandomizedRunner.java:1737)
	at com.carrotsearch.randomizedtesting.RandomizedRunner$8.evaluate(RandomizedRunner.java:934)
	at com.carrotsearch.randomizedtesting.RandomizedRunner$9.evaluate(RandomizedRunner.java:970)
	at com.carrotsearch.randomizedtesting.RandomizedRunner$10.evaluate(RandomizedRunner.java:984)
	at org.apache.solr.BaseDistributedSearchTestCase$ShardsRepeatRule$ShardsFixedStatement.callStatement(BaseDistributedSearchTestCase.java:993)
	at org.apache.solr.BaseDistributedSearchTestCase$ShardsRepeatRule$ShardsStatement.evaluate(BaseDistributedSearchTestCase.java:968)
	at com.carrotsearch.randomizedtesting.rules.SystemPropertiesRestoreRule$1.evaluate(SystemPropertiesRestoreRule.java:57)
	at org.apache.lucene.util.TestRuleSetupTeardownChained$1.evaluate(TestRuleSetupTeardownChained.java:49)
	at org.apache.lucene.util.AbstractBeforeAfterRule$1.evaluate(AbstractBeforeAfterRule.java:45)
	at org.apache.lucene.util.TestRuleThreadAndTestName$1.evaluate(TestRuleThreadAndTestName.java:48)
	at org.apache.lucene.util.TestRuleIgnoreAfterMaxFailures$1.evaluate(TestRuleIgnoreAfterMaxFailures.java:64)
	at org.apache.lucene.util.TestRuleMarkFailure$1.evaluate(TestRuleMarkFailure.java:47)
	at com.carrotsearch.randomizedtesting.rules.StatementAdapter.evaluate(StatementAdapter.java:36)
	at com.carrotsearch.randomizedtesting.ThreadLeakControl$StatementRunner.run(ThreadLeakControl.java:368)
	at com.carrotsearch.randomizedtesting.ThreadLeakControl.forkTimeoutingTask(ThreadLeakControl.java:817)
	at com.carrotsearch.randomizedtesting.ThreadLeakControl$3.evaluate(ThreadLeakControl.java:468)
	at com.carrotsearch.randomizedtesting.RandomizedRunner.runSingleTest(RandomizedRunner.java:943)
	at com.carrotsearch.randomizedtesting.RandomizedRunner$5.evaluate(RandomizedRunner.java:829)
	at com.carrotsearch.randomizedtesting.RandomizedRunner$6.evaluate(RandomizedRunner.java:879)
	at com.carrotsearch.randomizedtesting.RandomizedRunner$7.evaluate(RandomizedRunner.java:890)
	at com.carrotsearch.randomizedtesting.rules.StatementAdapter.evaluate(StatementAdapter.java:36)
	at com.carrotsearch.randomizedtesting.rules.SystemPropertiesRestoreRule$1.evaluate(SystemPropertiesRestoreRule.java:57)
	at org.apache.lucene.util.AbstractBeforeAfterRule$1.evaluate(AbstractBeforeAfterRule.java:45)
	at com.carrotsearch.randomizedtesting.rules.StatementAdapter.evaluate(StatementAdapter.java:36)
	at org.apache.lucene.util.TestRuleStoreClassName$1.evaluate(TestRuleStoreClassName.java:41)
	at com.carrotsearch.randomizedtesting.rules.NoShadowingOrOverridesOnMethodsRule$1.evaluate(NoShadowingOrOverridesOnMethodsRule.java:40)
	at com.carrotsearch.randomizedtesting.rules.NoShadowingOrOverridesOnMethodsRule$1.evaluate(NoShadowingOrOverridesOnMethodsRule.java:40)
	at com.carrotsearch.randomizedtesting.rules.StatementAdapter.evaluate(StatementAdapter.java:36)
	at com.carrotsearch.randomizedtesting.rules.StatementAdapter.evaluate(StatementAdapter.java:36)
	at com.carrotsearch.randomizedtesting.rules.StatementAdapter.evaluate(StatementAdapter.java:36)
	at org.apache.lucene.util.TestRuleAssertionsRequired$1.evaluate(TestRuleAssertionsRequired.java:53)
	at org.apache.lucene.util.TestRuleMarkFailure$1.evaluate(TestRuleMarkFailure.java:47)
	at org.apache.lucene.util.TestRuleIgnoreAfterMaxFailures$1.evaluate(TestRuleIgnoreAfterMaxFailures.java:64)
	at org.apache.lucene.util.TestRuleIgnoreTestSuites$1.evaluate(TestRuleIgnoreTestSuites.java:54)
	at com.carrotsearch.randomizedtesting.rules.StatementAdapter.evaluate(StatementAdapter.java:36)
	at com.carrotsearch.randomizedtesting.ThreadLeakControl$StatementRunner.run(ThreadLeakControl.java:368)
	at java.lang.Thread.run(Thread.java:748)


FAILED:  junit.framework.TestSuite.org.apache.solr.handler.TestSQLHandler

Error Message:
1 thread leaked from SUITE scope at org.apache.solr.handler.TestSQLHandler:     1) Thread[id=2956, name=Connection evictor, state=TIMED_WAITING, group=TGRP-TestSQLHandler]         at java.lang.Thread.sleep(Native Method)         at org.apache.http.impl.client.IdleConnectionEvictor$1.run(IdleConnectionEvictor.java:66)         at java.lang.Thread.run(Thread.java:748)

Stack Trace:
com.carrotsearch.randomizedtesting.ThreadLeakError: 1 thread leaked from SUITE scope at org.apache.solr.handler.TestSQLHandler: 
   1) Thread[id=2956, name=Connection evictor, state=TIMED_WAITING, group=TGRP-TestSQLHandler]
        at java.lang.Thread.sleep(Native Method)
        at org.apache.http.impl.client.IdleConnectionEvictor$1.run(IdleConnectionEvictor.java:66)
        at java.lang.Thread.run(Thread.java:748)
	at __randomizedtesting.SeedInfo.seed([F1EED2A27545430F]:0)


FAILED:  org.apache.solr.handler.TestSQLHandler.doTest

Error Message:


Stack Trace:
java.lang.AssertionError
	at __randomizedtesting.SeedInfo.seed([F1EED2A27545430F:56AA6A0618FE50B6]:0)
	at org.apache.solr.handler.TestSQLHandler.testBasicSelect(TestSQLHandler.java:181)
	at org.apache.solr.handler.TestSQLHandler.doTest(TestSQLHandler.java:82)
	at sun.reflect.NativeMethodAccessorImpl.invoke0(Native Method)
	at sun.reflect.NativeMethodAccessorImpl.invoke(NativeMethodAccessorImpl.java:62)
	at sun.reflect.DelegatingMethodAccessorImpl.invoke(DelegatingMethodAccessorImpl.java:43)
	at java.lang.reflect.Method.invoke(Method.java:498)
	at com.carrotsearch.randomizedtesting.RandomizedRunner.invoke(RandomizedRunner.java:1737)
	at com.carrotsearch.randomizedtesting.RandomizedRunner$8.evaluate(RandomizedRunner.java:934)
	at com.carrotsearch.randomizedtesting.RandomizedRunner$9.evaluate(RandomizedRunner.java:970)
	at com.carrotsearch.randomizedtesting.RandomizedRunner$10.evaluate(RandomizedRunner.java:984)
	at org.apache.solr.BaseDistributedSearchTestCase$ShardsRepeatRule$ShardsFixedStatement.callStatement(BaseDistributedSearchTestCase.java:993)
	at org.apache.solr.BaseDistributedSearchTestCase$ShardsRepeatRule$ShardsStatement.evaluate(BaseDistributedSearchTestCase.java:968)
	at com.carrotsearch.randomizedtesting.rules.SystemPropertiesRestoreRule$1.evaluate(SystemPropertiesRestoreRule.java:57)
	at org.apache.lucene.util.TestRuleSetupTeardownChained$1.evaluate(TestRuleSetupTeardownChained.java:49)
	at org.apache.lucene.util.AbstractBeforeAfterRule$1.evaluate(AbstractBeforeAfterRule.java:45)
	at org.apache.lucene.util.TestRuleThreadAndTestName$1.evaluate(TestRuleThreadAndTestName.java:48)
	at org.apache.lucene.util.TestRuleIgnoreAfterMaxFailures$1.evaluate(TestRuleIgnoreAfterMaxFailures.java:64)
	at org.apache.lucene.util.TestRuleMarkFailure$1.evaluate(TestRuleMarkFailure.java:47)
	at com.carrotsearch.randomizedtesting.rules.StatementAdapter.evaluate(StatementAdapter.java:36)
	at com.carrotsearch.randomizedtesting.ThreadLeakControl$StatementRunner.run(ThreadLeakControl.java:368)
	at com.carrotsearch.randomizedtesting.ThreadLeakControl.forkTimeoutingTask(ThreadLeakControl.java:817)
	at com.carrotsearch.randomizedtesting.ThreadLeakControl$3.evaluate(ThreadLeakControl.java:468)
	at com.carrotsearch.randomizedtesting.RandomizedRunner.runSingleTest(RandomizedRunner.java:943)
	at com.carrotsearch.randomizedtesting.RandomizedRunner$5.evaluate(RandomizedRunner.java:829)
	at com.carrotsearch.randomizedtesting.RandomizedRunner$6.evaluate(RandomizedRunner.java:879)
	at com.carrotsearch.randomizedtesting.RandomizedRunner$7.evaluate(RandomizedRunner.java:890)
	at com.carrotsearch.randomizedtesting.rules.StatementAdapter.evaluate(StatementAdapter.java:36)
	at com.carrotsearch.randomizedtesting.rules.SystemPropertiesRestoreRule$1.evaluate(SystemPropertiesRestoreRule.java:57)
	at org.apache.lucene.util.AbstractBeforeAfterRule$1.evaluate(AbstractBeforeAfterRule.java:45)
	at com.carrotsearch.randomizedtesting.rules.StatementAdapter.evaluate(StatementAdapter.java:36)
	at org.apache.lucene.util.TestRuleStoreClassName$1.evaluate(TestRuleStoreClassName.java:41)
	at com.carrotsearch.randomizedtesting.rules.NoShadowingOrOverridesOnMethodsRule$1.evaluate(NoShadowingOrOverridesOnMethodsRule.java:40)
	at com.carrotsearch.randomizedtesting.rules.NoShadowingOrOverridesOnMethodsRule$1.evaluate(NoShadowingOrOverridesOnMethodsRule.java:40)
	at com.carrotsearch.randomizedtesting.rules.StatementAdapter.evaluate(StatementAdapter.java:36)
	at com.carrotsearch.randomizedtesting.rules.StatementAdapter.evaluate(StatementAdapter.java:36)
	at com.carrotsearch.randomizedtesting.rules.StatementAdapter.evaluate(StatementAdapter.java:36)
	at org.apache.lucene.util.TestRuleAssertionsRequired$1.evaluate(TestRuleAssertionsRequired.java:53)
	at org.apache.lucene.util.TestRuleMarkFailure$1.evaluate(TestRuleMarkFailure.java:47)
	at org.apache.lucene.util.TestRuleIgnoreAfterMaxFailures$1.evaluate(TestRuleIgnoreAfterMaxFailures.java:64)
	at org.apache.lucene.util.TestRuleIgnoreTestSuites$1.evaluate(TestRuleIgnoreTestSuites.java:54)
	at com.carrotsearch.randomizedtesting.rules.StatementAdapter.evaluate(StatementAdapter.java:36)
	at com.carrotsearch.randomizedtesting.ThreadLeakControl$StatementRunner.run(ThreadLeakControl.java:368)
	at java.lang.Thread.run(Thread.java:748)


FAILED:  junit.framework.TestSuite.org.apache.solr.update.TestExceedMaxTermLength

Error Message:
Could not remove the following files (in the order of attempts):    C:\Users\jenkins\workspace\Lucene-Solr-7.x-Windows\solr\build\solr-core\test\J0\temp\solr.update.TestExceedMaxTermLength_F1EED2A27545430F-001\init-core-data-001\tlog: java.nio.file.DirectoryNotEmptyException: C:\Users\jenkins\workspace\Lucene-Solr-7.x-Windows\solr\build\solr-core\test\J0\temp\solr.update.TestExceedMaxTermLength_F1EED2A27545430F-001\init-core-data-001\tlog    C:\Users\jenkins\workspace\Lucene-Solr-7.x-Windows\solr\build\solr-core\test\J0\temp\solr.update.TestExceedMaxTermLength_F1EED2A27545430F-001\init-core-data-001: java.nio.file.DirectoryNotEmptyException: C:\Users\jenkins\workspace\Lucene-Solr-7.x-Windows\solr\build\solr-core\test\J0\temp\solr.update.TestExceedMaxTermLength_F1EED2A27545430F-001\init-core-data-001    C:\Users\jenkins\workspace\Lucene-Solr-7.x-Windows\solr\build\solr-core\test\J0\temp\solr.update.TestExceedMaxTermLength_F1EED2A27545430F-001\init-core-data-001\tlog\tlog.0000000000000000001: java.nio.file.AccessDeniedException: C:\Users\jenkins\workspace\Lucene-Solr-7.x-Windows\solr\build\solr-core\test\J0\temp\solr.update.TestExceedMaxTermLength_F1EED2A27545430F-001\init-core-data-001\tlog\tlog.0000000000000000001    C:\Users\jenkins\workspace\Lucene-Solr-7.x-Windows\solr\build\solr-core\test\J0\temp\solr.update.TestExceedMaxTermLength_F1EED2A27545430F-001: java.nio.file.DirectoryNotEmptyException: C:\Users\jenkins\workspace\Lucene-Solr-7.x-Windows\solr\build\solr-core\test\J0\temp\solr.update.TestExceedMaxTermLength_F1EED2A27545430F-001 

Stack Trace:
java.io.IOException: Could not remove the following files (in the order of attempts):
   C:\Users\jenkins\workspace\Lucene-Solr-7.x-Windows\solr\build\solr-core\test\J0\temp\solr.update.TestExceedMaxTermLength_F1EED2A27545430F-001\init-core-data-001\tlog: java.nio.file.DirectoryNotEmptyException: C:\Users\jenkins\workspace\Lucene-Solr-7.x-Windows\solr\build\solr-core\test\J0\temp\solr.update.TestExceedMaxTermLength_F1EED2A27545430F-001\init-core-data-001\tlog
   C:\Users\jenkins\workspace\Lucene-Solr-7.x-Windows\solr\build\solr-core\test\J0\temp\solr.update.TestExceedMaxTermLength_F1EED2A27545430F-001\init-core-data-001: java.nio.file.DirectoryNotEmptyException: C:\Users\jenkins\workspace\Lucene-Solr-7.x-Windows\solr\build\solr-core\test\J0\temp\solr.update.TestExceedMaxTermLength_F1EED2A27545430F-001\init-core-data-001
   C:\Users\jenkins\workspace\Lucene-Solr-7.x-Windows\solr\build\solr-core\test\J0\temp\solr.update.TestExceedMaxTermLength_F1EED2A27545430F-001\init-core-data-001\tlog\tlog.0000000000000000001: java.nio.file.AccessDeniedException: C:\Users\jenkins\workspace\Lucene-Solr-7.x-Windows\solr\build\solr-core\test\J0\temp\solr.update.TestExceedMaxTermLength_F1EED2A27545430F-001\init-core-data-001\tlog\tlog.0000000000000000001
   C:\Users\jenkins\workspace\Lucene-Solr-7.x-Windows\solr\build\solr-core\test\J0\temp\solr.update.TestExceedMaxTermLength_F1EED2A27545430F-001: java.nio.file.DirectoryNotEmptyException: C:\Users\jenkins\workspace\Lucene-Solr-7.x-Windows\solr\build\solr-core\test\J0\temp\solr.update.TestExceedMaxTermLength_F1EED2A27545430F-001

	at __randomizedtesting.SeedInfo.seed([F1EED2A27545430F]:0)
	at org.apache.lucene.util.IOUtils.rm(IOUtils.java:329)
	at org.apache.lucene.util.TestRuleTemporaryFilesCleanup.afterAlways(TestRuleTemporaryFilesCleanup.java:216)
	at com.carrotsearch.randomizedtesting.rules.TestRuleAdapter$1.afterAlways(TestRuleAdapter.java:31)
	at com.carrotsearch.randomizedtesting.rules.StatementAdapter.evaluate(StatementAdapter.java:43)
	at com.carrotsearch.randomizedtesting.rules.StatementAdapter.evaluate(StatementAdapter.java:36)
	at org.apache.lucene.util.TestRuleAssertionsRequired$1.evaluate(TestRuleAssertionsRequired.java:53)
	at org.apache.lucene.util.TestRuleMarkFailure$1.evaluate(TestRuleMarkFailure.java:47)
	at org.apache.lucene.util.TestRuleIgnoreAfterMaxFailures$1.evaluate(TestRuleIgnoreAfterMaxFailures.java:64)
	at org.apache.lucene.util.TestRuleIgnoreTestSuites$1.evaluate(TestRuleIgnoreTestSuites.java:54)
	at com.carrotsearch.randomizedtesting.rules.StatementAdapter.evaluate(StatementAdapter.java:36)
	at com.carrotsearch.randomizedtesting.ThreadLeakControl$StatementRunner.run(ThreadLeakControl.java:368)
	at java.lang.Thread.run(Thread.java:748)




Build Log:
[...truncated 2672 lines...]
   [junit4] Suite: org.apache.lucene.analysis.snowball.TestSnowballVocab
   [junit4]   2> NOTE: test params are: codec=Asserting(Lucene70): {}, docValues:{}, maxPointsInLeafNode=984, maxMBSortInHeap=5.8187494879093435, sim=RandomSimilarity(queryNorm=false): {}, locale=ja, timezone=America/St_Lucia
   [junit4]   2> NOTE: Windows 10 10.0 x86/Oracle Corporation 1.8.0_144 (32-bit)/cpus=3,threads=1,free=121422328,total=298844160
   [junit4]   2> NOTE: All tests run in this JVM: [TestItalianLightStemFilterFactory, TestNorwegianMinimalStemFilterFactory, TestArabicStemFilter, TestGermanNormalizationFilterFactory, TestRemoveDuplicatesTokenFilterFactory, TestUAX29URLEmailTokenizer, TestPortugueseLightStemFilter, TestRussianLightStemFilter, TestSwedishLightStemFilterFactory, TestStopAnalyzer, TestRussianAnalyzer, GreekAnalyzerTest, CommonGramsFilterTest, TestLengthFilter, TestGermanLightStemFilterFactory, TestKeepFilterFactory, TestPersianAnalyzer, TestThaiAnalyzer, TestGalicianStemFilter, TestZeroAffix2, TestCaseInsensitive, TestConv, TestUnicodeWhitespaceTokenizer, TestRussianLightStemFilterFactory, QueryAutoStopWordAnalyzerTest, TestPatternTokenizer, TestIndonesianStemFilterFactory, TestKStemFilterFactory, TestSnowballVocab]
   [junit4]   2> NOTE: reproduce with: ant test  -Dtestcase=TestSnowballVocab -Dtests.seed=2F91D9FF381DA1DE -Dtests.slow=true -Dtests.locale=ja -Dtests.timezone=America/St_Lucia -Dtests.asserts=true -Dtests.file.encoding=Cp1252
   [junit4] ERROR   0.00s J0 | TestSnowballVocab (suite) <<<
   [junit4]    > Throwable #1: java.io.IOException: Could not remove the following files (in the order of attempts):
   [junit4]    >    C:\Users\jenkins\workspace\Lucene-Solr-7.x-Windows\lucene\build\analysis\common\test\J0\temp\lucene.analysis.snowball.TestSnowballVocab_2F91D9FF381DA1DE-001\tempDir-011\romanian: java.nio.file.DirectoryNotEmptyException: C:\Users\jenkins\workspace\Lucene-Solr-7.x-Windows\lucene\build\analysis\common\test\J0\temp\lucene.analysis.snowball.TestSnowballVocab_2F91D9FF381DA1DE-001\tempDir-011\romanian
   [junit4]    >    C:\Users\jenkins\workspace\Lucene-Solr-7.x-Windows\lucene\build\analysis\common\test\J0\temp\lucene.analysis.snowball.TestSnowballVocab_2F91D9FF381DA1DE-001\tempDir-011: java.nio.file.DirectoryNotEmptyException: C:\Users\jenkins\workspace\Lucene-Solr-7.x-Windows\lucene\build\analysis\common\test\J0\temp\lucene.analysis.snowball.TestSnowballVocab_2F91D9FF381DA1DE-001\tempDir-011
   [junit4]    > 	at __randomizedtesting.SeedInfo.seed([2F91D9FF381DA1DE]:0)
   [junit4]    > 	at org.apache.lucene.util.IOUtils.rm(IOUtils.java:329)
   [junit4]    > 	at java.lang.Thread.run(Thread.java:748)
   [junit4] Completed [118/285 (1!)] on J0 in 36.67s, 1 test, 1 error <<< FAILURES!

[...truncated 11746 lines...]
   [junit4] Suite: org.apache.solr.handler.TestSQLHandler
   [junit4]   2> Creating dataDir: C:\Users\jenkins\workspace\Lucene-Solr-7.x-Windows\solr\build\solr-core\test\J0\temp\solr.handler.TestSQLHandler_F1EED2A27545430F-001\init-core-data-001
   [junit4]   2> 3256251 WARN  (SUITE-TestSQLHandler-seed#[F1EED2A27545430F]-worker) [    ] o.a.s.SolrTestCaseJ4 startTrackingSearchers: numOpens=3 numCloses=3
   [junit4]   2> 3256251 INFO  (SUITE-TestSQLHandler-seed#[F1EED2A27545430F]-worker) [    ] o.a.s.SolrTestCaseJ4 Using PointFields (NUMERIC_POINTS_SYSPROP=true) w/NUMERIC_DOCVALUES_SYSPROP=false
   [junit4]   2> 3256257 INFO  (SUITE-TestSQLHandler-seed#[F1EED2A27545430F]-worker) [    ] o.a.s.SolrTestCaseJ4 Randomized ssl (false) and clientAuth (false) via: @org.apache.solr.util.RandomizeSSL(reason=, value=NaN, ssl=NaN, clientAuth=NaN)
   [junit4]   2> 3256257 INFO  (SUITE-TestSQLHandler-seed#[F1EED2A27545430F]-worker) [    ] o.a.s.SolrTestCaseJ4 SecureRandom sanity checks: test.solr.allowed.securerandom=null & java.security.egd=file:/dev/./urandom
   [junit4]   2> 3256257 INFO  (SUITE-TestSQLHandler-seed#[F1EED2A27545430F]-worker) [    ] o.a.s.BaseDistributedSearchTestCase Setting hostContext system property: /
   [junit4]   2> 3256261 INFO  (TEST-TestSQLHandler.doTest-seed#[F1EED2A27545430F]) [    ] o.a.s.c.ZkTestServer STARTING ZK TEST SERVER
   [junit4]   2> 3256265 INFO  (Thread-5881) [    ] o.a.s.c.ZkTestServer client port:0.0.0.0/0.0.0.0:0
   [junit4]   2> 3256266 INFO  (Thread-5881) [    ] o.a.s.c.ZkTestServer Starting server
   [junit4]   2> 3256272 ERROR (Thread-5881) [    ] o.a.z.s.ZooKeeperServer ZKShutdownHandler is not registered, so ZooKeeper server won't take any action on ERROR or SHUTDOWN server state changes
   [junit4]   2> 3256363 INFO  (TEST-TestSQLHandler.doTest-seed#[F1EED2A27545430F]) [    ] o.a.s.c.ZkTestServer start zk server on port:54024
   [junit4]   2> 3256368 INFO  (zkConnectionManagerCallback-8284-thread-1) [    ] o.a.s.c.c.ConnectionManager zkClient has connected
   [junit4]   2> 3256372 WARN  (NIOServerCxn.Factory:0.0.0.0/0.0.0.0:0) [    ] o.a.z.s.NIOServerCnxn Unable to read additional data from client sessionid 0x100282ba9720000, likely client has closed socket
   [junit4]   2> 3256376 INFO  (zkConnectionManagerCallback-8286-thread-1) [    ] o.a.s.c.c.ConnectionManager zkClient has connected
   [junit4]   2> 3256390 INFO  (TEST-TestSQLHandler.doTest-seed#[F1EED2A27545430F]) [    ] o.a.s.c.AbstractZkTestCase put C:\Users\jenkins\workspace\Lucene-Solr-7.x-Windows\solr\core\src\test-files\solr\collection1\conf\solrconfig-sql.xml to /configs/conf1/solrconfig.xml
   [junit4]   2> 3256396 INFO  (TEST-TestSQLHandler.doTest-seed#[F1EED2A27545430F]) [    ] o.a.s.c.AbstractZkTestCase put C:\Users\jenkins\workspace\Lucene-Solr-7.x-Windows\solr\core\src\test-files\solr\collection1\conf\schema-sql.xml to /configs/conf1/schema.xml
   [junit4]   2> 3256398 INFO  (TEST-TestSQLHandler.doTest-seed#[F1EED2A27545430F]) [    ] o.a.s.c.AbstractZkTestCase put C:\Users\jenkins\workspace\Lucene-Solr-7.x-Windows\solr\core\src\test-files\solr\collection1\conf\solrconfig.snippet.randomindexconfig.xml to /configs/conf1/solrconfig.snippet.randomindexconfig.xml
   [junit4]   2> 3256421 INFO  (TEST-TestSQLHandler.doTest-seed#[F1EED2A27545430F]) [    ] o.a.s.c.AbstractZkTestCase put C:\Users\jenkins\workspace\Lucene-Solr-7.x-Windows\solr\core\src\test-files\solr\collection1\conf\stopwords.txt to /configs/conf1/stopwords.txt
   [junit4]   2> 3256423 INFO  (TEST-TestSQLHandler.doTest-seed#[F1EED2A27545430F]) [    ] o.a.s.c.AbstractZkTestCase put C:\Users\jenkins\workspace\Lucene-Solr-7.x-Windows\solr\core\src\test-files\solr\collection1\conf\protwords.txt to /configs/conf1/protwords.txt
   [junit4]   2> 3256426 INFO  (TEST-TestSQLHandler.doTest-seed#[F1EED2A27545430F]) [    ] o.a.s.c.AbstractZkTestCase put C:\Users\jenkins\workspace\Lucene-Solr-7.x-Windows\solr\core\src\test-files\solr\collection1\conf\currency.xml to /configs/conf1/currency.xml
   [junit4]   2> 3256428 INFO  (TEST-TestSQLHandler.doTest-seed#[F1EED2A27545430F]) [    ] o.a.s.c.AbstractZkTestCase put C:\Users\jenkins\workspace\Lucene-Solr-7.x-Windows\solr\core\src\test-files\solr\collection1\conf\enumsConfig.xml to /configs/conf1/enumsConfig.xml
   [junit4]   2> 3256433 INFO  (TEST-TestSQLHandler.doTest-seed#[F1EED2A27545430F]) [    ] o.a.s.c.AbstractZkTestCase put C:\Users\jenkins\workspace\Lucene-Solr-7.x-Windows\solr\core\src\test-files\solr\collection1\conf\open-exchange-rates.json to /configs/conf1/open-exchange-rates.json
   [junit4]   2> 3256435 INFO  (TEST-TestSQLHandler.doTest-seed#[F1EED2A27545430F]) [    ] o.a.s.c.AbstractZkTestCase put C:\Users\jenkins\workspace\Lucene-Solr-7.x-Windows\solr\core\src\test-files\solr\collection1\conf\mapping-ISOLatin1Accent.txt to /configs/conf1/mapping-ISOLatin1Accent.txt
   [junit4]   2> 3256438 INFO  (TEST-TestSQLHandler.doTest-seed#[F1EED2A27545430F]) [    ] o.a.s.c.AbstractZkTestCase put C:\Users\jenkins\workspace\Lucene-Solr-7.x-Windows\solr\core\src\test-files\solr\collection1\conf\old_synonyms.txt to /configs/conf1/old_synonyms.txt
   [junit4]   2> 3256439 INFO  (TEST-TestSQLHandler.doTest-seed#[F1EED2A27545430F]) [    ] o.a.s.c.AbstractZkTestCase put C:\Users\jenkins\workspace\Lucene-Solr-7.x-Windows\solr\core\src\test-files\solr\collection1\conf\synonyms.txt to /configs/conf1/synonyms.txt
   [junit4]   2> 3256442 WARN  (NIOServerCxn.Factory:0.0.0.0/0.0.0.0:0) [    ] o.a.z.s.NIOServerCnxn Unable to read additional data from client sessionid 0x100282ba9720001, likely client has closed socket
   [junit4]   2> 3256442 INFO  (TEST-TestSQLHandler.doTest-seed#[F1EED2A27545430F]) [    ] o.a.s.c.AbstractFullDistribZkTestBase Will use NRT replicas unless explicitly asked otherwise
   [junit4]   2> 3257675 INFO  (TEST-TestSQLHandler.doTest-seed#[F1EED2A27545430F]) [    ] o.e.j.s.Server jetty-9.4.8.v20171121, build timestamp: 2017-11-21T18:27:37-03:00, git hash: 82b8fb23f757335bb3329d540ce37a2a2615f0a8
   [junit4]   2> 3257675 INFO  (TEST-TestSQLHandler.doTest-seed#[F1EED2A27545430F]) [    ] o.e.j.s.session DefaultSessionIdManager workerName=node0
   [junit4]   2> 3257675 INFO  (TEST-TestSQLHandler.doTest-seed#[F1EED2A27545430F]) [    ] o.e.j.s.session No SessionScavenger set, using defaults
   [junit4]   2> 3257675 INFO  (TEST-TestSQLHandler.doTest-seed#[F1EED2A27545430F]) [    ] o.e.j.s.session Scavenging every 660000ms
   [junit4]   2> 3257675 INFO  (TEST-TestSQLHandler.doTest-seed#[F1EED2A27545430F]) [    ] o.e.j.s.h.ContextHandler Started o.e.j.s.ServletContextHandler@22d2ae{/,null,AVAILABLE}
   [junit4]   2> 3257696 INFO  (TEST-TestSQLHandler.doTest-seed#[F1EED2A27545430F]) [    ] o.e.j.s.AbstractConnector Started ServerConnector@8b2756{HTTP/1.1,[http/1.1]}{127.0.0.1:54068}
   [junit4]   2> 3257696 INFO  (TEST-TestSQLHandler.doTest-seed#[F1EED2A27545430F]) [    ] o.e.j.s.Server Started @3265249ms
   [junit4]   2> 3257696 INFO  (TEST-TestSQLHandler.doTest-seed#[F1EED2A27545430F]) [    ] o.a.s.c.s.e.JettySolrRunner Jetty properties: {solr.data.dir=C:\Users\jenkins\workspace\Lucene-Solr-7.x-Windows\solr\build\solr-core\test\J0\temp\solr.handler.TestSQLHandler_F1EED2A27545430F-001\tempDir-001/control/data, replicaType=NRT, hostContext=/, hostPort=54068, coreRootDirectory=C:\Users\jenkins\workspace\Lucene-Solr-7.x-Windows\solr\build\solr-core\test\J0\temp\solr.handler.TestSQLHandler_F1EED2A27545430F-001\control-001\cores}
   [junit4]   2> 3257697 ERROR (TEST-TestSQLHandler.doTest-seed#[F1EED2A27545430F]) [    ] o.a.s.u.StartupLoggingUtils Missing Java Option solr.log.dir. Logging may be missing or incomplete.
   [junit4]   2> 3257697 INFO  (TEST-TestSQLHandler.doTest-seed#[F1EED2A27545430F]) [    ] o.a.s.s.SolrDispatchFilter  ___      _       Welcome to Apache Solr™ version 7.3.0
   [junit4]   2> 3257697 INFO  (TEST-TestSQLHandler.doTest-seed#[F1EED2A27545430F]) [    ] o.a.s.s.SolrDispatchFilter / __| ___| |_ _   Starting in cloud mode on port null
   [junit4]   2> 3257697 INFO  (TEST-TestSQLHandler.doTest-seed#[F1EED2A27545430F]) [    ] o.a.s.s.SolrDispatchFilter \__ \/ _ \ | '_|  Install dir: null
   [junit4]   2> 3257697 INFO  (TEST-TestSQLHandler.doTest-seed#[F1EED2A27545430F]) [    ] o.a.s.s.SolrDispatchFilter |___/\___/_|_|    Start time: 2018-03-09T04:58:18.064Z
   [junit4]   2> 3257729 INFO  (zkConnectionManagerCallback-8288-thread-1) [    ] o.a.s.c.c.ConnectionManager zkClient has connected
   [junit4]   2> 3257732 WARN  (NIOServerCxn.Factory:0.0.0.0/0.0.0.0:0) [    ] o.a.z.s.NIOServerCnxn Unable to read additional data from client sessionid 0x100282ba9720002, likely client has closed socket
   [junit4]   2> 3257733 INFO  (TEST-TestSQLHandler.doTest-seed#[F1EED2A27545430F]) [    ] o.a.s.s.SolrDispatchFilter Loading solr.xml from SolrHome (not found in ZooKeeper)
   [junit4]   2> 3257733 INFO  (TEST-TestSQLHandler.doTest-seed#[F1EED2A27545430F]) [    ] o.a.s.c.SolrXmlConfig Loading container configuration from C:\Users\jenkins\workspace\Lucene-Solr-7.x-Windows\solr\build\solr-core\test\J0\temp\solr.handler.TestSQLHandler_F1EED2A27545430F-001\control-001\solr.xml
   [junit4]   2> 3257758 INFO  (TEST-TestSQLHandler.doTest-seed#[F1EED2A27545430F]) [    ] o.a.s.c.SolrXmlConfig Configuration parameter autoReplicaFailoverWorkLoopDelay is ignored
   [junit4]   2> 3257758 INFO  (TEST-TestSQLHandler.doTest-seed#[F1EED2A27545430F]) [    ] o.a.s.c.SolrXmlConfig Configuration parameter autoReplicaFailoverBadNodeExpiration is ignored
   [junit4]   2> 3257760 INFO  (TEST-TestSQLHandler.doTest-seed#[F1EED2A27545430F]) [    ] o.a.s.c.SolrXmlConfig MBean server found: com.sun.jmx.mbeanserver.JmxMBeanServer@18af8d, but no JMX reporters were configured - adding default JMX reporter.
   [junit4]   2> 3257784 INFO  (TEST-TestSQLHandler.doTest-seed#[F1EED2A27545430F]) [    ] o.a.s.c.ZkContainer Zookeeper client=127.0.0.1:54024/solr
   [junit4]   2> 3257809 INFO  (zkConnectionManagerCallback-8292-thread-1) [    ] o.a.s.c.c.ConnectionManager zkClient has connected
   [junit4]   2> 3257816 WARN  (NIOServerCxn.Factory:0.0.0.0/0.0.0.0:0) [    ] o.a.z.s.NIOServerCnxn Unable to read additional data from client sessionid 0x100282ba9720003, likely client has closed socket
   [junit4]   2> 3257825 INFO  (zkConnectionManagerCallback-8294-thread-1-processing-n:127.0.0.1:54068_) [n:127.0.0.1:54068_    ] o.a.s.c.c.ConnectionManager zkClient has connected
   [junit4]   2> 3258119 INFO  (TEST-TestSQLHandler.doTest-seed#[F1EED2A27545430F]) [n:127.0.0.1:54068_    ] o.a.s.c.Overseer Overseer (id=null) closing
   [junit4]   2> 3258125 INFO  (TEST-TestSQLHandler.doTest-seed#[F1EED2A27545430F]) [n:127.0.0.1:54068_    ] o.a.s.c.OverseerElectionContext I am going to be the leader 127.0.0.1:54068_
   [junit4]   2> 3258126 INFO  (TEST-TestSQLHandler.doTest-seed#[F1EED2A27545430F]) [n:127.0.0.1:54068_    ] o.a.s.c.Overseer Overseer (id=72101762029453316-127.0.0.1:54068_-n_0000000000) starting
   [junit4]   2> 3258137 INFO  (TEST-TestSQLHandler.doTest-seed#[F1EED2A27545430F]) [n:127.0.0.1:54068_    ] o.a.s.c.ZkController Register node as live in ZooKeeper:/live_nodes/127.0.0.1:54068_
   [junit4]   2> 3258140 INFO  (OverseerStateUpdate-72101762029453316-127.0.0.1:54068_-n_0000000000) [n:127.0.0.1:54068_    ] o.a.s.c.c.ZkStateReader Updated live nodes from ZooKeeper... (0) -> (1)
   [junit4]   2> 3258500 INFO  (TEST-TestSQLHandler.doTest-seed#[F1EED2A27545430F]) [n:127.0.0.1:54068_    ] o.a.s.m.r.SolrJmxReporter JMX monitoring for 'solr.node' (registry 'solr.node') enabled at server: com.sun.jmx.mbeanserver.JmxMBeanServer@18af8d
   [junit4]   2> 3258520 INFO  (TEST-TestSQLHandler.doTest-seed#[F1EED2A27545430F]) [n:127.0.0.1:54068_    ] o.a.s.m.r.SolrJmxReporter JMX monitoring for 'solr.jvm' (registry 'solr.jvm') enabled at server: com.sun.jmx.mbeanserver.JmxMBeanServer@18af8d
   [junit4]   2> 3258520 INFO  (TEST-TestSQLHandler.doTest-seed#[F1EED2A27545430F]) [n:127.0.0.1:54068_    ] o.a.s.m.r.SolrJmxReporter JMX monitoring for 'solr.jetty' (registry 'solr.jetty') enabled at server: com.sun.jmx.mbeanserver.JmxMBeanServer@18af8d
   [junit4]   2> 3258524 INFO  (TEST-TestSQLHandler.doTest-seed#[F1EED2A27545430F]) [n:127.0.0.1:54068_    ] o.a.s.c.CorePropertiesLocator Found 0 core definitions underneath C:\Users\jenkins\workspace\Lucene-Solr-7.x-Windows\solr\build\solr-core\test\J0\temp\solr.handler.TestSQLHandler_F1EED2A27545430F-001\control-001\cores
   [junit4]   2> 3258594 INFO  (zkConnectionManagerCallback-8300-thread-1) [    ] o.a.s.c.c.ConnectionManager zkClient has connected
   [junit4]   2> 3258596 INFO  (TEST-TestSQLHandler.doTest-seed#[F1EED2A27545430F]) [    ] o.a.s.c.c.ZkStateReader Updated live nodes from ZooKeeper... (0) -> (1)
   [junit4]   2> 3258597 INFO  (TEST-TestSQLHandler.doTest-seed#[F1EED2A27545430F]) [    ] o.a.s.c.s.i.ZkClientClusterStateProvider Cluster at 127.0.0.1:54024/solr ready
   [junit4]   2> 3258602 INFO  (qtp12518624-33636) [n:127.0.0.1:54068_    ] o.a.s.h.a.CollectionsHandler Invoked Collection Action :create with params replicationFactor=1&collection.configName=conf1&name=control_collection&nrtReplicas=1&action=CREATE&numShards=1&createNodeSet=127.0.0.1:54068_&wt=javabin&version=2 and sendToOCPQueue=true
   [junit4]   2> 3258604 INFO  (OverseerThreadFactory-12777-thread-1-processing-n:127.0.0.1:54068_) [n:127.0.0.1:54068_    ] o.a.s.c.a.c.CreateCollectionCmd Create collection control_collection
   [junit4]   2> 3258728 INFO  (qtp12518624-33643) [n:127.0.0.1:54068_    ] o.a.s.h.a.CoreAdminOperation core create command qt=/admin/cores&collection.configName=conf1&newCollection=true&name=control_collection_shard1_replica_n1&action=CREATE&numShards=1&collection=control_collection&shard=shard1&wt=javabin&version=2&replicaType=NRT
   [junit4]   2> 3258730 INFO  (qtp12518624-33643) [n:127.0.0.1:54068_    ] o.a.s.c.TransientSolrCoreCacheDefault Allocating transient cache for 4 transient cores
   [junit4]   2> 3258859 INFO  (zkCallback-8293-thread-1-processing-n:127.0.0.1:54068_) [n:127.0.0.1:54068_    ] o.a.s.c.c.ZkStateReader A cluster state change: [WatchedEvent state:SyncConnected type:NodeDataChanged path:/collections/control_collection/state.json] for collection [control_collection] has occurred - updating... (live nodes size: [1])
   [junit4]   2> 3259800 INFO  (qtp12518624-33643) [n:127.0.0.1:54068_ c:control_collection s:shard1  x:control_collection_shard1_replica_n1] o.a.s.c.SolrConfig Using Lucene MatchVersion: 7.3.0
   [junit4]   2> 3259815 INFO  (qtp12518624-33643) [n:127.0.0.1:54068_ c:control_collection s:shard1  x:control_collection_shard1_replica_n1] o.a.s.s.IndexSchema [control_collection_shard1_replica_n1] Schema name=test
   [junit4]   2> 3259934 WARN  (qtp12518624-33643) [n:127.0.0.1:54068_ c:control_collection s:shard1  x:control_collection_shard1_replica_n1] o.a.s.s.IndexSchema Field lowerfilt1and2 is not multivalued and destination for multiple copyFields (2)
   [junit4]   2> 3259934 WARN  (qtp12518624-33643) [n:127.0.0.1:54068_ c:control_collection s:shard1  x:control_collection_shard1_replica_n1] o.a.s.s.IndexSchema Field text is not multivalued and destination for multiple copyFields (3)
   [junit4]   2> 3259935 INFO  (qtp12518624-33643) [n:127.0.0.1:54068_ c:control_collection s:shard1  x:control_collection_shard1_replica_n1] o.a.s.s.IndexSchema Loaded schema test/1.6 with uniqueid field id
   [junit4]   2> 3259935 INFO  (qtp12518624-33643) [n:127.0.0.1:54068_ c:control_collection s:shard1  x:control_collection_shard1_replica_n1] o.a.s.c.CoreContainer Creating SolrCore 'control_collection_shard1_replica_n1' using configuration from collection control_collection, trusted=true
   [junit4]   2> 3259937 INFO  (qtp12518624-33643) [n:127.0.0.1:54068_ c:control_collection s:shard1  x:control_collection_shard1_replica_n1] o.a.s.m.r.SolrJmxReporter JMX monitoring for 'solr.core.control_collection.shard1.replica_n1' (registry 'solr.core.control_collection.shard1.replica_n1') enabled at server: com.sun.jmx.mbeanserver.JmxMBeanServer@18af8d
   [junit4]   2> 3259938 INFO  (qtp12518624-33643) [n:127.0.0.1:54068_ c:control_collection s:shard1  x:control_collection_shard1_replica_n1] o.a.s.c.SolrCore solr.RecoveryStrategy.Builder
   [junit4]   2> 3259938 INFO  (qtp12518624-33643) [n:127.0.0.1:54068_ c:control_collection s:shard1  x:control_collection_shard1_replica_n1] o.a.s.c.SolrCore [[control_collection_shard1_replica_n1] ] Opening new SolrCore at [C:\Users\jenkins\workspace\Lucene-Solr-7.x-Windows\solr\build\solr-core\test\J0\temp\solr.handler.TestSQLHandler_F1EED2A27545430F-001\control-001\cores\control_collection_shard1_replica_n1], dataDir=[C:\Users\jenkins\workspace\Lucene-Solr-7.x-Windows\solr\build\solr-core\test\J0\temp\solr.handler.TestSQLHandler_F1EED2A27545430F-001\control-001\cores\control_collection_shard1_replica_n1\data\]
   [junit4]   2> 3260092 INFO  (qtp12518624-33643) [n:127.0.0.1:54068_ c:control_collection s:shard1  x:control_collection_shard1_replica_n1] o.a.s.u.UpdateHandler Using UpdateLog implementation: org.apache.solr.update.UpdateLog
   [junit4]   2> 3260092 INFO  (qtp12518624-33643) [n:127.0.0.1:54068_ c:control_collection s:shard1  x:control_collection_shard1_replica_n1] o.a.s.u.UpdateLog Initializing UpdateLog: dataDir= defaultSyncLevel=FLUSH numRecordsToKeep=100 maxNumLogsToKeep=10 numVersionBuckets=65536
   [junit4]   2> 3260096 INFO  (qtp12518624-33643) [n:127.0.0.1:54068_ c:control_collection s:shard1  x:control_collection_shard1_replica_n1] o.a.s.u.CommitTracker Hard AutoCommit: disabled
   [junit4]   2> 3260096 INFO  (qtp12518624-33643) [n:127.0.0.1:54068_ c:control_collection s:shard1  x:control_collection_shard1_replica_n1] o.a.s.u.CommitTracker Soft AutoCommit: disabled
   [junit4]   2> 3260098 INFO  (qtp12518624-33643) [n:127.0.0.1:54068_ c:control_collection s:shard1  x:control_collection_shard1_replica_n1] o.a.s.s.SolrIndexSearcher Opening [Searcher@1fa7b0b[control_collection_shard1_replica_n1] main]
   [junit4]   2> 3260100 INFO  (qtp12518624-33643) [n:127.0.0.1:54068_ c:control_collection s:shard1  x:control_collection_shard1_replica_n1] o.a.s.r.ManagedResourceStorage Configured ZooKeeperStorageIO with znodeBase: /configs/conf1
   [junit4]   2> 3260101 INFO  (qtp12518624-33643) [n:127.0.0.1:54068_ c:control_collection s:shard1  x:control_collection_shard1_replica_n1] o.a.s.r.ManagedResourceStorage Loaded null at path _rest_managed.json using ZooKeeperStorageIO:path=/configs/conf1
   [junit4]   2> 3260103 INFO  (searcherExecutor-12780-thread-1-processing-n:127.0.0.1:54068_ x:control_collection_shard1_replica_n1 s:shard1 c:control_collection) [n:127.0.0.1:54068_ c:control_collection s:shard1  x:control_collection_shard1_replica_n1] o.a.s.c.SolrCore [control_collection_shard1_replica_n1] Registered new searcher Searcher@1fa7b0b[control_collection_shard1_replica_n1] main{ExitableDirectoryReader(UninvertingDirectoryReader())}
   [junit4]   2> 3260103 INFO  (qtp12518624-33643) [n:127.0.0.1:54068_ c:control_collection s:shard1  x:control_collection_shard1_replica_n1] o.a.s.u.UpdateLog Could not find max version in index or recent updates, using new clock 1594434781676830720
   [junit4]   2> 3260110 INFO  (qtp12518624-33643) [n:127.0.0.1:54068_ c:control_collection s:shard1  x:control_collection_shard1_replica_n1] o.a.s.c.ZkShardTerms Successful update terms at /collections/control_collection/terms/shard1 to Terms{values={core_node2=0}, version=0}
   [junit4]   2> 3260114 INFO  (qtp12518624-33643) [n:127.0.0.1:54068_ c:control_collection s:shard1  x:control_collection_shard1_replica_n1] o.a.s.c.ShardLeaderElectionContext Enough replicas found to continue.
   [junit4]   2> 3260114 INFO  (qtp12518624-33643) [n:127.0.0.1:54068_ c:control_collection s:shard1  x:control_collection_shard1_replica_n1] o.a.s.c.ShardLeaderElectionContext I may be the new leader - try and sync
   [junit4]   2> 3260114 INFO  (qtp12518624-33643) [n:127.0.0.1:54068_ c:control_collection s:shard1  x:control_collection_shard1_replica_n1] o.a.s.c.SyncStrategy Sync replicas to http://127.0.0.1:54068/control_collection_shard1_replica_n1/
   [junit4]   2> 3260114 INFO  (qtp12518624-33643) [n:127.0.0.1:54068_ c:control_collection s:shard1  x:control_collection_shard1_replica_n1] o.a.s.c.SyncStrategy Sync Success - now sync replicas to me
   [junit4]   2> 3260114 INFO  (qtp12518624-33643) [n:127.0.0.1:54068_ c:control_collection s:shard1  x:control_collection_shard1_replica_n1] o.a.s.c.SyncStrategy http://127.0.0.1:54068/control_collection_shard1_replica_n1/ has no replicas
   [junit4]   2> 3260114 INFO  (qtp12518624-33643) [n:127.0.0.1:54068_ c:control_collection s:shard1  x:control_collection_shard1_replica_n1] o.a.s.c.ShardLeaderElectionContext Found all replicas participating in election, clear LIR
   [junit4]   2> 3260119 INFO  (qtp12518624-33643) [n:127.0.0.1:54068_ c:control_collection s:shard1  x:control_collection_shard1_replica_n1] o.a.s.c.ShardLeaderElectionContext I am the new leader: http://127.0.0.1:54068/control_collection_shard1_replica_n1/ shard1
   [junit4]   2> 3260225 INFO  (zkCallback-8293-thread-1-processing-n:127.0.0.1:54068_) [n:127.0.0.1:54068_    ] o.a.s.c.c.ZkStateReader A cluster state change: [WatchedEvent state:SyncConnected type:NodeDataChanged path:/collections/control_collection/state.json] for collection [control_collection] has occurred - updating... (live nodes size: [1])
   [junit4]   2> 3260276 INFO  (qtp12518624-33643) [n:127.0.0.1:54068_ c:control_collection s:shard1  x:control_collection_shard1_replica_n1] o.a.s.c.ZkController I am the leader, no recovery necessary
   [junit4]   2> 3260282 INFO  (qtp12518624-33643) [n:127.0.0.1:54068_ c:control_collection s:shard1  x:control_collection_shard1_replica_n1] o.a.s.s.HttpSolrCall [admin] webapp=null path=/admin/cores params={qt=/admin/cores&collection.configName=conf1&newCollection=true&name=control_collection_shard1_replica_n1&action=CREATE&numShards=1&collection=control_collection&shard=shard1&wt=javabin&version=2&replicaType=NRT} status=0 QTime=1554
   [junit4]   2> 3260291 INFO  (qtp12518624-33636) [n:127.0.0.1:54068_    ] o.a.s.h.a.CollectionsHandler Wait for new collection to be active for at most 30 seconds. Check all shard replicas
   [junit4]   2> 3260393 INFO  (zkCallback-8293-thread-1-processing-n:127.0.0.1:54068_) [n:127.0.0.1:54068_    ] o.a.s.c.c.ZkStateReader A cluster state change: [WatchedEvent state:SyncConnected type:NodeDataChanged path:/collections/control_collection/state.json] for collection [control_collection] has occurred - updating... (live nodes size: [1])
   [junit4]   2> 3260607 INFO  (OverseerCollectionConfigSetProcessor-72101762029453316-127.0.0.1:54068_-n_0000000000) [n:127.0.0.1:54068_    ] o.a.s.c.OverseerTaskQueue Response ZK path: /overseer/collection-queue-work/qnr-0000000000 doesn't exist.  Requestor may have disconnected from ZooKeeper
   [junit4]   2> 3261291 INFO  (qtp12518624-33636) [n:127.0.0.1:54068_    ] o.a.s.s.HttpSolrCall [admin] webapp=null path=/admin/collections params={replicationFactor=1&collection.configName=conf1&name=control_collection&nrtReplicas=1&action=CREATE&numShards=1&createNodeSet=127.0.0.1:54068_&wt=javabin&version=2} status=0 QTime=2689
   [junit4]   2> 3261292 WARN  (NIOServerCxn.Factory:0.0.0.0/0.0.0.0:0) [    ] o.a.z.s.NIOServerCnxn Unable to read additional data from client sessionid 0x100282ba9720005, likely client has closed socket
   [junit4]   2> 3261304 INFO  (zkConnectionManagerCallback-8304-thread-1) [    ] o.a.s.c.c.ConnectionManager zkClient has connected
   [junit4]   2> 3261305 INFO  (TEST-TestSQLHandler.doTest-seed#[F1EED2A27545430F]) [    ] o.a.s.c.c.ZkStateReader Updated live nodes from ZooKeeper... (0) -> (1)
   [junit4]   2> 3261307 INFO  (TEST-TestSQLHandler.doTest-seed#[F1EED2A27545430F]) [    ] o.a.s.c.s.i.ZkClientClusterStateProvider Cluster at 127.0.0.1:54024/solr ready
   [junit4]   2> 3261307 INFO  (TEST-TestSQLHandler.doTest-seed#[F1EED2A27545430F]) [    ] o.a.s.c.ChaosMonkey monkey: init - expire sessions:false cause connection loss:false
   [junit4]   2> 3261311 INFO  (qtp12518624-33643) [n:127.0.0.1:54068_    ] o.a.s.h.a.CollectionsHandler Invoked Collection Action :create with params replicationFactor=1&collection.configName=conf1&name=collection1&nrtReplicas=1&action=CREATE&numShards=2&createNodeSet=&stateFormat=1&wt=javabin&version=2 and sendToOCPQueue=true
   [junit4]   2> 3261315 INFO  (OverseerThreadFactory-12777-thread-2-processing-n:127.0.0.1:54068_) [n:127.0.0.1:54068_    ] o.a.s.c.a.c.CreateCollectionCmd Create collection collection1
   [junit4]   2> 3261317 WARN  (OverseerThreadFactory-12777-thread-2-processing-n:127.0.0.1:54068_) [n:127.0.0.1:54068_    ] o.a.s.c.a.c.CreateCollectionCmd It is unusual to create a collection (collection1) without cores.
   [junit4]   2> 3261527 INFO  (qtp12518624-33643) [n:127.0.0.1:54068_    ] o.a.s.h.a.CollectionsHandler Wait for new collection to be active for at most 30 seconds. Check all shard replicas
   [junit4]   2> 3261528 INFO  (qtp12518624-33643) [n:127.0.0.1:54068_    ] o.a.s.s.HttpSolrCall [admin] webapp=null path=/admin/collections params={replicationFactor=1&collection.configName=conf1&name=collection1&nrtReplicas=1&action=CREATE&numShards=2&createNodeSet=&stateFormat=1&wt=javabin&version=2} status=0 QTime=216
   [junit4]   2> 3262418 INFO  (TEST-TestSQLHandler.doTest-seed#[F1EED2A27545430F]) [    ] o.a.s.c.AbstractFullDistribZkTestBase create jetty 1 in directory C:\Users\jenkins\workspace\Lucene-Solr-7.x-Windows\solr\build\solr-core\test\J0\temp\solr.handler.TestSQLHandler_F1EED2A27545430F-001\shard-1-001 of type NRT
   [junit4]   2> 3262419 INFO  (TEST-TestSQLHandler.doTest-seed#[F1EED2A27545430F]) [    ] o.e.j.s.Server jetty-9.4.8.v20171121, build timestamp: 2017-11-21T18:27:37-03:00, git hash: 82b8fb23f757335bb3329d540ce37a2a2615f0a8
   [junit4]   2> 3262419 INFO  (TEST-TestSQLHandler.doTest-seed#[F1EED2A27545430F]) [    ] o.e.j.s.session DefaultSessionIdManager workerName=node0
   [junit4]   2> 3262419 INFO  (TEST-TestSQLHandler.doTest-seed#[F1EED2A27545430F]) [    ] o.e.j.s.session No SessionScavenger set, using defaults
   [junit4]   2> 3262419 INFO  (TEST-TestSQLHandler.doTest-seed#[F1EED2A27545430F]) [    ] o.e.j.s.session Scavenging every 660000ms
   [junit4]   2> 3262420 INFO  (TEST-TestSQLHandler.doTest-seed#[F1EED2A27545430F]) [    ] o.e.j.s.h.ContextHandler Started o.e.j.s.ServletContextHandler@1d52849{/,null,AVAILABLE}
   [junit4]   2> 3262421 INFO  (TEST-TestSQLHandler.doTest-seed#[F1EED2A27545430F]) [    ] o.e.j.s.AbstractConnector Started ServerConnector@167ccc7{HTTP/1.1,[http/1.1]}{127.0.0.1:54097}
   [junit4]   2> 3262421 INFO  (TEST-TestSQLHandler.doTest-seed#[F1EED2A27545430F]) [    ] o.e.j.s.Server Started @3269974ms
   [junit4]   2> 3262421 INFO  (TEST-TestSQLHandler.doTest-seed#[F1EED2A27545430F]) [    ] o.a.s.c.s.e.JettySolrRunner Jetty properties: {solr.data.dir=C:\Users\jenkins\workspace\Lucene-Solr-7.x-Windows\solr\build\solr-core\test\J0\temp\solr.handler.TestSQLHandler_F1EED2A27545430F-001\tempDir-001/jetty1, replicaType=NRT, solrconfig=solrconfig.xml, hostContext=/, hostPort=54097, coreRootDirectory=C:\Users\jenkins\workspace\Lucene-Solr-7.x-Windows\solr\build\solr-core\test\J0\..\..\..\..\..\..\..\..\..\Users\jenkins\workspace\Lucene-Solr-7.x-Windows\solr\build\solr-core\test\J0\temp\solr.handler.TestSQLHandler_F1EED2A27545430F-001\shard-1-001\cores}
   [junit4]   2> 3262421 ERROR (TEST-TestSQLHandler.doTest-seed#[F1EED2A27545430F]) [    ] o.a.s.u.StartupLoggingUtils Missing Java Option solr.log.dir. Logging may be missing or incomplete.
   [junit4]   2> 3262422 INFO  (TEST-TestSQLHandler.doTest-seed#[F1EED2A27545430F]) [    ] o.a.s.s.SolrDispatchFilter  ___      _       Welcome to Apache Solr™ version 7.3.0
   [junit4]   2> 3262422 INFO  (TEST-TestSQLHandler.doTest-seed#[F1EED2A27545430F]) [    ] o.a.s.s.SolrDispatchFilter / __| ___| |_ _   Starting in cloud mode on port null
   [junit4]   2> 3262422 INFO  (TEST-TestSQLHandler.doTest-seed#[F1EED2A27545430F]) [    ] o.a.s.s.SolrDispatchFilter \__ \/ _ \ | '_|  Install dir: null
   [junit4]   2> 3262422 INFO  (TEST-TestSQLHandler.doTest-seed#[F1EED2A27545430F]) [    ] o.a.s.s.SolrDispatchFilter |___/\___/_|_|    Start time: 2018-03-09T04:58:22.789Z
   [junit4]   2> 3262426 INFO  (zkConnectionManagerCallback-8306-thread-1) [    ] o.a.s.c.c.ConnectionManager zkClient has connected
   [junit4]   2> 3262427 INFO  (TEST-TestSQLHandler.doTest-seed#[F1EED2A27545430F]) [    ] o.a.s.s.SolrDispatchFilter Loading solr.xml from SolrHome (not found in ZooKeeper)
   [junit4]   2> 3262427 INFO  (TEST-TestSQLHandler.doTest-seed#[F1EED2A27545430F]) [    ] o.a.s.c.SolrXmlConfig Loading container configuration from C:\Users\jenkins\workspace\Lucene-Solr-7.x-Windows\solr\build\solr-core\test\J0\temp\solr.handler.TestSQLHandler_F1EED2A27545430F-001\shard-1-001\solr.xml
   [junit4]   2> 3262435 INFO  (TEST-TestSQLHandler.doTest-seed#[F1EED2A27545430F]) [    ] o.a.s.c.SolrXmlConfig Configuration parameter autoReplicaFailoverWorkLoopDelay is ignored
   [junit4]   2> 3262435 INFO  (TEST-TestSQLHandler.doTest-seed#[F1EED2A27545430F]) [    ] o.a.s.c.SolrXmlConfig Configuration parameter autoReplicaFailoverBadNodeExpiration is ignored
   [junit4]   2> 3262436 INFO  (TEST-TestSQLHandler.doTest-seed#[F1EED2A27545430F]) [    ] o.a.s.c.SolrXmlConfig MBean server found: com.sun.jmx.mbeanserver.JmxMBeanServer@18af8d, but no JMX reporters were configured - adding default JMX reporter.
   [junit4]   2> 3262445 INFO  (TEST-TestSQLHandler.doTest-seed#[F1EED2A27545430F]) [    ] o.a.s.c.ZkContainer Zookeeper client=127.0.0.1:54024/solr
   [junit4]   2> 3262448 INFO  (zkConnectionManagerCallback-8310-thread-1) [    ] o.a.s.c.c.ConnectionManager zkClient has connected
   [junit4]   2> 3262453 INFO  (zkConnectionManagerCallback-8312-thread-1-processing-n:127.0.0.1:54097_) [n:127.0.0.1:54097_    ] o.a.s.c.c.ConnectionManager zkClient has connected
   [junit4]   2> 3262463 INFO  (TEST-TestSQLHandler.doTest-seed#[F1EED2A27545430F]) [n:127.0.0.1:54097_    ] o.a.s.c.c.ZkStateReader Updated live nodes from ZooKeeper... (0) -> (1)
   [junit4]   2> 3262467 INFO  (TEST-TestSQLHandler.doTest-seed#[F1EED2A27545430F]) [n:127.0.0.1:54097_    ] o.a.s.c.Overseer Overseer (id=null) closing
   [junit4]   2> 3262470 INFO  (TEST-TestSQLHandler.doTest-seed#[F1EED2A27545430F]) [n:127.0.0.1:54097_    ] o.a.s.c.ZkController Register node as live in ZooKeeper:/live_nodes/127.0.0.1:54097_
   [junit4]   2> 3262471 INFO  (zkCallback-8303-thread-1) [    ] o.a.s.c.c.ZkStateReader Updated live nodes from ZooKeeper... (1) -> (2)
   [junit4]   2> 3262471 INFO  (zkCallback-8293-thread-2-processing-n:127.0.0.1:54068_) [n:127.0.0.1:54068_    ] o.a.s.c.c.ZkStateReader Updated live nodes from ZooKeeper... (1) -> (2)
   [junit4]   2> 3262472 INFO  (zkCallback-8311-thread-1-processing-n:127.0.0.1:54097_) [n:127.0.0.1:54097_    ] o.a.s.c.c.ZkStateReader Updated live nodes from ZooKeeper... (1) -> (2)
   [junit4]   2> 3262681 INFO  (TEST-TestSQLHandler.doTest-seed#[F1EED2A27545430F]) [n:127.0.0.1:54097_    ] o.a.s.m.r.SolrJmxReporter JMX monitoring for 'solr.node' (registry 'solr.node') enabled at server: com.sun.jmx.mbeanserver.JmxMBeanServer@18af8d
   [junit4]   2> 3262712 INFO  (TEST-TestSQLHandler.doTest-seed#[F1EED2A27545430F]) [n:127.0.0.1:54097_    ] o.a.s.m.r.SolrJmxReporter JMX monitoring for 'solr.jvm' (registry 'solr.jvm') enabled at server: com.sun.jmx.mbeanserver.JmxMBeanServer@18af8d
   [junit4]   2> 3262713 INFO  (TEST-TestSQLHandler.doTest-seed#[F1EED2A27545430F]) [n:127.0.0.1:54097_    ] o.a.s.m.r.SolrJmxReporter JMX monitoring for 'solr.jetty' (registry 'solr.jetty') enabled at server: com.sun.jmx.mbeanserver.JmxMBeanServer@18af8d
   [junit4]   2> 3262717 INFO  (TEST-TestSQLHandler.doTest-seed#[F1EED2A27545430F]) [n:127.0.0.1:54097_    ] o.a.s.c.CorePropertiesLocator Found 0 core definitions underneath C:\Users\jenkins\workspace\Lucene-Solr-7.x-Windows\solr\build\solr-core\test\J0\..\..\..\..\..\..\..\..\..\Users\jenkins\workspace\Lucene-Solr-7.x-Windows\solr\build\solr-core\test\J0\temp\solr.handler.TestSQLHandler_F1EED2A27545430F-001\shard-1-001\cores
   [junit4]   2> 3262787 INFO  (qtp12518624-33646) [n:127.0.0.1:54068_    ] o.a.s.h.a.CollectionsHandler Invoked Collection Action :addreplica with params node=127.0.0.1:54097_&action=ADDREPLICA&collection=collection1&shard=shard2&type=NRT&wt=javabin&version=2 and sendToOCPQueue=true
   [junit4]   2> 3262796 INFO  (OverseerCollectionConfigSetProcessor-72101762029453316-127.0.0.1:54068_-n_0000000000) [n:127.0.0.1:54068_    ] o.a.s.c.OverseerTaskQueue Response ZK path: /overseer/collection-queue-work/qnr-0000000002 doesn't exist.  Requestor may have disconnected from ZooKeeper
   [junit4]   2> 3262797 INFO  (OverseerThreadFactory-12777-thread-3-processing-n:127.0.0.1:54068_) [n:127.0.0.1:54068_    ] o.a.s.c.a.c.AddReplicaCmd Node Identified 127.0.0.1:54097_ for creating new replica
   [junit4]   2> 3262808 INFO  (qtp25207119-33688) [n:127.0.0.1:54097_    ] o.a.s.h.a.CoreAdminOperation core create command qt=/admin/cores&collection.configName=conf1&name=collection1_shard2_replica_n41&action=CREATE&collection=collection1&shard=shard2&wt=javabin&version=2&replicaType=NRT
   [junit4]   2> 3262810 INFO  (qtp25207119-33688) [n:127.0.0.1:54097_    ] o.a.s.c.TransientSolrCoreCacheDefault Allocating transient cache for 4 transient cores
   [junit4]   2> 3263873 INFO  (qtp25207119-33688) [n:127.0.0.1:54097_ c:collection1 s:shard2  x:collection1_shard2_replica_n41] o.a.s.c.SolrConfig Using Lucene MatchVersion: 7.3.0
   [junit4]   2> 3263890 INFO  (qtp25207119-33688) [n:127.0.0.1:54097_ c:collection1 s:shard2  x:collection1_shard2_replica_n41] o.a.s.s.IndexSchema [collection1_shard2_replica_n41] Schema name=test
   [junit4]   2> 3264014 WARN  (qtp25207119-33688) [n:127.0.0.1:54097_ c:collection1 s:shard2  x:collection1_shard2_replica_n41] o.a.s.s.IndexSchema Field lowerfilt1and2 is not multivalued and destination for multiple copyFields (2)
   [junit4]   2> 3264014 WARN  (qtp25207119-33688) [n:127.0.0.1:54097_ c:collection1 s:shard2  x:collection1_shard2_replica_n41] o.a.s.s.IndexSchema Field text is not multivalued and destination for multiple copyFields (3)
   [junit4]   2> 3264014 INFO  (qtp25207119-33688) [n:127.0.0.1:54097_ c:collection1 s:shard2  x:collection1_shard2_replica_n41] o.a.s.s.IndexSchema Loaded schema test/1.6 with uniqueid field id
   [junit4]   2> 3264014 INFO  (qtp25207119-33688) [n:127.0.0.1:54097_ c:collection1 s:shard2  x:collection1_shard2_replica_n41] o.a.s.c.CoreContainer Creating SolrCore 'collection1_shard2_replica_n41' using configuration from collection collection1, trusted=true
   [junit4]   2> 3264016 INFO  (qtp25207119-33688) [n:127.0.0.1:54097_ c:collection1 s:shard2  x:collection1_shard2_replica_n41] o.a.s.m.r.SolrJmxReporter JMX monitoring for 'solr.core.collection1.shard2.replica_n41' (registry 'solr.core.collection1.shard2.replica_n41') enabled at server: com.sun.jmx.mbeanserver.JmxMBeanServer@18af8d
   [junit4]   2> 3264016 INFO  (qtp25207119-33688) [n:127.0.0.1:54097_ c:collection1 s:shard2  x:collection1_shard2_replica_n41] o.a.s.c.SolrCore solr.RecoveryStrategy.Builder
   [junit4]   2> 3264016 INFO  (qtp25207119-33688) [n:127.0.0.1:54097_ c:collection1 s:shard2  x:collection1_shard2_replica_n41] o.a.s.c.SolrCore [[collection1_shard2_replica_n41] ] Opening new SolrCore at [C:\Users\jenkins\workspace\Lucene-Solr-7.x-Windows\solr\build\solr-core\test\J0\temp\solr.handler.TestSQLHandler_F1EED2A27545430F-001\shard-1-001\cores\collection1_shard2_replica_n41], dataDir=[C:\Users\jenkins\workspace\Lucene-Solr-7.x-Windows\solr\build\solr-core\test\J0\..\..\..\..\..\..\..\..\..\Users\jenkins\workspace\Lucene-Solr-7.x-Windows\solr\build\solr-core\test\J0\temp\solr.handler.TestSQLHandler_F1EED2A27545430F-001\shard-1-001\cores\collection1_shard2_replica_n41\data\]
   [junit4]   2> 3264240 INFO  (qtp25207119-33688) [n:127.0.0.1:54097_ c:collection1 s:shard2  x:collection1_shard2_replica_n41] o.a.s.u.UpdateHandler Using UpdateLog implementation: org.apache.solr.update.UpdateLog
   [junit4]   2> 3264240 INFO  (qtp25207119-33688) [n:127.0.0.1:54097_ c:collection1 s:shard2  x:collection1_shard2_replica_n41] o.a.s.u.UpdateLog Initializing UpdateLog: dataDir= defaultSyncLevel=FLUSH numRecordsToKeep=100 maxNumLogsToKeep=10 numVersionBuckets=65536
   [junit4]   2> 3264240 INFO  (qtp25207119-33688) [n:127.0.0.1:54097_ c:collection1 s:shard2  x:collection1_shard2_replica_n41] o.a.s.u.CommitTracker Hard AutoCommit: disabled
   [junit4]   2> 3264240 INFO  (qtp25207119-33688) [n:127.0.0.1:54097_ c:collection1 s:shard2  x:collection1_shard2_replica_n41] o.a.s.u.CommitTracker Soft AutoCommit: disabled
   [junit4]   2> 3264240 INFO  (qtp25207119-33688) [n:127.0.0.1:54097_ c:collection1 s:shard2  x:collection1_shard2_replica_n41] o.a.s.s.SolrIndexSearcher Opening [Searcher@1db696c[collection1_shard2_replica_n41] main]
   [junit4]   2> 3264260 INFO  (qtp25207119-33688) [n:127.0.0.1:54097_ c:collection1 s:shard2  x:collection1_shard2_replica_n41] o.a.s.r.ManagedResourceStorage Configured ZooKeeperStorageIO with znodeBase: /configs/conf1
   [junit4]   2> 3264261 INFO  (qtp25207119-33688) [n:127.0.0.1:54097_ c:collection1 s:shard2  x:collection1_shard2_replica_n41] o.a.s.r.ManagedResourceStorage Loaded null at path _rest_managed.json using ZooKeeperStorageIO:path=/configs/conf1
   [junit4]   2> 3264263 INFO  (qtp25207119-33688) [n:127.0.0.1:54097_ c:collection1 s:shard2  x:collection1_shard2_replica_n41] o.a.s.u.UpdateLog Could not find max version in index or recent updates, using new clock 1594434786038906880
   [junit4]   2> 3264263 INFO  (searcherExecutor-12790-thread-1-processing-n:127.0.0.1:54097_ x:collection1_shard2_replica_n41 s:shard2 c:collection1) [n:127.0.0.1:54097_ c:collection1 s:shard2  x:collection1_shard2_replica_n41] o.a.s.c.SolrCore [collection1_shard2_replica_n41] Registered new searcher Searcher@1db696c[collection1_shard2_replica_n41] main{ExitableDirectoryReader(UninvertingDirectoryReader())}
   [junit4]   2> 3264274 INFO  (qtp25207119-33688) [n:127.0.0.1:54097_ c:collection1 s:shard2  x:collection1_shard2_replica_n41] o.a.s.c.ZkShardTerms Successful update terms at /collections/collection1/terms/shard2 to Terms{values={core_node42=0}, version=0}
   [junit4]   2> 3264282 INFO  (qtp25207119-33688) [n:127.0.0.1:54097_ c:collection1 s:shard2  x:collection1_shard2_replica_n41] o.a.s.c.ShardLeaderElectionContext Enough replicas found to continue.
   [junit4]   2> 3264282 INFO  (qtp25207119-33688) [n:127.0.0.1:54097_ c:collection1 s:shard2  x:collection1_shard2_replica_n41] o.a.s.c.ShardLeaderElectionContext I may be the new leader - try and sync
   [junit4]   2> 3264282 INFO  (qtp25207119-33688) [n:127.0.0.1:54097_ c:collection1 s:shard2  x:collection1_shard2_replica_n41] o.a.s.c.SyncStrategy Sync replicas to http://127.0.0.1:54097/collection1_shard2_replica_n41/
   [junit4]   2> 3264282 INFO  (qtp25207119-33688) [n:127.0.0.1:54097_ c:collection1 s:shard2  x:collection1_shard2_replica_n41] o.a.s.c.SyncStrategy Sync Success - now sync replicas to me
   [junit4]   2> 3264282 INFO  (qtp25207119-33688) [n:127.0.0.1:54097_ c:collection1 s:shard2  x:collection1_shard2_replica_n41] o.a.s.c.SyncStrategy http://127.0.0.1:54097/collection1_shard2_replica_n41/ has no replicas
   [junit4]   2> 3264282 INFO  (qtp25207119-33688) [n:127.0.0.1:54097_ c:collection1 s:shard2  x:collection1_shard2_replica_n41] o.a.s.c.ShardLeaderElectionContext Found all replicas participating in election, clear LIR
   [junit4]   2> 3264292 INFO  (qtp25207119-33688) [n:127.0.0.1:54097_ c:collection1 s:shard2  x:collection1_shard2_replica_n41] o.a.s.c.ShardLeaderElectionContext I am the new leader: http://127.0.0.1:54097/collection1_shard2_replica_n41/ shard2
   [junit4]   2> 3264400 INFO  (qtp25207119-33688) [n:127.0.0.1:54097_ c:collection1 s:shard2  x:collection1_shard2_replica_n41] o.a.s.c.ZkController I am the leader, no recovery necessary
   [junit4]   2> 3264403 INFO  (qtp25207119-33688) [n:127.0.0.1:54097_ c:collection1 s:shard2  x:collection1_shard2_replica_n41] o.a.s.s.HttpSolrCall [admin] webapp=null path=/admin/cores params={qt=/admin/cores&collection.configName=conf1&name=collection1_shard2_replica_n41&action=CREATE&collection=collection1&shard=shard2&wt=javabin&version=2&replicaType=NRT} status=0 QTime=1596
   [junit4]   2> 3264408 INFO  (qtp12518624-33646) [n:127.0.0.1:54068_    ] o.a.s.s.HttpSolrCall [admin] webapp=null path=/admin/collections params={node=127.0.0.1:54097_&action=ADDREPLICA&collection=collection1&shard=shard2&type=NRT&wt=javabin&version=2} status=0 QTime=1621
   [junit4]   2> 3264804 INFO  (OverseerCollectionConfigSetProcessor-72101762029453316-127.0.0.1:54068_-n_0000000000) [n:127.0.0.1:54068_    ] o.a.s.c.OverseerTaskQueue Response ZK path: /overseer/collection-queue-work/qnr-0000000004 doesn't exist.  Requestor may have disconnected from ZooKeeper
   [junit4]   2> 3264962 INFO  (TEST-TestSQLHandler.doTest-seed#[F1EED2A27545430F]) [    ] o.a.s.c.AbstractFullDistribZkTestBase create jetty 2 in directory C:\Users\jenkins\workspace\Lucene-Solr-7.x-Windows\solr\build\solr-core\test\J0\temp\solr.handler.TestSQLHandler_F1EED2A27545430F-001\shard-2-001 of type NRT
   [junit4]   2> 3264964 INFO  (TEST-TestSQLHandler.doTest-seed#[F1EED2A27545430F]) [    ] o.e.j.s.Server jetty-9.4.8.v20171121, build timestamp: 2017-11-21T18:27:37-03:00, git hash: 82b8fb23f757335bb3329d540ce37a2a2615f0a8
   [junit4]   2> 3264965 INFO  (TEST-TestSQLHandler.doTest-seed#[F1EED2A27545430F]) [    ] o.e.j.s.session DefaultSessionIdManager workerName=node0
   [junit4]   2> 3264965 INFO  (TEST-TestSQLHandler.doTest-seed#[F1EED2A27545430F]) [    ] o.e.j.s.session No SessionScavenger set, using defaults
   [junit4]   2> 3264965 INFO  (TEST-TestSQLHandler.doTest-seed#[F1EED2A27545430F]) [    ] o.e.j.s.session Scavenging every 660000ms
   [junit4]   2> 3264965 INFO  (TEST-TestSQLHandler.doTest-seed#[F1EED2A27545430F]) [    ] o.e.j.s.h.ContextHandler Started o.e.j.s.ServletContextHandler@1658a9d{/,null,AVAILABLE}
   [junit4]   2> 3264966 INFO  (TEST-TestSQLHandler.doTest-seed#[F1EED2A27545430F]) [    ] o.e.j.s.AbstractConnector Started ServerConnector@1f80319{HTTP/1.1,[http/1.1]}{127.0.0.1:54146}
   [junit4]   2> 3264966 INFO  (TEST-TestSQLHandler.doTest-seed#[F1EED2A27545430F]) [    ] o.e.j.s.Server Started @3272520ms
   [junit4]   2> 3264966 INFO  (TEST-TestSQLHandler.doTest-seed#[F1EED2A27545430F]) [    ] o.a.s.c.s.e.JettySolrRunner Jetty properties: {solr.data.dir=C:\Users\jenkins\workspace\Lucene-Solr-7.x-Windows\solr\build\solr-core\test\J0\temp\solr.handler.TestSQLHandler_F1EED2A27545430F-001\tempDir-001/jetty2, replicaType=NRT, solrconfig=solrconfig.xml, hostContext=/, hostPort=54146, coreRootDirectory=C:\Users\jenkins\workspace\Lucene-Solr-7.x-Windows\solr\build\solr-core\test\J0\..\..\..\..\..\..\..\..\..\Users\jenkins\workspace\Lucene-Solr-7.x-Windows\solr\build\solr-core\test\J0\temp\solr.handler.TestSQLHandler_F1EED2A27545430F-001\shard-2-001\cores}
   [junit4]   2> 3264966 ERROR (TEST-TestSQLHandler.doTest-seed#[F1EED2A27545430F]) [    ] o.a.s.u.StartupLoggingUtils Missing Java Option solr.log.dir. Logging may be missing or incomplete.
   [junit4]   2> 3264967 INFO  (TEST-TestSQLHandler.doTest-seed#[F1EED2A27545430F]) [    ] o.a.s.s.SolrDispatchFilter  ___      _       Welcome to Apache Solr™ version 7.3.0
   [junit4]   2> 3264967 INFO  (TEST-TestSQLHandler.doTest-seed#[F1EED2A27545430F]) [    ] o.a.s.s.SolrDispatchFilter / __| ___| |_ _   Starting in cloud mode on port null
   [junit4]   2> 3264967 INFO  (TEST-TestSQLHandler.doTest-seed#[F1EED2A27545430F]) [    ] o.a.s.s.SolrDispatchFilter \__ \/ _ \ | '_|  Install dir: null
   [junit4]   2> 3264967 INFO  (TEST-TestSQLHandler.doTest-seed#[F1EED2A27545430F]) [    ] o.a.s.s.SolrDispatchFilter |___/\___/_|_|    Start time: 2018-03-09T04:58:25.334Z
   [junit4]   2> 3264970 INFO  (zkConnectionManagerCallback-8316-thread-1) [    ] o.a.s.c.c.ConnectionManager zkClient has connected
   [junit4]   2> 3264971 INFO  (TEST-TestSQLHandler.doTest-seed#[F1EED2A27545430F]) [    ] o.a.s.s.SolrDispatchFilter Loading solr.xml from SolrHome (not found in ZooKeeper)
   [junit4]   2> 3264971 INFO  (TEST-TestSQLHandler.doTest-seed#[F1EED2A27545430F]) [    ] o.a.s.c.SolrXmlConfig Loading container configuration from C:\Users\jenkins\workspace\Lucene-Solr-7.x-Windows\solr\build\solr-core\test\J0\temp\solr.handler.TestSQLHandler_F1EED2A27545430F-001\shard-2-001\solr.xml
   [junit4]   2> 3264979 INFO  (TEST-TestSQLHandler.doTest-seed#[F1EED2A27545430F]) [    ] o.a.s.c.SolrXmlConfig Configuration parameter autoReplicaFailoverWorkLoopDelay is ignored
   [junit4]   2> 3264979 INFO  (TEST-TestSQLHandler.doTest-seed#[F1EED2A27545430F]) [    ] o.a.s.c.SolrXmlConfig Configuration parameter autoReplicaFailoverBadNodeExpiration is ignored
   [junit4]   2> 3264980 INFO  (TEST-TestSQLHandler.doTest-seed#[F1EED2A27545430F]) [    ] o.a.s.c.SolrXmlConfig MBean server found: com.sun.jmx.mbeanserver.JmxMBeanServer@18af8d, but no JMX reporters were configured - adding default JMX reporter.
   [junit4]   2> 3264985 INFO  (TEST-TestSQLHandler.doTest-seed#[F1EED2A27545430F]) [    ] o.a.s.c.ZkContainer Zookeeper client=127.0.0.1:54024/solr
   [junit4]   2> 3264987 INFO  (zkConnectionManagerCallback-8320-thread-1) [    ] o.a.s.c.c.ConnectionManager zkClient has connected
   [junit4]   2> 3264988 WARN  (NIOServerCxn.Factory:0.0.0.0/0.0.0.0:0) [    ] o.a.z.s.NIOServerCnxn Unable to read additional data from client sessionid 0x100282ba972000b, likely client has closed socket
   [junit4]   2> 3264995 INFO  (zkConnectionManagerCallback-8322-thread-1-processing-n:127.0.0.1:54146_) [n:127.0.0.1:54146_    ] o.a.s.c.c.ConnectionManager zkClient has connected
   [junit4]   2> 3265003 INFO  (TEST-TestSQLHandler.doTest-seed#[F1EED2A27545430F]) [n:127.0.0.1:54146_    ] o.a.s.c.c.ZkStateReader Updated live nodes from ZooKeeper... (0) -> (2)
   [junit4]   2> 3265005 INFO  (TEST-TestSQLHandler.doTest-seed#[F1EED2A27545430F]) [n:127.0.0.1:54146_    ] o.a.s.c.Overseer Overseer (id=null) closing
   [junit4]   2> 3265006 INFO  (TEST-TestSQLHandler.doTest-seed#[F1EED2A27545430F]) [n:127.0.0.1:54146_    ] o.a.s.c.ZkController Register node as live in ZooKeeper:/live_nodes/127.0.0.1:54146_
   [junit4]   2> 3265008 INFO  (zkCallback-8303-thread-1) [    ] o.a.s.c.c.ZkStateReader Updated live nodes from ZooKeeper... (2) -> (3)
   [junit4]   2> 3265008 INFO  (zkCallback-8293-thread-2-processing-n:127.0.0.1:54068_) [n:127.0.0.1:54068_    ] o.a.s.c.c.ZkStateReader Updated live nodes from ZooKeeper... (2) -> (3)
   [junit4]   2> 3265008 INFO  (zkCallback-8311-thread-1-processing-n:127.0.0.1:54097_) [n:127.0.0.1:54097_    ] o.a.s.c.c.ZkStateReader Updated live nodes from ZooKeeper... (2) -> (3)
   [junit4]   2> 3265009 INFO  (zkCallback-8321-thread-1-processing-n:127.0.0.1:54146_) [n:127.0.0.1:54146_    ] o.a.s.c.c.ZkStateReader Updated live nodes from ZooKeeper... (2) -> (3)
   [junit4]   2> 3265160 INFO  (TEST-TestSQLHandler.doTest-seed#[F1EED2A27545430F]) [n:127.0.0.1:54146_    ] o.a.s.m.r.SolrJmxReporter JMX monitoring for 'solr.node' (registry 'solr.node') enabled at server: com.sun.jmx.mbeanserver.JmxMBeanServer@18af8d
   [junit4]   2> 3265174 INFO  (TEST-TestSQLHandler.doTest-seed#[F1EED2A27545430F]) [n:127.0.0.1:54146_    ] o.a.s.m.r.SolrJmxReporter JMX monitoring for 'solr.jvm' (registry 'solr.jvm') enabled at server: com.sun.jmx.mbeanserver.JmxMBeanServer@18af8d
   [junit4]   2> 3265175 INFO  (TEST-TestSQLHandler.doTest-seed#[F1EED2A27545430F]) [n:127.0.0.1:54146_    ] o.a.s.m.r.SolrJmxReporter JMX monitoring for 'solr.jetty' (registry 'solr.jetty') enabled at server: com.sun.jmx.mbeanserver.JmxMBeanServer@18af8d
   [junit4]   2> 3265178 INFO  (TEST-TestSQLHandler.doTest-seed#[F1EED2A27545430F]) [n:127.0.0.1:54146_    ] o.a.s.c.CorePropertiesLocator Found 0 core definitions underneath C:\Users\jenkins\workspace\Lucene-Solr-7.x-Windows\solr\build\solr-core\test\J0\..\..\..\..\..\..\..\..\..\Users\jenkins\workspace\Lucene-Solr-7.x-Windows\solr\build\solr-core\test\J0\temp\solr.handler.TestSQLHandler_F1EED2A27545430F-001\shard-2-001\cores
   [junit4]   2> 3265237 INFO  (qtp12518624-33643) [n:127.0.0.1:54068_    ] o.a.s.h.a.CollectionsHandler Invoked Collection Action :addreplica with params node=127.0.0.1:54146_&action=ADDREPLICA&collection=collection1&shard=shard1&type=NRT&wt=javabin&version=2 and sendToOCPQueue=true
   [junit4]   2> 3265240 INFO  (OverseerThreadFactory-12777-thread-4-processing-n:127.0.0.1:54068_) [n:127.0.0.1:54068_    ] o.a.s.c.a.c.AddReplicaCmd Node Identified 127.0.0.1:54146_ for creating new replica
   [junit4]   2> 3265247 INFO  (qtp29022695-33719) [n:127.0.0.1:54146_    ] o.a.s.h.a.CoreAdminOperation core create command qt=/admin/cores&collection.configName=conf1&name=collection1_shard1_replica_n43&action=CREATE&collection=collection1&shard=shard1&wt=javabin&version=2&replicaType=NRT
   [junit4]   2> 3265248 INFO  (qtp29022695-33719) [n:127.0.0.1:54146_    ] o.a.s.c.TransientSolrCoreCacheDefault Allocating transient cache for 4 transient cores
   [junit4]   2> 3266277 INFO  (qtp29022695-33719) [n:127.0.0.1:54146_ c:collection1 s:shard1  x:collection1_shard1_replica_n43] o.a.s.c.SolrConfig Using Lucene MatchVersion: 7.3.0
   [junit4]   2> 3266290 INFO  (qtp29022695-33719) [n:127.0.0.1:54146_ c:collection1 s:shard1  x:collection1_shard1_replica_n43] o.a.s.s.IndexSchema [collection1_shard1_replica_n43] Schema name=test
   [junit4]   2> 3266373 WARN  (qtp29022695-33719) [n:127.0.0.1:54146_ c:collection1 s:shard1  x:collection1_shard1_replica_n43] o.a.s.s.IndexSchema Field lowerfilt1and2 is not multivalued and destination for multiple copyFields (2)
   [junit4]   2> 3266373 WARN  (qtp29022695-33719) [n:127.0.0.1:54146_ c:collection1 s:shard1  x:collection1_shard1_replica_n43] o.a.s.s.IndexSchema Field text is not multivalued and destination for multiple copyFields (3)
   [junit4]   2> 3266374 INFO  (qtp29022695-33719) [n:127.0.0.1:54146_ c:collection1 s:shard1  x:collection1_shard1_replica_n43] o.a.s.s.IndexSchema Loaded schema test/1.6 with uniqueid field id
   [junit4]   2> 3266374 INFO  (qtp29022695-33719) [n:127.0.0.

[...truncated too long message...]

20141213170938 :: http://ant.apache.org/ivy/ ::
[ivy:configure] :: loading settings :: file = C:\Users\jenkins\workspace\Lucene-Solr-7.x-Windows\lucene\top-level-ivy-settings.xml

resolve:

common.init:

compile-lucene-core:

-check-git-state:

-git-cleanroot:

-copy-git-state:

git-autoclean:

ivy-availability-check:
[loadresource] Do not set property disallowed.ivy.jars.list as its length is 0.

-ivy-fail-disallowed-ivy-version:

ivy-fail:

ivy-configure:
[ivy:configure] :: loading settings :: file = C:\Users\jenkins\workspace\Lucene-Solr-7.x-Windows\lucene\top-level-ivy-settings.xml

resolve:

init:

-clover.disable:

-clover.load:

-clover.classpath:

-clover.setup:

clover:

compile-core:

init:

compile-test:

-check-git-state:

-git-cleanroot:

-copy-git-state:

git-autoclean:

ivy-availability-check:

ivy-configure:
[ivy:configure] :: loading settings :: file = C:\Users\jenkins\workspace\Lucene-Solr-7.x-Windows\lucene\top-level-ivy-settings.xml

resolve:

common.init:

compile-lucene-core:

init:

-clover.disable:

-clover.load:

-clover.classpath:

-clover.setup:

clover:

compile-core:

compile-test-framework:

-check-git-state:

-git-cleanroot:

-copy-git-state:

git-autoclean:

ivy-availability-check:
[loadresource] Do not set property disallowed.ivy.jars.list as its length is 0.

-ivy-fail-disallowed-ivy-version:

ivy-fail:

ivy-configure:
[ivy:configure] :: loading settings :: file = C:\Users\jenkins\workspace\Lucene-Solr-7.x-Windows\lucene\top-level-ivy-settings.xml

resolve:

init:

compile-lucene-core:

compile-codecs:

-check-git-state:

-git-cleanroot:

-copy-git-state:

git-autoclean:

ivy-availability-check:
[loadresource] Do not set property disallowed.ivy.jars.list as its length is 0.

-ivy-fail-disallowed-ivy-version:

ivy-fail:

ivy-configure:
[ivy:configure] :: loading settings :: file = C:\Users\jenkins\workspace\Lucene-Solr-7.x-Windows\lucene\top-level-ivy-settings.xml

resolve:

common.init:

compile-lucene-core:

init:

-clover.disable:

-clover.load:

-clover.classpath:

-clover.setup:

clover:

compile-core:

-clover.disable:

-clover.load:

-clover.classpath:

-clover.setup:

clover:

common.compile-core:

compile-core:

common.compile-test:
    [mkdir] Created dir: C:\Users\jenkins\workspace\Lucene-Solr-7.x-Windows\lucene\build\analysis\common\classes\test
    [javac] Compiling 289 source files to C:\Users\jenkins\workspace\Lucene-Solr-7.x-Windows\lucene\build\analysis\common\classes\test
    [javac] Note: Some input files use or override a deprecated API.
    [javac] Note: Recompile with -Xlint:deprecation for details.
     [copy] Copying 115 files to C:\Users\jenkins\workspace\Lucene-Solr-7.x-Windows\lucene\build\analysis\common\classes\test

BUILD SUCCESSFUL
Total time: 4 seconds
[repro] ant test-nocompile -Dtests.dups=5 -Dtests.maxfailures=5 -Dtests.class="*.TestSnowballVocab" -Dtests.showOutput=onerror "-Dargs=-client -XX:+UseG1GC" -Dtests.seed=2F91D9FF381DA1DE -Dtests.slow=true -Dtests.locale=ja -Dtests.timezone=America/St_Lucia -Dtests.asserts=true -Dtests.file.encoding=Cp1252
Buildfile: C:\Users\jenkins\workspace\Lucene-Solr-7.x-Windows\lucene\analysis\common\build.xml

-clover.disable:

ivy-configure:
[ivy:configure] :: Apache Ivy 2.4.0 - 20141213170938 :: http://ant.apache.org/ivy/ ::
[ivy:configure] :: loading settings :: file = C:\Users\jenkins\workspace\Lucene-Solr-7.x-Windows\lucene\top-level-ivy-settings.xml

install-junit4-taskdef:

ivy-availability-check:
[loadresource] Do not set property disallowed.ivy.jars.list as its length is 0.

-ivy-fail-disallowed-ivy-version:

ivy-fail:

resolve-groovy:
[ivy:cachepath] :: resolving dependencies :: org.codehaus.groovy#groovy-all-caller;working
[ivy:cachepath] 	confs: [default]
[ivy:cachepath] 	found org.codehaus.groovy#groovy-all;2.4.13 in public
[ivy:cachepath] :: resolution report :: resolve 12ms :: artifacts dl 0ms
	---------------------------------------------------------------------
	|                  |            modules            ||   artifacts   |
	|       conf       | number| search|dwnlded|evicted|| number|dwnlded|
	---------------------------------------------------------------------
	|      default     |   1   |   0   |   0   |   0   ||   1   |   0   |
	---------------------------------------------------------------------

-init-totals:

-test:
    [mkdir] Created dir: C:\Users\jenkins\workspace\Lucene-Solr-7.x-Windows\lucene\build\analysis\common\test
[junit4:pickseed] Seed property 'tests.seed' already defined: 2F91D9FF381DA1DE
    [mkdir] Created dir: C:\Users\jenkins\workspace\Lucene-Solr-7.x-Windows\lucene\build\analysis\common\test\temp
   [junit4] <JUnit4> says aloha! Master seed: 2F91D9FF381DA1DE
   [junit4] Your default console's encoding may not display certain unicode glyphs: windows-1252
   [junit4] Executing 5 suites with 2 JVMs.
   [junit4] 
   [junit4] Started J1 PID(8680@localhost).
   [junit4] Started J0 PID(1000@localhost).
   [junit4] Suite: org.apache.lucene.analysis.snowball.TestSnowballVocab
   [junit4] OK      15.9s J0 | TestSnowballVocab.testStemmers
   [junit4] Completed [1/5] on J0 in 16.93s, 1 test
   [junit4] 
   [junit4] Suite: org.apache.lucene.analysis.snowball.TestSnowballVocab
   [junit4] OK      16.3s J1 | TestSnowballVocab.testStemmers
   [junit4] Completed [2/5] on J1 in 17.28s, 1 test
   [junit4] 
   [junit4] Duplicate suite name used with XML reports: org.apache.lucene.analysis.snowball.TestSnowballVocab. This may confuse tools that process XML reports. Set 'ignoreDuplicateSuites' to true to skip this message.
   [junit4] Suite: org.apache.lucene.analysis.snowball.TestSnowballVocab
   [junit4] OK      15.4s J0 | TestSnowballVocab.testStemmers
   [junit4] Completed [3/5] on J0 in 15.88s, 1 test
   [junit4] 
   [junit4] Suite: org.apache.lucene.analysis.snowball.TestSnowballVocab
   [junit4] OK      15.6s J1 | TestSnowballVocab.testStemmers
   [junit4] Completed [4/5] on J1 in 16.07s, 1 test
   [junit4] 
   [junit4] Suite: org.apache.lucene.analysis.snowball.TestSnowballVocab
   [junit4] OK      15.3s J0 | TestSnowballVocab.testStemmers
   [junit4] Completed [5/5] on J0 in 15.74s, 1 test
   [junit4] 
   [junit4] JVM J0:     0.32 ..    50.41 =    50.09s
   [junit4] JVM J1:     0.32 ..    34.33 =    34.00s
   [junit4] Execution time total: 50 seconds
   [junit4] Tests summary: 5 suites, 5 tests
   [junit4] Could not remove temporary path: C:\Users\jenkins\workspace\Lucene-Solr-7.x-Windows\lucene\build\analysis\common\test\J1 (java.nio.file.DirectoryNotEmptyException: Remaining files: [C:\Users\jenkins\workspace\Lucene-Solr-7.x-Windows\lucene\build\analysis\common\test\J1\temp])
   [junit4] Could not remove temporary path: C:\Users\jenkins\workspace\Lucene-Solr-7.x-Windows\lucene\build\analysis\common\test\J0 (java.nio.file.DirectoryNotEmptyException: Remaining files: [C:\Users\jenkins\workspace\Lucene-Solr-7.x-Windows\lucene\build\analysis\common\test\J0\temp])
     [echo] 5 slowest tests:
[junit4:tophints]  39.20s | org.apache.lucene.analysis.core.TestBugInSomething
[junit4:tophints]  20.99s | org.apache.lucene.analysis.standard.TestUAX29URLEmailTokenizer
[junit4:tophints]  19.76s | org.apache.lucene.analysis.snowball.TestSnowballVocab
[junit4:tophints]  19.56s | org.apache.lucene.analysis.core.TestFactories
[junit4:tophints]  16.09s | org.apache.lucene.analysis.pattern.TestPatternTokenizer

-check-totals:

test-nocompile:

BUILD SUCCESSFUL
Total time: 52 seconds
[repro] Failures:
[repro]   0/5 failed: org.apache.lucene.analysis.snowball.TestSnowballVocab
[repro]   0/5 failed: org.apache.lucene.index.TestExceedMaxTermLength
[repro]   0/5 failed: org.apache.solr.ltr.TestLTRWithSort
[repro]   0/5 failed: org.apache.solr.update.TestExceedMaxTermLength
[repro]   3/5 failed: org.apache.solr.handler.TestSQLHandler
[repro] Exiting with code 1

C:\Users\jenkins\workspace\Lucene-Solr-7.x-Windows>IF EXIST lucene\build move /y lucene\build lucene\build.repro 
        1 dir(s) moved.

C:\Users\jenkins\workspace\Lucene-Solr-7.x-Windows>IF EXIST solr\build move /y solr\build solr\build.repro 
        1 dir(s) moved.

C:\Users\jenkins\workspace\Lucene-Solr-7.x-Windows>IF EXIST lucene\build.orig move /y lucene\build.orig lucene\build 
        1 dir(s) moved.

C:\Users\jenkins\workspace\Lucene-Solr-7.x-Windows>IF EXIST solr\build.orig move /y solr\build.orig solr\build 
        1 dir(s) moved.

C:\Users\jenkins\workspace\Lucene-Solr-7.x-Windows>exit 0 
Archiving artifacts
Setting ANT_1_8_2_HOME=C:\Users\jenkins\tools\hudson.tasks.Ant_AntInstallation\ANT_1.8.2
[WARNINGS] Parsing warnings in console log with parser Java Compiler (javac)
Setting ANT_1_8_2_HOME=C:\Users\jenkins\tools\hudson.tasks.Ant_AntInstallation\ANT_1.8.2
Setting ANT_1_8_2_HOME=C:\Users\jenkins\tools\hudson.tasks.Ant_AntInstallation\ANT_1.8.2
<Git Blamer> Using GitBlamer to create author and commit information for all warnings.
<Git Blamer> GIT_COMMIT=b992bbb2d7480d4cf2ff1d9302a7e20732c1100c, workspace=C:\Users\jenkins\workspace\Lucene-Solr-7.x-Windows
[WARNINGS] Computing warning deltas based on reference build #491
Recording test results
Setting ANT_1_8_2_HOME=C:\Users\jenkins\tools\hudson.tasks.Ant_AntInstallation\ANT_1.8.2
Build step 'Publish JUnit test result report' changed build result to UNSTABLE
Email was triggered for: Unstable (Test Failures)
Sending email for trigger: Unstable (Test Failures)
Setting ANT_1_8_2_HOME=C:\Users\jenkins\tools\hudson.tasks.Ant_AntInstallation\ANT_1.8.2
Setting ANT_1_8_2_HOME=C:\Users\jenkins\tools\hudson.tasks.Ant_AntInstallation\ANT_1.8.2
Setting ANT_1_8_2_HOME=C:\Users\jenkins\tools\hudson.tasks.Ant_AntInstallation\ANT_1.8.2
Setting ANT_1_8_2_HOME=C:\Users\jenkins\tools\hudson.tasks.Ant_AntInstallation\ANT_1.8.2

Mime
View raw message