lucene-dev mailing list archives

Site index · List index
Message view « Date » · « Thread »
Top « Date » · « Thread »
From Apache Jenkins Server <jenk...@builds.apache.org>
Subject [JENKINS] Lucene-Solr-Tests-7.x - Build # 346 - Still Unstable
Date Thu, 01 Feb 2018 17:09:15 GMT
Build: https://builds.apache.org/job/Lucene-Solr-Tests-7.x/346/

11 tests failed.
FAILED:  org.apache.solr.cloud.ConcurrentCreateRoutedAliasTest.testConcurrentCreateRoutedAliasMinimal

Error Message:
concurrent alias creation failed java.lang.IllegalStateException: Connection pool shut down

Stack Trace:
java.lang.AssertionError: concurrent alias creation failed java.lang.IllegalStateException: Connection pool shut down
	at __randomizedtesting.SeedInfo.seed([5E759413D09EF7AE:9AEE98417D814094]:0)
	at org.junit.Assert.fail(Assert.java:93)
	at org.junit.Assert.assertTrue(Assert.java:43)
	at org.junit.Assert.assertNull(Assert.java:551)
	at org.apache.solr.cloud.ConcurrentCreateRoutedAliasTest.testConcurrentCreateRoutedAliasMinimal(ConcurrentCreateRoutedAliasTest.java:108)
	at sun.reflect.NativeMethodAccessorImpl.invoke0(Native Method)
	at sun.reflect.NativeMethodAccessorImpl.invoke(NativeMethodAccessorImpl.java:62)
	at sun.reflect.DelegatingMethodAccessorImpl.invoke(DelegatingMethodAccessorImpl.java:43)
	at java.lang.reflect.Method.invoke(Method.java:498)
	at com.carrotsearch.randomizedtesting.RandomizedRunner.invoke(RandomizedRunner.java:1737)
	at com.carrotsearch.randomizedtesting.RandomizedRunner$8.evaluate(RandomizedRunner.java:934)
	at com.carrotsearch.randomizedtesting.RandomizedRunner$9.evaluate(RandomizedRunner.java:970)
	at com.carrotsearch.randomizedtesting.RandomizedRunner$10.evaluate(RandomizedRunner.java:984)
	at com.carrotsearch.randomizedtesting.rules.SystemPropertiesRestoreRule$1.evaluate(SystemPropertiesRestoreRule.java:57)
	at org.apache.lucene.util.TestRuleSetupTeardownChained$1.evaluate(TestRuleSetupTeardownChained.java:49)
	at org.apache.lucene.util.AbstractBeforeAfterRule$1.evaluate(AbstractBeforeAfterRule.java:45)
	at org.apache.lucene.util.TestRuleThreadAndTestName$1.evaluate(TestRuleThreadAndTestName.java:48)
	at org.apache.lucene.util.TestRuleIgnoreAfterMaxFailures$1.evaluate(TestRuleIgnoreAfterMaxFailures.java:64)
	at org.apache.lucene.util.TestRuleMarkFailure$1.evaluate(TestRuleMarkFailure.java:47)
	at com.carrotsearch.randomizedtesting.rules.StatementAdapter.evaluate(StatementAdapter.java:36)
	at com.carrotsearch.randomizedtesting.ThreadLeakControl$StatementRunner.run(ThreadLeakControl.java:368)
	at com.carrotsearch.randomizedtesting.ThreadLeakControl.forkTimeoutingTask(ThreadLeakControl.java:817)
	at com.carrotsearch.randomizedtesting.ThreadLeakControl$3.evaluate(ThreadLeakControl.java:468)
	at com.carrotsearch.randomizedtesting.RandomizedRunner.runSingleTest(RandomizedRunner.java:943)
	at com.carrotsearch.randomizedtesting.RandomizedRunner$5.evaluate(RandomizedRunner.java:829)
	at com.carrotsearch.randomizedtesting.RandomizedRunner$6.evaluate(RandomizedRunner.java:879)
	at com.carrotsearch.randomizedtesting.RandomizedRunner$7.evaluate(RandomizedRunner.java:890)
	at com.carrotsearch.randomizedtesting.rules.StatementAdapter.evaluate(StatementAdapter.java:36)
	at com.carrotsearch.randomizedtesting.rules.SystemPropertiesRestoreRule$1.evaluate(SystemPropertiesRestoreRule.java:57)
	at org.apache.lucene.util.AbstractBeforeAfterRule$1.evaluate(AbstractBeforeAfterRule.java:45)
	at com.carrotsearch.randomizedtesting.rules.StatementAdapter.evaluate(StatementAdapter.java:36)
	at org.apache.lucene.util.TestRuleStoreClassName$1.evaluate(TestRuleStoreClassName.java:41)
	at com.carrotsearch.randomizedtesting.rules.NoShadowingOrOverridesOnMethodsRule$1.evaluate(NoShadowingOrOverridesOnMethodsRule.java:40)
	at com.carrotsearch.randomizedtesting.rules.NoShadowingOrOverridesOnMethodsRule$1.evaluate(NoShadowingOrOverridesOnMethodsRule.java:40)
	at com.carrotsearch.randomizedtesting.rules.StatementAdapter.evaluate(StatementAdapter.java:36)
	at com.carrotsearch.randomizedtesting.rules.StatementAdapter.evaluate(StatementAdapter.java:36)
	at com.carrotsearch.randomizedtesting.rules.StatementAdapter.evaluate(StatementAdapter.java:36)
	at org.apache.lucene.util.TestRuleAssertionsRequired$1.evaluate(TestRuleAssertionsRequired.java:53)
	at org.apache.lucene.util.TestRuleMarkFailure$1.evaluate(TestRuleMarkFailure.java:47)
	at org.apache.lucene.util.TestRuleIgnoreAfterMaxFailures$1.evaluate(TestRuleIgnoreAfterMaxFailures.java:64)
	at org.apache.lucene.util.TestRuleIgnoreTestSuites$1.evaluate(TestRuleIgnoreTestSuites.java:54)
	at com.carrotsearch.randomizedtesting.rules.StatementAdapter.evaluate(StatementAdapter.java:36)
	at com.carrotsearch.randomizedtesting.ThreadLeakControl$StatementRunner.run(ThreadLeakControl.java:368)
	at java.lang.Thread.run(Thread.java:748)


FAILED:  org.apache.solr.cloud.ForceLeaderTest.testReplicasInLIRNoLeader

Error Message:
Didn't see all replicas for shard shard1 in forceleader_test_collection come up within 90000 ms! ClusterState: {   "control_collection":{     "pullReplicas":"0",     "replicationFactor":"1",     "shards":{"shard1":{         "range":"80000000-7fffffff",         "state":"active",         "replicas":{"core_node2":{             "core":"control_collection_shard1_replica_n1",             "base_url":"http://127.0.0.1:50147",             "node_name":"127.0.0.1:50147_",             "state":"active",             "type":"NRT",             "leader":"true"}}}},     "router":{"name":"compositeId"},     "maxShardsPerNode":"1",     "autoAddReplicas":"false",     "nrtReplicas":"1",     "tlogReplicas":"0"},   "forceleader_test_collection":{     "pullReplicas":"0",     "replicationFactor":"0",     "shards":{"shard1":{         "range":"80000000-7fffffff",         "state":"active",         "replicas":{           "core_node2":{             "core":"forceleader_test_collection_shard1_replica_t1",             "base_url":"http://127.0.0.1:50740",             "node_name":"127.0.0.1:50740_",             "state":"active",             "type":"TLOG",             "leader":"true"},           "core_node4":{             "core":"forceleader_test_collection_shard1_replica_t3",             "base_url":"http://127.0.0.1:36186",             "node_name":"127.0.0.1:36186_",             "state":"down",             "type":"TLOG"},           "core_node6":{             "core":"forceleader_test_collection_shard1_replica_t5",             "base_url":"http://127.0.0.1:51355",             "node_name":"127.0.0.1:51355_",             "state":"down",             "type":"TLOG"}}}},     "router":{"name":"compositeId"},     "maxShardsPerNode":"1",     "autoAddReplicas":"false",     "nrtReplicas":"0",     "tlogReplicas":"3"},   "collection1":{     "pullReplicas":"0",     "replicationFactor":"1",     "shards":{       "shard1":{         "range":"80000000-ffffffff",         "state":"active",         "replicas":{"core_node44":{             "core":"collection1_shard1_replica_t43",             "base_url":"http://127.0.0.1:36186",             "node_name":"127.0.0.1:36186_",             "state":"active",             "type":"TLOG",             "leader":"true"}}},       "shard2":{         "range":"0-7fffffff",         "state":"active",         "replicas":{           "core_node42":{             "core":"collection1_shard2_replica_t41",             "base_url":"http://127.0.0.1:50740",             "node_name":"127.0.0.1:50740_",             "state":"active",             "type":"TLOG",             "leader":"true"},           "core_node46":{             "core":"collection1_shard2_replica_t45",             "base_url":"http://127.0.0.1:51355",             "node_name":"127.0.0.1:51355_",             "state":"down",             "type":"TLOG"}}}},     "router":{"name":"compositeId"},     "maxShardsPerNode":"1",     "autoAddReplicas":"false",     "nrtReplicas":"1",     "tlogReplicas":"0"}}

Stack Trace:
java.lang.AssertionError: Didn't see all replicas for shard shard1 in forceleader_test_collection come up within 90000 ms! ClusterState: {
  "control_collection":{
    "pullReplicas":"0",
    "replicationFactor":"1",
    "shards":{"shard1":{
        "range":"80000000-7fffffff",
        "state":"active",
        "replicas":{"core_node2":{
            "core":"control_collection_shard1_replica_n1",
            "base_url":"http://127.0.0.1:50147",
            "node_name":"127.0.0.1:50147_",
            "state":"active",
            "type":"NRT",
            "leader":"true"}}}},
    "router":{"name":"compositeId"},
    "maxShardsPerNode":"1",
    "autoAddReplicas":"false",
    "nrtReplicas":"1",
    "tlogReplicas":"0"},
  "forceleader_test_collection":{
    "pullReplicas":"0",
    "replicationFactor":"0",
    "shards":{"shard1":{
        "range":"80000000-7fffffff",
        "state":"active",
        "replicas":{
          "core_node2":{
            "core":"forceleader_test_collection_shard1_replica_t1",
            "base_url":"http://127.0.0.1:50740",
            "node_name":"127.0.0.1:50740_",
            "state":"active",
            "type":"TLOG",
            "leader":"true"},
          "core_node4":{
            "core":"forceleader_test_collection_shard1_replica_t3",
            "base_url":"http://127.0.0.1:36186",
            "node_name":"127.0.0.1:36186_",
            "state":"down",
            "type":"TLOG"},
          "core_node6":{
            "core":"forceleader_test_collection_shard1_replica_t5",
            "base_url":"http://127.0.0.1:51355",
            "node_name":"127.0.0.1:51355_",
            "state":"down",
            "type":"TLOG"}}}},
    "router":{"name":"compositeId"},
    "maxShardsPerNode":"1",
    "autoAddReplicas":"false",
    "nrtReplicas":"0",
    "tlogReplicas":"3"},
  "collection1":{
    "pullReplicas":"0",
    "replicationFactor":"1",
    "shards":{
      "shard1":{
        "range":"80000000-ffffffff",
        "state":"active",
        "replicas":{"core_node44":{
            "core":"collection1_shard1_replica_t43",
            "base_url":"http://127.0.0.1:36186",
            "node_name":"127.0.0.1:36186_",
            "state":"active",
            "type":"TLOG",
            "leader":"true"}}},
      "shard2":{
        "range":"0-7fffffff",
        "state":"active",
        "replicas":{
          "core_node42":{
            "core":"collection1_shard2_replica_t41",
            "base_url":"http://127.0.0.1:50740",
            "node_name":"127.0.0.1:50740_",
            "state":"active",
            "type":"TLOG",
            "leader":"true"},
          "core_node46":{
            "core":"collection1_shard2_replica_t45",
            "base_url":"http://127.0.0.1:51355",
            "node_name":"127.0.0.1:51355_",
            "state":"down",
            "type":"TLOG"}}}},
    "router":{"name":"compositeId"},
    "maxShardsPerNode":"1",
    "autoAddReplicas":"false",
    "nrtReplicas":"1",
    "tlogReplicas":"0"}}
	at __randomizedtesting.SeedInfo.seed([5E759413D09EF7AE:B8E2A0D3E91C0ECF]:0)
	at org.junit.Assert.fail(Assert.java:93)
	at org.apache.solr.cloud.AbstractFullDistribZkTestBase.ensureAllReplicasAreActive(AbstractFullDistribZkTestBase.java:2005)
	at org.apache.solr.cloud.ForceLeaderTest.testReplicasInLIRNoLeader(ForceLeaderTest.java:237)
	at sun.reflect.NativeMethodAccessorImpl.invoke0(Native Method)
	at sun.reflect.NativeMethodAccessorImpl.invoke(NativeMethodAccessorImpl.java:62)
	at sun.reflect.DelegatingMethodAccessorImpl.invoke(DelegatingMethodAccessorImpl.java:43)
	at java.lang.reflect.Method.invoke(Method.java:498)
	at com.carrotsearch.randomizedtesting.RandomizedRunner.invoke(RandomizedRunner.java:1737)
	at com.carrotsearch.randomizedtesting.RandomizedRunner$8.evaluate(RandomizedRunner.java:934)
	at com.carrotsearch.randomizedtesting.RandomizedRunner$9.evaluate(RandomizedRunner.java:970)
	at com.carrotsearch.randomizedtesting.RandomizedRunner$10.evaluate(RandomizedRunner.java:984)
	at org.apache.solr.BaseDistributedSearchTestCase$ShardsRepeatRule$ShardsFixedStatement.callStatement(BaseDistributedSearchTestCase.java:993)
	at org.apache.solr.BaseDistributedSearchTestCase$ShardsRepeatRule$ShardsStatement.evaluate(BaseDistributedSearchTestCase.java:968)
	at com.carrotsearch.randomizedtesting.rules.SystemPropertiesRestoreRule$1.evaluate(SystemPropertiesRestoreRule.java:57)
	at org.apache.lucene.util.TestRuleSetupTeardownChained$1.evaluate(TestRuleSetupTeardownChained.java:49)
	at org.apache.lucene.util.AbstractBeforeAfterRule$1.evaluate(AbstractBeforeAfterRule.java:45)
	at org.apache.lucene.util.TestRuleThreadAndTestName$1.evaluate(TestRuleThreadAndTestName.java:48)
	at org.apache.lucene.util.TestRuleIgnoreAfterMaxFailures$1.evaluate(TestRuleIgnoreAfterMaxFailures.java:64)
	at org.apache.lucene.util.TestRuleMarkFailure$1.evaluate(TestRuleMarkFailure.java:47)
	at com.carrotsearch.randomizedtesting.rules.StatementAdapter.evaluate(StatementAdapter.java:36)
	at com.carrotsearch.randomizedtesting.ThreadLeakControl$StatementRunner.run(ThreadLeakControl.java:368)
	at com.carrotsearch.randomizedtesting.ThreadLeakControl.forkTimeoutingTask(ThreadLeakControl.java:817)
	at com.carrotsearch.randomizedtesting.ThreadLeakControl$3.evaluate(ThreadLeakControl.java:468)
	at com.carrotsearch.randomizedtesting.RandomizedRunner.runSingleTest(RandomizedRunner.java:943)
	at com.carrotsearch.randomizedtesting.RandomizedRunner$5.evaluate(RandomizedRunner.java:829)
	at com.carrotsearch.randomizedtesting.RandomizedRunner$6.evaluate(RandomizedRunner.java:879)
	at com.carrotsearch.randomizedtesting.RandomizedRunner$7.evaluate(RandomizedRunner.java:890)
	at com.carrotsearch.randomizedtesting.rules.StatementAdapter.evaluate(StatementAdapter.java:36)
	at com.carrotsearch.randomizedtesting.rules.SystemPropertiesRestoreRule$1.evaluate(SystemPropertiesRestoreRule.java:57)
	at org.apache.lucene.util.AbstractBeforeAfterRule$1.evaluate(AbstractBeforeAfterRule.java:45)
	at com.carrotsearch.randomizedtesting.rules.StatementAdapter.evaluate(StatementAdapter.java:36)
	at org.apache.lucene.util.TestRuleStoreClassName$1.evaluate(TestRuleStoreClassName.java:41)
	at com.carrotsearch.randomizedtesting.rules.NoShadowingOrOverridesOnMethodsRule$1.evaluate(NoShadowingOrOverridesOnMethodsRule.java:40)
	at com.carrotsearch.randomizedtesting.rules.NoShadowingOrOverridesOnMethodsRule$1.evaluate(NoShadowingOrOverridesOnMethodsRule.java:40)
	at com.carrotsearch.randomizedtesting.rules.StatementAdapter.evaluate(StatementAdapter.java:36)
	at com.carrotsearch.randomizedtesting.rules.StatementAdapter.evaluate(StatementAdapter.java:36)
	at com.carrotsearch.randomizedtesting.rules.StatementAdapter.evaluate(StatementAdapter.java:36)
	at org.apache.lucene.util.TestRuleAssertionsRequired$1.evaluate(TestRuleAssertionsRequired.java:53)
	at org.apache.lucene.util.TestRuleMarkFailure$1.evaluate(TestRuleMarkFailure.java:47)
	at org.apache.lucene.util.TestRuleIgnoreAfterMaxFailures$1.evaluate(TestRuleIgnoreAfterMaxFailures.java:64)
	at org.apache.lucene.util.TestRuleIgnoreTestSuites$1.evaluate(TestRuleIgnoreTestSuites.java:54)
	at com.carrotsearch.randomizedtesting.rules.StatementAdapter.evaluate(StatementAdapter.java:36)
	at com.carrotsearch.randomizedtesting.ThreadLeakControl$StatementRunner.run(ThreadLeakControl.java:368)
	at java.lang.Thread.run(Thread.java:748)


FAILED:  org.apache.solr.cloud.TestPullReplica.testCreateDelete {seed=[5E759413D09EF7AE:4565655F266E0F9E]}

Error Message:
KeeperErrorCode = Session expired for /

Stack Trace:
org.apache.zookeeper.KeeperException$SessionExpiredException: KeeperErrorCode = Session expired for /
	at org.apache.zookeeper.KeeperException.create(KeeperException.java:130)
	at org.apache.zookeeper.KeeperException.create(KeeperException.java:54)
	at org.apache.zookeeper.ZooKeeper.getData(ZooKeeper.java:1215)
	at org.apache.solr.common.cloud.SolrZkClient.lambda$getData$5(SolrZkClient.java:340)
	at org.apache.solr.common.cloud.ZkCmdExecutor.retryOperation(ZkCmdExecutor.java:60)
	at org.apache.solr.common.cloud.SolrZkClient.getData(SolrZkClient.java:340)
	at org.apache.solr.common.cloud.SolrZkClient.printLayout(SolrZkClient.java:569)
	at org.apache.solr.common.cloud.SolrZkClient.printLayoutToStream(SolrZkClient.java:614)
	at org.apache.solr.common.cloud.SolrZkClient.printLayoutToStdOut(SolrZkClient.java:609)
	at org.apache.solr.cloud.TestPullReplica.testCreateDelete(TestPullReplica.java:189)
	at sun.reflect.NativeMethodAccessorImpl.invoke0(Native Method)
	at sun.reflect.NativeMethodAccessorImpl.invoke(NativeMethodAccessorImpl.java:62)
	at sun.reflect.DelegatingMethodAccessorImpl.invoke(DelegatingMethodAccessorImpl.java:43)
	at java.lang.reflect.Method.invoke(Method.java:498)
	at com.carrotsearch.randomizedtesting.RandomizedRunner.invoke(RandomizedRunner.java:1737)
	at com.carrotsearch.randomizedtesting.RandomizedRunner$8.evaluate(RandomizedRunner.java:934)
	at com.carrotsearch.randomizedtesting.RandomizedRunner$9.evaluate(RandomizedRunner.java:970)
	at com.carrotsearch.randomizedtesting.RandomizedRunner$10.evaluate(RandomizedRunner.java:984)
	at com.carrotsearch.randomizedtesting.rules.SystemPropertiesRestoreRule$1.evaluate(SystemPropertiesRestoreRule.java:57)
	at org.apache.lucene.util.TestRuleSetupTeardownChained$1.evaluate(TestRuleSetupTeardownChained.java:49)
	at org.apache.lucene.util.AbstractBeforeAfterRule$1.evaluate(AbstractBeforeAfterRule.java:45)
	at org.apache.lucene.util.TestRuleThreadAndTestName$1.evaluate(TestRuleThreadAndTestName.java:48)
	at org.apache.lucene.util.TestRuleIgnoreAfterMaxFailures$1.evaluate(TestRuleIgnoreAfterMaxFailures.java:64)
	at org.apache.lucene.util.TestRuleMarkFailure$1.evaluate(TestRuleMarkFailure.java:47)
	at com.carrotsearch.randomizedtesting.rules.StatementAdapter.evaluate(StatementAdapter.java:36)
	at com.carrotsearch.randomizedtesting.ThreadLeakControl$StatementRunner.run(ThreadLeakControl.java:368)
	at com.carrotsearch.randomizedtesting.ThreadLeakControl.forkTimeoutingTask(ThreadLeakControl.java:817)
	at com.carrotsearch.randomizedtesting.ThreadLeakControl$3.evaluate(ThreadLeakControl.java:468)
	at com.carrotsearch.randomizedtesting.RandomizedRunner.runSingleTest(RandomizedRunner.java:943)
	at com.carrotsearch.randomizedtesting.RandomizedRunner$5.evaluate(RandomizedRunner.java:829)
	at com.carrotsearch.randomizedtesting.RandomizedRunner$6.evaluate(RandomizedRunner.java:879)
	at com.carrotsearch.randomizedtesting.RandomizedRunner$7.evaluate(RandomizedRunner.java:890)
	at com.carrotsearch.randomizedtesting.rules.StatementAdapter.evaluate(StatementAdapter.java:36)
	at com.carrotsearch.randomizedtesting.rules.SystemPropertiesRestoreRule$1.evaluate(SystemPropertiesRestoreRule.java:57)
	at org.apache.lucene.util.AbstractBeforeAfterRule$1.evaluate(AbstractBeforeAfterRule.java:45)
	at com.carrotsearch.randomizedtesting.rules.StatementAdapter.evaluate(StatementAdapter.java:36)
	at org.apache.lucene.util.TestRuleStoreClassName$1.evaluate(TestRuleStoreClassName.java:41)
	at com.carrotsearch.randomizedtesting.rules.NoShadowingOrOverridesOnMethodsRule$1.evaluate(NoShadowingOrOverridesOnMethodsRule.java:40)
	at com.carrotsearch.randomizedtesting.rules.NoShadowingOrOverridesOnMethodsRule$1.evaluate(NoShadowingOrOverridesOnMethodsRule.java:40)
	at com.carrotsearch.randomizedtesting.rules.StatementAdapter.evaluate(StatementAdapter.java:36)
	at com.carrotsearch.randomizedtesting.rules.StatementAdapter.evaluate(StatementAdapter.java:36)
	at com.carrotsearch.randomizedtesting.rules.StatementAdapter.evaluate(StatementAdapter.java:36)
	at org.apache.lucene.util.TestRuleAssertionsRequired$1.evaluate(TestRuleAssertionsRequired.java:53)
	at org.apache.lucene.util.TestRuleMarkFailure$1.evaluate(TestRuleMarkFailure.java:47)
	at org.apache.lucene.util.TestRuleIgnoreAfterMaxFailures$1.evaluate(TestRuleIgnoreAfterMaxFailures.java:64)
	at org.apache.lucene.util.TestRuleIgnoreTestSuites$1.evaluate(TestRuleIgnoreTestSuites.java:54)
	at com.carrotsearch.randomizedtesting.rules.StatementAdapter.evaluate(StatementAdapter.java:36)
	at com.carrotsearch.randomizedtesting.ThreadLeakControl$StatementRunner.run(ThreadLeakControl.java:368)
	at java.lang.Thread.run(Thread.java:748)


FAILED:  org.apache.solr.cloud.TestPullReplica.testCreateDelete {seed=[5E759413D09EF7AE:F133D9A312ACC4B2]}

Error Message:
Expected exception SolrException but no exception was thrown

Stack Trace:
junit.framework.AssertionFailedError: Expected exception SolrException but no exception was thrown
	at __randomizedtesting.SeedInfo.seed([5E759413D09EF7AE:F133D9A312ACC4B2]:0)
	at org.apache.lucene.util.LuceneTestCase.expectThrows(LuceneTestCase.java:2675)
	at org.apache.solr.cloud.TestPullReplica.setUp(TestPullReplica.java:102)
	at sun.reflect.GeneratedMethodAccessor25.invoke(Unknown Source)
	at sun.reflect.DelegatingMethodAccessorImpl.invoke(DelegatingMethodAccessorImpl.java:43)
	at java.lang.reflect.Method.invoke(Method.java:498)
	at com.carrotsearch.randomizedtesting.RandomizedRunner.invoke(RandomizedRunner.java:1737)
	at com.carrotsearch.randomizedtesting.RandomizedRunner$9.evaluate(RandomizedRunner.java:968)
	at com.carrotsearch.randomizedtesting.RandomizedRunner$10.evaluate(RandomizedRunner.java:984)
	at com.carrotsearch.randomizedtesting.rules.SystemPropertiesRestoreRule$1.evaluate(SystemPropertiesRestoreRule.java:57)
	at org.apache.lucene.util.TestRuleSetupTeardownChained$1.evaluate(TestRuleSetupTeardownChained.java:49)
	at org.apache.lucene.util.AbstractBeforeAfterRule$1.evaluate(AbstractBeforeAfterRule.java:45)
	at org.apache.lucene.util.TestRuleThreadAndTestName$1.evaluate(TestRuleThreadAndTestName.java:48)
	at org.apache.lucene.util.TestRuleIgnoreAfterMaxFailures$1.evaluate(TestRuleIgnoreAfterMaxFailures.java:64)
	at org.apache.lucene.util.TestRuleMarkFailure$1.evaluate(TestRuleMarkFailure.java:47)
	at com.carrotsearch.randomizedtesting.rules.StatementAdapter.evaluate(StatementAdapter.java:36)
	at com.carrotsearch.randomizedtesting.ThreadLeakControl$StatementRunner.run(ThreadLeakControl.java:368)
	at com.carrotsearch.randomizedtesting.ThreadLeakControl.forkTimeoutingTask(ThreadLeakControl.java:817)
	at com.carrotsearch.randomizedtesting.ThreadLeakControl$3.evaluate(ThreadLeakControl.java:468)
	at com.carrotsearch.randomizedtesting.RandomizedRunner.runSingleTest(RandomizedRunner.java:943)
	at com.carrotsearch.randomizedtesting.RandomizedRunner$5.evaluate(RandomizedRunner.java:829)
	at com.carrotsearch.randomizedtesting.RandomizedRunner$6.evaluate(RandomizedRunner.java:879)
	at com.carrotsearch.randomizedtesting.RandomizedRunner$7.evaluate(RandomizedRunner.java:890)
	at com.carrotsearch.randomizedtesting.rules.StatementAdapter.evaluate(StatementAdapter.java:36)
	at com.carrotsearch.randomizedtesting.rules.SystemPropertiesRestoreRule$1.evaluate(SystemPropertiesRestoreRule.java:57)
	at org.apache.lucene.util.AbstractBeforeAfterRule$1.evaluate(AbstractBeforeAfterRule.java:45)
	at com.carrotsearch.randomizedtesting.rules.StatementAdapter.evaluate(StatementAdapter.java:36)
	at org.apache.lucene.util.TestRuleStoreClassName$1.evaluate(TestRuleStoreClassName.java:41)
	at com.carrotsearch.randomizedtesting.rules.NoShadowingOrOverridesOnMethodsRule$1.evaluate(NoShadowingOrOverridesOnMethodsRule.java:40)
	at com.carrotsearch.randomizedtesting.rules.NoShadowingOrOverridesOnMethodsRule$1.evaluate(NoShadowingOrOverridesOnMethodsRule.java:40)
	at com.carrotsearch.randomizedtesting.rules.StatementAdapter.evaluate(StatementAdapter.java:36)
	at com.carrotsearch.randomizedtesting.rules.StatementAdapter.evaluate(StatementAdapter.java:36)
	at com.carrotsearch.randomizedtesting.rules.StatementAdapter.evaluate(StatementAdapter.java:36)
	at org.apache.lucene.util.TestRuleAssertionsRequired$1.evaluate(TestRuleAssertionsRequired.java:53)
	at org.apache.lucene.util.TestRuleMarkFailure$1.evaluate(TestRuleMarkFailure.java:47)
	at org.apache.lucene.util.TestRuleIgnoreAfterMaxFailures$1.evaluate(TestRuleIgnoreAfterMaxFailures.java:64)
	at org.apache.lucene.util.TestRuleIgnoreTestSuites$1.evaluate(TestRuleIgnoreTestSuites.java:54)
	at com.carrotsearch.randomizedtesting.rules.StatementAdapter.evaluate(StatementAdapter.java:36)
	at com.carrotsearch.randomizedtesting.ThreadLeakControl$StatementRunner.run(ThreadLeakControl.java:368)
	at java.lang.Thread.run(Thread.java:748)


FAILED:  org.apache.solr.cloud.api.collections.ShardSplitTest.testSplitAfterFailedSplit

Error Message:
expected:<1> but was:<2>

Stack Trace:
java.lang.AssertionError: expected:<1> but was:<2>
	at __randomizedtesting.SeedInfo.seed([5E759413D09EF7AE:A73807BCECEBBA24]:0)
	at org.junit.Assert.fail(Assert.java:93)
	at org.junit.Assert.failNotEquals(Assert.java:647)
	at org.junit.Assert.assertEquals(Assert.java:128)
	at org.junit.Assert.assertEquals(Assert.java:472)
	at org.junit.Assert.assertEquals(Assert.java:456)
	at org.apache.solr.cloud.api.collections.ShardSplitTest.testSplitAfterFailedSplit(ShardSplitTest.java:282)
	at sun.reflect.NativeMethodAccessorImpl.invoke0(Native Method)
	at sun.reflect.NativeMethodAccessorImpl.invoke(NativeMethodAccessorImpl.java:62)
	at sun.reflect.DelegatingMethodAccessorImpl.invoke(DelegatingMethodAccessorImpl.java:43)
	at java.lang.reflect.Method.invoke(Method.java:498)
	at com.carrotsearch.randomizedtesting.RandomizedRunner.invoke(RandomizedRunner.java:1737)
	at com.carrotsearch.randomizedtesting.RandomizedRunner$8.evaluate(RandomizedRunner.java:934)
	at com.carrotsearch.randomizedtesting.RandomizedRunner$9.evaluate(RandomizedRunner.java:970)
	at com.carrotsearch.randomizedtesting.RandomizedRunner$10.evaluate(RandomizedRunner.java:984)
	at org.apache.solr.BaseDistributedSearchTestCase$ShardsRepeatRule$ShardsFixedStatement.callStatement(BaseDistributedSearchTestCase.java:993)
	at org.apache.solr.BaseDistributedSearchTestCase$ShardsRepeatRule$ShardsStatement.evaluate(BaseDistributedSearchTestCase.java:968)
	at com.carrotsearch.randomizedtesting.rules.SystemPropertiesRestoreRule$1.evaluate(SystemPropertiesRestoreRule.java:57)
	at org.apache.lucene.util.TestRuleSetupTeardownChained$1.evaluate(TestRuleSetupTeardownChained.java:49)
	at org.apache.lucene.util.AbstractBeforeAfterRule$1.evaluate(AbstractBeforeAfterRule.java:45)
	at org.apache.lucene.util.TestRuleThreadAndTestName$1.evaluate(TestRuleThreadAndTestName.java:48)
	at org.apache.lucene.util.TestRuleIgnoreAfterMaxFailures$1.evaluate(TestRuleIgnoreAfterMaxFailures.java:64)
	at org.apache.lucene.util.TestRuleMarkFailure$1.evaluate(TestRuleMarkFailure.java:47)
	at com.carrotsearch.randomizedtesting.rules.StatementAdapter.evaluate(StatementAdapter.java:36)
	at com.carrotsearch.randomizedtesting.ThreadLeakControl$StatementRunner.run(ThreadLeakControl.java:368)
	at com.carrotsearch.randomizedtesting.ThreadLeakControl.forkTimeoutingTask(ThreadLeakControl.java:817)
	at com.carrotsearch.randomizedtesting.ThreadLeakControl$3.evaluate(ThreadLeakControl.java:468)
	at com.carrotsearch.randomizedtesting.RandomizedRunner.runSingleTest(RandomizedRunner.java:943)
	at com.carrotsearch.randomizedtesting.RandomizedRunner$5.evaluate(RandomizedRunner.java:829)
	at com.carrotsearch.randomizedtesting.RandomizedRunner$6.evaluate(RandomizedRunner.java:879)
	at com.carrotsearch.randomizedtesting.RandomizedRunner$7.evaluate(RandomizedRunner.java:890)
	at com.carrotsearch.randomizedtesting.rules.StatementAdapter.evaluate(StatementAdapter.java:36)
	at com.carrotsearch.randomizedtesting.rules.SystemPropertiesRestoreRule$1.evaluate(SystemPropertiesRestoreRule.java:57)
	at org.apache.lucene.util.AbstractBeforeAfterRule$1.evaluate(AbstractBeforeAfterRule.java:45)
	at com.carrotsearch.randomizedtesting.rules.StatementAdapter.evaluate(StatementAdapter.java:36)
	at org.apache.lucene.util.TestRuleStoreClassName$1.evaluate(TestRuleStoreClassName.java:41)
	at com.carrotsearch.randomizedtesting.rules.NoShadowingOrOverridesOnMethodsRule$1.evaluate(NoShadowingOrOverridesOnMethodsRule.java:40)
	at com.carrotsearch.randomizedtesting.rules.NoShadowingOrOverridesOnMethodsRule$1.evaluate(NoShadowingOrOverridesOnMethodsRule.java:40)
	at com.carrotsearch.randomizedtesting.rules.StatementAdapter.evaluate(StatementAdapter.java:36)
	at com.carrotsearch.randomizedtesting.rules.StatementAdapter.evaluate(StatementAdapter.java:36)
	at com.carrotsearch.randomizedtesting.rules.StatementAdapter.evaluate(StatementAdapter.java:36)
	at org.apache.lucene.util.TestRuleAssertionsRequired$1.evaluate(TestRuleAssertionsRequired.java:53)
	at org.apache.lucene.util.TestRuleMarkFailure$1.evaluate(TestRuleMarkFailure.java:47)
	at org.apache.lucene.util.TestRuleIgnoreAfterMaxFailures$1.evaluate(TestRuleIgnoreAfterMaxFailures.java:64)
	at org.apache.lucene.util.TestRuleIgnoreTestSuites$1.evaluate(TestRuleIgnoreTestSuites.java:54)
	at com.carrotsearch.randomizedtesting.rules.StatementAdapter.evaluate(StatementAdapter.java:36)
	at com.carrotsearch.randomizedtesting.ThreadLeakControl$StatementRunner.run(ThreadLeakControl.java:368)
	at java.lang.Thread.run(Thread.java:748)


FAILED:  org.apache.solr.cloud.api.collections.TestHdfsCloudBackupRestore.test

Error Message:
Could not load collection from ZK: hdfsbackuprestore_restored

Stack Trace:
org.apache.solr.common.SolrException: Could not load collection from ZK: hdfsbackuprestore_restored
	at __randomizedtesting.SeedInfo.seed([5E759413D09EF7AE:D621ABC97E629A56]:0)
	at org.apache.solr.common.cloud.ZkStateReader.getCollectionLive(ZkStateReader.java:1108)
	at org.apache.solr.common.cloud.ZkStateReader$LazyCollectionRef.get(ZkStateReader.java:647)
	at org.apache.solr.common.cloud.ClusterState.getCollectionOrNull(ClusterState.java:137)
	at org.apache.solr.cloud.AbstractDistribZkTestBase.waitForRecoveriesToFinish(AbstractDistribZkTestBase.java:154)
	at org.apache.solr.cloud.api.collections.AbstractCloudBackupRestoreTestCase.testBackupAndRestore(AbstractCloudBackupRestoreTestCase.java:291)
	at org.apache.solr.cloud.api.collections.AbstractCloudBackupRestoreTestCase.test(AbstractCloudBackupRestoreTestCase.java:142)
	at sun.reflect.NativeMethodAccessorImpl.invoke0(Native Method)
	at sun.reflect.NativeMethodAccessorImpl.invoke(NativeMethodAccessorImpl.java:62)
	at sun.reflect.DelegatingMethodAccessorImpl.invoke(DelegatingMethodAccessorImpl.java:43)
	at java.lang.reflect.Method.invoke(Method.java:498)
	at com.carrotsearch.randomizedtesting.RandomizedRunner.invoke(RandomizedRunner.java:1737)
	at com.carrotsearch.randomizedtesting.RandomizedRunner$8.evaluate(RandomizedRunner.java:934)
	at com.carrotsearch.randomizedtesting.RandomizedRunner$9.evaluate(RandomizedRunner.java:970)
	at com.carrotsearch.randomizedtesting.RandomizedRunner$10.evaluate(RandomizedRunner.java:984)
	at com.carrotsearch.randomizedtesting.rules.SystemPropertiesRestoreRule$1.evaluate(SystemPropertiesRestoreRule.java:57)
	at org.apache.lucene.util.TestRuleSetupTeardownChained$1.evaluate(TestRuleSetupTeardownChained.java:49)
	at org.apache.lucene.util.AbstractBeforeAfterRule$1.evaluate(AbstractBeforeAfterRule.java:45)
	at org.apache.lucene.util.TestRuleThreadAndTestName$1.evaluate(TestRuleThreadAndTestName.java:48)
	at org.apache.lucene.util.TestRuleIgnoreAfterMaxFailures$1.evaluate(TestRuleIgnoreAfterMaxFailures.java:64)
	at org.apache.lucene.util.TestRuleMarkFailure$1.evaluate(TestRuleMarkFailure.java:47)
	at com.carrotsearch.randomizedtesting.rules.StatementAdapter.evaluate(StatementAdapter.java:36)
	at com.carrotsearch.randomizedtesting.ThreadLeakControl$StatementRunner.run(ThreadLeakControl.java:368)
	at com.carrotsearch.randomizedtesting.ThreadLeakControl.forkTimeoutingTask(ThreadLeakControl.java:817)
	at com.carrotsearch.randomizedtesting.ThreadLeakControl$3.evaluate(ThreadLeakControl.java:468)
	at com.carrotsearch.randomizedtesting.RandomizedRunner.runSingleTest(RandomizedRunner.java:943)
	at com.carrotsearch.randomizedtesting.RandomizedRunner$5.evaluate(RandomizedRunner.java:829)
	at com.carrotsearch.randomizedtesting.RandomizedRunner$6.evaluate(RandomizedRunner.java:879)
	at com.carrotsearch.randomizedtesting.RandomizedRunner$7.evaluate(RandomizedRunner.java:890)
	at com.carrotsearch.randomizedtesting.rules.StatementAdapter.evaluate(StatementAdapter.java:36)
	at com.carrotsearch.randomizedtesting.rules.SystemPropertiesRestoreRule$1.evaluate(SystemPropertiesRestoreRule.java:57)
	at org.apache.lucene.util.AbstractBeforeAfterRule$1.evaluate(AbstractBeforeAfterRule.java:45)
	at com.carrotsearch.randomizedtesting.rules.StatementAdapter.evaluate(StatementAdapter.java:36)
	at org.apache.lucene.util.TestRuleStoreClassName$1.evaluate(TestRuleStoreClassName.java:41)
	at com.carrotsearch.randomizedtesting.rules.NoShadowingOrOverridesOnMethodsRule$1.evaluate(NoShadowingOrOverridesOnMethodsRule.java:40)
	at com.carrotsearch.randomizedtesting.rules.NoShadowingOrOverridesOnMethodsRule$1.evaluate(NoShadowingOrOverridesOnMethodsRule.java:40)
	at com.carrotsearch.randomizedtesting.rules.StatementAdapter.evaluate(StatementAdapter.java:36)
	at com.carrotsearch.randomizedtesting.rules.StatementAdapter.evaluate(StatementAdapter.java:36)
	at com.carrotsearch.randomizedtesting.rules.StatementAdapter.evaluate(StatementAdapter.java:36)
	at org.apache.lucene.util.TestRuleAssertionsRequired$1.evaluate(TestRuleAssertionsRequired.java:53)
	at org.apache.lucene.util.TestRuleMarkFailure$1.evaluate(TestRuleMarkFailure.java:47)
	at org.apache.lucene.util.TestRuleIgnoreAfterMaxFailures$1.evaluate(TestRuleIgnoreAfterMaxFailures.java:64)
	at org.apache.lucene.util.TestRuleIgnoreTestSuites$1.evaluate(TestRuleIgnoreTestSuites.java:54)
	at com.carrotsearch.randomizedtesting.rules.StatementAdapter.evaluate(StatementAdapter.java:36)
	at com.carrotsearch.randomizedtesting.ThreadLeakControl$StatementRunner.run(ThreadLeakControl.java:368)
	at java.lang.Thread.run(Thread.java:748)
Caused by: org.apache.zookeeper.KeeperException$SessionExpiredException: KeeperErrorCode = Session expired for /collections/hdfsbackuprestore_restored/state.json
	at org.apache.zookeeper.KeeperException.create(KeeperException.java:130)
	at org.apache.zookeeper.KeeperException.create(KeeperException.java:54)
	at org.apache.zookeeper.ZooKeeper.getData(ZooKeeper.java:1215)
	at org.apache.solr.common.cloud.SolrZkClient.lambda$getData$5(SolrZkClient.java:340)
	at org.apache.solr.common.cloud.ZkCmdExecutor.retryOperation(ZkCmdExecutor.java:60)
	at org.apache.solr.common.cloud.SolrZkClient.getData(SolrZkClient.java:340)
	at org.apache.solr.common.cloud.ZkStateReader.fetchCollectionState(ZkStateReader.java:1120)
	at org.apache.solr.common.cloud.ZkStateReader.getCollectionLive(ZkStateReader.java:1106)
	... 44 more


FAILED:  org.apache.solr.cloud.autoscaling.AutoScalingHandlerTest.testReadApi

Error Message:
expected:<1> but was:<0>

Stack Trace:
java.lang.AssertionError: expected:<1> but was:<0>
	at __randomizedtesting.SeedInfo.seed([5E759413D09EF7AE:95C6FA60B6C15B5]:0)
	at org.junit.Assert.fail(Assert.java:93)
	at org.junit.Assert.failNotEquals(Assert.java:647)
	at org.junit.Assert.assertEquals(Assert.java:128)
	at org.junit.Assert.assertEquals(Assert.java:472)
	at org.junit.Assert.assertEquals(Assert.java:456)
	at org.apache.solr.cloud.autoscaling.AutoScalingHandlerTest.testReadApi(AutoScalingHandlerTest.java:725)
	at sun.reflect.NativeMethodAccessorImpl.invoke0(Native Method)
	at sun.reflect.NativeMethodAccessorImpl.invoke(NativeMethodAccessorImpl.java:62)
	at sun.reflect.DelegatingMethodAccessorImpl.invoke(DelegatingMethodAccessorImpl.java:43)
	at java.lang.reflect.Method.invoke(Method.java:498)
	at com.carrotsearch.randomizedtesting.RandomizedRunner.invoke(RandomizedRunner.java:1737)
	at com.carrotsearch.randomizedtesting.RandomizedRunner$8.evaluate(RandomizedRunner.java:934)
	at com.carrotsearch.randomizedtesting.RandomizedRunner$9.evaluate(RandomizedRunner.java:970)
	at com.carrotsearch.randomizedtesting.RandomizedRunner$10.evaluate(RandomizedRunner.java:984)
	at com.carrotsearch.randomizedtesting.rules.SystemPropertiesRestoreRule$1.evaluate(SystemPropertiesRestoreRule.java:57)
	at org.apache.lucene.util.TestRuleSetupTeardownChained$1.evaluate(TestRuleSetupTeardownChained.java:49)
	at org.apache.lucene.util.AbstractBeforeAfterRule$1.evaluate(AbstractBeforeAfterRule.java:45)
	at org.apache.lucene.util.TestRuleThreadAndTestName$1.evaluate(TestRuleThreadAndTestName.java:48)
	at org.apache.lucene.util.TestRuleIgnoreAfterMaxFailures$1.evaluate(TestRuleIgnoreAfterMaxFailures.java:64)
	at org.apache.lucene.util.TestRuleMarkFailure$1.evaluate(TestRuleMarkFailure.java:47)
	at com.carrotsearch.randomizedtesting.rules.StatementAdapter.evaluate(StatementAdapter.java:36)
	at com.carrotsearch.randomizedtesting.ThreadLeakControl$StatementRunner.run(ThreadLeakControl.java:368)
	at com.carrotsearch.randomizedtesting.ThreadLeakControl.forkTimeoutingTask(ThreadLeakControl.java:817)
	at com.carrotsearch.randomizedtesting.ThreadLeakControl$3.evaluate(ThreadLeakControl.java:468)
	at com.carrotsearch.randomizedtesting.RandomizedRunner.runSingleTest(RandomizedRunner.java:943)
	at com.carrotsearch.randomizedtesting.RandomizedRunner$5.evaluate(RandomizedRunner.java:829)
	at com.carrotsearch.randomizedtesting.RandomizedRunner$6.evaluate(RandomizedRunner.java:879)
	at com.carrotsearch.randomizedtesting.RandomizedRunner$7.evaluate(RandomizedRunner.java:890)
	at com.carrotsearch.randomizedtesting.rules.StatementAdapter.evaluate(StatementAdapter.java:36)
	at com.carrotsearch.randomizedtesting.rules.SystemPropertiesRestoreRule$1.evaluate(SystemPropertiesRestoreRule.java:57)
	at org.apache.lucene.util.AbstractBeforeAfterRule$1.evaluate(AbstractBeforeAfterRule.java:45)
	at com.carrotsearch.randomizedtesting.rules.StatementAdapter.evaluate(StatementAdapter.java:36)
	at org.apache.lucene.util.TestRuleStoreClassName$1.evaluate(TestRuleStoreClassName.java:41)
	at com.carrotsearch.randomizedtesting.rules.NoShadowingOrOverridesOnMethodsRule$1.evaluate(NoShadowingOrOverridesOnMethodsRule.java:40)
	at com.carrotsearch.randomizedtesting.rules.NoShadowingOrOverridesOnMethodsRule$1.evaluate(NoShadowingOrOverridesOnMethodsRule.java:40)
	at com.carrotsearch.randomizedtesting.rules.StatementAdapter.evaluate(StatementAdapter.java:36)
	at com.carrotsearch.randomizedtesting.rules.StatementAdapter.evaluate(StatementAdapter.java:36)
	at com.carrotsearch.randomizedtesting.rules.StatementAdapter.evaluate(StatementAdapter.java:36)
	at org.apache.lucene.util.TestRuleAssertionsRequired$1.evaluate(TestRuleAssertionsRequired.java:53)
	at org.apache.lucene.util.TestRuleMarkFailure$1.evaluate(TestRuleMarkFailure.java:47)
	at org.apache.lucene.util.TestRuleIgnoreAfterMaxFailures$1.evaluate(TestRuleIgnoreAfterMaxFailures.java:64)
	at org.apache.lucene.util.TestRuleIgnoreTestSuites$1.evaluate(TestRuleIgnoreTestSuites.java:54)
	at com.carrotsearch.randomizedtesting.rules.StatementAdapter.evaluate(StatementAdapter.java:36)
	at com.carrotsearch.randomizedtesting.ThreadLeakControl$StatementRunner.run(ThreadLeakControl.java:368)
	at java.lang.Thread.run(Thread.java:748)


FAILED:  org.apache.solr.cloud.autoscaling.TriggerIntegrationTest.testNodeMarkersRegistration

Error Message:
Path /autoscaling/nodeAdded/127.0.0.1:49559_solr wasn't created

Stack Trace:
java.lang.AssertionError: Path /autoscaling/nodeAdded/127.0.0.1:49559_solr wasn't created
	at __randomizedtesting.SeedInfo.seed([5E759413D09EF7AE:46CF1C1FDEAB3A41]:0)
	at org.junit.Assert.fail(Assert.java:93)
	at org.junit.Assert.assertTrue(Assert.java:43)
	at org.apache.solr.cloud.autoscaling.TriggerIntegrationTest.testNodeMarkersRegistration(TriggerIntegrationTest.java:938)
	at sun.reflect.NativeMethodAccessorImpl.invoke0(Native Method)
	at sun.reflect.NativeMethodAccessorImpl.invoke(NativeMethodAccessorImpl.java:62)
	at sun.reflect.DelegatingMethodAccessorImpl.invoke(DelegatingMethodAccessorImpl.java:43)
	at java.lang.reflect.Method.invoke(Method.java:498)
	at com.carrotsearch.randomizedtesting.RandomizedRunner.invoke(RandomizedRunner.java:1737)
	at com.carrotsearch.randomizedtesting.RandomizedRunner$8.evaluate(RandomizedRunner.java:934)
	at com.carrotsearch.randomizedtesting.RandomizedRunner$9.evaluate(RandomizedRunner.java:970)
	at com.carrotsearch.randomizedtesting.RandomizedRunner$10.evaluate(RandomizedRunner.java:984)
	at com.carrotsearch.randomizedtesting.rules.SystemPropertiesRestoreRule$1.evaluate(SystemPropertiesRestoreRule.java:57)
	at org.apache.lucene.util.TestRuleSetupTeardownChained$1.evaluate(TestRuleSetupTeardownChained.java:49)
	at org.apache.lucene.util.AbstractBeforeAfterRule$1.evaluate(AbstractBeforeAfterRule.java:45)
	at org.apache.lucene.util.TestRuleThreadAndTestName$1.evaluate(TestRuleThreadAndTestName.java:48)
	at org.apache.lucene.util.TestRuleIgnoreAfterMaxFailures$1.evaluate(TestRuleIgnoreAfterMaxFailures.java:64)
	at org.apache.lucene.util.TestRuleMarkFailure$1.evaluate(TestRuleMarkFailure.java:47)
	at com.carrotsearch.randomizedtesting.rules.StatementAdapter.evaluate(StatementAdapter.java:36)
	at com.carrotsearch.randomizedtesting.ThreadLeakControl$StatementRunner.run(ThreadLeakControl.java:368)
	at com.carrotsearch.randomizedtesting.ThreadLeakControl.forkTimeoutingTask(ThreadLeakControl.java:817)
	at com.carrotsearch.randomizedtesting.ThreadLeakControl$3.evaluate(ThreadLeakControl.java:468)
	at com.carrotsearch.randomizedtesting.RandomizedRunner.runSingleTest(RandomizedRunner.java:943)
	at com.carrotsearch.randomizedtesting.RandomizedRunner$5.evaluate(RandomizedRunner.java:829)
	at com.carrotsearch.randomizedtesting.RandomizedRunner$6.evaluate(RandomizedRunner.java:879)
	at com.carrotsearch.randomizedtesting.RandomizedRunner$7.evaluate(RandomizedRunner.java:890)
	at com.carrotsearch.randomizedtesting.rules.StatementAdapter.evaluate(StatementAdapter.java:36)
	at com.carrotsearch.randomizedtesting.rules.SystemPropertiesRestoreRule$1.evaluate(SystemPropertiesRestoreRule.java:57)
	at org.apache.lucene.util.AbstractBeforeAfterRule$1.evaluate(AbstractBeforeAfterRule.java:45)
	at com.carrotsearch.randomizedtesting.rules.StatementAdapter.evaluate(StatementAdapter.java:36)
	at org.apache.lucene.util.TestRuleStoreClassName$1.evaluate(TestRuleStoreClassName.java:41)
	at com.carrotsearch.randomizedtesting.rules.NoShadowingOrOverridesOnMethodsRule$1.evaluate(NoShadowingOrOverridesOnMethodsRule.java:40)
	at com.carrotsearch.randomizedtesting.rules.NoShadowingOrOverridesOnMethodsRule$1.evaluate(NoShadowingOrOverridesOnMethodsRule.java:40)
	at com.carrotsearch.randomizedtesting.rules.StatementAdapter.evaluate(StatementAdapter.java:36)
	at com.carrotsearch.randomizedtesting.rules.StatementAdapter.evaluate(StatementAdapter.java:36)
	at com.carrotsearch.randomizedtesting.rules.StatementAdapter.evaluate(StatementAdapter.java:36)
	at org.apache.lucene.util.TestRuleAssertionsRequired$1.evaluate(TestRuleAssertionsRequired.java:53)
	at org.apache.lucene.util.TestRuleMarkFailure$1.evaluate(TestRuleMarkFailure.java:47)
	at org.apache.lucene.util.TestRuleIgnoreAfterMaxFailures$1.evaluate(TestRuleIgnoreAfterMaxFailures.java:64)
	at org.apache.lucene.util.TestRuleIgnoreTestSuites$1.evaluate(TestRuleIgnoreTestSuites.java:54)
	at com.carrotsearch.randomizedtesting.rules.StatementAdapter.evaluate(StatementAdapter.java:36)
	at com.carrotsearch.randomizedtesting.ThreadLeakControl$StatementRunner.run(ThreadLeakControl.java:368)
	at java.lang.Thread.run(Thread.java:748)


FAILED:  org.apache.solr.cloud.autoscaling.sim.TestLargeCluster.testSearchRate

Error Message:
The trigger did not fire at all

Stack Trace:
java.lang.AssertionError: The trigger did not fire at all
	at __randomizedtesting.SeedInfo.seed([5E759413D09EF7AE:33D8A9A1F5851E1]:0)
	at org.junit.Assert.fail(Assert.java:93)
	at org.junit.Assert.assertTrue(Assert.java:43)
	at org.apache.solr.cloud.autoscaling.sim.TestLargeCluster.testSearchRate(TestLargeCluster.java:547)
	at sun.reflect.NativeMethodAccessorImpl.invoke0(Native Method)
	at sun.reflect.NativeMethodAccessorImpl.invoke(NativeMethodAccessorImpl.java:62)
	at sun.reflect.DelegatingMethodAccessorImpl.invoke(DelegatingMethodAccessorImpl.java:43)
	at java.lang.reflect.Method.invoke(Method.java:498)
	at com.carrotsearch.randomizedtesting.RandomizedRunner.invoke(RandomizedRunner.java:1737)
	at com.carrotsearch.randomizedtesting.RandomizedRunner$8.evaluate(RandomizedRunner.java:934)
	at com.carrotsearch.randomizedtesting.RandomizedRunner$9.evaluate(RandomizedRunner.java:970)
	at com.carrotsearch.randomizedtesting.RandomizedRunner$10.evaluate(RandomizedRunner.java:984)
	at com.carrotsearch.randomizedtesting.rules.SystemPropertiesRestoreRule$1.evaluate(SystemPropertiesRestoreRule.java:57)
	at org.apache.lucene.util.TestRuleSetupTeardownChained$1.evaluate(TestRuleSetupTeardownChained.java:49)
	at org.apache.lucene.util.AbstractBeforeAfterRule$1.evaluate(AbstractBeforeAfterRule.java:45)
	at org.apache.lucene.util.TestRuleThreadAndTestName$1.evaluate(TestRuleThreadAndTestName.java:48)
	at org.apache.lucene.util.TestRuleIgnoreAfterMaxFailures$1.evaluate(TestRuleIgnoreAfterMaxFailures.java:64)
	at org.apache.lucene.util.TestRuleMarkFailure$1.evaluate(TestRuleMarkFailure.java:47)
	at com.carrotsearch.randomizedtesting.rules.StatementAdapter.evaluate(StatementAdapter.java:36)
	at com.carrotsearch.randomizedtesting.ThreadLeakControl$StatementRunner.run(ThreadLeakControl.java:368)
	at com.carrotsearch.randomizedtesting.ThreadLeakControl.forkTimeoutingTask(ThreadLeakControl.java:817)
	at com.carrotsearch.randomizedtesting.ThreadLeakControl$3.evaluate(ThreadLeakControl.java:468)
	at com.carrotsearch.randomizedtesting.RandomizedRunner.runSingleTest(RandomizedRunner.java:943)
	at com.carrotsearch.randomizedtesting.RandomizedRunner$5.evaluate(RandomizedRunner.java:829)
	at com.carrotsearch.randomizedtesting.RandomizedRunner$6.evaluate(RandomizedRunner.java:879)
	at com.carrotsearch.randomizedtesting.RandomizedRunner$7.evaluate(RandomizedRunner.java:890)
	at com.carrotsearch.randomizedtesting.rules.StatementAdapter.evaluate(StatementAdapter.java:36)
	at com.carrotsearch.randomizedtesting.rules.SystemPropertiesRestoreRule$1.evaluate(SystemPropertiesRestoreRule.java:57)
	at org.apache.lucene.util.AbstractBeforeAfterRule$1.evaluate(AbstractBeforeAfterRule.java:45)
	at com.carrotsearch.randomizedtesting.rules.StatementAdapter.evaluate(StatementAdapter.java:36)
	at org.apache.lucene.util.TestRuleStoreClassName$1.evaluate(TestRuleStoreClassName.java:41)
	at com.carrotsearch.randomizedtesting.rules.NoShadowingOrOverridesOnMethodsRule$1.evaluate(NoShadowingOrOverridesOnMethodsRule.java:40)
	at com.carrotsearch.randomizedtesting.rules.NoShadowingOrOverridesOnMethodsRule$1.evaluate(NoShadowingOrOverridesOnMethodsRule.java:40)
	at com.carrotsearch.randomizedtesting.rules.StatementAdapter.evaluate(StatementAdapter.java:36)
	at com.carrotsearch.randomizedtesting.rules.StatementAdapter.evaluate(StatementAdapter.java:36)
	at com.carrotsearch.randomizedtesting.rules.StatementAdapter.evaluate(StatementAdapter.java:36)
	at org.apache.lucene.util.TestRuleAssertionsRequired$1.evaluate(TestRuleAssertionsRequired.java:53)
	at org.apache.lucene.util.TestRuleMarkFailure$1.evaluate(TestRuleMarkFailure.java:47)
	at org.apache.lucene.util.TestRuleIgnoreAfterMaxFailures$1.evaluate(TestRuleIgnoreAfterMaxFailures.java:64)
	at org.apache.lucene.util.TestRuleIgnoreTestSuites$1.evaluate(TestRuleIgnoreTestSuites.java:54)
	at com.carrotsearch.randomizedtesting.rules.StatementAdapter.evaluate(StatementAdapter.java:36)
	at com.carrotsearch.randomizedtesting.ThreadLeakControl$StatementRunner.run(ThreadLeakControl.java:368)
	at java.lang.Thread.run(Thread.java:748)


FAILED:  org.apache.solr.cloud.autoscaling.sim.TestTriggerIntegration.testCooldown

Error Message:


Stack Trace:
java.lang.NullPointerException
	at __randomizedtesting.SeedInfo.seed([5E759413D09EF7AE:6FCBF9F7AE34825C]:0)
	at org.apache.solr.cloud.autoscaling.sim.TestTriggerIntegration.testCooldown(TestTriggerIntegration.java:1086)
	at sun.reflect.NativeMethodAccessorImpl.invoke0(Native Method)
	at sun.reflect.NativeMethodAccessorImpl.invoke(NativeMethodAccessorImpl.java:62)
	at sun.reflect.DelegatingMethodAccessorImpl.invoke(DelegatingMethodAccessorImpl.java:43)
	at java.lang.reflect.Method.invoke(Method.java:498)
	at com.carrotsearch.randomizedtesting.RandomizedRunner.invoke(RandomizedRunner.java:1737)
	at com.carrotsearch.randomizedtesting.RandomizedRunner$8.evaluate(RandomizedRunner.java:934)
	at com.carrotsearch.randomizedtesting.RandomizedRunner$9.evaluate(RandomizedRunner.java:970)
	at com.carrotsearch.randomizedtesting.RandomizedRunner$10.evaluate(RandomizedRunner.java:984)
	at com.carrotsearch.randomizedtesting.rules.SystemPropertiesRestoreRule$1.evaluate(SystemPropertiesRestoreRule.java:57)
	at org.apache.lucene.util.TestRuleSetupTeardownChained$1.evaluate(TestRuleSetupTeardownChained.java:49)
	at org.apache.lucene.util.AbstractBeforeAfterRule$1.evaluate(AbstractBeforeAfterRule.java:45)
	at org.apache.lucene.util.TestRuleThreadAndTestName$1.evaluate(TestRuleThreadAndTestName.java:48)
	at org.apache.lucene.util.TestRuleIgnoreAfterMaxFailures$1.evaluate(TestRuleIgnoreAfterMaxFailures.java:64)
	at org.apache.lucene.util.TestRuleMarkFailure$1.evaluate(TestRuleMarkFailure.java:47)
	at com.carrotsearch.randomizedtesting.rules.StatementAdapter.evaluate(StatementAdapter.java:36)
	at com.carrotsearch.randomizedtesting.ThreadLeakControl$StatementRunner.run(ThreadLeakControl.java:368)
	at com.carrotsearch.randomizedtesting.ThreadLeakControl.forkTimeoutingTask(ThreadLeakControl.java:817)
	at com.carrotsearch.randomizedtesting.ThreadLeakControl$3.evaluate(ThreadLeakControl.java:468)
	at com.carrotsearch.randomizedtesting.RandomizedRunner.runSingleTest(RandomizedRunner.java:943)
	at com.carrotsearch.randomizedtesting.RandomizedRunner$5.evaluate(RandomizedRunner.java:829)
	at com.carrotsearch.randomizedtesting.RandomizedRunner$6.evaluate(RandomizedRunner.java:879)
	at com.carrotsearch.randomizedtesting.RandomizedRunner$7.evaluate(RandomizedRunner.java:890)
	at com.carrotsearch.randomizedtesting.rules.StatementAdapter.evaluate(StatementAdapter.java:36)
	at com.carrotsearch.randomizedtesting.rules.SystemPropertiesRestoreRule$1.evaluate(SystemPropertiesRestoreRule.java:57)
	at org.apache.lucene.util.AbstractBeforeAfterRule$1.evaluate(AbstractBeforeAfterRule.java:45)
	at com.carrotsearch.randomizedtesting.rules.StatementAdapter.evaluate(StatementAdapter.java:36)
	at org.apache.lucene.util.TestRuleStoreClassName$1.evaluate(TestRuleStoreClassName.java:41)
	at com.carrotsearch.randomizedtesting.rules.NoShadowingOrOverridesOnMethodsRule$1.evaluate(NoShadowingOrOverridesOnMethodsRule.java:40)
	at com.carrotsearch.randomizedtesting.rules.NoShadowingOrOverridesOnMethodsRule$1.evaluate(NoShadowingOrOverridesOnMethodsRule.java:40)
	at com.carrotsearch.randomizedtesting.rules.StatementAdapter.evaluate(StatementAdapter.java:36)
	at com.carrotsearch.randomizedtesting.rules.StatementAdapter.evaluate(StatementAdapter.java:36)
	at com.carrotsearch.randomizedtesting.rules.StatementAdapter.evaluate(StatementAdapter.java:36)
	at org.apache.lucene.util.TestRuleAssertionsRequired$1.evaluate(TestRuleAssertionsRequired.java:53)
	at org.apache.lucene.util.TestRuleMarkFailure$1.evaluate(TestRuleMarkFailure.java:47)
	at org.apache.lucene.util.TestRuleIgnoreAfterMaxFailures$1.evaluate(TestRuleIgnoreAfterMaxFailures.java:64)
	at org.apache.lucene.util.TestRuleIgnoreTestSuites$1.evaluate(TestRuleIgnoreTestSuites.java:54)
	at com.carrotsearch.randomizedtesting.rules.StatementAdapter.evaluate(StatementAdapter.java:36)
	at com.carrotsearch.randomizedtesting.ThreadLeakControl$StatementRunner.run(ThreadLeakControl.java:368)
	at java.lang.Thread.run(Thread.java:748)


FAILED:  org.apache.solr.update.processor.TimeRoutedAliasUpdateProcessorTest.test

Error Message:
Could not load collection from ZK: myalias_2017-10-23

Stack Trace:
org.apache.solr.common.SolrException: Could not load collection from ZK: myalias_2017-10-23
	at __randomizedtesting.SeedInfo.seed([5E759413D09EF7AE:D621ABC97E629A56]:0)
	at org.apache.solr.common.cloud.ZkStateReader.getCollectionLive(ZkStateReader.java:1108)
	at org.apache.solr.common.cloud.ZkStateReader$LazyCollectionRef.get(ZkStateReader.java:647)
	at org.apache.solr.client.solrj.impl.CloudSolrClient.getDocCollection(CloudSolrClient.java:1206)
	at org.apache.solr.client.solrj.impl.CloudSolrClient.requestWithRetryOnStaleState(CloudSolrClient.java:849)
	at org.apache.solr.client.solrj.impl.CloudSolrClient.request(CloudSolrClient.java:817)
	at org.apache.solr.client.solrj.SolrRequest.process(SolrRequest.java:194)
	at org.apache.solr.client.solrj.SolrClient.query(SolrClient.java:942)
	at org.apache.solr.update.processor.TimeRoutedAliasUpdateProcessorTest.queryNumDocs(TimeRoutedAliasUpdateProcessorTest.java:286)
	at org.apache.solr.update.processor.TimeRoutedAliasUpdateProcessorTest.addDocsAndCommit(TimeRoutedAliasUpdateProcessorTest.java:232)
	at org.apache.solr.update.processor.TimeRoutedAliasUpdateProcessorTest.test(TimeRoutedAliasUpdateProcessorTest.java:163)
	at sun.reflect.NativeMethodAccessorImpl.invoke0(Native Method)
	at sun.reflect.NativeMethodAccessorImpl.invoke(NativeMethodAccessorImpl.java:62)
	at sun.reflect.DelegatingMethodAccessorImpl.invoke(DelegatingMethodAccessorImpl.java:43)
	at java.lang.reflect.Method.invoke(Method.java:498)
	at com.carrotsearch.randomizedtesting.RandomizedRunner.invoke(RandomizedRunner.java:1737)
	at com.carrotsearch.randomizedtesting.RandomizedRunner$8.evaluate(RandomizedRunner.java:934)
	at com.carrotsearch.randomizedtesting.RandomizedRunner$9.evaluate(RandomizedRunner.java:970)
	at com.carrotsearch.randomizedtesting.RandomizedRunner$10.evaluate(RandomizedRunner.java:984)
	at com.carrotsearch.randomizedtesting.rules.SystemPropertiesRestoreRule$1.evaluate(SystemPropertiesRestoreRule.java:57)
	at org.apache.lucene.util.TestRuleSetupTeardownChained$1.evaluate(TestRuleSetupTeardownChained.java:49)
	at org.apache.lucene.util.AbstractBeforeAfterRule$1.evaluate(AbstractBeforeAfterRule.java:45)
	at org.apache.lucene.util.TestRuleThreadAndTestName$1.evaluate(TestRuleThreadAndTestName.java:48)
	at org.apache.lucene.util.TestRuleIgnoreAfterMaxFailures$1.evaluate(TestRuleIgnoreAfterMaxFailures.java:64)
	at org.apache.lucene.util.TestRuleMarkFailure$1.evaluate(TestRuleMarkFailure.java:47)
	at com.carrotsearch.randomizedtesting.rules.StatementAdapter.evaluate(StatementAdapter.java:36)
	at com.carrotsearch.randomizedtesting.ThreadLeakControl$StatementRunner.run(ThreadLeakControl.java:368)
	at com.carrotsearch.randomizedtesting.ThreadLeakControl.forkTimeoutingTask(ThreadLeakControl.java:817)
	at com.carrotsearch.randomizedtesting.ThreadLeakControl$3.evaluate(ThreadLeakControl.java:468)
	at com.carrotsearch.randomizedtesting.RandomizedRunner.runSingleTest(RandomizedRunner.java:943)
	at com.carrotsearch.randomizedtesting.RandomizedRunner$5.evaluate(RandomizedRunner.java:829)
	at com.carrotsearch.randomizedtesting.RandomizedRunner$6.evaluate(RandomizedRunner.java:879)
	at com.carrotsearch.randomizedtesting.RandomizedRunner$7.evaluate(RandomizedRunner.java:890)
	at com.carrotsearch.randomizedtesting.rules.StatementAdapter.evaluate(StatementAdapter.java:36)
	at com.carrotsearch.randomizedtesting.rules.SystemPropertiesRestoreRule$1.evaluate(SystemPropertiesRestoreRule.java:57)
	at org.apache.lucene.util.AbstractBeforeAfterRule$1.evaluate(AbstractBeforeAfterRule.java:45)
	at com.carrotsearch.randomizedtesting.rules.StatementAdapter.evaluate(StatementAdapter.java:36)
	at org.apache.lucene.util.TestRuleStoreClassName$1.evaluate(TestRuleStoreClassName.java:41)
	at com.carrotsearch.randomizedtesting.rules.NoShadowingOrOverridesOnMethodsRule$1.evaluate(NoShadowingOrOverridesOnMethodsRule.java:40)
	at com.carrotsearch.randomizedtesting.rules.NoShadowingOrOverridesOnMethodsRule$1.evaluate(NoShadowingOrOverridesOnMethodsRule.java:40)
	at com.carrotsearch.randomizedtesting.rules.StatementAdapter.evaluate(StatementAdapter.java:36)
	at com.carrotsearch.randomizedtesting.rules.StatementAdapter.evaluate(StatementAdapter.java:36)
	at com.carrotsearch.randomizedtesting.rules.StatementAdapter.evaluate(StatementAdapter.java:36)
	at org.apache.lucene.util.TestRuleAssertionsRequired$1.evaluate(TestRuleAssertionsRequired.java:53)
	at org.apache.lucene.util.TestRuleMarkFailure$1.evaluate(TestRuleMarkFailure.java:47)
	at org.apache.lucene.util.TestRuleIgnoreAfterMaxFailures$1.evaluate(TestRuleIgnoreAfterMaxFailures.java:64)
	at org.apache.lucene.util.TestRuleIgnoreTestSuites$1.evaluate(TestRuleIgnoreTestSuites.java:54)
	at com.carrotsearch.randomizedtesting.rules.StatementAdapter.evaluate(StatementAdapter.java:36)
	at com.carrotsearch.randomizedtesting.ThreadLeakControl$StatementRunner.run(ThreadLeakControl.java:368)
	at java.lang.Thread.run(Thread.java:748)
Caused by: org.apache.zookeeper.KeeperException$SessionExpiredException: KeeperErrorCode = Session expired for /collections/myalias_2017-10-23/state.json
	at org.apache.zookeeper.KeeperException.create(KeeperException.java:130)
	at org.apache.zookeeper.KeeperException.create(KeeperException.java:54)
	at org.apache.zookeeper.ZooKeeper.getData(ZooKeeper.java:1215)
	at org.apache.solr.common.cloud.SolrZkClient.lambda$getData$5(SolrZkClient.java:340)
	at org.apache.solr.common.cloud.ZkCmdExecutor.retryOperation(ZkCmdExecutor.java:60)
	at org.apache.solr.common.cloud.SolrZkClient.getData(SolrZkClient.java:340)
	at org.apache.solr.common.cloud.ZkStateReader.fetchCollectionState(ZkStateReader.java:1120)
	at org.apache.solr.common.cloud.ZkStateReader.getCollectionLive(ZkStateReader.java:1106)
	... 48 more




Build Log:
[...truncated 11774 lines...]
   [junit4] Suite: org.apache.solr.cloud.autoscaling.AutoScalingHandlerTest
   [junit4]   2> 0    INFO  (SUITE-AutoScalingHandlerTest-seed#[5E759413D09EF7AE]-worker) [    ] o.a.s.SolrTestCaseJ4 SecureRandom sanity checks: test.solr.allowed.securerandom=null & java.security.egd=file:/dev/./urandom
   [junit4]   2> Creating dataDir: /x1/jenkins/jenkins-slave/workspace/Lucene-Solr-Tests-7.x/solr/build/solr-core/test/J2/temp/solr.cloud.autoscaling.AutoScalingHandlerTest_5E759413D09EF7AE-001/init-core-data-001
   [junit4]   2> 1747 INFO  (SUITE-AutoScalingHandlerTest-seed#[5E759413D09EF7AE]-worker) [    ] o.a.s.SolrTestCaseJ4 Using TrieFields (NUMERIC_POINTS_SYSPROP=false) w/NUMERIC_DOCVALUES_SYSPROP=true
   [junit4]   2> 2425 INFO  (SUITE-AutoScalingHandlerTest-seed#[5E759413D09EF7AE]-worker) [    ] o.e.j.u.log Logging initialized @25983ms to org.eclipse.jetty.util.log.Slf4jLog
   [junit4]   2> 2509 INFO  (SUITE-AutoScalingHandlerTest-seed#[5E759413D09EF7AE]-worker) [    ] o.a.s.SolrTestCaseJ4 Randomized ssl (true) and clientAuth (false) via: @org.apache.solr.util.RandomizeSSL(reason=, ssl=NaN, value=NaN, clientAuth=NaN)
   [junit4]   2> 5902 INFO  (SUITE-AutoScalingHandlerTest-seed#[5E759413D09EF7AE]-worker) [    ] o.a.s.c.MiniSolrCloudCluster Starting cluster of 2 servers in /x1/jenkins/jenkins-slave/workspace/Lucene-Solr-Tests-7.x/solr/build/solr-core/test/J2/temp/solr.cloud.autoscaling.AutoScalingHandlerTest_5E759413D09EF7AE-001/tempDir-001
   [junit4]   2> 5974 INFO  (SUITE-AutoScalingHandlerTest-seed#[5E759413D09EF7AE]-worker) [    ] o.a.s.c.ZkTestServer STARTING ZK TEST SERVER
   [junit4]   2> 6009 INFO  (Thread-1) [    ] o.a.s.c.ZkTestServer client port:0.0.0.0/0.0.0.0:0
   [junit4]   2> 6010 INFO  (Thread-1) [    ] o.a.s.c.ZkTestServer Starting server
   [junit4]   2> 6760 INFO  (SUITE-AutoScalingHandlerTest-seed#[5E759413D09EF7AE]-worker) [    ] o.a.s.c.ZkTestServer start zk server on port:41506
   [junit4]   2> 7708 WARN  (NIOServerCxn.Factory:0.0.0.0/0.0.0.0:0) [    ] o.a.z.s.NIOServerCnxn Exception causing close of session 0x0: ZooKeeperServer not running
   [junit4]   2> 8503 ERROR (Thread-1) [    ] o.a.z.s.ZooKeeperServer ZKShutdownHandler is not registered, so ZooKeeper server won't take any action on ERROR or SHUTDOWN server state changes
   [junit4]   2> 10257 INFO  (zkConnectionManagerCallback-4-thread-1) [    ] o.a.s.c.c.ConnectionManager zkClient has connected
   [junit4]   2> 10532 WARN  (NIOServerCxn.Factory:0.0.0.0/0.0.0.0:0) [    ] o.a.z.s.NIOServerCnxn Unable to read additional data from client sessionid 0x1042160735b0000, likely client has closed socket
   [junit4]   2> 14084 INFO  (jetty-launcher-1-thread-2) [    ] o.e.j.s.Server jetty-9.4.8.v20171121, build timestamp: 2017-11-21T22:27:37+01:00, git hash: 82b8fb23f757335bb3329d540ce37a2a2615f0a8
   [junit4]   2> 14119 INFO  (jetty-launcher-1-thread-1) [    ] o.e.j.s.Server jetty-9.4.8.v20171121, build timestamp: 2017-11-21T22:27:37+01:00, git hash: 82b8fb23f757335bb3329d540ce37a2a2615f0a8
   [junit4]   2> 14361 INFO  (jetty-launcher-1-thread-1) [    ] o.e.j.s.session DefaultSessionIdManager workerName=node0
   [junit4]   2> 14361 INFO  (jetty-launcher-1-thread-1) [    ] o.e.j.s.session No SessionScavenger set, using defaults
   [junit4]   2> 14373 INFO  (jetty-launcher-1-thread-1) [    ] o.e.j.s.session Scavenging every 660000ms
   [junit4]   2> 15381 INFO  (jetty-launcher-1-thread-2) [    ] o.e.j.s.session DefaultSessionIdManager workerName=node0
   [junit4]   2> 15437 INFO  (jetty-launcher-1-thread-2) [    ] o.e.j.s.session No SessionScavenger set, using defaults
   [junit4]   2> 15438 INFO  (jetty-launcher-1-thread-2) [    ] o.e.j.s.session Scavenging every 660000ms
   [junit4]   2> 15789 INFO  (jetty-launcher-1-thread-1) [    ] o.e.j.s.h.ContextHandler Started o.e.j.s.ServletContextHandler@4d23014d{/solr,null,AVAILABLE}
   [junit4]   2> 15790 INFO  (jetty-launcher-1-thread-2) [    ] o.e.j.s.h.ContextHandler Started o.e.j.s.ServletContextHandler@1830188c{/solr,null,AVAILABLE}
   [junit4]   2> 16641 INFO  (jetty-launcher-1-thread-1) [    ] o.e.j.s.AbstractConnector Started ServerConnector@22dc005a{SSL,[ssl, http/1.1]}{127.0.0.1:38245}
   [junit4]   2> 16642 INFO  (jetty-launcher-1-thread-1) [    ] o.e.j.s.Server Started @40325ms
   [junit4]   2> 16642 INFO  (jetty-launcher-1-thread-1) [    ] o.a.s.c.s.e.JettySolrRunner Jetty properties: {hostContext=/solr, hostPort=38245}
   [junit4]   2> 16810 INFO  (jetty-launcher-1-thread-2) [    ] o.e.j.s.AbstractConnector Started ServerConnector@2c764106{SSL,[ssl, http/1.1]}{127.0.0.1:58364}
   [junit4]   2> 16810 INFO  (jetty-launcher-1-thread-2) [    ] o.e.j.s.Server Started @40493ms
   [junit4]   2> 16810 INFO  (jetty-launcher-1-thread-2) [    ] o.a.s.c.s.e.JettySolrRunner Jetty properties: {hostContext=/solr, hostPort=58364}
   [junit4]   2> 16911 ERROR (jetty-launcher-1-thread-2) [    ] o.a.s.u.StartupLoggingUtils Missing Java Option solr.log.dir. Logging may be missing or incomplete.
   [junit4]   2> 16928 ERROR (jetty-launcher-1-thread-1) [    ] o.a.s.u.StartupLoggingUtils Missing Java Option solr.log.dir. Logging may be missing or incomplete.
   [junit4]   2> 16929 INFO  (jetty-launcher-1-thread-1) [    ] o.a.s.s.SolrDispatchFilter  ___      _       Welcome to Apache Solr? version 7.3.0
   [junit4]   2> 16948 INFO  (jetty-launcher-1-thread-2) [    ] o.a.s.s.SolrDispatchFilter  ___      _       Welcome to Apache Solr? version 7.3.0
   [junit4]   2> 16982 INFO  (jetty-launcher-1-thread-1) [    ] o.a.s.s.SolrDispatchFilter / __| ___| |_ _   Starting in cloud mode on port null
   [junit4]   2> 16982 INFO  (jetty-launcher-1-thread-1) [    ] o.a.s.s.SolrDispatchFilter \__ \/ _ \ | '_|  Install dir: null
   [junit4]   2> 16982 INFO  (jetty-launcher-1-thread-2) [    ] o.a.s.s.SolrDispatchFilter / __| ___| |_ _   Starting in cloud mode on port null
   [junit4]   2> 16984 INFO  (jetty-launcher-1-thread-2) [    ] o.a.s.s.SolrDispatchFilter \__ \/ _ \ | '_|  Install dir: null
   [junit4]   2> 17724 INFO  (jetty-launcher-1-thread-2) [    ] o.a.s.s.SolrDispatchFilter |___/\___/_|_|    Start time: 2018-02-01T12:25:35.886Z
   [junit4]   2> 17761 INFO  (jetty-launcher-1-thread-1) [    ] o.a.s.s.SolrDispatchFilter |___/\___/_|_|    Start time: 2018-02-01T12:25:35.885Z
   [junit4]   2> 18201 INFO  (jetty-launcher-1-thread-2) [    ] o.a.s.c.SolrResourceLoader solr home defaulted to 'solr/' (could not find system property or JNDI)
   [junit4]   2> 18336 INFO  (zkConnectionManagerCallback-8-thread-1) [    ] o.a.s.c.c.ConnectionManager zkClient has connected
   [junit4]   2> 18377 INFO  (jetty-launcher-1-thread-1) [    ] o.a.s.s.SolrDispatchFilter solr.xml found in ZooKeeper. Loading...
   [junit4]   2> 18398 INFO  (zkConnectionManagerCallback-6-thread-1) [    ] o.a.s.c.c.ConnectionManager zkClient has connected
   [junit4]   2> 18657 INFO  (jetty-launcher-1-thread-2) [    ] o.a.s.s.SolrDispatchFilter solr.xml found in ZooKeeper. Loading...
   [junit4]   2> 26012 INFO  (jetty-launcher-1-thread-2) [    ] o.a.s.c.ZkContainer Zookeeper client=127.0.0.1:41506/solr
   [junit4]   2> 26037 INFO  (jetty-launcher-1-thread-1) [    ] o.a.s.c.ZkContainer Zookeeper client=127.0.0.1:41506/solr
   [junit4]   2> 26286 INFO  (zkConnectionManagerCallback-14-thread-1) [    ] o.a.s.c.c.ConnectionManager zkClient has connected
   [junit4]   2> 26309 INFO  (zkConnectionManagerCallback-16-thread-1) [    ] o.a.s.c.c.ConnectionManager zkClient has connected
   [junit4]   2> 26805 INFO  (zkConnectionManagerCallback-20-thread-1-processing-n:127.0.0.1:58364_solr) [n:127.0.0.1:58364_solr    ] o.a.s.c.c.ConnectionManager zkClient has connected
   [junit4]   2> 26806 INFO  (zkConnectionManagerCallback-18-thread-1-processing-n:127.0.0.1:38245_solr) [n:127.0.0.1:38245_solr    ] o.a.s.c.c.ConnectionManager zkClient has connected
   [junit4]   2> 32613 INFO  (jetty-launcher-1-thread-1) [n:127.0.0.1:38245_solr    ] o.a.s.c.Overseer Overseer (id=null) closing
   [junit4]   2> 32635 INFO  (jetty-launcher-1-thread-1) [n:127.0.0.1:38245_solr    ] o.a.s.c.OverseerElectionContext I am going to be the leader 127.0.0.1:38245_solr
   [junit4]   2> 33009 INFO  (jetty-launcher-1-thread-1) [n:127.0.0.1:38245_solr    ] o.a.s.c.Overseer Overseer (id=73220192080691205-127.0.0.1:38245_solr-n_0000000000) starting
   [junit4]   2> 33203 INFO  (jetty-launcher-1-thread-2) [n:127.0.0.1:58364_solr    ] o.a.s.c.Overseer Overseer (id=null) closing
   [junit4]   2> 33243 INFO  (jetty-launcher-1-thread-2) [n:127.0.0.1:58364_solr    ] o.a.s.c.ZkController Register node as live in ZooKeeper:/live_nodes/127.0.0.1:58364_solr
   [junit4]   2> 33555 INFO  (zkCallback-19-thread-1-processing-n:127.0.0.1:58364_solr) [n:127.0.0.1:58364_solr    ] o.a.s.c.c.ZkStateReader Updated live nodes from ZooKeeper... (0) -> (1)
   [junit4]   2> 33746 INFO  (zkCallback-17-thread-1-processing-n:127.0.0.1:38245_solr) [n:127.0.0.1:38245_solr    ] o.a.s.c.c.ZkStateReader Updated live nodes from ZooKeeper... (0) -> (1)
   [junit4]   2> 35184 INFO  (jetty-launcher-1-thread-1) [n:127.0.0.1:38245_solr    ] o.a.s.c.ZkController Register node as live in ZooKeeper:/live_nodes/127.0.0.1:38245_solr
   [junit4]   2> 35363 INFO  (zkCallback-19-thread-1-processing-n:127.0.0.1:58364_solr) [n:127.0.0.1:58364_solr    ] o.a.s.c.c.ZkStateReader Updated live nodes from ZooKeeper... (1) -> (2)
   [junit4]   2> 35381 INFO  (OverseerStateUpdate-73220192080691205-127.0.0.1:38245_solr-n_0000000000) [n:127.0.0.1:38245_solr    ] o.a.s.c.c.ZkStateReader Updated live nodes from ZooKeeper... (1) -> (2)
   [junit4]   2> 40910 INFO  (jetty-launcher-1-thread-2) [n:127.0.0.1:58364_solr    ] o.a.s.m.r.SolrJmxReporter JMX monitoring for 'solr_58364.solr.node' (registry 'solr.node') enabled at server: com.sun.jmx.mbeanserver.JmxMBeanServer@29bb994b
   [junit4]   2> 40911 INFO  (jetty-launcher-1-thread-2) [n:127.0.0.1:58364_solr    ] o.a.s.m.r.SolrJmxReporter JMX monitoring for 'solr_58364.solr.jvm' (registry 'solr.jvm') enabled at server: com.sun.jmx.mbeanserver.JmxMBeanServer@29bb994b
   [junit4]   2> 40911 INFO  (jetty-launcher-1-thread-2) [n:127.0.0.1:58364_solr    ] o.a.s.m.r.SolrJmxReporter JMX monitoring for 'solr_58364.solr.jetty' (registry 'solr.jetty') enabled at server: com.sun.jmx.mbeanserver.JmxMBeanServer@29bb994b
   [junit4]   2> 40929 INFO  (jetty-launcher-1-thread-1) [n:127.0.0.1:38245_solr    ] o.a.s.m.r.SolrJmxReporter JMX monitoring for 'solr_38245.solr.node' (registry 'solr.node') enabled at server: com.sun.jmx.mbeanserver.JmxMBeanServer@29bb994b
   [junit4]   2> 40970 INFO  (jetty-launcher-1-thread-1) [n:127.0.0.1:38245_solr    ] o.a.s.m.r.SolrJmxReporter JMX monitoring for 'solr_38245.solr.jvm' (registry 'solr.jvm') enabled at server: com.sun.jmx.mbeanserver.JmxMBeanServer@29bb994b
   [junit4]   2> 40970 INFO  (jetty-launcher-1-thread-1) [n:127.0.0.1:38245_solr    ] o.a.s.m.r.SolrJmxReporter JMX monitoring for 'solr_38245.solr.jetty' (registry 'solr.jetty') enabled at server: com.sun.jmx.mbeanserver.JmxMBeanServer@29bb994b
   [junit4]   2> 41672 INFO  (jetty-launcher-1-thread-2) [n:127.0.0.1:58364_solr    ] o.a.s.c.CorePropertiesLocator Found 0 core definitions underneath /x1/jenkins/jenkins-slave/workspace/Lucene-Solr-Tests-7.x/solr/build/solr-core/test/J2/temp/solr.cloud.autoscaling.AutoScalingHandlerTest_5E759413D09EF7AE-001/tempDir-001/node2/.
   [junit4]   2> 41678 INFO  (jetty-launcher-1-thread-1) [n:127.0.0.1:38245_solr    ] o.a.s.c.CorePropertiesLocator Found 0 core definitions underneath /x1/jenkins/jenkins-slave/workspace/Lucene-Solr-Tests-7.x/solr/build/solr-core/test/J2/temp/solr.cloud.autoscaling.AutoScalingHandlerTest_5E759413D09EF7AE-001/tempDir-001/node1/.
   [junit4]   2> 43940 INFO  (zkConnectionManagerCallback-26-thread-1) [    ] o.a.s.c.c.ConnectionManager zkClient has connected
   [junit4]   2> 44167 INFO  (zkConnectionManagerCallback-30-thread-1) [    ] o.a.s.c.c.ConnectionManager zkClient has connected
   [junit4]   2> 44206 INFO  (SUITE-AutoScalingHandlerTest-seed#[5E759413D09EF7AE]-worker) [    ] o.a.s.c.c.ZkStateReader Updated live nodes from ZooKeeper... (0) -> (2)
   [junit4]   2> 44208 INFO  (SUITE-AutoScalingHandlerTest-seed#[5E759413D09EF7AE]-worker) [    ] o.a.s.c.s.i.ZkClientClusterStateProvider Cluster at 127.0.0.1:41506/solr ready
   [junit4]   2> 44645 INFO  (TEST-AutoScalingHandlerTest.testReadApi-seed#[5E759413D09EF7AE]) [    ] o.a.s.SolrTestCaseJ4 ###Starting testReadApi
   [junit4]   2> 51915 INFO  (qtp1363753776-24) [n:127.0.0.1:38245_solr    ] o.a.s.s.HttpSolrCall [admin] webapp=null path=/admin/metrics params={prefix=CONTAINER.fs.usableSpace,CORE.coreName&wt=javabin&version=2&group=solr.node,solr.core} status=0 QTime=41
   [junit4]   2> 54345 INFO  (qtp1859038655-37) [n:127.0.0.1:58364_solr    ] o.a.s.s.HttpSolrCall [admin] webapp=null path=/admin/metrics params={prefix=CONTAINER.fs.usableSpace,CORE.coreName&wt=javabin&version=2&group=solr.node,solr.core} status=0 QTime=17
   [junit4]   2> 54389 INFO  (qtp1363753776-27) [n:127.0.0.1:38245_solr    ] o.a.s.s.HttpSolrCall [admin] webapp=null path=/cluster/autoscaling params={wt=javabin&version=2} status=0 QTime=4184
   [junit4]   2> 54618 INFO  (qtp1363753776-29) [n:127.0.0.1:38245_solr    ] o.a.s.s.HttpSolrCall [admin] webapp=null path=/admin/metrics params={prefix=CONTAINER.fs.usableSpace,CORE.coreName&wt=javabin&version=2&group=solr.node,solr.core} status=0 QTime=1
   [junit4]   2> 54684 INFO  (qtp1859038655-36) [n:127.0.0.1:58364_solr    ] o.a.s.s.HttpSolrCall [admin] webapp=null path=/admin/metrics params={prefix=CONTAINER.fs.usableSpace,CORE.coreName&wt=javabin&version=2&group=solr.node,solr.core} status=0 QTime=1
   [junit4]   2> 54744 INFO  (qtp1859038655-37) [n:127.0.0.1:58364_solr    ] o.a.s.s.HttpSolrCall [admin] webapp=null path=/cluster/autoscaling params={wt=javabin&version=2} status=0 QTime=334
   [junit4]   2> 54864 INFO  (qtp1363753776-30) [n:127.0.0.1:38245_solr    ] o.a.s.s.HttpSolrCall [admin] webapp=null path=/admin/metrics params={prefix=CONTAINER.fs.usableSpace,CORE.coreName,os.systemLoadAverage,memory.heap.usage&wt=javabin&version=2&group=solr.jvm,solr.node,solr.core} status=0 QTime=3
   [junit4]   2> 54870 INFO  (qtp1859038655-39) [n:127.0.0.1:58364_solr    ] o.a.s.s.HttpSolrCall [admin] webapp=null path=/admin/metrics params={prefix=CONTAINER.fs.usableSpace,CORE.coreName,os.systemLoadAverage,memory.heap.usage&wt=javabin&version=2&group=solr.jvm,solr.node,solr.core} status=0 QTime=1
   [junit4]   2> 54874 INFO  (qtp1363753776-27) [n:127.0.0.1:38245_solr    ] o.a.s.s.HttpSolrCall [admin] webapp=null path=/cluster/autoscaling params={wt=javabin&version=2} status=0 QTime=119
   [junit4]   2> 54921 INFO  (qtp1363753776-24) [n:127.0.0.1:38245_solr    ] o.a.s.s.HttpSolrCall [admin] webapp=null path=/admin/metrics params={prefix=CONTAINER.fs.usableSpace,CORE.coreName,os.systemLoadAverage,memory.heap.usage&wt=javabin&version=2&group=solr.jvm,solr.node,solr.core} status=0 QTime=14
   [junit4]   2> 54997 INFO  (qtp1859038655-37) [n:127.0.0.1:58364_solr    ] o.a.s.s.HttpSolrCall [admin] webapp=null path=/admin/metrics params={prefix=CONTAINER.fs.usableSpace,CORE.coreName,os.systemLoadAverage,memory.heap.usage&wt=javabin&version=2&group=solr.jvm,solr.node,solr.core} status=0 QTime=0
   [junit4]   2> 55024 INFO  (qtp1363753776-27) [n:127.0.0.1:38245_solr    ] o.a.s.s.HttpSolrCall [admin] webapp=null path=/admin/autoscaling params={wt=javabin&version=2} status=0 QTime=145
   [junit4]   2> 55094 INFO  (qtp1363753776-27) [n:127.0.0.1:38245_solr    ] o.a.s.s.HttpSolrCall [admin] webapp=null path=/cluster/autoscaling params={wt=javabin&version=2} status=0 QTime=48
   [junit4]   2> 55170 INFO  (qtp1363753776-30) [n:127.0.0.1:38245_solr    ] o.a.s.s.HttpSolrCall [admin] webapp=null path=/admin/metrics params={prefix=CONTAINER.fs.usableSpace,CORE.coreName,os.systemLoadAverage,memory.heap.usage&wt=javabin&version=2&group=solr.jvm,solr.node,solr.core} status=0 QTime=0
   [junit4]   2> 55190 INFO  (qtp1859038655-39) [n:127.0.0.1:58364_solr    ] o.a.s.s.HttpSolrCall [admin] webapp=null path=/admin/metrics params={prefix=CONTAINER.fs.usableSpace,CORE.coreName,os.systemLoadAverage,memory.heap.usage&wt=javabin&version=2&group=solr.jvm,solr.node,solr.core} status=0 QTime=0
   [junit4]   2> 55230 INFO  (qtp1363753776-27) [n:127.0.0.1:38245_solr    ] o.a.s.s.HttpSolrCall [admin] webapp=null path=/admin/autoscaling/diagnostics params={wt=javabin&version=2} status=0 QTime=104
   [junit4]   2> 55433 INFO  (qtp1363753776-27) [n:127.0.0.1:38245_solr    ] o.a.s.h.a.CollectionsHandler Invoked Collection Action :create with params replicationFactor=6&collection.configName=conf&maxShardsPerNode=10&name=readApiTestViolations&nrtReplicas=6&action=CREATE&numShards=1&wt=javabin&version=2 and sendToOCPQueue=true
   [junit4]   2> 55461 INFO  (OverseerThreadFactory-12-thread-1-processing-n:127.0.0.1:38245_solr) [n:127.0.0.1:38245_solr    ] o.a.s.c.a.c.CreateCollectionCmd Create collection readApiTestViolations
   [junit4]   2> 55509 ERROR (OverseerThreadFactory-12-thread-1-processing-n:127.0.0.1:38245_solr) [n:127.0.0.1:38245_solr    ] o.a.s.c.a.c.OverseerCollectionMessageHandler Collection: readApiTestViolations operation: create failed:org.apache.solr.common.SolrException: 'maxShardsPerNode>0' is not supported when autoScaling policies are used
   [junit4]   2> 	at org.apache.solr.cloud.api.collections.CreateCollectionCmd.buildReplicaPositions(CreateCollectionCmd.java:293)
   [junit4]   2> 	at org.apache.solr.cloud.api.collections.CreateCollectionCmd.call(CreateCollectionCmd.java:122)
   [junit4]   2> 	at org.apache.solr.cloud.api.collections.OverseerCollectionMessageHandler.processMessage(OverseerCollectionMessageHandler.java:254)
   [junit4]   2> 	at org.apache.solr.cloud.OverseerTaskProcessor$Runner.run(OverseerTaskProcessor.java:469)
   [junit4]   2> 	at org.apache.solr.common.util.ExecutorUtil$MDCAwareThreadPoolExecutor.lambda$execute$0(ExecutorUtil.java:188)
   [junit4]   2> 	at java.util.concurrent.ThreadPoolExecutor.runWorker(ThreadPoolExecutor.java:1149)
   [junit4]   2> 	at java.util.concurrent.ThreadPoolExecutor$Worker.run(ThreadPoolExecutor.java:624)
   [junit4]   2> 	at java.lang.Thread.run(Thread.java:748)
   [junit4]   2> 
   [junit4]   2> 56199 INFO  (qtp1363753776-27) [n:127.0.0.1:38245_solr    ] o.a.s.s.HttpSolrCall [admin] webapp=null path=/admin/collections params={replicationFactor=6&collection.configName=conf&maxShardsPerNode=10&name=readApiTestViolations&nrtReplicas=6&action=CREATE&numShards=1&wt=javabin&version=2} status=400 QTime=934
   [junit4]   2> 56231 INFO  (OverseerCollectionConfigSetProcessor-73220192080691205-127.0.0.1:38245_solr-n_0000000000) [n:127.0.0.1:38245_solr    ] o.a.s.c.OverseerTaskQueue Response ZK path: /overseer/collection-queue-work/qnr-0000000000 doesn't exist.  Requestor may have disconnected from ZooKeeper
   [junit4]   2> 56282 INFO  (qtp1363753776-24) [n:127.0.0.1:38245_solr    ] o.a.s.s.HttpSolrCall [admin] webapp=null path=/admin/metrics params={prefix=CONTAINER.fs.usableSpace,CORE.coreName,os.systemLoadAverage,memory.heap.usage&wt=javabin&version=2&group=solr.jvm,solr.node,solr.core} status=0 QTime=0
   [junit4]   2> 56407 INFO  (qtp1859038655-37) [n:127.0.0.1:58364_solr    ] o.a.s.s.HttpSolrCall [admin] webapp=null path=/admin/metrics params={prefix=CONTAINER.fs.usableSpace,CORE.coreName,os.systemLoadAverage,memory.heap.usage&wt=javabin&version=2&group=solr.jvm,solr.node,solr.core} status=0 QTime=0
   [junit4]   2> 56437 INFO  (qtp1363753776-27) [n:127.0.0.1:38245_solr    ] o.a.s.s.HttpSolrCall [admin] webapp=null path=/admin/autoscaling params={wt=javabin&version=2} status=0 QTime=175
   [junit4]   2> 56463 INFO  (qtp1363753776-29) [n:127.0.0.1:38245_solr    ] o.a.s.h.a.CollectionsHandler Invoked Collection Action :create with params replicationFactor=6&collection.configName=conf&name=readApiTestViolations&nrtReplicas=6&action=CREATE&numShards=1&wt=javabin&version=2 and sendToOCPQueue=true
   [junit4]   2> 56581 INFO  (OverseerThreadFactory-12-thread-2-processing-n:127.0.0.1:38245_solr) [n:127.0.0.1:38245_solr    ] o.a.s.c.a.c.CreateCollectionCmd Create collection readApiTestViolations
   [junit4]   2> 56597 WARN  (OverseerThreadFactory-12-thread-2-processing-n:127.0.0.1:38245_solr) [n:127.0.0.1:38245_solr    ] o.a.s.c.a.c.CreateCollectionCmd Specified number of replicas of 6 on collection readApiTestViolations is higher than the number of Solr instances currently live or live and part of your createNodeSet(2). It's unusual to run two replica of the same slice on the same Solr-instance.
   [junit4]   2> 56793 INFO  (qtp1363753776-30) [n:127.0.0.1:38245_solr    ] o.a.s.s.HttpSolrCall [admin] webapp=null path=/admin/metrics params={prefix=CONTAINER.fs.usableSpace,CORE.coreName,os.systemLoadAverage,memory.heap.usage&wt=javabin&version=2&group=solr.jvm,solr.node,solr.core} status=0 QTime=18
   [junit4]   2> 56839 INFO  (qtp1859038655-39) [n:127.0.0.1:58364_solr    ] o.a.s.s.HttpSolrCall [admin] webapp=null path=/admin/metrics params={prefix=CONTAINER.fs.usableSpace,CORE.coreName,os.systemLoadAverage,memory.heap.usage&wt=javabin&version=2&group=solr.jvm,solr.node,solr.core} status=0 QTime=0
   [junit4]   2> 57345 INFO  (OverseerThreadFactory-12-thread-2-processing-n:127.0.0.1:38245_solr) [n:127.0.0.1:38245_solr    ] o.a.s.c.s.c.a.PolicyHelper returnSession, curr-time 17739888860 sessionWrapper.createTime 17739888356414277, this.sessionWrapper.createTime 17739888356414277 
   [junit4]   2> 57602 INFO  (OverseerStateUpdate-73220192080691205-127.0.0.1:38245_solr-n_0000000000) [n:127.0.0.1:38245_solr    ] o.a.s.c.o.SliceMutator createReplica() {
   [junit4]   2>   "operation":"ADDREPLICA",
   [junit4]   2>   "collection":"readApiTestViolations",
   [junit4]   2>   "shard":"shard1",
   [junit4]   2>   "core":"readApiTestViolations_shard1_replica_n1",
   [junit4]   2>   "state":"down",
   [junit4]   2>   "base_url":"https://127.0.0.1:38245/solr",
   [junit4]   2>   "type":"NRT",
   [junit4]   2>   "waitForFinalState":"false"} 
   [junit4]   2> 57935 INFO  (OverseerStateUpdate-73220192080691205-127.0.0.1:38245_solr-n_0000000000) [n:127.0.0.1:38245_solr    ] o.a.s.c.o.SliceMutator createReplica() {
   [junit4]   2>   "operation":"ADDREPLICA",
   [junit4]   2>   "collection":"readApiTestViolations",
   [junit4]   2>   "shard":"shard1",
   [junit4]   2>   "core":"readApiTestViolations_shard1_replica_n3",
   [junit4]   2>   "state":"down",
   [junit4]   2>   "base_url":"https://127.0.0.1:58364/solr",
   [junit4]   2>   "type":"NRT",
   [junit4]   2>   "waitForFinalState":"false"} 
   [junit4]   2> 57940 INFO  (OverseerStateUpdate-73220192080691205-127.0.0.1:38245_solr-n_0000000000) [n:127.0.0.1:38245_solr    ] o.a.s.c.o.SliceMutator createReplica() {
   [junit4]   2>   "operation":"ADDREPLICA",
   [junit4]   2>   "collection":"readApiTestViolations",
   [junit4]   2>   "shard":"shard1",
   [junit4]   2>   "core":"readApiTestViolations_shard1_replica_n4",
   [junit4]   2>   "state":"down",
   [junit4]   2>   "base_url":"https://127.0.0.1:38245/solr",
   [junit4]   2>   "type":"NRT",
   [junit4]   2>   "waitForFinalState":"false"} 
   [junit4]   2> 57951 INFO  (OverseerStateUpdate-73220192080691205-127.0.0.1:38245_solr-n_0000000000) [n:127.0.0.1:38245_solr    ] o.a.s.c.o.SliceMutator createReplica() {
   [junit4]   2>   "operation":"ADDREPLICA",
   [junit4]   2>   "collection":"readApiTestViolations",
   [junit4]   2>   "shard":"shard1",
   [junit4]   2>   "core":"readApiTestViolations_shard1_replica_n6",
   [junit4]   2>   "state":"down",
   [junit4]   2>   "base_url":"https://127.0.0.1:58364/solr",
   [junit4]   2>   "type":"NRT",
   [junit4]   2>   "waitForFinalState":"false"} 
   [junit4]   2> 57972 INFO  (OverseerStateUpdate-73220192080691205-127.0.0.1:38245_solr-n_0000000000) [n:127.0.0.1:38245_solr    ] o.a.s.c.o.SliceMutator createReplica() {
   [junit4]   2>   "operation":"ADDREPLICA",
   [junit4]   2>   "collection":"readApiTestViolations",
   [junit4]   2>   "shard":"shard1",
   [junit4]   2>   "core":"readApiTestViolations_shard1_replica_n9",
   [junit4]   2>   "state":"down",
   [junit4]   2>   "base_url":"https://127.0.0.1:38245/solr",
   [junit4]   2>   "type":"NRT",
   [junit4]   2>   "waitForFinalState":"false"} 
   [junit4]   2> 57992 INFO  (OverseerStateUpdate-73220192080691205-127.0.0.1:38245_solr-n_0000000000) [n:127.0.0.1:38245_solr    ] o.a.s.c.o.SliceMutator createReplica() {
   [junit4]   2>   "operation":"ADDREPLICA",
   [junit4]   2>   "collection":"readApiTestViolations",
   [junit4]   2>   "shard":"shard1",
   [junit4]   2>   "core":"readApiTestViolations_shard1_replica_n10",
   [junit4]   2>   "state":"down",
   [junit4]   2>   "base_url":"https://127.0.0.1:58364/solr",
   [junit4]   2>   "type":"NRT",
   [junit4]   2>   "waitForFinalState":"false"} 
   [junit4]   2> 58567 INFO  (qtp1363753776-24) [n:127.0.0.1:38245_solr    ] o.a.s.h.a.CoreAdminOperation core create command qt=/admin/cores&coreNodeName=core_node2&collection.configName=conf&newCollection=true&name=readApiTestViolations_shard1_replica_n1&action=CREATE&numShards=1&collection=readApiTestViolations&shard=shard1&wt=javabin&version=2&replicaType=NRT
   [junit4]   2> 58659 INFO  (qtp1363753776-24) [n:127.0.0.1:38245_solr    ] o.a.s.c.TransientSolrCoreCacheDefault Allocating transient cache for 2147483647 transient cores
   [junit4]   2> 58645 INFO  (qtp1363753776-97) [n:127.0.0.1:38245_solr    ] o.a.s.h.a.CoreAdminOperation core create command qt=/admin/cores&coreNodeName=core_node11&collection.configName=conf&newCollection=true&name=readApiTestViolations_shard1_replica_n9&action=CREATE&numShards=1&collection=readApiTestViolations&shard=shard1&wt=javabin&version=2&replicaType=NRT
   [junit4]   2> 58645 INFO  (qtp1859038655-33) [n:127.0.0.1:58364_solr    ] o.a.s.h.a.CoreAdminOperation core create command qt=/admin/cores&coreNodeName=core_node5&collection.configName=conf&newCollection=true&name=readApiTestViolations_shard1_replica_n3&action=CREATE&numShards=1&collection=readApiTestViolations&shard=shard1&wt=javabin&version=2&replicaType=NRT
   [junit4]   2> 58958 INFO  (qtp1859038655-33) [n:127.0.0.1:58364_solr    ] o.a.s.c.TransientSolrCoreCacheDefault Allocating transient cache for 2147483647 transient cores
   [junit4]   2> 59182 INFO  (qtp1363753776-27) [n:127.0.0.1:38245_solr    ] o.a.s.h.a.CoreAdminOperation core create command qt=/admin/cores&coreNodeName=core_node7&collection.configName=conf&newCollection=true&name=readApiTestViolations_shard1_replica_n4&action=CREATE&numShards=1&collection=readApiTestViolations&shard=shard1&wt=javabin&version=2&replicaType=NRT
   [junit4]   2> 59183 INFO  (qtp1859038655-39) [n:127.0.0.1:58364_solr    ] o.a.s.h.a.CoreAdminOperation core create command qt=/admin/cores&coreNodeName=core_node12&collection.configName=conf&newCollection=true&name=readApiTestViolations_shard1_replica_n10&action=CREATE&numShards=1&collection=readApiTestViolations&shard=shard1&wt=javabin&version=2&replicaType=NRT
   [junit4]   2> 59205 INFO  (qtp1859038655-36) [n:127.0.0.1:58364_solr    ] o.a.s.h.a.CoreAdminOperation core create command qt=/admin/cores&coreNodeName=core_node8&collection.configName=conf&newCollection=true&name=readApiTestViolations_shard1_replica_n6&action=CREATE&numShards=1&collection=readApiTestViolations&shard=shard1&wt=javabin&version=2&replicaType=NRT
   [junit4]   2> 59376 INFO  (zkCallback-17-thread-1-processing-n:127.0.0.1:38245_solr) [n:127.0.0.1:38245_solr    ] o.a.s.c.c.ZkStateReader A cluster state change: [WatchedEvent state:SyncConnected type:NodeDataChanged path:/collections/readApiTestViolations/state.json] for collection [readApiTestViolations] has occurred - updating... (live nodes size: [2])
   [junit4]   2> 59376 INFO  (zkCallback-19-thread-1-processing-n:127.0.0.1:58364_solr) [n:127.0.0.1:58364_solr    ] o.a.s.c.c.ZkStateReader A cluster state change: [WatchedEvent state:SyncConnected type:NodeDataChanged path:/collections/readApiTestViolations/state.json] for collection [readApiTestViolations] has occurred - updating... (live nodes size: [2])
   [junit4]   2> 59434 INFO  (zkCallback-19-thread-2-processing-n:127.0.0.1:58364_solr) [n:127.0.0.1:58364_solr    ] o.a.s.c.c.ZkStateReader A cluster state change: [WatchedEvent state:SyncConnected type:NodeDataChanged path:/collections/readApiTestViolations/state.json] for collection [readApiTestViolations] has occurred - updating... (live nodes size: [2])
   [junit4]   2> 60573 INFO  (qtp1363753776-24) [n:127.0.0.1:38245_solr c:readApiTestViolations s:shard1 r:core_node2 x:readApiTestViolations_shard1_replica_n1] o.a.s.c.SolrConfig Using Lucene MatchVersion: 7.3.0
   [junit4]   2> 60688 INFO  (qtp1859038655-36) [n:127.0.0.1:58364_solr c:readApiTestViolations s:shard1 r:core_node8 x:readApiTestViolations_shard1_replica_n6] o.a.s.c.SolrConfig Using Lucene MatchVersion: 7.3.0
   [junit4]   2> 60692 INFO  (qtp1859038655-33) [n:127.0.0.1:58364_solr c:readApiTestViolations s:shard1 r:core_node5 x:readApiTestViolations_shard1_replica_n3] o.a.s.c.SolrConfig Using Lucene MatchVersion: 7.3.0
   [junit4]   2> 60593 INFO  (qtp1363753776-27) [n:127.0.0.1:38245_solr c:readApiTestViolations s:shard1 r:core_node7 x:readApiTestViolations_shard1_replica_n4] o.a.s.c.SolrConfig Using Lucene MatchVersion: 7.3.0
   [junit4]   2> 60696 INFO  (qtp1363753776-97) [n:127.0.0.1:38245_solr c:readApiTestViolations s:shard1 r:core_node11 x:readApiTestViolations_shard1_replica_n9] o.a.s.c.SolrConfig Using Lucene MatchVersion: 7.3.0
   [junit4]   2> 60759 INFO  (qtp1859038655-39) [n:127.0.0.1:58364_solr c:readApiTestViolations s:shard1 r:core_node12 x:readApiTestViolations_shard1_replica_n10] o.a.s.c.SolrConfig Using Lucene MatchVersion: 7.3.0
   [junit4]   2> 63337 INFO  (qtp1363753776-97) [n:127.0.0.1:38245_solr c:readApiTestViolations s:shard1 r:core_node11 x:readApiTestViolations_shard1_replica_n9] o.a.s.s.IndexSchema [readApiTestViolations_shard1_replica_n9] Schema name=minimal
   [junit4]   2> 63339 INFO  (qtp1859038655-39) [n:127.0.0.1:58364_solr c:readApiTestViolations s:shard1 r:core_node12 x:readApiTestViolations_shard1_replica_n10] o.a.s.s.IndexSchema [readApiTestViolations_shard1_replica_n10] Schema name=minimal
   [junit4]   2> 63510 INFO  (qtp1363753776-27) [n:127.0.0.1:38245_solr c:readApiTestViolations s:shard1 r:core_node7 x:readApiTestViolations_shard1_replica_n4] o.a.s.s.IndexSchema [readApiTestViolations_shard1_replica_n4] Schema name=minimal
   [junit4]   2> 63522 INFO  (qtp1363753776-24) [n:127.0.0.1:38245_solr c:readApiTestViolations s:shard1 r:core_node2 x:readApiTestViolations_shard1_replica_n1] o.a.s.s.IndexSchema [readApiTestViolations_shard1_replica_n1] Schema name=minimal
   [junit4]   2> 64260 WARN  (qtp1363753776-97) [n:127.0.0.1:38245_solr c:readApiTestViolations s:shard1 r:core_node11 x:readApiTestViolations_shard1_replica_n9] o.a.s.c.SolrResourceLoader Solr loaded a deprecated plugin/analysis class [solr.TrieIntField]. Please consult documentation how to replace it accordingly.
   [junit4]   2> 64101 WARN  (qtp1363753776-27) [n:127.0.0.1:38245_solr c:readApiTestViolations s:shard1 r:core_node7 x:readApiTestViolations_shard1_replica_n4] o.a.s.c.SolrResourceLoader Solr loaded a deprecated plugin/analysis class [solr.TrieIntField]. Please consult documentation how to replace it accordingly.
   [junit4]   2> 64100 WARN  (qtp1859038655-39) [n:127.0.0.1:58364_solr c:readApiTestViolations s:shard1 r:core_node12 x:readApiTestViolations_shard1_replica_n10] o.a.s.c.SolrResourceLoader Solr loaded a deprecated plugin/analysis class [solr.TrieIntField]. Please consult documentation how to replace it accordingly.
   [junit4]   2> 63956 INFO  (qtp1859038655-33) [n:127.0.0.1:58364_solr c:readApiTestViolations s:shard1 r:core_node5 x:readApiTestViolations_shard1_replica_n3] o.a.s.s.IndexSchema [readApiTestViolations_shard1_replica_n3] Schema name=minimal
   [junit4]   2> 63924 INFO  (qtp1859038655-36) [n:127.0.0.1:58364_solr c:readApiTestViolations s:shard1 r:core_node8 x:readApiTestViolations_shard1_replica_n6] o.a.s.s.IndexSchema [readApiTestViolations_shard1_replica_n6] Schema name=minimal
   [junit4]   2> 64605 WARN  (qtp1363753776-27) [n:127.0.0.1:38245_solr c:readApiTestViolations s:shard1 r:core_node7 x:readApiTestViolations_shard1_replica_n4] o.a.s.c.SolrResourceLoader Solr loaded a deprecated plugin/analysis class [solr.TrieLongField]. Please consult documentation how to replace it accordingly.
   [junit4]   2> 64624 WARN  (qtp1859038655-36) [n:127.0.0.1:58364_solr c:readApiTestViolations s:shard1 r:core_node8 x:readApiTestViolations_shard1_replica_n6] o.a.s.c.SolrResourceLoader Solr loaded a deprecated plugin/analysis class [solr.TrieLongField]. Pleas

[...truncated too long message...]

2> 10928548 INFO  (TEST-ShardSplitTest.testSplitStaticIndexReplication-seed#[5E759413D09EF7AE]) [    ] o.a.s.m.SolrMetricManager Closing metric reporters for registry=solr.cluster, tag=null
   [junit4]   2> 10928548 INFO  (zkCallback-6901-thread-1-processing-n:127.0.0.1:47248_ld_%2Fax) [n:127.0.0.1:47248_ld_%2Fax    ] o.a.s.c.c.ZkStateReader Updated live nodes from ZooKeeper... (1) -> (0)
   [junit4]   2> 10928566 INFO  (coreCloseExecutor-7135-thread-1) [n:127.0.0.1:47248_ld_%2Fax c:collection1 s:shard1 r:core_node48 x:collection1_shard1_replica_t47] o.a.s.c.SolrCore [collection1_shard1_replica_t47]  CLOSING SolrCore org.apache.solr.core.SolrCore@66bd7fe9
   [junit4]   2> 10928566 INFO  (coreCloseExecutor-7135-thread-1) [n:127.0.0.1:47248_ld_%2Fax c:collection1 s:shard1 r:core_node48 x:collection1_shard1_replica_t47] o.a.s.m.SolrMetricManager Closing metric reporters for registry=solr.core.collection1.shard1.replica_t47, tag=1723695081
   [junit4]   2> 10928566 INFO  (coreCloseExecutor-7135-thread-1) [n:127.0.0.1:47248_ld_%2Fax c:collection1 s:shard1 r:core_node48 x:collection1_shard1_replica_t47] o.a.s.m.r.SolrJmxReporter Closing reporter [org.apache.solr.metrics.reporters.SolrJmxReporter@780f3ed9: rootName = null, domain = solr.core.collection1.shard1.replica_t47, service url = null, agent id = null] for registry solr.core.collection1.shard1.replica_t47 / com.codahale.metrics.MetricRegistry@173c496b
   [junit4]   2> 10928732 INFO  (coreCloseExecutor-7135-thread-1) [n:127.0.0.1:47248_ld_%2Fax c:collection1 s:shard1 r:core_node48 x:collection1_shard1_replica_t47] o.a.s.m.SolrMetricManager Closing metric reporters for registry=solr.collection.collection1.shard1.leader, tag=1723695081
   [junit4]   2> 10928737 INFO  (TEST-ShardSplitTest.testSplitStaticIndexReplication-seed#[5E759413D09EF7AE]) [    ] o.a.s.c.Overseer Overseer (id=73220899329015827-127.0.0.1:47248_ld_%2Fax-n_0000000004) closing
   [junit4]   2> 10928738 INFO  (OverseerStateUpdate-73220899329015827-127.0.0.1:47248_ld_%2Fax-n_0000000004) [n:127.0.0.1:47248_ld_%2Fax    ] o.a.s.c.Overseer Overseer Loop exiting : 127.0.0.1:47248_ld_%2Fax
   [junit4]   2> 10928738 WARN  (OverseerAutoScalingTriggerThread-73220899329015827-127.0.0.1:47248_ld_%2Fax-n_0000000004) [n:127.0.0.1:47248_ld_%2Fax    ] o.a.s.c.a.OverseerTriggerThread OverseerTriggerThread woken up but we are closed, exiting.
   [junit4]   2> 10928794 INFO  (TEST-ShardSplitTest.testSplitStaticIndexReplication-seed#[5E759413D09EF7AE]) [    ] o.e.j.s.AbstractConnector Stopped ServerConnector@53aa91e3{HTTP/1.1,[http/1.1]}{127.0.0.1:0}
   [junit4]   2> 10928794 INFO  (TEST-ShardSplitTest.testSplitStaticIndexReplication-seed#[5E759413D09EF7AE]) [    ] o.e.j.s.h.ContextHandler Stopped o.e.j.s.ServletContextHandler@5b60d898{/ld_/ax,null,UNAVAILABLE}
   [junit4]   2> 10928794 INFO  (TEST-ShardSplitTest.testSplitStaticIndexReplication-seed#[5E759413D09EF7AE]) [    ] o.e.j.s.session Stopped scavenging
   [junit4]   2> 10929103 INFO  (TEST-ShardSplitTest.testSplitStaticIndexReplication-seed#[5E759413D09EF7AE]) [    ] o.a.s.c.ChaosMonkey monkey: stop jetty! 33819
   [junit4]   2> 10929103 ERROR (TEST-ShardSplitTest.testSplitStaticIndexReplication-seed#[5E759413D09EF7AE]) [    ] o.a.z.s.ZooKeeperServer ZKShutdownHandler is not registered, so ZooKeeper server won't take any action on ERROR or SHUTDOWN server state changes
   [junit4]   2> 10929130 INFO  (TEST-ShardSplitTest.testSplitStaticIndexReplication-seed#[5E759413D09EF7AE]) [    ] o.a.s.c.ZkTestServer connecting to 127.0.0.1:55377 55377
   [junit4]   2> 10929422 INFO  (Thread-4420) [    ] o.a.s.c.ZkTestServer connecting to 127.0.0.1:55377 55377
   [junit4]   2> 10929422 WARN  (Thread-4420) [    ] o.a.s.c.ZkTestServer Watch limit violations: 
   [junit4]   2> Maximum concurrent create/delete watches above limit:
   [junit4]   2> 
   [junit4]   2> 	10	/solr/aliases.json
   [junit4]   2> 	6	/solr/security.json
   [junit4]   2> 	6	/solr/configs/conf1
   [junit4]   2> 	6	/solr/collections/collection1/terms/shard1
   [junit4]   2> 	6	/solr/collections/testSplitStaticIndexReplication/terms/shard1_0
   [junit4]   2> 	5	/solr/collections/collection1/state.json
   [junit4]   2> 	5	/solr/collections/collection1/terms/shard2
   [junit4]   2> 	3	/solr/collections/testSplitStaticIndexReplication/terms/shard1_1
   [junit4]   2> 	3	/solr/collections/testSplitStaticIndexReplication/terms/shard1
   [junit4]   2> 	2	/solr/collections/control_collection/terms/shard1
   [junit4]   2> 
   [junit4]   2> Maximum concurrent data watches above limit:
   [junit4]   2> 
   [junit4]   2> 	10	/solr/clusterprops.json
   [junit4]   2> 	10	/solr/clusterstate.json
   [junit4]   2> 	4	/solr/collections/testSplitStaticIndexReplication/state.json
   [junit4]   2> 	4	/solr/autoscaling.json
   [junit4]   2> 	2	/solr/overseer_elect/election/73220899329015817-127.0.0.1:46629_ld_%2Fax-n_0000000001
   [junit4]   2> 
   [junit4]   2> Maximum concurrent children watches above limit:
   [junit4]   2> 
   [junit4]   2> 	10	/solr/live_nodes
   [junit4]   2> 	10	/solr/collections
   [junit4]   2> 	4	/solr/overseer/queue
   [junit4]   2> 	4	/solr/autoscaling/events/.auto_add_replicas
   [junit4]   2> 	4	/solr/overseer/collection-queue-work
   [junit4]   2> 	4	/solr/overseer/queue-work
   [junit4]   2> 
   [junit4]   2> NOTE: leaving temporary files on disk at: /x1/jenkins/jenkins-slave/workspace/Lucene-Solr-Tests-7.x/solr/build/solr-core/test/J1/temp/solr.cloud.api.collections.ShardSplitTest_5E759413D09EF7AE-001
   [junit4]   2> Feb 01, 2018 3:27:25 PM com.carrotsearch.randomizedtesting.ThreadLeakControl checkThreadLeaks
   [junit4]   2> WARNING: Will linger awaiting termination of 1 leaked thread(s).
   [junit4]   2> NOTE: test params are: codec=Asserting(Lucene70): {shard_s=PostingsFormat(name=Memory), rnd_b=PostingsFormat(name=Asserting), a_t=PostingsFormat(name=Memory), id=PostingsFormat(name=Asserting)}, docValues:{shard_s=DocValuesFormat(name=Lucene70), rnd_b=DocValuesFormat(name=Memory), _version_=DocValuesFormat(name=Asserting), n_ti=DocValuesFormat(name=Lucene70), a_t=DocValuesFormat(name=Lucene70), a_i=DocValuesFormat(name=Memory), id=DocValuesFormat(name=Memory)}, maxPointsInLeafNode=1613, maxMBSortInHeap=6.918001884944582, sim=RandomSimilarity(queryNorm=false): {}, locale=bg-BG, timezone=Australia/Victoria
   [junit4]   2> NOTE: Linux 3.13.0-88-generic amd64/Oracle Corporation 1.8.0_144 (64-bit)/cpus=4,threads=1,free=138599000,total=524288000
   [junit4]   2> NOTE: All tests run in this JVM: [BlockJoinFacetDistribTest, TestReversedWildcardFilterFactory, DistributedFacetPivotSmallTest, DirectoryFactoryTest, SolrMetricManagerTest, CurrencyRangeFacetCloudTest, TestSkipOverseerOperations, AsyncCallRequestStatusResponseTest, DocumentBuilderTest, TestNumericTerms32, DistanceUnitsTest, TestRebalanceLeaders, BaseCdcrDistributedZkTest, UpdateRequestProcessorFactoryTest, TestDistributedGrouping, TestRTGBase, LegacyCloudClusterPropTest, QueryEqualityTest, TestSolr4Spatial2, TriggerIntegrationTest, QueryParsingTest, BasicZkTest, DistributedQueryComponentOptimizationTest, TestAuthorizationFramework, TestStandardQParsers, BigEndianAscendingWordDeserializerTest, RestartWhileUpdatingTest, BasicAuthIntegrationTest, TestDocBasedVersionConstraints, TimeRoutedAliasUpdateProcessorTest, TestScoreJoinQPNoScore, SearchHandlerTest, TestSolrIndexConfig, StressHdfsTest, ZkShardTermsTest, HdfsLockFactoryTest, TestLeaderInitiatedRecoveryThread, SpatialHeatmapFacetsTest, TestConfigSetsAPIExclusivity, TestConfigSetImmutable, ConfigSetsAPITest, TestQueryUtils, MultiThreadedOCPTest, TestJettySolrRunner, PropertiesRequestHandlerTest, TestCoreBackup, SolrJmxReporterTest, SaslZkACLProviderTest, TestSchemaManager, TestFilteredDocIdSet, PeerSyncTest, TestSha256AuthenticationProvider, UninvertDocValuesMergePolicyTest, TestMacroExpander, TestSegmentSorting, TestSolrCloudWithSecureImpersonation, DistributedFacetPivotLargeTest, TestSubQueryTransformerDistrib, TestFieldCacheVsDocValues, TestDynamicFieldCollectionResource, TestDeleteCollectionOnDownNodes, TestJsonFacetRefinement, SchemaApiFailureTest, TestCloudSearcherWarming, SearchRateTriggerTest, HdfsNNFailoverTest, SampleTest, TestDistributedStatsComponentCardinality, TestExportWriter, TestUseDocValuesAsStored2, TestOrdValues, PeerSyncReplicationTest, TestManagedStopFilterFactory, TestElisionMultitermQuery, TestFuzzyAnalyzedSuggestions, ExecutePlanActionTest, TestSolrCloudSnapshots, IgnoreCommitOptimizeUpdateProcessorFactoryTest, TestLargeCluster, TermsComponentTest, SuggesterFSTTest, PrimUtilsTest, DistributedMLTComponentTest, DeleteStatusTest, TestXmlQParser, HdfsBasicDistributedZkTest, TestLRUCache, OverseerRolesTest, TestExactSharedStatsCache, AddBlockUpdateTest, ExplicitHLLTest, TestQueryWrapperFilter, CoreMergeIndexesAdminHandlerTest, TestPostingsSolrHighlighter, SolrCloudExampleTest, TestSearchPerf, TestExclusionRuleCollectionAccess, ZkControllerTest, SolrInfoBeanTest, TestFreeTextSuggestions, SoftAutoCommitTest, CachingDirectoryFactoryTest, TestPivotHelperCode, FileUtilsTest, DistributedDebugComponentTest, SimplePostToolTest, SolrShardReporterTest, TestSolrJ, SolrCoreTest, TestAnalyzeInfixSuggestions, TestReload, TestPullReplicaErrorHandling, TestSchemaNameResource, AddReplicaTest, TestCollectionsAPIViaSolrCloudCluster, ClassificationUpdateProcessorTest, BlockDirectoryTest, TestSQLHandlerNonCloud, TestStressRecovery, TestConfigsApi, TestTrie, TestTolerantUpdateProcessorRandomCloud, TestImplicitCoreProperties, HttpPartitionTest, CSVRequestHandlerTest, OverriddenZkACLAndCredentialsProvidersTest, DistributedIntervalFacetingTest, CollectionStateFormat2Test, ConcurrentCreateRoutedAliasTest, ForceLeaderTest, TestCloudRecovery, TestLeaderElectionWithEmptyReplica, TestPrepRecovery, TestStressCloudBlindAtomicUpdates, TestStressLiveNodes, AssignTest, ShardSplitTest]
   [junit4] Completed [623/773 (10!)] on J1 in 763.97s, 5 tests, 1 failure <<< FAILURES!

[...truncated 48726 lines...]

Mime
View raw message