lucene-dev mailing list archives

Site index · List index
Message view « Date » · « Thread »
Top « Date » · « Thread »
From Apache Jenkins Server <jenk...@builds.apache.org>
Subject [JENKINS] Lucene-Solr-Tests-7.x - Build # 434 - Still Unstable
Date Thu, 22 Feb 2018 12:27:34 GMT
Build: https://builds.apache.org/job/Lucene-Solr-Tests-7.x/434/

6 tests failed.
FAILED:  org.apache.solr.handler.extraction.TestExtractionDateUtil.testParseDate

Error Message:
Incorrect parsed timestamp: 1226583351000 != 1226579751000 (Thu Nov 13 04:35:51 AKST 2008)

Stack Trace:
java.lang.AssertionError: Incorrect parsed timestamp: 1226583351000 != 1226579751000 (Thu Nov 13 04:35:51 AKST 2008)
	at __randomizedtesting.SeedInfo.seed([4CE51B213315124B:6FC631448BC65FE]:0)
	at org.junit.Assert.fail(Assert.java:93)
	at org.junit.Assert.assertTrue(Assert.java:43)
	at org.apache.solr.handler.extraction.TestExtractionDateUtil.assertParsedDate(TestExtractionDateUtil.java:59)
	at org.apache.solr.handler.extraction.TestExtractionDateUtil.testParseDate(TestExtractionDateUtil.java:54)
	at sun.reflect.NativeMethodAccessorImpl.invoke0(Native Method)
	at sun.reflect.NativeMethodAccessorImpl.invoke(NativeMethodAccessorImpl.java:62)
	at sun.reflect.DelegatingMethodAccessorImpl.invoke(DelegatingMethodAccessorImpl.java:43)
	at java.lang.reflect.Method.invoke(Method.java:498)
	at com.carrotsearch.randomizedtesting.RandomizedRunner.invoke(RandomizedRunner.java:1737)
	at com.carrotsearch.randomizedtesting.RandomizedRunner$8.evaluate(RandomizedRunner.java:934)
	at com.carrotsearch.randomizedtesting.RandomizedRunner$9.evaluate(RandomizedRunner.java:970)
	at com.carrotsearch.randomizedtesting.RandomizedRunner$10.evaluate(RandomizedRunner.java:984)
	at org.apache.lucene.util.TestRuleSetupTeardownChained$1.evaluate(TestRuleSetupTeardownChained.java:49)
	at org.apache.lucene.util.AbstractBeforeAfterRule$1.evaluate(AbstractBeforeAfterRule.java:45)
	at org.apache.lucene.util.TestRuleThreadAndTestName$1.evaluate(TestRuleThreadAndTestName.java:48)
	at org.apache.lucene.util.TestRuleIgnoreAfterMaxFailures$1.evaluate(TestRuleIgnoreAfterMaxFailures.java:64)
	at org.apache.lucene.util.TestRuleMarkFailure$1.evaluate(TestRuleMarkFailure.java:47)
	at com.carrotsearch.randomizedtesting.rules.StatementAdapter.evaluate(StatementAdapter.java:36)
	at com.carrotsearch.randomizedtesting.ThreadLeakControl$StatementRunner.run(ThreadLeakControl.java:368)
	at com.carrotsearch.randomizedtesting.ThreadLeakControl.forkTimeoutingTask(ThreadLeakControl.java:817)
	at com.carrotsearch.randomizedtesting.ThreadLeakControl$3.evaluate(ThreadLeakControl.java:468)
	at com.carrotsearch.randomizedtesting.RandomizedRunner.runSingleTest(RandomizedRunner.java:943)
	at com.carrotsearch.randomizedtesting.RandomizedRunner$5.evaluate(RandomizedRunner.java:829)
	at com.carrotsearch.randomizedtesting.RandomizedRunner$6.evaluate(RandomizedRunner.java:879)
	at com.carrotsearch.randomizedtesting.RandomizedRunner$7.evaluate(RandomizedRunner.java:890)
	at org.apache.lucene.util.AbstractBeforeAfterRule$1.evaluate(AbstractBeforeAfterRule.java:45)
	at com.carrotsearch.randomizedtesting.rules.StatementAdapter.evaluate(StatementAdapter.java:36)
	at org.apache.lucene.util.TestRuleStoreClassName$1.evaluate(TestRuleStoreClassName.java:41)
	at com.carrotsearch.randomizedtesting.rules.NoShadowingOrOverridesOnMethodsRule$1.evaluate(NoShadowingOrOverridesOnMethodsRule.java:40)
	at com.carrotsearch.randomizedtesting.rules.NoShadowingOrOverridesOnMethodsRule$1.evaluate(NoShadowingOrOverridesOnMethodsRule.java:40)
	at com.carrotsearch.randomizedtesting.rules.StatementAdapter.evaluate(StatementAdapter.java:36)
	at com.carrotsearch.randomizedtesting.rules.StatementAdapter.evaluate(StatementAdapter.java:36)
	at com.carrotsearch.randomizedtesting.rules.StatementAdapter.evaluate(StatementAdapter.java:36)
	at org.apache.lucene.util.TestRuleAssertionsRequired$1.evaluate(TestRuleAssertionsRequired.java:53)
	at org.apache.lucene.util.TestRuleMarkFailure$1.evaluate(TestRuleMarkFailure.java:47)
	at org.apache.lucene.util.TestRuleIgnoreAfterMaxFailures$1.evaluate(TestRuleIgnoreAfterMaxFailures.java:64)
	at org.apache.lucene.util.TestRuleIgnoreTestSuites$1.evaluate(TestRuleIgnoreTestSuites.java:54)
	at com.carrotsearch.randomizedtesting.rules.StatementAdapter.evaluate(StatementAdapter.java:36)
	at com.carrotsearch.randomizedtesting.ThreadLeakControl$StatementRunner.run(ThreadLeakControl.java:368)
	at java.lang.Thread.run(Thread.java:748)


FAILED:  junit.framework.TestSuite.org.apache.solr.cloud.ReplaceNodeTest

Error Message:
1 thread leaked from SUITE scope at org.apache.solr.cloud.ReplaceNodeTest:     1) Thread[id=24544, name=qtp1376091525-24544, state=TIMED_WAITING, group=TGRP-ReplaceNodeTest]         at sun.misc.Unsafe.park(Native Method)         at java.util.concurrent.locks.LockSupport.parkNanos(LockSupport.java:215)         at java.util.concurrent.locks.AbstractQueuedSynchronizer$ConditionObject.await(AbstractQueuedSynchronizer.java:2163)         at org.eclipse.jetty.util.thread.ReservedThreadExecutor$ReservedThread.reservedWait(ReservedThreadExecutor.java:308)         at org.eclipse.jetty.util.thread.ReservedThreadExecutor$ReservedThread.run(ReservedThreadExecutor.java:373)         at org.eclipse.jetty.util.thread.QueuedThreadPool.runJob(QueuedThreadPool.java:708)         at org.eclipse.jetty.util.thread.QueuedThreadPool$2.run(QueuedThreadPool.java:626)         at java.lang.Thread.run(Thread.java:748)

Stack Trace:
com.carrotsearch.randomizedtesting.ThreadLeakError: 1 thread leaked from SUITE scope at org.apache.solr.cloud.ReplaceNodeTest: 
   1) Thread[id=24544, name=qtp1376091525-24544, state=TIMED_WAITING, group=TGRP-ReplaceNodeTest]
        at sun.misc.Unsafe.park(Native Method)
        at java.util.concurrent.locks.LockSupport.parkNanos(LockSupport.java:215)
        at java.util.concurrent.locks.AbstractQueuedSynchronizer$ConditionObject.await(AbstractQueuedSynchronizer.java:2163)
        at org.eclipse.jetty.util.thread.ReservedThreadExecutor$ReservedThread.reservedWait(ReservedThreadExecutor.java:308)
        at org.eclipse.jetty.util.thread.ReservedThreadExecutor$ReservedThread.run(ReservedThreadExecutor.java:373)
        at org.eclipse.jetty.util.thread.QueuedThreadPool.runJob(QueuedThreadPool.java:708)
        at org.eclipse.jetty.util.thread.QueuedThreadPool$2.run(QueuedThreadPool.java:626)
        at java.lang.Thread.run(Thread.java:748)
	at __randomizedtesting.SeedInfo.seed([5EF3A043CD943FF9]:0)


FAILED:  junit.framework.TestSuite.org.apache.solr.cloud.ReplaceNodeTest

Error Message:
There are still zombie threads that couldn't be terminated:    1) Thread[id=24544, name=qtp1376091525-24544, state=TIMED_WAITING, group=TGRP-ReplaceNodeTest]         at sun.misc.Unsafe.park(Native Method)         at java.util.concurrent.locks.LockSupport.parkNanos(LockSupport.java:215)         at java.util.concurrent.locks.AbstractQueuedSynchronizer$ConditionObject.await(AbstractQueuedSynchronizer.java:2163)         at org.eclipse.jetty.util.thread.ReservedThreadExecutor$ReservedThread.reservedWait(ReservedThreadExecutor.java:308)         at org.eclipse.jetty.util.thread.ReservedThreadExecutor$ReservedThread.run(ReservedThreadExecutor.java:373)         at org.eclipse.jetty.util.thread.QueuedThreadPool.runJob(QueuedThreadPool.java:708)         at org.eclipse.jetty.util.thread.QueuedThreadPool$2.run(QueuedThreadPool.java:626)         at java.lang.Thread.run(Thread.java:748)

Stack Trace:
com.carrotsearch.randomizedtesting.ThreadLeakError: There are still zombie threads that couldn't be terminated:
   1) Thread[id=24544, name=qtp1376091525-24544, state=TIMED_WAITING, group=TGRP-ReplaceNodeTest]
        at sun.misc.Unsafe.park(Native Method)
        at java.util.concurrent.locks.LockSupport.parkNanos(LockSupport.java:215)
        at java.util.concurrent.locks.AbstractQueuedSynchronizer$ConditionObject.await(AbstractQueuedSynchronizer.java:2163)
        at org.eclipse.jetty.util.thread.ReservedThreadExecutor$ReservedThread.reservedWait(ReservedThreadExecutor.java:308)
        at org.eclipse.jetty.util.thread.ReservedThreadExecutor$ReservedThread.run(ReservedThreadExecutor.java:373)
        at org.eclipse.jetty.util.thread.QueuedThreadPool.runJob(QueuedThreadPool.java:708)
        at org.eclipse.jetty.util.thread.QueuedThreadPool$2.run(QueuedThreadPool.java:626)
        at java.lang.Thread.run(Thread.java:748)
	at __randomizedtesting.SeedInfo.seed([5EF3A043CD943FF9]:0)


FAILED:  org.apache.solr.cloud.autoscaling.TriggerIntegrationTest.testEventQueue

Error Message:
action wasn't interrupted

Stack Trace:
java.lang.AssertionError: action wasn't interrupted
	at __randomizedtesting.SeedInfo.seed([5EF3A043CD943FF9:9746E2EDC4F3F90C]:0)
	at org.junit.Assert.fail(Assert.java:93)
	at org.junit.Assert.assertTrue(Assert.java:43)
	at org.apache.solr.cloud.autoscaling.TriggerIntegrationTest.testEventQueue(TriggerIntegrationTest.java:726)
	at sun.reflect.NativeMethodAccessorImpl.invoke0(Native Method)
	at sun.reflect.NativeMethodAccessorImpl.invoke(NativeMethodAccessorImpl.java:62)
	at sun.reflect.DelegatingMethodAccessorImpl.invoke(DelegatingMethodAccessorImpl.java:43)
	at java.lang.reflect.Method.invoke(Method.java:498)
	at com.carrotsearch.randomizedtesting.RandomizedRunner.invoke(RandomizedRunner.java:1737)
	at com.carrotsearch.randomizedtesting.RandomizedRunner$8.evaluate(RandomizedRunner.java:934)
	at com.carrotsearch.randomizedtesting.RandomizedRunner$9.evaluate(RandomizedRunner.java:970)
	at com.carrotsearch.randomizedtesting.RandomizedRunner$10.evaluate(RandomizedRunner.java:984)
	at com.carrotsearch.randomizedtesting.rules.SystemPropertiesRestoreRule$1.evaluate(SystemPropertiesRestoreRule.java:57)
	at org.apache.lucene.util.TestRuleSetupTeardownChained$1.evaluate(TestRuleSetupTeardownChained.java:49)
	at org.apache.lucene.util.AbstractBeforeAfterRule$1.evaluate(AbstractBeforeAfterRule.java:45)
	at org.apache.lucene.util.TestRuleThreadAndTestName$1.evaluate(TestRuleThreadAndTestName.java:48)
	at org.apache.lucene.util.TestRuleIgnoreAfterMaxFailures$1.evaluate(TestRuleIgnoreAfterMaxFailures.java:64)
	at org.apache.lucene.util.TestRuleMarkFailure$1.evaluate(TestRuleMarkFailure.java:47)
	at com.carrotsearch.randomizedtesting.rules.StatementAdapter.evaluate(StatementAdapter.java:36)
	at com.carrotsearch.randomizedtesting.ThreadLeakControl$StatementRunner.run(ThreadLeakControl.java:368)
	at com.carrotsearch.randomizedtesting.ThreadLeakControl.forkTimeoutingTask(ThreadLeakControl.java:817)
	at com.carrotsearch.randomizedtesting.ThreadLeakControl$3.evaluate(ThreadLeakControl.java:468)
	at com.carrotsearch.randomizedtesting.RandomizedRunner.runSingleTest(RandomizedRunner.java:943)
	at com.carrotsearch.randomizedtesting.RandomizedRunner$5.evaluate(RandomizedRunner.java:829)
	at com.carrotsearch.randomizedtesting.RandomizedRunner$6.evaluate(RandomizedRunner.java:879)
	at com.carrotsearch.randomizedtesting.RandomizedRunner$7.evaluate(RandomizedRunner.java:890)
	at com.carrotsearch.randomizedtesting.rules.StatementAdapter.evaluate(StatementAdapter.java:36)
	at com.carrotsearch.randomizedtesting.rules.SystemPropertiesRestoreRule$1.evaluate(SystemPropertiesRestoreRule.java:57)
	at org.apache.lucene.util.AbstractBeforeAfterRule$1.evaluate(AbstractBeforeAfterRule.java:45)
	at com.carrotsearch.randomizedtesting.rules.StatementAdapter.evaluate(StatementAdapter.java:36)
	at org.apache.lucene.util.TestRuleStoreClassName$1.evaluate(TestRuleStoreClassName.java:41)
	at com.carrotsearch.randomizedtesting.rules.NoShadowingOrOverridesOnMethodsRule$1.evaluate(NoShadowingOrOverridesOnMethodsRule.java:40)
	at com.carrotsearch.randomizedtesting.rules.NoShadowingOrOverridesOnMethodsRule$1.evaluate(NoShadowingOrOverridesOnMethodsRule.java:40)
	at com.carrotsearch.randomizedtesting.rules.StatementAdapter.evaluate(StatementAdapter.java:36)
	at com.carrotsearch.randomizedtesting.rules.StatementAdapter.evaluate(StatementAdapter.java:36)
	at com.carrotsearch.randomizedtesting.rules.StatementAdapter.evaluate(StatementAdapter.java:36)
	at org.apache.lucene.util.TestRuleAssertionsRequired$1.evaluate(TestRuleAssertionsRequired.java:53)
	at org.apache.lucene.util.TestRuleMarkFailure$1.evaluate(TestRuleMarkFailure.java:47)
	at org.apache.lucene.util.TestRuleIgnoreAfterMaxFailures$1.evaluate(TestRuleIgnoreAfterMaxFailures.java:64)
	at org.apache.lucene.util.TestRuleIgnoreTestSuites$1.evaluate(TestRuleIgnoreTestSuites.java:54)
	at com.carrotsearch.randomizedtesting.rules.StatementAdapter.evaluate(StatementAdapter.java:36)
	at com.carrotsearch.randomizedtesting.ThreadLeakControl$StatementRunner.run(ThreadLeakControl.java:368)
	at java.lang.Thread.run(Thread.java:748)


FAILED:  junit.framework.TestSuite.org.apache.solr.client.solrj.SolrExampleBinaryTest

Error Message:
1 thread leaked from SUITE scope at org.apache.solr.client.solrj.SolrExampleBinaryTest:     1) Thread[id=776, name=qtp1958745-776, state=TIMED_WAITING, group=TGRP-SolrExampleBinaryTest]         at sun.misc.Unsafe.park(Native Method)         at java.util.concurrent.locks.LockSupport.parkNanos(LockSupport.java:215)         at java.util.concurrent.locks.AbstractQueuedSynchronizer$ConditionObject.await(AbstractQueuedSynchronizer.java:2163)         at org.eclipse.jetty.util.thread.ReservedThreadExecutor$ReservedThread.reservedWait(ReservedThreadExecutor.java:308)         at org.eclipse.jetty.util.thread.ReservedThreadExecutor$ReservedThread.run(ReservedThreadExecutor.java:373)         at org.eclipse.jetty.util.thread.QueuedThreadPool.runJob(QueuedThreadPool.java:708)         at org.eclipse.jetty.util.thread.QueuedThreadPool$2.run(QueuedThreadPool.java:626)         at java.lang.Thread.run(Thread.java:748)

Stack Trace:
com.carrotsearch.randomizedtesting.ThreadLeakError: 1 thread leaked from SUITE scope at org.apache.solr.client.solrj.SolrExampleBinaryTest: 
   1) Thread[id=776, name=qtp1958745-776, state=TIMED_WAITING, group=TGRP-SolrExampleBinaryTest]
        at sun.misc.Unsafe.park(Native Method)
        at java.util.concurrent.locks.LockSupport.parkNanos(LockSupport.java:215)
        at java.util.concurrent.locks.AbstractQueuedSynchronizer$ConditionObject.await(AbstractQueuedSynchronizer.java:2163)
        at org.eclipse.jetty.util.thread.ReservedThreadExecutor$ReservedThread.reservedWait(ReservedThreadExecutor.java:308)
        at org.eclipse.jetty.util.thread.ReservedThreadExecutor$ReservedThread.run(ReservedThreadExecutor.java:373)
        at org.eclipse.jetty.util.thread.QueuedThreadPool.runJob(QueuedThreadPool.java:708)
        at org.eclipse.jetty.util.thread.QueuedThreadPool$2.run(QueuedThreadPool.java:626)
        at java.lang.Thread.run(Thread.java:748)
	at __randomizedtesting.SeedInfo.seed([776DBAFE3D0068DD]:0)


FAILED:  junit.framework.TestSuite.org.apache.solr.client.solrj.SolrExampleBinaryTest

Error Message:
There are still zombie threads that couldn't be terminated:    1) Thread[id=776, name=qtp1958745-776, state=TIMED_WAITING, group=TGRP-SolrExampleBinaryTest]         at sun.misc.Unsafe.park(Native Method)         at java.util.concurrent.locks.LockSupport.parkNanos(LockSupport.java:215)         at java.util.concurrent.locks.AbstractQueuedSynchronizer$ConditionObject.await(AbstractQueuedSynchronizer.java:2163)         at org.eclipse.jetty.util.thread.ReservedThreadExecutor$ReservedThread.reservedWait(ReservedThreadExecutor.java:308)         at org.eclipse.jetty.util.thread.ReservedThreadExecutor$ReservedThread.run(ReservedThreadExecutor.java:373)         at org.eclipse.jetty.util.thread.QueuedThreadPool.runJob(QueuedThreadPool.java:708)         at org.eclipse.jetty.util.thread.QueuedThreadPool$2.run(QueuedThreadPool.java:626)         at java.lang.Thread.run(Thread.java:748)

Stack Trace:
com.carrotsearch.randomizedtesting.ThreadLeakError: There are still zombie threads that couldn't be terminated:
   1) Thread[id=776, name=qtp1958745-776, state=TIMED_WAITING, group=TGRP-SolrExampleBinaryTest]
        at sun.misc.Unsafe.park(Native Method)
        at java.util.concurrent.locks.LockSupport.parkNanos(LockSupport.java:215)
        at java.util.concurrent.locks.AbstractQueuedSynchronizer$ConditionObject.await(AbstractQueuedSynchronizer.java:2163)
        at org.eclipse.jetty.util.thread.ReservedThreadExecutor$ReservedThread.reservedWait(ReservedThreadExecutor.java:308)
        at org.eclipse.jetty.util.thread.ReservedThreadExecutor$ReservedThread.run(ReservedThreadExecutor.java:373)
        at org.eclipse.jetty.util.thread.QueuedThreadPool.runJob(QueuedThreadPool.java:708)
        at org.eclipse.jetty.util.thread.QueuedThreadPool$2.run(QueuedThreadPool.java:626)
        at java.lang.Thread.run(Thread.java:748)
	at __randomizedtesting.SeedInfo.seed([776DBAFE3D0068DD]:0)




Build Log:
[...truncated 12450 lines...]
   [junit4] Suite: org.apache.solr.cloud.autoscaling.TriggerIntegrationTest
   [junit4]   2> 210157 INFO  (SUITE-TriggerIntegrationTest-seed#[5EF3A043CD943FF9]-worker) [    ] o.a.s.SolrTestCaseJ4 SecureRandom sanity checks: test.solr.allowed.securerandom=null & java.security.egd=file:/dev/./urandom
   [junit4]   2> Creating dataDir: /x1/jenkins/jenkins-slave/workspace/Lucene-Solr-Tests-7.x/solr/build/solr-core/test/J2/temp/solr.cloud.autoscaling.TriggerIntegrationTest_5EF3A043CD943FF9-001/init-core-data-001
   [junit4]   2> 210157 WARN  (SUITE-TriggerIntegrationTest-seed#[5EF3A043CD943FF9]-worker) [    ] o.a.s.SolrTestCaseJ4 startTrackingSearchers: numOpens=2 numCloses=2
   [junit4]   2> 210157 INFO  (SUITE-TriggerIntegrationTest-seed#[5EF3A043CD943FF9]-worker) [    ] o.a.s.SolrTestCaseJ4 Using PointFields (NUMERIC_POINTS_SYSPROP=true) w/NUMERIC_DOCVALUES_SYSPROP=true
   [junit4]   2> 210159 INFO  (SUITE-TriggerIntegrationTest-seed#[5EF3A043CD943FF9]-worker) [    ] o.a.s.SolrTestCaseJ4 Randomized ssl (false) and clientAuth (true) via: @org.apache.solr.util.RandomizeSSL(reason=, ssl=NaN, value=NaN, clientAuth=NaN)
   [junit4]   2> 210159 INFO  (SUITE-TriggerIntegrationTest-seed#[5EF3A043CD943FF9]-worker) [    ] o.a.s.c.MiniSolrCloudCluster Starting cluster of 2 servers in /x1/jenkins/jenkins-slave/workspace/Lucene-Solr-Tests-7.x/solr/build/solr-core/test/J2/temp/solr.cloud.autoscaling.TriggerIntegrationTest_5EF3A043CD943FF9-001/tempDir-001
   [junit4]   2> 210159 INFO  (SUITE-TriggerIntegrationTest-seed#[5EF3A043CD943FF9]-worker) [    ] o.a.s.c.ZkTestServer STARTING ZK TEST SERVER
   [junit4]   2> 210168 INFO  (Thread-167) [    ] o.a.s.c.ZkTestServer client port:0.0.0.0/0.0.0.0:0
   [junit4]   2> 210168 INFO  (Thread-167) [    ] o.a.s.c.ZkTestServer Starting server
   [junit4]   2> 210169 ERROR (Thread-167) [    ] o.a.z.s.ZooKeeperServer ZKShutdownHandler is not registered, so ZooKeeper server won't take any action on ERROR or SHUTDOWN server state changes
   [junit4]   2> 210268 INFO  (SUITE-TriggerIntegrationTest-seed#[5EF3A043CD943FF9]-worker) [    ] o.a.s.c.ZkTestServer start zk server on port:39482
   [junit4]   2> 210270 INFO  (zkConnectionManagerCallback-285-thread-1) [    ] o.a.s.c.c.ConnectionManager zkClient has connected
   [junit4]   2> 210273 WARN  (NIOServerCxn.Factory:0.0.0.0/0.0.0.0:0) [    ] o.a.z.s.NIOServerCnxn Unable to read additional data from client sessionid 0x1048d49d3d50000, likely client has closed socket
   [junit4]   2> 210280 INFO  (jetty-launcher-282-thread-1) [    ] o.e.j.s.Server jetty-9.4.8.v20171121, build timestamp: 2017-11-21T10:27:37-11:00, git hash: 82b8fb23f757335bb3329d540ce37a2a2615f0a8
   [junit4]   2> 210281 INFO  (jetty-launcher-282-thread-1) [    ] o.e.j.s.session DefaultSessionIdManager workerName=node0
   [junit4]   2> 210281 INFO  (jetty-launcher-282-thread-1) [    ] o.e.j.s.session No SessionScavenger set, using defaults
   [junit4]   2> 210281 INFO  (jetty-launcher-282-thread-1) [    ] o.e.j.s.session Scavenging every 600000ms
   [junit4]   2> 210281 INFO  (jetty-launcher-282-thread-1) [    ] o.e.j.s.h.ContextHandler Started o.e.j.s.ServletContextHandler@6da7c9f4{/solr,null,AVAILABLE}
   [junit4]   2> 210291 INFO  (jetty-launcher-282-thread-2) [    ] o.e.j.s.Server jetty-9.4.8.v20171121, build timestamp: 2017-11-21T10:27:37-11:00, git hash: 82b8fb23f757335bb3329d540ce37a2a2615f0a8
   [junit4]   2> 210292 INFO  (jetty-launcher-282-thread-1) [    ] o.e.j.s.AbstractConnector Started ServerConnector@49d5f1d5{HTTP/1.1,[http/1.1]}{127.0.0.1:33094}
   [junit4]   2> 210292 INFO  (jetty-launcher-282-thread-1) [    ] o.e.j.s.Server Started @212525ms
   [junit4]   2> 210292 INFO  (jetty-launcher-282-thread-1) [    ] o.a.s.c.s.e.JettySolrRunner Jetty properties: {hostContext=/solr, hostPort=33094}
   [junit4]   2> 210293 ERROR (jetty-launcher-282-thread-1) [    ] o.a.s.u.StartupLoggingUtils Missing Java Option solr.log.dir. Logging may be missing or incomplete.
   [junit4]   2> 210293 INFO  (jetty-launcher-282-thread-1) [    ] o.a.s.s.SolrDispatchFilter  ___      _       Welcome to Apache Solr™ version 7.3.0
   [junit4]   2> 210293 INFO  (jetty-launcher-282-thread-1) [    ] o.a.s.s.SolrDispatchFilter / __| ___| |_ _   Starting in cloud mode on port null
   [junit4]   2> 210293 INFO  (jetty-launcher-282-thread-1) [    ] o.a.s.s.SolrDispatchFilter \__ \/ _ \ | '_|  Install dir: null
   [junit4]   2> 210293 INFO  (jetty-launcher-282-thread-1) [    ] o.a.s.s.SolrDispatchFilter |___/\___/_|_|    Start time: 2018-02-22T11:19:47.901Z
   [junit4]   2> 210300 INFO  (zkConnectionManagerCallback-287-thread-1) [    ] o.a.s.c.c.ConnectionManager zkClient has connected
   [junit4]   2> 210301 INFO  (jetty-launcher-282-thread-1) [    ] o.a.s.s.SolrDispatchFilter solr.xml found in ZooKeeper. Loading...
   [junit4]   2> 210309 INFO  (jetty-launcher-282-thread-2) [    ] o.e.j.s.session DefaultSessionIdManager workerName=node0
   [junit4]   2> 210309 INFO  (jetty-launcher-282-thread-2) [    ] o.e.j.s.session No SessionScavenger set, using defaults
   [junit4]   2> 210309 INFO  (jetty-launcher-282-thread-2) [    ] o.e.j.s.session Scavenging every 600000ms
   [junit4]   2> 210309 INFO  (jetty-launcher-282-thread-2) [    ] o.e.j.s.h.ContextHandler Started o.e.j.s.ServletContextHandler@563f2225{/solr,null,AVAILABLE}
   [junit4]   2> 210310 INFO  (jetty-launcher-282-thread-2) [    ] o.e.j.s.AbstractConnector Started ServerConnector@db51426{HTTP/1.1,[http/1.1]}{127.0.0.1:54912}
   [junit4]   2> 210310 INFO  (jetty-launcher-282-thread-2) [    ] o.e.j.s.Server Started @212543ms
   [junit4]   2> 210310 INFO  (jetty-launcher-282-thread-2) [    ] o.a.s.c.s.e.JettySolrRunner Jetty properties: {hostContext=/solr, hostPort=54912}
   [junit4]   2> 210310 ERROR (jetty-launcher-282-thread-2) [    ] o.a.s.u.StartupLoggingUtils Missing Java Option solr.log.dir. Logging may be missing or incomplete.
   [junit4]   2> 210310 INFO  (jetty-launcher-282-thread-2) [    ] o.a.s.s.SolrDispatchFilter  ___      _       Welcome to Apache Solr™ version 7.3.0
   [junit4]   2> 210310 INFO  (jetty-launcher-282-thread-2) [    ] o.a.s.s.SolrDispatchFilter / __| ___| |_ _   Starting in cloud mode on port null
   [junit4]   2> 210310 INFO  (jetty-launcher-282-thread-2) [    ] o.a.s.s.SolrDispatchFilter \__ \/ _ \ | '_|  Install dir: null
   [junit4]   2> 210311 INFO  (jetty-launcher-282-thread-2) [    ] o.a.s.s.SolrDispatchFilter |___/\___/_|_|    Start time: 2018-02-22T11:19:47.918Z
   [junit4]   2> 210315 INFO  (zkConnectionManagerCallback-289-thread-1) [    ] o.a.s.c.c.ConnectionManager zkClient has connected
   [junit4]   2> 210315 INFO  (jetty-launcher-282-thread-2) [    ] o.a.s.s.SolrDispatchFilter solr.xml found in ZooKeeper. Loading...
   [junit4]   2> 210315 INFO  (jetty-launcher-282-thread-1) [    ] o.a.s.c.ZkContainer Zookeeper client=127.0.0.1:39482/solr
   [junit4]   2> 210317 INFO  (zkConnectionManagerCallback-293-thread-1) [    ] o.a.s.c.c.ConnectionManager zkClient has connected
   [junit4]   2> 210318 INFO  (zkConnectionManagerCallback-295-thread-1-processing-n:127.0.0.1:33094_solr) [n:127.0.0.1:33094_solr    ] o.a.s.c.c.ConnectionManager zkClient has connected
   [junit4]   2> 210348 INFO  (jetty-launcher-282-thread-2) [    ] o.a.s.c.ZkContainer Zookeeper client=127.0.0.1:39482/solr
   [junit4]   2> 210357 INFO  (zkConnectionManagerCallback-300-thread-1) [    ] o.a.s.c.c.ConnectionManager zkClient has connected
   [junit4]   2> 210364 INFO  (zkConnectionManagerCallback-302-thread-1-processing-n:127.0.0.1:54912_solr) [n:127.0.0.1:54912_solr    ] o.a.s.c.c.ConnectionManager zkClient has connected
   [junit4]   2> 210374 INFO  (jetty-launcher-282-thread-2) [n:127.0.0.1:54912_solr    ] o.a.s.c.Overseer Overseer (id=null) closing
   [junit4]   2> 210375 INFO  (jetty-launcher-282-thread-2) [n:127.0.0.1:54912_solr    ] o.a.s.c.OverseerElectionContext I am going to be the leader 127.0.0.1:54912_solr
   [junit4]   2> 210376 INFO  (jetty-launcher-282-thread-2) [n:127.0.0.1:54912_solr    ] o.a.s.c.Overseer Overseer (id=73338842170851334-127.0.0.1:54912_solr-n_0000000000) starting
   [junit4]   2> 210382 INFO  (jetty-launcher-282-thread-2) [n:127.0.0.1:54912_solr    ] o.a.s.c.ZkController Register node as live in ZooKeeper:/live_nodes/127.0.0.1:54912_solr
   [junit4]   2> 210384 DEBUG (OverseerAutoScalingTriggerThread-73338842170851334-127.0.0.1:54912_solr-n_0000000000) [n:127.0.0.1:54912_solr    ] o.a.s.c.a.OverseerTriggerThread Adding .autoAddReplicas trigger
   [junit4]   2> 210390 INFO  (zkCallback-301-thread-1-processing-n:127.0.0.1:54912_solr) [n:127.0.0.1:54912_solr    ] o.a.s.c.c.ZkStateReader Updated live nodes from ZooKeeper... (0) -> (1)
   [junit4]   2> 210392 DEBUG (OverseerAutoScalingTriggerThread-73338842170851334-127.0.0.1:54912_solr-n_0000000000) [n:127.0.0.1:54912_solr    ] o.a.s.c.a.OverseerTriggerThread Refreshing /autoscaling.json with znode version 1
   [junit4]   2> 210392 DEBUG (OverseerAutoScalingTriggerThread-73338842170851334-127.0.0.1:54912_solr-n_0000000000) [n:127.0.0.1:54912_solr    ] o.a.s.c.a.NodeLostTrigger Initial livenodes: [127.0.0.1:54912_solr]
   [junit4]   2> 210392 DEBUG (OverseerAutoScalingTriggerThread-73338842170851334-127.0.0.1:54912_solr-n_0000000000) [n:127.0.0.1:54912_solr    ] o.a.s.c.a.OverseerTriggerThread Current znodeVersion 1, lastZnodeVersion -1
   [junit4]   2> 210392 DEBUG (OverseerAutoScalingTriggerThread-73338842170851334-127.0.0.1:54912_solr-n_0000000000) [n:127.0.0.1:54912_solr    ] o.a.s.c.a.OverseerTriggerThread Processed trigger updates upto znodeVersion 1
   [junit4]   2> 210394 DEBUG (OverseerAutoScalingTriggerThread-73338842170851334-127.0.0.1:54912_solr-n_0000000000) [n:127.0.0.1:54912_solr    ] o.a.s.c.a.OverseerTriggerThread -- clean old nodeAdded markers
   [junit4]   2> 210394 DEBUG (OverseerAutoScalingTriggerThread-73338842170851334-127.0.0.1:54912_solr-n_0000000000) [n:127.0.0.1:54912_solr    ] o.a.s.c.a.OverseerTriggerThread Current znodeVersion 1, lastZnodeVersion 1
   [junit4]   2> 210396 DEBUG (ScheduledTrigger-482-thread-1) [n:127.0.0.1:54912_solr    ] o.a.s.c.a.NodeLostTrigger Running NodeLostTrigger: .auto_add_replicas with currently live nodes: 1
   [junit4]   2> 210403 INFO  (jetty-launcher-282-thread-1) [n:127.0.0.1:33094_solr    ] o.a.s.c.c.ZkStateReader Updated live nodes from ZooKeeper... (0) -> (1)
   [junit4]   2> 210405 INFO  (jetty-launcher-282-thread-1) [n:127.0.0.1:33094_solr    ] o.a.s.c.Overseer Overseer (id=null) closing
   [junit4]   2> 210407 INFO  (jetty-launcher-282-thread-1) [n:127.0.0.1:33094_solr    ] o.a.s.c.ZkController Register node as live in ZooKeeper:/live_nodes/127.0.0.1:33094_solr
   [junit4]   2> 210412 INFO  (zkCallback-301-thread-1-processing-n:127.0.0.1:54912_solr) [n:127.0.0.1:54912_solr    ] o.a.s.c.c.ZkStateReader Updated live nodes from ZooKeeper... (1) -> (2)
   [junit4]   2> 210413 INFO  (zkCallback-294-thread-1-processing-n:127.0.0.1:33094_solr) [n:127.0.0.1:33094_solr    ] o.a.s.c.c.ZkStateReader Updated live nodes from ZooKeeper... (1) -> (2)
   [junit4]   2> 210485 INFO  (jetty-launcher-282-thread-2) [n:127.0.0.1:54912_solr    ] o.a.s.m.r.SolrJmxReporter JMX monitoring for 'solr_54912.solr.node' (registry 'solr.node') enabled at server: com.sun.jmx.mbeanserver.JmxMBeanServer@c4cf17b
   [junit4]   2> 210485 INFO  (jetty-launcher-282-thread-1) [n:127.0.0.1:33094_solr    ] o.a.s.m.r.SolrJmxReporter JMX monitoring for 'solr_33094.solr.node' (registry 'solr.node') enabled at server: com.sun.jmx.mbeanserver.JmxMBeanServer@c4cf17b
   [junit4]   2> 210493 INFO  (jetty-launcher-282-thread-2) [n:127.0.0.1:54912_solr    ] o.a.s.m.r.SolrJmxReporter JMX monitoring for 'solr_54912.solr.jvm' (registry 'solr.jvm') enabled at server: com.sun.jmx.mbeanserver.JmxMBeanServer@c4cf17b
   [junit4]   2> 210493 INFO  (jetty-launcher-282-thread-2) [n:127.0.0.1:54912_solr    ] o.a.s.m.r.SolrJmxReporter JMX monitoring for 'solr_54912.solr.jetty' (registry 'solr.jetty') enabled at server: com.sun.jmx.mbeanserver.JmxMBeanServer@c4cf17b
   [junit4]   2> 210493 INFO  (jetty-launcher-282-thread-1) [n:127.0.0.1:33094_solr    ] o.a.s.m.r.SolrJmxReporter JMX monitoring for 'solr_33094.solr.jvm' (registry 'solr.jvm') enabled at server: com.sun.jmx.mbeanserver.JmxMBeanServer@c4cf17b
   [junit4]   2> 210493 INFO  (jetty-launcher-282-thread-1) [n:127.0.0.1:33094_solr    ] o.a.s.m.r.SolrJmxReporter JMX monitoring for 'solr_33094.solr.jetty' (registry 'solr.jetty') enabled at server: com.sun.jmx.mbeanserver.JmxMBeanServer@c4cf17b
   [junit4]   2> 210494 INFO  (jetty-launcher-282-thread-2) [n:127.0.0.1:54912_solr    ] o.a.s.c.CorePropertiesLocator Found 0 core definitions underneath /x1/jenkins/jenkins-slave/workspace/Lucene-Solr-Tests-7.x/solr/build/solr-core/test/J2/temp/solr.cloud.autoscaling.TriggerIntegrationTest_5EF3A043CD943FF9-001/tempDir-001/node2/.
   [junit4]   2> 210494 INFO  (jetty-launcher-282-thread-1) [n:127.0.0.1:33094_solr    ] o.a.s.c.CorePropertiesLocator Found 0 core definitions underneath /x1/jenkins/jenkins-slave/workspace/Lucene-Solr-Tests-7.x/solr/build/solr-core/test/J2/temp/solr.cloud.autoscaling.TriggerIntegrationTest_5EF3A043CD943FF9-001/tempDir-001/node1/.
   [junit4]   2> 210548 INFO  (zkConnectionManagerCallback-307-thread-1) [    ] o.a.s.c.c.ConnectionManager zkClient has connected
   [junit4]   2> 210552 INFO  (zkConnectionManagerCallback-311-thread-1) [    ] o.a.s.c.c.ConnectionManager zkClient has connected
   [junit4]   2> 210553 INFO  (SUITE-TriggerIntegrationTest-seed#[5EF3A043CD943FF9]-worker) [    ] o.a.s.c.c.ZkStateReader Updated live nodes from ZooKeeper... (0) -> (2)
   [junit4]   2> 210553 INFO  (SUITE-TriggerIntegrationTest-seed#[5EF3A043CD943FF9]-worker) [    ] o.a.s.c.s.i.ZkClientClusterStateProvider Cluster at 127.0.0.1:39482/solr ready
   [junit4]   2> 210569 INFO  (TEST-TriggerIntegrationTest.testEventFromRestoredState-seed#[5EF3A043CD943FF9]) [    ] o.a.s.SolrTestCaseJ4 ###Starting testEventFromRestoredState
   [junit4]   2> 210574 INFO  (qtp303552862-1684) [n:127.0.0.1:33094_solr    ] o.a.s.h.a.CollectionsHandler Invoked Collection Action :overseerstatus with params action=OVERSEERSTATUS&wt=javabin&version=2 and sendToOCPQueue=true
   [junit4]   2> 210588 INFO  (qtp303552862-1684) [n:127.0.0.1:33094_solr    ] o.a.s.s.HttpSolrCall [admin] webapp=null path=/admin/collections params={action=OVERSEERSTATUS&wt=javabin&version=2} status=0 QTime=14
   [junit4]   2> 210590 INFO  (TEST-TriggerIntegrationTest.testEventFromRestoredState-seed#[5EF3A043CD943FF9]) [    ] o.a.s.c.a.ScheduledTriggers -- removing trigger: .auto_add_replicas
   [junit4]   2> 210591 INFO  (TEST-TriggerIntegrationTest.testEventFromRestoredState-seed#[5EF3A043CD943FF9]) [    ] o.a.s.c.a.TriggerIntegrationTest /autoscaling.json reset, new znode version 2
   [junit4]   2> 210592 DEBUG (zkCallback-301-thread-1-processing-n:127.0.0.1:54912_solr) [n:127.0.0.1:54912_solr    ] o.a.s.c.a.OverseerTriggerThread Refreshing /autoscaling.json with znode version 2
   [junit4]   2> 210592 DEBUG (OverseerAutoScalingTriggerThread-73338842170851334-127.0.0.1:54912_solr-n_0000000000) [n:127.0.0.1:54912_solr    ] o.a.s.c.a.OverseerTriggerThread Processed trigger updates upto znodeVersion 2
   [junit4]   2> 210592 DEBUG (OverseerAutoScalingTriggerThread-73338842170851334-127.0.0.1:54912_solr-n_0000000000) [n:127.0.0.1:54912_solr    ] o.a.s.c.a.OverseerTriggerThread -- clean old nodeLost markers
   [junit4]   2> 210592 DEBUG (OverseerAutoScalingTriggerThread-73338842170851334-127.0.0.1:54912_solr-n_0000000000) [n:127.0.0.1:54912_solr    ] o.a.s.c.a.OverseerTriggerThread -- clean old nodeAdded markers
   [junit4]   2> 210592 DEBUG (OverseerAutoScalingTriggerThread-73338842170851334-127.0.0.1:54912_solr-n_0000000000) [n:127.0.0.1:54912_solr    ] o.a.s.c.a.OverseerTriggerThread Current znodeVersion 2, lastZnodeVersion 2
   [junit4]   2> 210593 INFO  (TEST-TriggerIntegrationTest.testEventFromRestoredState-seed#[5EF3A043CD943FF9]) [    ] o.a.s.c.c.ZkStateReader Updated live nodes from ZooKeeper... (0) -> (2)
   [junit4]   2> 210594 INFO  (TEST-TriggerIntegrationTest.testEventFromRestoredState-seed#[5EF3A043CD943FF9]) [    ] o.e.j.s.AbstractConnector Stopped ServerConnector@db51426{HTTP/1.1,[http/1.1]}{127.0.0.1:0}
   [junit4]   2> 210594 INFO  (TEST-TriggerIntegrationTest.testEventFromRestoredState-seed#[5EF3A043CD943FF9]) [    ] o.a.s.c.CoreContainer Shutting down CoreContainer instance=713341323
   [junit4]   2> 210594 INFO  (TEST-TriggerIntegrationTest.testEventFromRestoredState-seed#[5EF3A043CD943FF9]) [    ] o.a.s.m.SolrMetricManager Closing metric reporters for registry=solr.node, tag=null
   [junit4]   2> 210595 INFO  (TEST-TriggerIntegrationTest.testEventFromRestoredState-seed#[5EF3A043CD943FF9]) [    ] o.a.s.m.r.SolrJmxReporter Closing reporter [org.apache.solr.metrics.reporters.SolrJmxReporter@4fd2a53e: rootName = solr_54912, domain = solr.node, service url = null, agent id = null] for registry solr.node / com.codahale.metrics.MetricRegistry@b67b277
   [junit4]   2> 210601 INFO  (TEST-TriggerIntegrationTest.testEventFromRestoredState-seed#[5EF3A043CD943FF9]) [    ] o.a.s.m.SolrMetricManager Closing metric reporters for registry=solr.jvm, tag=null
   [junit4]   2> 210601 INFO  (TEST-TriggerIntegrationTest.testEventFromRestoredState-seed#[5EF3A043CD943FF9]) [    ] o.a.s.m.r.SolrJmxReporter Closing reporter [org.apache.solr.metrics.reporters.SolrJmxReporter@766fdf82: rootName = solr_54912, domain = solr.jvm, service url = null, agent id = null] for registry solr.jvm / com.codahale.metrics.MetricRegistry@412ee9d5
   [junit4]   2> 210604 INFO  (TEST-TriggerIntegrationTest.testEventFromRestoredState-seed#[5EF3A043CD943FF9]) [    ] o.a.s.m.SolrMetricManager Closing metric reporters for registry=solr.jetty, tag=null
   [junit4]   2> 210605 INFO  (TEST-TriggerIntegrationTest.testEventFromRestoredState-seed#[5EF3A043CD943FF9]) [    ] o.a.s.m.r.SolrJmxReporter Closing reporter [org.apache.solr.metrics.reporters.SolrJmxReporter@5e006590: rootName = solr_54912, domain = solr.jetty, service url = null, agent id = null] for registry solr.jetty / com.codahale.metrics.MetricRegistry@6fb67b98
   [junit4]   2> 210606 INFO  (TEST-TriggerIntegrationTest.testEventFromRestoredState-seed#[5EF3A043CD943FF9]) [    ] o.a.s.c.ZkController Remove node as live in ZooKeeper:/live_nodes/127.0.0.1:54912_solr
   [junit4]   2> 210607 INFO  (zkCallback-294-thread-1-processing-n:127.0.0.1:33094_solr) [n:127.0.0.1:33094_solr    ] o.a.s.c.c.ZkStateReader Updated live nodes from ZooKeeper... (2) -> (1)
   [junit4]   2> 210607 INFO  (TEST-TriggerIntegrationTest.testEventFromRestoredState-seed#[5EF3A043CD943FF9]) [    ] o.a.s.m.SolrMetricManager Closing metric reporters for registry=solr.cluster, tag=null
   [junit4]   2> 210607 INFO  (zkCallback-301-thread-1-processing-n:127.0.0.1:54912_solr) [n:127.0.0.1:54912_solr    ] o.a.s.c.c.ZkStateReader Updated live nodes from ZooKeeper... (2) -> (1)
   [junit4]   2> 210608 INFO  (TEST-TriggerIntegrationTest.testEventFromRestoredState-seed#[5EF3A043CD943FF9]) [    ] o.a.s.c.TransientSolrCoreCacheDefault Allocating transient cache for 2147483647 transient cores
   [junit4]   2> 210608 INFO  (TEST-TriggerIntegrationTest.testEventFromRestoredState-seed#[5EF3A043CD943FF9]) [    ] o.a.s.c.Overseer Overseer (id=73338842170851334-127.0.0.1:54912_solr-n_0000000000) closing
   [junit4]   2> 210608 INFO  (OverseerStateUpdate-73338842170851334-127.0.0.1:54912_solr-n_0000000000) [n:127.0.0.1:54912_solr    ] o.a.s.c.Overseer Overseer Loop exiting : 127.0.0.1:54912_solr
   [junit4]   2> 210615 INFO  (zkCallback-310-thread-2) [    ] o.a.s.c.c.ZkStateReader Updated live nodes from ZooKeeper... (2) -> (1)
   [junit4]   2> 210620 WARN  (OverseerAutoScalingTriggerThread-73338842170851334-127.0.0.1:54912_solr-n_0000000000) [n:127.0.0.1:54912_solr    ] o.a.s.c.a.OverseerTriggerThread OverseerTriggerThread woken up but we are closed, exiting.
   [junit4]   2> 210621 DEBUG (TEST-TriggerIntegrationTest.testEventFromRestoredState-seed#[5EF3A043CD943FF9]) [    ] o.a.s.c.a.OverseerTriggerThread OverseerTriggerThread has been closed explicitly
   [junit4]   2> 210621 INFO  (zkCallback-310-thread-1) [    ] o.a.s.c.c.ZkStateReader Updated live nodes from ZooKeeper... (2) -> (1)
   [junit4]   2> 210622 INFO  (zkCallback-294-thread-1-processing-n:127.0.0.1:33094_solr) [n:127.0.0.1:33094_solr    ] o.a.s.c.OverseerElectionContext I am going to be the leader 127.0.0.1:33094_solr
   [junit4]   2> 210623 INFO  (TEST-TriggerIntegrationTest.testEventFromRestoredState-seed#[5EF3A043CD943FF9]) [    ] o.e.j.s.h.ContextHandler Stopped o.e.j.s.ServletContextHandler@563f2225{/solr,null,UNAVAILABLE}
   [junit4]   2> 210623 INFO  (TEST-TriggerIntegrationTest.testEventFromRestoredState-seed#[5EF3A043CD943FF9]) [    ] o.e.j.s.session Stopped scavenging
   [junit4]   2> 210624 INFO  (zkCallback-294-thread-1-processing-n:127.0.0.1:33094_solr) [n:127.0.0.1:33094_solr    ] o.a.s.c.Overseer Overseer (id=73338842170851332-127.0.0.1:33094_solr-n_0000000001) starting
   [junit4]   2> 210632 DEBUG (OverseerAutoScalingTriggerThread-73338842170851332-127.0.0.1:33094_solr-n_0000000001) [n:127.0.0.1:33094_solr    ] o.a.s.c.a.OverseerTriggerThread Adding .autoAddReplicas trigger
   [junit4]   2> 210633 DEBUG (OverseerAutoScalingTriggerThread-73338842170851332-127.0.0.1:33094_solr-n_0000000001) [n:127.0.0.1:33094_solr    ] o.a.s.c.a.OverseerTriggerThread Refreshing /autoscaling.json with znode version 3
   [junit4]   2> 210633 DEBUG (OverseerAutoScalingTriggerThread-73338842170851332-127.0.0.1:33094_solr-n_0000000001) [n:127.0.0.1:33094_solr    ] o.a.s.c.a.NodeLostTrigger Initial livenodes: [127.0.0.1:33094_solr]
   [junit4]   2> 210633 DEBUG (OverseerAutoScalingTriggerThread-73338842170851332-127.0.0.1:33094_solr-n_0000000001) [n:127.0.0.1:33094_solr    ] o.a.s.c.a.OverseerTriggerThread Current znodeVersion 3, lastZnodeVersion -1
   [junit4]   2> 210633 DEBUG (OverseerAutoScalingTriggerThread-73338842170851332-127.0.0.1:33094_solr-n_0000000001) [n:127.0.0.1:33094_solr    ] o.a.s.c.a.OverseerTriggerThread Processed trigger updates upto znodeVersion 3
   [junit4]   2> 210635 DEBUG (OverseerAutoScalingTriggerThread-73338842170851332-127.0.0.1:33094_solr-n_0000000001) [n:127.0.0.1:33094_solr    ] o.a.s.c.a.OverseerTriggerThread -- clean old nodeAdded markers
   [junit4]   2> 210635 DEBUG (OverseerAutoScalingTriggerThread-73338842170851332-127.0.0.1:33094_solr-n_0000000001) [n:127.0.0.1:33094_solr    ] o.a.s.c.a.OverseerTriggerThread Current znodeVersion 3, lastZnodeVersion 3
   [junit4]   2> 210635 DEBUG (ScheduledTrigger-491-thread-1) [n:127.0.0.1:33094_solr    ] o.a.s.c.a.NodeLostTrigger Running NodeLostTrigger: .auto_add_replicas with currently live nodes: 1
   [junit4]   2> 211636 DEBUG (ScheduledTrigger-491-thread-1) [n:127.0.0.1:33094_solr    ] o.a.s.c.a.NodeLostTrigger Running NodeLostTrigger: .auto_add_replicas with currently live nodes: 1
   [junit4]   2> 212636 DEBUG (ScheduledTrigger-491-thread-2) [n:127.0.0.1:33094_solr    ] o.a.s.c.a.NodeLostTrigger Running NodeLostTrigger: .auto_add_replicas with currently live nodes: 1
   [junit4]   2> 213637 DEBUG (ScheduledTrigger-491-thread-1) [n:127.0.0.1:33094_solr    ] o.a.s.c.a.NodeLostTrigger Running NodeLostTrigger: .auto_add_replicas with currently live nodes: 1
   [junit4]   2> 214637 DEBUG (ScheduledTrigger-491-thread-1) [n:127.0.0.1:33094_solr    ] o.a.s.c.a.NodeLostTrigger Running NodeLostTrigger: .auto_add_replicas with currently live nodes: 1
   [junit4]   2> 215625 INFO  (TEST-TriggerIntegrationTest.testEventFromRestoredState-seed#[5EF3A043CD943FF9]) [    ] o.e.j.s.Server jetty-9.4.8.v20171121, build timestamp: 2017-11-21T10:27:37-11:00, git hash: 82b8fb23f757335bb3329d540ce37a2a2615f0a8
   [junit4]   2> 215626 INFO  (TEST-TriggerIntegrationTest.testEventFromRestoredState-seed#[5EF3A043CD943FF9]) [    ] o.e.j.s.session DefaultSessionIdManager workerName=node0
   [junit4]   2> 215626 INFO  (TEST-TriggerIntegrationTest.testEventFromRestoredState-seed#[5EF3A043CD943FF9]) [    ] o.e.j.s.session No SessionScavenger set, using defaults
   [junit4]   2> 215626 INFO  (TEST-TriggerIntegrationTest.testEventFromRestoredState-seed#[5EF3A043CD943FF9]) [    ] o.e.j.s.session Scavenging every 660000ms
   [junit4]   2> 215627 INFO  (TEST-TriggerIntegrationTest.testEventFromRestoredState-seed#[5EF3A043CD943FF9]) [    ] o.e.j.s.h.ContextHandler Started o.e.j.s.ServletContextHandler@54365a3d{/solr,null,AVAILABLE}
   [junit4]   2> 215628 INFO  (TEST-TriggerIntegrationTest.testEventFromRestoredState-seed#[5EF3A043CD943FF9]) [    ] o.e.j.s.AbstractConnector Started ServerConnector@6500e398{HTTP/1.1,[http/1.1]}{127.0.0.1:58350}
   [junit4]   2> 215628 INFO  (TEST-TriggerIntegrationTest.testEventFromRestoredState-seed#[5EF3A043CD943FF9]) [    ] o.e.j.s.Server Started @217861ms
   [junit4]   2> 215628 INFO  (TEST-TriggerIntegrationTest.testEventFromRestoredState-seed#[5EF3A043CD943FF9]) [    ] o.a.s.c.s.e.JettySolrRunner Jetty properties: {hostContext=/solr, hostPort=58350}
   [junit4]   2> 215628 ERROR (TEST-TriggerIntegrationTest.testEventFromRestoredState-seed#[5EF3A043CD943FF9]) [    ] o.a.s.u.StartupLoggingUtils Missing Java Option solr.log.dir. Logging may be missing or incomplete.
   [junit4]   2> 215629 INFO  (TEST-TriggerIntegrationTest.testEventFromRestoredState-seed#[5EF3A043CD943FF9]) [    ] o.a.s.s.SolrDispatchFilter  ___      _       Welcome to Apache Solr™ version 7.3.0
   [junit4]   2> 215629 INFO  (TEST-TriggerIntegrationTest.testEventFromRestoredState-seed#[5EF3A043CD943FF9]) [    ] o.a.s.s.SolrDispatchFilter / __| ___| |_ _   Starting in cloud mode on port null
   [junit4]   2> 215629 INFO  (TEST-TriggerIntegrationTest.testEventFromRestoredState-seed#[5EF3A043CD943FF9]) [    ] o.a.s.s.SolrDispatchFilter \__ \/ _ \ | '_|  Install dir: null
   [junit4]   2> 215629 INFO  (TEST-TriggerIntegrationTest.testEventFromRestoredState-seed#[5EF3A043CD943FF9]) [    ] o.a.s.s.SolrDispatchFilter |___/\___/_|_|    Start time: 2018-02-22T11:19:53.237Z
   [junit4]   2> 215632 INFO  (zkConnectionManagerCallback-314-thread-1) [    ] o.a.s.c.c.ConnectionManager zkClient has connected
   [junit4]   2> 215632 INFO  (TEST-TriggerIntegrationTest.testEventFromRestoredState-seed#[5EF3A043CD943FF9]) [    ] o.a.s.s.SolrDispatchFilter solr.xml found in ZooKeeper. Loading...
   [junit4]   2> 215637 DEBUG (ScheduledTrigger-491-thread-1) [n:127.0.0.1:33094_solr    ] o.a.s.c.a.NodeLostTrigger Running NodeLostTrigger: .auto_add_replicas with currently live nodes: 1
   [junit4]   2> 215643 INFO  (TEST-TriggerIntegrationTest.testEventFromRestoredState-seed#[5EF3A043CD943FF9]) [    ] o.a.s.c.ZkContainer Zookeeper client=127.0.0.1:39482/solr
   [junit4]   2> 215644 INFO  (zkConnectionManagerCallback-318-thread-1) [    ] o.a.s.c.c.ConnectionManager zkClient has connected
   [junit4]   2> 215647 INFO  (zkConnectionManagerCallback-320-thread-1-processing-n:127.0.0.1:58350_solr) [n:127.0.0.1:58350_solr    ] o.a.s.c.c.ConnectionManager zkClient has connected
   [junit4]   2> 215653 INFO  (TEST-TriggerIntegrationTest.testEventFromRestoredState-seed#[5EF3A043CD943FF9]) [n:127.0.0.1:58350_solr    ] o.a.s.c.c.ZkStateReader Updated live nodes from ZooKeeper... (0) -> (1)
   [junit4]   2> 215655 INFO  (TEST-TriggerIntegrationTest.testEventFromRestoredState-seed#[5EF3A043CD943FF9]) [n:127.0.0.1:58350_solr    ] o.a.s.c.Overseer Overseer (id=null) closing
   [junit4]   2> 215657 INFO  (TEST-TriggerIntegrationTest.testEventFromRestoredState-seed#[5EF3A043CD943FF9]) [n:127.0.0.1:58350_solr    ] o.a.s.c.ZkController Register node as live in ZooKeeper:/live_nodes/127.0.0.1:58350_solr
   [junit4]   2> 215658 INFO  (zkCallback-294-thread-1-processing-n:127.0.0.1:33094_solr) [n:127.0.0.1:33094_solr    ] o.a.s.c.c.ZkStateReader Updated live nodes from ZooKeeper... (1) -> (2)
   [junit4]   2> 215664 INFO  (zkCallback-310-thread-1) [    ] o.a.s.c.c.ZkStateReader Updated live nodes from ZooKeeper... (1) -> (2)
   [junit4]   2> 215664 INFO  (zkCallback-310-thread-2) [    ] o.a.s.c.c.ZkStateReader Updated live nodes from ZooKeeper... (1) -> (2)
   [junit4]   2> 215668 INFO  (zkCallback-319-thread-1-processing-n:127.0.0.1:58350_solr) [n:127.0.0.1:58350_solr    ] o.a.s.c.c.ZkStateReader Updated live nodes from ZooKeeper... (1) -> (2)
   [junit4]   2> 215751 INFO  (TEST-TriggerIntegrationTest.testEventFromRestoredState-seed#[5EF3A043CD943FF9]) [n:127.0.0.1:58350_solr    ] o.a.s.m.r.SolrJmxReporter JMX monitoring for 'solr_58350.solr.node' (registry 'solr.node') enabled at server: com.sun.jmx.mbeanserver.JmxMBeanServer@c4cf17b
   [junit4]   2> 215759 INFO  (TEST-TriggerIntegrationTest.testEventFromRestoredState-seed#[5EF3A043CD943FF9]) [n:127.0.0.1:58350_solr    ] o.a.s.m.r.SolrJmxReporter JMX monitoring for 'solr_58350.solr.jvm' (registry 'solr.jvm') enabled at server: com.sun.jmx.mbeanserver.JmxMBeanServer@c4cf17b
   [junit4]   2> 215759 INFO  (TEST-TriggerIntegrationTest.testEventFromRestoredState-seed#[5EF3A043CD943FF9]) [n:127.0.0.1:58350_solr    ] o.a.s.m.r.SolrJmxReporter JMX monitoring for 'solr_58350.solr.jetty' (registry 'solr.jetty') enabled at server: com.sun.jmx.mbeanserver.JmxMBeanServer@c4cf17b
   [junit4]   2> 215760 INFO  (TEST-TriggerIntegrationTest.testEventFromRestoredState-seed#[5EF3A043CD943FF9]) [n:127.0.0.1:58350_solr    ] o.a.s.c.CorePropertiesLocator Found 0 core definitions underneath /x1/jenkins/jenkins-slave/workspace/Lucene-Solr-Tests-7.x/solr/build/solr-core/test/J2/temp/solr.cloud.autoscaling.TriggerIntegrationTest_5EF3A043CD943FF9-001/tempDir-001/node3/.
   [junit4]   2> 215812 INFO  (qtp303552862-1690) [n:127.0.0.1:33094_solr    ] o.a.s.s.HttpSolrCall [admin] webapp=null path=/admin/metrics params={prefix=CONTAINER.fs.usableSpace,CORE.coreName&wt=javabin&version=2&group=solr.node,solr.core} status=0 QTime=8
   [junit4]   2> 215817 INFO  (qtp197111232-1761) [n:127.0.0.1:58350_solr    ] o.a.s.s.HttpSolrCall [admin] webapp=null path=/admin/metrics params={prefix=CONTAINER.fs.usableSpace,CORE.coreName&wt=javabin&version=2&group=solr.node,solr.core} status=0 QTime=0
   [junit4]   2> 215823 DEBUG (qtp303552862-1687) [n:127.0.0.1:33094_solr    ] o.a.s.c.a.AutoScalingHandler Verified autoscaling configuration
   [junit4]   2> 215824 INFO  (qtp303552862-1687) [n:127.0.0.1:33094_solr    ] o.a.s.s.HttpSolrCall [admin] webapp=null path=/admin/autoscaling params={wt=javabin&version=2} status=0 QTime=34
   [junit4]   2> 215824 DEBUG (zkCallback-294-thread-1-processing-n:127.0.0.1:33094_solr) [n:127.0.0.1:33094_solr    ] o.a.s.c.a.OverseerTriggerThread Refreshing /autoscaling.json with znode version 4
   [junit4]   2> 215825 DEBUG (zkCallback-294-thread-1-processing-n:127.0.0.1:33094_solr) [n:127.0.0.1:33094_solr    ] o.a.s.c.a.NodeAddedTrigger Initial livenodes: [127.0.0.1:33094_solr, 127.0.0.1:58350_solr]
   [junit4]   2> 215825 DEBUG (zkCallback-294-thread-1-processing-n:127.0.0.1:33094_solr) [n:127.0.0.1:33094_solr    ] o.a.s.c.a.NodeAddedTrigger NodeAddedTrigger node_added_triggerEFRS instantiated with properties: {event=nodeAdded, waitFor=10, actions=[{name=test, class=org.apache.solr.cloud.autoscaling.TriggerIntegrationTest$TestTriggerAction}], enabled=true}
   [junit4]   2> 215825 DEBUG (zkCallback-294-thread-1-processing-n:127.0.0.1:33094_solr) [n:127.0.0.1:33094_solr    ] o.a.s.c.a.NodeLostTrigger Initial livenodes: [127.0.0.1:33094_solr, 127.0.0.1:58350_solr]
   [junit4]   2> 215825 DEBUG (OverseerAutoScalingTriggerThread-73338842170851332-127.0.0.1:33094_solr-n_0000000001) [n:127.0.0.1:33094_solr    ] o.a.s.c.a.OverseerTriggerThread Processed trigger updates upto znodeVersion 4
   [junit4]   2> 215827 INFO  (OverseerAutoScalingTriggerThread-73338842170851332-127.0.0.1:33094_solr-n_0000000001) [n:127.0.0.1:33094_solr    ] o.a.s.c.a.TriggerIntegrationTest TestTriggerAction init
   [junit4]   2> 215828 INFO  (qtp303552862-1689) [n:127.0.0.1:33094_solr    ] o.a.s.h.a.CollectionsHandler Invoked Collection Action :overseerstatus with params action=OVERSEERSTATUS&wt=javabin&version=2 and sendToOCPQueue=true
   [junit4]   2> 215829 DEBUG (ScheduledTrigger-491-thread-3) [n:127.0.0.1:33094_solr    ] o.a.s.c.a.NodeAddedTrigger Running NodeAddedTrigger node_added_triggerEFRS
   [junit4]   2> 215829 DEBUG (ScheduledTrigger-491-thread-3) [n:127.0.0.1:33094_solr    ] o.a.s.c.a.NodeAddedTrigger Found livenodes: 2
   [junit4]   2> 215830 DEBUG (OverseerAutoScalingTriggerThread-73338842170851332-127.0.0.1:33094_solr-n_0000000001) [n:127.0.0.1:33094_solr    ] o.a.s.c.a.OverseerTriggerThread Current znodeVersion 4, lastZnodeVersion 4
   [junit4]   2> 215850 INFO  (qtp303552862-1689) [n:127.0.0.1:33094_solr    ] o.a.s.s.HttpSolrCall [admin] webapp=null path=/admin/collections params={action=OVERSEERSTATUS&wt=javabin&version=2} status=0 QTime=22
   [junit4]   2> 215852 INFO  (TEST-TriggerIntegrationTest.testEventFromRestoredState-seed#[5EF3A043CD943FF9]) [    ] o.e.j.s.Server jetty-9.4.8.v20171121, build timestamp: 2017-11-21T10:27:37-11:00, git hash: 82b8fb23f757335bb3329d540ce37a2a2615f0a8
   [junit4]   2> 215853 INFO  (TEST-TriggerIntegrationTest.testEventFromRestoredState-seed#[5EF3A043CD943FF9]) [    ] o.e.j.s.session DefaultSessionIdManager workerName=node0
   [junit4]   2> 215853 INFO  (TEST-TriggerIntegrationTest.testEventFromRestoredState-seed#[5EF3A043CD943FF9]) [    ] o.e.j.s.session No SessionScavenger set, using defaults
   [junit4]   2> 215853 INFO  (TEST-TriggerIntegrationTest.testEventFromRestoredState-seed#[5EF3A043CD943FF9]) [    ] o.e.j.s.session Scavenging every 600000ms
   [junit4]   2> 215854 INFO  (TEST-TriggerIntegrationTest.testEventFromRestoredState-seed#[5EF3A043CD943FF9]) [    ] o.e.j.s.h.ContextHandler Started o.e.j.s.ServletContextHandler@a976d5c{/solr,null,AVAILABLE}
   [junit4]   2> 215854 INFO  (TEST-TriggerIntegrationTest.testEventFromRestoredState-seed#[5EF3A043CD943FF9]) [    ] o.e.j.s.AbstractConnector Started ServerConnector@4a9fa21e{HTTP/1.1,[http/1.1]}{127.0.0.1:51462}
   [junit4]   2> 215854 INFO  (TEST-TriggerIntegrationTest.testEventFromRestoredState-seed#[5EF3A043CD943FF9]) [    ] o.e.j.s.Server Started @218087ms
   [junit4]   2> 215854 INFO  (TEST-TriggerIntegrationTest.testEventFromRestoredState-seed#[5EF3A043CD943FF9]) [    ] o.a.s.c.s.e.JettySolrRunner Jetty properties: {hostContext=/solr, hostPort=51462}
   [junit4]   2> 215854 ERROR (TEST-TriggerIntegrationTest.testEventFromRestoredState-seed#[5EF3A043CD943FF9]) [    ] o.a.s.u.StartupLoggingUtils Missing Java Option solr.log.dir. Logging may be missing or incomplete.
   [junit4]   2> 215854 INFO  (TEST-TriggerIntegrationTest.testEventFromRestoredState-seed#[5EF3A043CD943FF9]) [    ] o.a.s.s.SolrDispatchFilter  ___      _       Welcome to Apache Solr™ version 7.3.0
   [junit4]   2> 215854 INFO  (TEST-TriggerIntegrationTest.testEventFromRestoredState-seed#[5EF3A043CD943FF9]) [    ] o.a.s.s.SolrDispatchFilter / __| ___| |_ _   Starting in cloud mode on port null
   [junit4]   2> 215855 INFO  (TEST-TriggerIntegrationTest.testEventFromRestoredState-seed#[5EF3A043CD943FF9]) [    ] o.a.s.s.SolrDispatchFilter \__ \/ _ \ | '_|  Install dir: null
   [junit4]   2> 215855 INFO  (TEST-TriggerIntegrationTest.testEventFromRestoredState-seed#[5EF3A043CD943FF9]) [    ] o.a.s.s.SolrDispatchFilter |___/\___/_|_|    Start time: 2018-02-22T11:19:53.463Z
   [junit4]   2> 215869 INFO  (zkConnectionManagerCallback-324-thread-1) [    ] o.a.s.c.c.ConnectionManager zkClient has connected
   [junit4]   2> 215869 INFO  (TEST-TriggerIntegrationTest.testEventFromRestoredState-seed#[5EF3A043CD943FF9]) [    ] o.a.s.s.SolrDispatchFilter solr.xml found in ZooKeeper. Loading...
   [junit4]   2> 215881 INFO  (TEST-TriggerIntegrationTest.testEventFromRestoredState-seed#[5EF3A043CD943FF9]) [    ] o.a.s.c.ZkContainer Zookeeper client=127.0.0.1:39482/solr
   [junit4]   2> 215885 INFO  (zkConnectionManagerCallback-328-thread-1) [    ] o.a.s.c.c.ConnectionManager zkClient has connected
   [junit4]   2> 215888 INFO  (zkConnectionManagerCallback-330-thread-1-processing-n:127.0.0.1:51462_solr) [n:127.0.0.1:51462_solr    ] o.a.s.c.c.ConnectionManager zkClient has connected
   [junit4]   2> 215893 INFO  (TEST-TriggerIntegrationTest.testEventFromRestoredState-seed#[5EF3A043CD943FF9]) [n:127.0.0.1:51462_solr    ] o.a.s.c.c.ZkStateReader Updated live nodes from ZooKeeper... (0) -> (2)
   [junit4]   2> 215894 INFO  (TEST-TriggerIntegrationTest.testEventFromRestoredState-seed#[5EF3A043CD943FF9]) [n:127.0.0.1:51462_solr    ] o.a.s.c.Overseer Overseer (id=null) closing
   [junit4]   2> 215897 INFO  (TEST-TriggerIntegrationTest.testEventFromRestoredState-seed#[5EF3A043CD943FF9]) [n:127.0.0.1:51462_solr    ] o.a.s.c.ZkController Register node as live in ZooKeeper:/live_nodes/127.0.0.1:51462_solr
   [junit4]   2> 215898 INFO  (zkCallback-310-thread-1) [    ] o.a.s.c.c.ZkStateReader Updated live nodes from ZooKeeper... (2) -> (3)
   [junit4]   2> 215898 INFO  (zkCallback-319-thread-1-processing-n:127.0.0.1:58350_solr) [n:127.0.0.1:58350_solr    ] o.a.s.c.c.ZkStateReader Updated live nodes from ZooKeeper... (2) -> (3)
   [junit4]   2> 215898 INFO  (zkCallback-294-thread-1-processing-n:127.0.0.1:33094_solr) [n:127.0.0.1:33094_solr    ] o.a.s.c.c.ZkStateReader Updated live nodes from ZooKeeper... (2) -> (3)
   [junit4]   2> 215898 INFO  (zkCallback-310-thread-2) [    ] o.a.s.c.c.ZkStateReader Updated live nodes from ZooKeeper... (2) -> (3)
   [junit4]   2> 215908 INFO  (zkCallback-329-thread-1-processing-n:127.0.0.1:51462_solr) [n:127.0.0.1:51462_solr    ] o.a.s.c.c.ZkStateReader Updated live nodes from ZooKeeper... (2) -> (3)
   [junit4]   2> 216023 INFO  (TEST-TriggerIntegrationTest.testEventFromRestoredState-seed#[5EF3A043CD943FF9]) [n:127.0.0.1:51462_solr    ] o.a.s.m.r.SolrJmxReporter JMX monitoring for 'solr_51462.solr.node' (registry 'solr.node') enabled at server: com.sun.jmx.mbeanserver.JmxMBeanServer@c4cf17b
   [junit4]   2> 216032 INFO  (TEST-TriggerIntegrationTest.testEventFromRestoredState-seed#[5EF3A043CD943FF9]) [n:127.0.0.1:51462_solr    ] o.a.s.m.r.SolrJmxReporter JMX monitoring for 'solr_51462.solr.jvm' (registry 'solr.jvm') enabled at server: com.sun.jmx.mbeanserver.JmxMBeanServer@c4cf17b
   [junit4]   2> 216032 INFO  (TEST-TriggerIntegrationTest.testEventFromRestoredState-seed#[5EF3A043CD943FF9]) [n:127.0.0.1:51462_solr    ] o.a.s.m.r.SolrJmxReporter JMX monitoring for 'solr_51462.solr.jetty' (registry 'solr.jetty') enabled at server: com.sun.jmx.mbeanserver.JmxMBeanServer@c4cf17b
   [junit4]   2> 216033 INFO  (TEST-TriggerIntegrationTest.testEventFromRestoredState-seed#[5EF3A043CD943FF9]) [n:127.0.0.1:51462_solr    ] o.a.s.c.CorePropertiesLocator Found 0 core definitions underneath /x1/jenkins/jenkins-slave/workspace/Lucene-Solr-Tests-7.x/solr/build/solr-core/test/J2/temp/solr.cloud.autoscaling.TriggerIntegrationTest_5EF3A043CD943FF9-001/tempDir-001/node4/.
   [junit4]   2> 216637 DEBUG (ScheduledTrigger-491-thread-1) [n:127.0.0.1:33094_solr    ] o.a.s.c.a.NodeLostTrigger Running NodeLostTrigger: .auto_add_replicas with currently live nodes: 3
   [junit4]   2> 216831 DEBUG (ScheduledTrigger-491-thread-2) [n:127.0.0.1:33094_solr    ] o.a.s.c.a.NodeAddedTrigger Running NodeAddedTrigger node_added_triggerEFRS
   [junit4]   2> 216831 DEBUG (ScheduledTrigger-491-thread-2) [n:127.0.0.1:33094_solr    ] o.a.s.c.a.NodeAddedTrigger Found livenodes: 3
   [junit4]   2> 216831 DEBUG (ScheduledTrigger-491-thread-2) [n:127.0.0.1:33094_solr    ] o.a.s.c.a.NodeAddedTrigger Tracking new node: 127.0.0.1:51462_solr at time 19550301659104489
   [junit4]   2> 217638 DEBUG (ScheduledTrigger-491-thread-4) [n:127.0.0.1:33094_solr    ] o.a.s.c.a.NodeLostTrigger Running NodeLostTrigger: .auto_add_replicas with currently live nodes: 3
   [junit4]   2> 217832 DEBUG (ScheduledTrigger-491-thread-3) [n:127.0.0.1:33094_solr    ] o.a.s.c.a.NodeAddedTrigger Running NodeAddedTrigger node_added_triggerEFRS
   [junit4]   2> 217832 DEBUG (ScheduledTrigger-491-thread-3) [n:127.0.0.1:33094_solr    ] o.a.s.c.a.NodeAddedTrigger Found livenodes: 3
   [junit4]   2> 217839 INFO  (OverseerCollectionConfigSetProcessor-73338842170851332-127.0.0.1:33094_solr-n_0000000001) [n:127.0.0.1:33094_solr    ] o.a.s.c.OverseerTaskQueue Response ZK path: /overseer/collection-queue-work/qnr-0000000002 doesn't exist.  Requestor may have disconnected from ZooKeeper
   [junit4]   2> 218638 DEBUG (ScheduledTrigger-491-thread-1) [n:127.0.0.1:33094_solr    ] o.a.s.c.a.NodeLostTrigger Running NodeLostTrigger: .auto_add_replicas with currently live nodes: 3
   [junit4]   2> 218832 DEBUG (ScheduledTrigger-491-thread-2) [n:127.0.0.1:33094_solr    ] o.a.s.c.a.NodeAddedTrigger Running NodeAddedTrigger node_added_triggerEFRS
   [junit4]   2> 218832 DEBUG (ScheduledTrigger-491-thread-2) [n:127.0.0.1:33094_solr    ] o.a.s.c.a.NodeAddedTrigger Found livenodes: 3
   [junit4]   2> 219639 DEBUG (ScheduledTrigger-491-thread-4) [n:127.0.0.1:33094_solr    ] o.a.s.c.a.NodeLostTrigger Running NodeLostTrigger: .auto_add_replicas with currently live nodes: 3
   [junit4]   2> 219832 DEBUG (ScheduledTrigger-491-thread-3) [n:127.0.0.1:33094_solr    ] o.a.s.c.a.NodeAddedTrigger Running NodeAddedTrigger node_added_triggerEFRS
   [junit4]   2> 219832 DEBUG (ScheduledTrigger-491-thread-3) [n:127.0.0.1:33094_solr    ] o.a.s.c.a.NodeAddedTrigger Found livenodes: 3
   [junit4]   2> 220639 DEBUG (ScheduledTrigger-491-thread-1) [n:127.0.0.1:33094_solr    ] o.a.s.c.a.NodeLostTrigger Running NodeLostTrigger: .auto_add_replicas with currently live nodes: 3
   [junit4]   2> 220833 DEBUG (ScheduledTrigger-491-thread-2) [n:127.0.0.1:33094_solr    ] o.a.s.c.a.NodeAddedTrigger Running NodeAddedTrigger node_added_triggerEFRS
   [junit4]   2> 220833 DEBUG (ScheduledTrigger-491-thread-2) [n:127.0.0.1:33094_solr    ] o.a.s.c.a.NodeAddedTrigger Found livenodes: 3
   [junit4]   2> 221639 DEBUG (ScheduledTrigger-491-thread-4) [n:127.0.0.1:33094_solr    ] o.a.s.c.a.NodeLostTrigger Running NodeLostTrigger: .auto_add_replicas with currently live nodes: 3
   [junit4]   2> 221833 DEBUG (ScheduledTrigger-491-thread-3) [n:127.0.0.1:33094_solr    ] o.a.s.c.a.NodeAddedTrigger Running NodeAddedTrigger node_added_triggerEFRS
   [junit4]   2> 221833 DEBUG (ScheduledTrigger-491-thread-3) [n:127.0.0.1:33094_solr    ] o.a.s.c.a.NodeAddedTrigger Found livenodes: 3
   [junit4]   2> 222640 DEBUG (ScheduledTrigger-491-thread-1) [n:127.0.0.1:33094_solr    ] o.a.s.c.a.NodeLostTrigger Running NodeLostTrigger: .auto_add_replicas with currently live nodes: 3
   [junit4]   2> 222833 DEBUG (ScheduledTrigger-491-thread-2) [n:127.0.0.1:33094_solr    ] o.a.s.c.a.NodeAddedTrigger Running NodeAddedTrigger node_added_triggerEFRS
   [junit4]   2> 222833 DEBUG (ScheduledTrigger-491-thread-2) [n:127.0.0.1:33094_solr    ] o.a.s.c.a.NodeAddedTrigger Found livenodes: 3
   [junit4]   2> 223640 DEBUG (ScheduledTrigger-491-thread-4) [n:127.0.0.1:33094_solr    ] o.a.s.c.a.NodeLostTrigger Running NodeLostTrigger: .auto_add_replicas with currently live nodes: 3
   [junit4]   2> 223834 DEBUG (ScheduledTrigger-491-thread-3) [n:127.0.0.1:33094_solr    ] o.a.s.c.a.NodeAddedTrigger Running NodeAddedTrigger node_added_triggerEFRS
   [junit4]   2> 223834 DEBUG (ScheduledTrigger-491-thread-3) [n:127.0.0.1:33094_solr    ] o.a.s.c.a.NodeAddedTrigger Found livenodes: 3
   [junit4]   2> 224640 DEBUG (ScheduledTrigger-491-thread-1) [n:127.0.0.1:33094_solr    ] o.a.s.c.a.NodeLostTrigger Running NodeLostTrigger: .auto_add_replicas with currently live nodes: 3
   [junit4]   2> 224834 DEBUG (ScheduledTrigger-491-thread-2) [n:127.0.0.1:33094_solr    ] o.a.s.c.a.NodeAddedTrigger Running NodeAddedTrigger node_added_triggerEFRS
   [junit4]   2> 224834 DEBUG (ScheduledTrigger-491-thread-2) [n:127.0.0.1:33094_solr    ] o.a.s.c.a.NodeAddedTrigger Found livenodes: 3
   [junit4]   2> 225641 DEBUG (ScheduledTrigger-491-thread-4) [n:127.0.0.1:33094_solr    ] o.a.s.c.a.NodeLostTrigger Running NodeLostTrigger: .auto_add_replicas with currently live nodes: 3
   [junit4]   2> 225834 DEBUG (ScheduledTrigger-491-thread-3) [n:127.0.0.1:33094_solr    ] o.a.s.c.a.NodeAddedTrigger Running NodeAddedTrigger node_added_triggerEFRS
   [junit4]   2> 225835 DEBUG (ScheduledTrigger-491-thread-3) [n:127.0.0.1:33094_solr    ] o.a.s.c.a.NodeAddedTrigger Found livenodes: 3
   [junit4]   2> 226641 DEBUG (ScheduledTrigger-491-thread-1) [n:127.0.0.1:33094_solr    ] o.a.s.c.a.NodeLostTrigger Running NodeLostTrigger: .auto_add_replicas with currently live nodes: 3
   [junit4]   2> 226835 DEBUG (ScheduledTrigger-491-thread-2) [n:127.0.0.1:33094_solr    ] o.a.s.c.a.NodeAddedTrigger Running NodeAddedTrigger node_added_triggerEFRS
   [junit4]   2> 226835 DEBUG (ScheduledTrigger-491-thread-2) [n:127.0.0.1:33094_solr    ] o.a.s.c.a.NodeAddedTrigger Found livenodes: 3
   [junit4]   2> 226835 DEBUG (ScheduledTrigger-491-thread-2) [n:127.0.0.1:33094_solr    ] o.a.s.c.a.NodeAddedTrigger NodeAddedTrigger node_added_triggerEFRS firing registered processor for nodes: [127.0.0.1:51462_solr] added at times [19550301659104489], now=19550311663297159
   [junit4]   2> 226835 DEBUG (ScheduledTrigger-491-thread-2) [n:127.0.0.1:33094_solr    ] o.a.s.c.a.ScheduledTriggers ++++++++ Cooldown inactive - processing event: {
   [junit4]   2>   "id":"4574e551a484e9T46fu4wjmr1q70wd9bxfydkxwl",
   [junit4]   2>   "source":"node_added_triggerEFRS",
   [junit4]   2>   "eventTime":19550301659104489,
   [junit4]   2>   "eventType":"NODEADDED",
   [junit4]   2>   "properties":{
   [junit4]   2>     "eventTimes":[19550301659104489],
   [junit4]   2>     "nodeNames":["127.0.0.1:51462_solr"]}}
   [junit4]   2> 226836 DEBUG (ScheduledTrigger-491-thread-2) [n:127.0.0.1:33094_solr    ] o.a.s.c.a.ScheduledTriggers Pausing all triggers: [.auto_add_replicas, node_added_triggerEFRS]
   [junit4]   2> 226838 INFO  (ScheduledTrigger-491-thread-2) [n:127.0.0.1:33094_solr    ] o.a.s.c.a.SystemLogListener Collection .system does not exist, disabling logging.
   [junit4]   2> 226838 DEBUG (AutoscalingActionExecutor-492-thread-1-processing-n:127.0.0.1:33094_solr) [n:127.0.0.1:33094_solr    ] o.a.s.c.a.ScheduledTriggers -- processing actions for {
   [junit4]   2>   "id":"4574e551a484e9T46fu4wjmr1q70wd9bxfydkxwl",
   [junit4]   2>   "source":"node_added_triggerEFRS",
   [junit4]   2>   "eventTime":19550301659104489,
   [junit4]   2>   "eventType":"NODEADDED",
   [junit4]   2>   "properties":{
   [junit4]   2>     "eventTimes":[19550301659104489],
   [junit4]   2>     "_enqueue_time_":19550311664382554,
   [junit4]   2>     "nodeNames":["127.0.0.1:51462_solr"]}}
   [junit4]   2> 226840 INFO  (TEST-TriggerIntegrationTest.testEventFromRestoredState-seed#[5EF3A043CD943FF9]) [    ] o.e.j.s.Server jetty-9.4.8.v20171121, build timestamp: 2017-11-21T10:27:37-11:00, git hash: 82b8fb23f757335bb3329d540ce37a2a2615f0a8
   [junit4]   2> 226842 DEBUG (AutoscalingActionExecutor-492-thread-1-processing-n:127.0.0.1:33094_solr) [n:127.0.0.1:33094_solr    ] o.a.s.c.a.ScheduledTriggers Resuming trigger: .auto_add_replicas after 5000ms
   [junit4]   2> 226842 INFO  (TEST-TriggerIntegrationTest.testEventFromRestoredState-seed#[5EF3A043CD943FF9]) [    ] o.e.j.s.session DefaultSessionIdManager workerName=node0
   [junit4]   2> 226842 INFO  (TEST-TriggerIntegrationTest.testEventFromRestoredState-seed#[5EF3A043CD943FF9]) [    ] o.e.j.s.session No SessionScavenger set, using defaults
   [junit4]   2> 226842 DEBUG (AutoscalingActionExecutor-492-thread-1-processing-n:127.0.0.1:33094_solr) [n:127.0.0.1:33094_solr    ] o.a.s.c.a.ScheduledTriggers Resuming trigger: node_added_triggerEFRS after 5000ms
   [junit4]   2> 226842 INFO  (TEST-TriggerIntegrationTest.testEventFromRestoredState-seed#[5EF3A043CD943FF9]) [    ] o.e.j.s.session Scavenging every 660000ms
   [junit4]   2> 226842 DEBUG (AutoscalingActionExecutor-492-thread-1-processing-n:127.0.0.1:33094_solr) [n:127.0.0.1:33094_solr    ] o.a.s.c.a.ScheduledTriggers -- processing took 3 ms for event id=4574e551a484e9T46fu4wjmr1q70wd9bxfydkxwl
   [junit4]   2> 226843 INFO  (TEST-TriggerIntegrationTest.testEventFromRestoredState-seed#[5EF3A043CD943FF9]) [    ] o.e.j.s.h.ContextHandler Started o.e.j.s.ServletContextHandler@6ec85e4c{/solr,null,AVAILABLE}
   [junit4]   2> 226843 INFO  (TEST-TriggerIntegrationTest.testEventFromRestoredState-seed#[5EF3A043CD943FF9]) [    ] o.e.j.s.AbstractConnector Started ServerConnector@6d8e47a7{HTTP/1.1,[http/1.1]}{127.0.0.1:60218}
   [junit4]   2> 226843 INFO  (TEST-TriggerIntegrationTest.testEventFromRestoredState-seed#[5EF3A043CD943FF9]) [    ] o.e.j.s.Server Started @229077ms
   [junit4]   2> 226844 INFO  (TEST-TriggerIntegrationTest.testEventFromRestoredState-seed#[5EF3A043CD943FF9]) [    ] o.a.s.c.s.e.JettySolrRunner Jetty properties: {hostContext=/solr, hostPort=60218}
   [junit4]   2> 226844 ERROR (TEST-TriggerIntegrationTest.testEventFromRestoredState-seed#[5EF3A043CD943FF9]) [    ] o.a.s.u.StartupLoggingUtils Missing Java Option solr.log.dir. Logging may be missing or incomplete.
   [junit4]   2> 226844 INFO  (TEST-TriggerIntegrationTest.testEventFromRestoredState-seed#[5EF3A043CD943FF9]) [    ] o.a.s.s.SolrDispatchFilter  ___      _       Welcome to Apache Solr™ version 7.3.0
   [junit4]   2> 226844 INFO  (TEST-TriggerIntegrationTest.testEventFromRestoredState-seed#[5EF3A043CD943FF9]) [    ] o.a.s.s.SolrDispatchFilter / __| ___| |_ _   Starting in cloud mode on port null
   [junit4]   2> 226844 INFO  (TEST-TriggerIntegrationTest.testEventFromRestoredState-seed#[5EF3A043CD943FF9]) [    ] o.a.s.s.SolrDispatchFilter \__ \/ _ \ | '_|  Install dir: null
   [junit4]   2> 226844 INFO  (TEST-TriggerIntegrationTest.testEventFromRestoredState-seed#[5EF3A043CD943FF9]) [    ] o.a.s.s.SolrDispatchFilter |___/\___/_|_|    Start time: 2018-02-22T11:20:04.452Z
   [junit4]   2> 226847 INFO  (zkConnectionManagerCallback-334-thread-1) [    ] o.a.s.c.c.ConnectionManager zkClient has connected
   [junit4]   2> 226848 INFO  (TEST-TriggerIntegrationTest.testEventFromRestoredState-seed#[5EF3A043CD943FF9]) [    ] o.a.s.s.SolrDispatchFilter solr.xml found in ZooKeeper. Loading...
   [junit4]   2> 226857 INFO  (TEST-TriggerIntegrationTest.testEventFromRestoredState-seed#[5EF3A043CD943FF9]) [    ] o.a.s.c.ZkContainer Zookeeper client=127.0.0.1:39482/solr
   [junit4]   2> 226858 INFO  (zkConnectionManagerCallback-338-thread-1) [    ] o.a.s.c.c.ConnectionManager zkClient has connected
   [junit4]   2> 226861 INFO  (zkConnectionManagerCallback-340-thread-1-processing-n:127.0.0.1:60218_solr) [n:127.0.0.1:60218_solr    ] o.a.s.c.c.ConnectionManager zkClient has connected
   [junit4]   2> 226868 INFO  (TEST-TriggerIntegrationTest.testEventFromRestoredState-seed#[5EF3A043CD943FF9]) [n:127.0.0.1:60218_solr    ] o.a.s.c.c.ZkStateReader Updated live nodes from ZooKeeper... (0) -> (3)
   [junit4]   2> 226870 INFO  (TEST-TriggerIntegrationTest.testEventFromRestoredState-seed#[5EF3A043CD943FF9]) [n:127.0.0.1:60218_solr    ] o.a.s.c.Overseer Overseer (id=null) closing
   [junit4]   2> 226872 INFO  (TEST-TriggerIntegrationTest.testEventFromRestoredState-seed#[5EF3A043CD943FF9]) [n:127.0.0.1:60218_solr    ] o.a.s.c.ZkController Register node as live in ZooKeeper:/live_nodes/127.0.0.1:60218_solr
   [junit4]   2> 226884 INFO  (zkCallback-310-thread-2) [    ] o.a.s.c.c.ZkStateReader Updated live nodes from ZooKeeper... (3) -> (4)
   [junit4]   2> 226884 INFO  (zkCallback-310-thread-1) [    ] o.a.s.c.c.ZkStateReader Updated live nodes from ZooKeeper... (3) -> (4)
   [junit4]   2> 226884 INFO  (zkCallback-319-thread-1-processing-n:127.0.0.1:58350_solr) [n:127.0.0.1:58350_solr    ] o.a.s.c.c.ZkStateReader Updated live nodes from ZooKeeper... (3) -> (4)
   [junit4]   2> 226884 INFO  (zkCallback-329-thread-1-processing-n:127.0.0.1:51462_solr) [n:127.0.0.1:51462_solr    ] o.a.s.c.c.ZkStateReader Updated live nodes from ZooKeeper... (3) -> (4)
   [junit4]   2> 226884 INFO  (zkCallback-294-thread-1-processing-n:127.0.0.1:33094_solr) [n:127.0.0.1:33094_solr    ] o.a.s.c.c.ZkStateReader Updated live nodes from ZooKeeper... (3) -> (4)
   [junit4]   2> 226885 INFO  (zkCallback-339-thread-1-processing-n:127.0.0.1:60218_solr) [n:127.0.0.1:60218_solr    ] o.a.s.c.c.ZkStateReader Updated live nodes from ZooKeeper... (3) -> (4)
   [junit4]   2> 226955 INFO  (TEST-TriggerIntegrationTest.testEventFromRestoredState-seed#[5EF3A043CD943FF9]) [n:127.0.0.1:60218_solr    ] o.a.s.m.r.SolrJmxReporter JMX monitoring for 'solr_60218.solr.node' (registry 'solr.node') enabled at server: com.sun.jmx.mbeanserver.JmxMBeanServer@c4cf17b
   [junit4]   2> 226964 INFO  (TEST-TriggerIntegrationTest.testEventFromRestoredState-seed#[5EF3A043CD943FF9]) [n:127.0.0.1:60218_solr    ] o.a.s.m.r.SolrJmxReporter JMX monitoring for 'solr_60218.solr.jvm' (registry 'solr.jvm') enabled at server: com.sun.jmx.mbeanserver.JmxMBeanServer@c4cf17b
   [junit4]   2> 226964 INFO  (TEST-TriggerIntegrationTest.testEventFromRestoredState-seed#[5EF3A043CD943FF9]) [n:127.0.0.1:60218_solr    ] o.a.s.m.r.SolrJmxReporter JMX monitoring for 'solr_60218.solr.jetty' (registry 'solr.jetty') enabled at server: com.sun.jmx.mbeanserver.JmxMBeanServer@c4cf17b
   [junit4]   2> 226966 INFO  (TEST-TriggerIntegrationTest.testEventFromRestoredState-seed#[5EF3A043CD943FF9]) [n:127.0.0.1:60218_solr    ] o.a.s.c.CorePropertiesLocator Found 0 core definitions underneath /x1/jenkins/jenkins-slave/workspace/Lucene-Solr-Tests-7.x/solr/build/solr-core/test/J2/temp/solr.cloud.autoscaling.TriggerIntegrationTest_5EF3A043CD943FF9-001/tempDir-001/node5/.
   [junit4]   2> 231842 DEBUG (ScheduledTrigger-491-thread-3) [n:127.0.0.1:33094_solr    ] o.a.s.c.a.NodeLostTrigger Running NodeLostTrigger: .auto_add_replicas with currently live nodes: 4
   [junit4]   2> 231842 DEBUG (ScheduledTrigger-491-thread-1) [n:127.0.0.1:33094_solr    ] o.a.s.c.a.NodeAddedTrigger Running NodeAddedTrigger node_added_triggerEFRS
   [junit4]   2> 231842 DEBUG (ScheduledTrigger-491-thread-1) [n:127.0.0.1:33094_solr    ] o.a.s.c.a.NodeAddedTrigger Found livenodes: 4
   [junit4]   2> 231842 DEBUG (ScheduledTrigger-491-thread-1) [n:127.0.0.1:33094_solr    ] o.a.s.c.a.NodeAddedTrigger Tracking new node: 127.0.0.1:60218_solr at time 19550316670482126
   [junit4]   2> 232844 DEBUG (ScheduledTrigger-491-thread-4) [n:127.0.0.1:33094_solr    ] o.a.s.c.a.NodeAddedTrigger Running NodeAddedTrigger node_added_triggerEFRS
   [junit4]   2> 232844 DEBUG (ScheduledTrigger-491-thread-3) [n:127.0.0.1:33094_solr    ] o.a.s.c.a.NodeLostTrigger Running NodeLostTrigger: .auto_add_replicas with currently live nodes: 4
   [junit4]   2> 232844 DEBUG (ScheduledTrigger-491-thread-4) [n:127.0.0.1:33094_solr    ] o.a.s.c.a.NodeAddedTrigger Found livenodes: 4
   [junit4]   2> 233844 DEBUG (ScheduledTrigger-491-thread-3) [n:127.0.0.1:33094_solr    ] o.a.s.c.a.NodeLostTrigger Running NodeLostTrigger: .auto_add_replicas with currently live nodes: 4
   [junit4]   2> 233844 DEBUG (ScheduledTrigger-491-thread-1) [n:127.0.0.1:33094_solr    ] o.a.s.c.a.NodeAddedTrigger Running NodeAddedTrigger node_added_triggerEFRS
   [junit4]   2> 233844 DEBUG (ScheduledTrigger-491-thread-1) [n:127.0.0.1:33094_solr    ] o.a.s.c.a.NodeAddedTrigger Found livenodes: 4
   [junit4]   2> 234844 DEBUG (ScheduledTrigger-491-thread-3) [n:127.0.0.1:33094_solr    ] o.a.s.c.a.NodeLostTrigger Running NodeLostTrigger: .auto_add_replicas with currently live nodes: 4
   [junit4]   2> 234844 DEBUG (ScheduledTrigger-491-thread-3) [n:127.0.0.1:33094_solr    ] o.a.s.c.a.NodeAddedTrigger Running NodeAddedTrigger node_added_triggerEFRS
   [junit4]   2> 234844 DEBUG (ScheduledTrigger-491-thread-3) [n:127.0.0.1:33094_solr    ] o.a.s.c.a.NodeAddedTrigger Found livenodes: 4
   [junit4]   2> 235844 DEBUG (ScheduledTrigger-491-thread-3) [n:127.0.0.1:33094_solr    ] o.a.s.c.a.NodeLostTrigger Running NodeLostTrigger: .auto_add_replicas with currently live nodes: 4
   [junit4]   2> 235844 DEBUG (ScheduledTrigger-491-thread-3) [n:127.0.0.1:33094_solr    ] o.a.s.c.a.NodeAddedTrigger Running NodeAddedTrigger node_added_triggerEFRS
   [junit4]   2> 235844 DEBUG (ScheduledTrigger-491-thread-3) [n:127.0.0.1:33094_solr    ] o.a.s.c.a.NodeAddedTrigger Found livenodes: 4
   [junit4]   2> 236845 DEBUG (ScheduledTrigger-491-thread-3) [n:127.0.0.1:33094_solr    ] o.a.s.c.a.NodeLostTrigger Running NodeLostTrigger: .auto_add_replicas with currently live nodes: 4
   [junit4]   2> 236845 DEBUG (ScheduledTrigger-491-thread-2) [n:127.0.0.1:33094_solr    ] o.a.s.c.a.NodeAddedTrigger Running NodeAddedTrigger node_added_triggerEFRS
   [junit4]   2> 236845 DEBUG (ScheduledTrigger-491-thread-2) [n:127.0.0.1:33094_solr    ] o.a.s.c.a.NodeAddedTrigger Found livenodes: 4
   [junit4]   2> 237025 INFO  (TEST-TriggerIntegrationTest.testEventFromRestoredState-seed#[5EF3A043CD943FF9]) [    ] o.e.j.s.AbstractConnector Stopped ServerConnector@49d5f1d5{HTTP/1.1,[http/1.1]}{127.0.0.1:0}
   [junit4]   2> 237028 INFO  (TEST-TriggerIntegrationTest.testEventFromRestoredState-seed#[5EF3A043CD943FF9]) [    ] o.a.s.c.CoreContainer Shutting down CoreContainer instance=1219919718
   [junit4]   2> 237028 INFO  (TEST-TriggerIntegrationTest.testEventFromRestoredState-seed#[5EF3A043CD943FF9]) [    ] o.a.s.m.SolrMetricManager Closing metric reporters for registry=solr.node, tag=null
   [junit4]   2> 237029 INFO  (TEST-TriggerIntegrationTest.testEventFromRestoredState-seed#[5EF3A043CD943FF9]) [    ] o.a.s.m.r.SolrJmxReporter Closing reporter [org.apache.solr.metrics.reporters.SolrJmxReporter@3a7c5565: rootName = solr_33094, domain = solr.node, service url = null, agent id = null] for registry solr.node / com.codahale.metrics.MetricRegistry@260c172
   [junit4]   2> 237035 INFO  (TEST-TriggerIntegrationTest.testEventFromRestoredState-seed#[5EF3A043CD943FF9]) [    ] o.a.s.m.SolrMetricManager Closing metric reporters for registry=solr.jvm, tag=null
   [junit4]   2> 237035 INFO  (TEST-TriggerIntegrationTest.testEventFromRestoredState-seed#[5EF3A043CD943FF9]) [    ] o.a.s.m.r.SolrJmxReporter Closing reporter [org.apache.solr.metrics.reporters.SolrJmxReporter@78e0ebad: rootName = solr_33094, domain = solr.jvm, service url = null, agent id = null] for registry solr.jvm / com.codahale.metrics.MetricRegistry@412ee9d5
   [junit4]   2> 237039 INFO  (TEST-TriggerIntegrationTest.testEventFromRestoredState-seed#[5EF3A043CD943FF9]) [    ] o.a.s.m.SolrMetricManager Closing metric reporters for registry=solr.jetty, tag=null
   [junit4]   2> 237039 INFO  (TEST-TriggerIntegrationTest.testEventFromRestoredState-seed#[5EF3A043CD943FF9]) [    ] o.a.s.m.r.SolrJmxReporter Closing reporter [org.apache.solr.metrics.reporters.SolrJmxReporter@7017432a: rootName = solr_33094, domain = solr.jetty, service url = null, agent id = null] for registry solr.jetty / com.codahale.metrics.MetricRegistry@6fb67b98
   [junit4]   2> 237041 INFO  (TEST-TriggerIntegrationTest.testEventFromRestoredState-seed#[5EF3A043CD943FF9]) [    ] o.a.s.c.ZkController Remove node as live in ZooKeeper:/live_nodes/127.0.0.1:33094_solr
   [junit4]   2> 237043 INFO  (TEST-TriggerIntegrationTest.testEventFromRestoredState-seed#[5EF3A043CD943FF9]) [    ] o.a.s.m.SolrMetricManager Closing metric reporters for registry=solr.cluster, tag=null
   [junit4]   2> 237043 INFO  (TEST-TriggerIntegrationTest.testEventFromRestoredState-seed#[5EF3A043CD943FF9]) [    ] o.a.s.c.TransientSolrCoreCacheDefault Allocating transient cache for 2147483647 transient cores
   [junit4]   2> 237043 INFO  (TEST-TriggerIntegrationTest.testEventFromRestoredState-seed#[5EF3A043CD943FF9]) [    ] o.a.s.c.Overseer Overseer (id=73338842170851332-127.0.0.1:33094_solr-n_0000000001) closing
   [junit4]   2> 237044 INFO  (OverseerStateUpdate-73338842170851332-127.0.0.1:33094_solr-n_0000000001) [n:127.0.0.1:33094_solr    ] o.a.s.c.Overseer Overseer Loop exiting : 127.0.0.1:33094_solr
   [junit4]   2> 237045 WARN  (OverseerAutoScalingTriggerThread-73338842170851332-127.0.0.1:33094_solr-n_0000000001) [n:127.0.0.1:33094_solr    ] o.a.s.c.a.OverseerTriggerThread OverseerTriggerThread woken up but we are closed, exiting.
   [junit4]   2> 237045 DEBUG (TEST-TriggerIntegrationTest.testEventFromRestoredState-seed#[5EF3A043CD943FF9]) [    ] o.a.s.c.a.OverseerTriggerThread OverseerTriggerThread has been closed explicitly
   [junit4]   2> 237047 INFO  (zkCallback-339-thread-1-processing-n:127.0.0.1:60218_solr) [n:127.0.0.1:60218_solr    ] o.a.s.c.c.ZkStateReader Updated live nodes from ZooKeeper... (4) -> (3)
   [junit4]   2> 237047 INFO  (zkCallback-294-thread-1-processing-n:127.0.0.1:33094_solr) [n:127.0.0.1:33094_solr    ] o.a.s.c.c.ZkStateReader Updated live nodes from ZooKeeper... (4) -> (3)
   [junit4]   2> 237047 INFO  (zkCallback-319-thread-1-processing-n:127.0.0.1:58350_solr) [n:127.0.0.1:58350_solr    ] o.a.s.c.c.ZkStateReader Updated live nodes from ZooKeeper... (4) -> (3)
   [junit4]   2> 237047 INFO  (zkCallback-310-thread-1) [    ] o.a.s.c.c.ZkStateReader Updated live nodes from ZooKeeper... (4) -> (3)
   [junit4]   2> 237047 INFO  (zkCallback-310-thread-2) [    ] o.a.s.c.c.ZkStateReader Updated live nodes from ZooKeeper... (4) -> (3)
   [junit4]   2> 237048 INFO  (zkCallback-329-thread-1-processing-n:127.0.0.1:51462_solr) [n:127.0.0.1:51462_solr    ] o.a.s.c.c.ZkStateReader Updated live nodes from ZooKeeper... (4) -> (3)
   [junit4]   2> 237053 INFO  (zkCallback-319-thread-1-processing-n:127.0.0.1:58350_solr) [n:127.0.0.1:58350_solr    ] o.a.s.c.OverseerElectionContext I am going to be the leader 127.0.0.1:58350_solr
   [junit4]   2> 237055 INFO  (TEST-TriggerIntegrationTest.testEventFromRestoredState-seed#[5EF3A043CD943FF9]) [    ] o.e.j.s.h.ContextHandler Stopped o.e.j.s.ServletContextHandler@6da7c9f4{/solr,null,UNAVAILABLE}
   [junit4]   2> 237055 INFO  (zkCallback-319-thread-1-processing-n:127.0.0.1:58350_solr) [n:127.0.0.1:58350_solr    ] o.a.s.c.Overseer Overseer (id=73338842170851339-127.0.0.1:58350_solr-n_0000000002) starting
   [junit4]   2> 237056 INFO  (TEST-TriggerIntegrationTest.testEventFromRestoredState-seed#[5EF3A043CD943FF9]) [    ] o.e.j.s.session Stopped scavenging
   [junit4]   2> 237065 DEBUG (OverseerAutoScalingTriggerThread-73338842170851339-127.0.0.1:58350_solr-n_0000000002) [n:127.0.0.1:58350_solr    ] o.a.s.c.a.OverseerTriggerThread Refreshing /autoscaling.json with znode version 4
   [junit4]   2> 237068 DEBUG (OverseerAutoScalingTriggerThread-73338842170851339-127.0.0.1:58350_solr-n_0000000002) [n:127.0.0.1:58350_solr    ] o.a.s.c.a.NodeAddedTrigger Initial livenodes: [127.0.0.1:58350_solr, 127.0.0.1:60218_solr, 127.0.0.1:51462_solr]
   [junit4]   2> 237068 DEBUG (OverseerAutoScalingTriggerThread-73338842170851339-127.0.0.1:58350_solr-n_0000000002) [n:127.0.0.1:58350_solr    ] o.a.s.c.a.NodeAddedTrigger NodeAddedTrigger node_added_triggerEFRS instantiated with properties: {event=nodeAdded, waitFor=10, actions=[{name=test, class=org.apache.solr.cloud.autoscaling.TriggerIntegrationTest$TestTriggerAction}], enabled=true}
   [junit4]   2> 237069 DEBUG (OverseerAutoScalingTriggerThread-73338842170851339-127.0.0.1:58350_solr-n_0000000002) [n:127.0.0.1:58350_solr    ] o.a.s.c.a.NodeLostTrigger Initial livenodes: [127.0.0.1:58350_solr, 127.0.0.1:60218_solr, 127.0.0.1:51462_solr]
   [junit4]   2> 237069 DEBUG (OverseerAutoScalingTriggerThread-73338842170851339-127.0.0.1:58350_solr-n_0000000002) [n:127.0.0.1:58350_solr    ] o.a.s.c.a.OverseerTriggerThread Current znodeVersion 4, lastZnodeVersion -1
   [junit4]   2> 237069 DEBUG (OverseerAutoScalingTriggerThread-73338842170851339-127.0.0.1:58350_solr-n_0000000002) [n:127.0.0.1:58350_solr    ] o.a.s.c.a.OverseerTriggerThread Processed trigger updates upto znodeVersion 4
   [junit4]   2> 237069 INFO  (OverseerAutoScalingTriggerThread-73338842170851339-127.0.0.1:58350_solr-n_0000000002) [n:127.0.0.1:58350_solr    ] o.a.s.c.a.TriggerIntegrationTest TestTriggerAction init
   [junit4]   2> 237069 DEBUG (OverseerAutoScalingTriggerThread-73338842170851339-127.0.0.1:58350_solr-n_0000000002) [n:127.0.0.1:58350_solr    ] o.a.s.c.a.NodeAddedTrigger Adding node from marker path: 127.0.0.1:60218_solr
   [junit4]   2> 237070 DEBUG (OverseerAutoScalingTriggerThread-73338842170851339-127.0.0.1:58350_solr-n_0000000002) [n:127.0.0.1:58350_solr    ] o.a.s.c.a.NodeLostTrigger Adding lost node from marker path: 127.0.0.1:33094_solr
   [junit4]   2> 237071 DEBUG (ScheduledTrigger-514-thread-1) [n:127.0.0.1:58350_solr    ] o.a.s.c.a.NodeAddedTrigger Running NodeAddedTrigger node_added_triggerEFRS
   [junit4]   2> 237071 DEBUG (ScheduledTrigger-514-thread-1) [n:127.0.0.1:58350_solr    ] o.a.s.c.a.NodeAddedTrigger Found livenodes: 3
   [junit4]   2> 237071 DEBUG (OverseerAutoScalingTriggerThread-73338842170851339-127.0.0.1:58350_solr-n_0000000002) [n:127.0.0.1:58350_solr    ] o.a.s.c.a.OverseerTriggerThread Current znodeVersion 4, lastZnodeVersion 4
   [junit4]   2> 237072 DEBUG (ScheduledTrigger-514-thread-2) [n:127.0.0.1:58350_solr    ] o.a.s.c.a.NodeLostTrigger Running NodeLostTrigger: .auto_add_replicas with currently live nodes: 3
   [junit4]   2> 237072 DEBUG (ScheduledTrigger-514-thread-2) [n:127.0.0.1:58350_solr    ] o.a.s.c.a.NodeLostTrigger Tracking lost node: 127.0.0.1:33094_solr
   [junit4]   2> 238072 DEBUG (ScheduledTrigger-514-thread-1) [n:127.0.0.1:58350_solr    ] o.a.s.c.a.NodeAddedTrigger Running NodeAddedTrigger node_added_triggerEFRS
   [junit4]   2> 238072 DEBUG (ScheduledTrigger-514-thread-1) [n:127.0.0.1:58350_solr    ] o.a.s.c.a.NodeAddedTrigger Found livenodes: 3
   [junit4]   2> 238077 DEBUG (ScheduledTrigger-514-thread-3) [n:127.0.0.1:58350_solr    ] o.a.s.c.a.NodeLostTrigger Running NodeLostTrigger: .auto_add_replicas with currently live nodes: 3
   [junit4]   2> 239072 DEBUG (ScheduledTrigger-514-thread-2) [n:127.0.0.1:58350_solr    ] o.a.s.c.a.NodeAddedTrigger Running NodeAddedTrigger node_added_triggerEFRS
   [junit4]   2> 239072 DEBUG (ScheduledTrigger-514-thread-2) [n:127.0.0.1:58350_solr    ] o.a.s.c.a.NodeAddedTrigger Found livenodes: 3
   [junit4]   2> 239077 DEBUG (ScheduledTrigger-514-thread-4) [n:127.0.0.1:58350_solr    ] o.a.s.c.a.NodeLostTrigger Running NodeLostTrigger: .auto_add_replicas with currently live nodes: 3
   [junit4]   2> 240073 DEBUG (ScheduledTrigger-514-thread-1) [n:127.0.0.1:58350_solr    ] o.a.s.c.a.NodeAddedTrigger Running NodeAddedTrigger node_added_triggerEFRS
   [junit4]   2> 240073 DEBUG (ScheduledTrigger-514-thread-1) [n:127.0.0.1:58350_solr    ] o.a.s.c.a.NodeAddedTrigger Found livenodes: 3
   [junit4]   2> 240077 DEBUG (ScheduledTrigger-514-thread-3) [n:127.0.0.1:58350_solr    ] o.a.s.c.a.NodeLostTrigger Running NodeLostTrigger: .auto_add_replicas with currently live nodes: 3
   [junit4]   2> 241073 DEBUG (ScheduledTrigger-514-thread-2) [n:127.0.0.1:58350_solr    ] o.a.s.c.a.NodeAddedTrigger Running NodeAddedTrigger node_added_triggerEFRS
   [junit4]   2> 241073 DEBUG (ScheduledTrigger-514-thread-2) [n:127.0.0.1:58350_solr    ] o.a.s.c.a.NodeAddedTrigger Found livenodes: 3
   [junit4]   2> 241078 DEBUG (ScheduledTrigger-514-thread-2) [n:127.0.0.1:58350_solr    ] o.a.s.c.a.NodeLostTrigger Running NodeLostTrigger: .auto_add_replicas with currently live nodes: 3
   [junit4]   2> 242073 DEBUG (ScheduledTrigger-514-thread-2) [n:127.0.0.1:58350_solr    ] o.a.s.c.a.NodeAddedTrigger Running NodeAddedTrigger node_added_triggerEFRS
   [junit4]   2> 242073 DEBUG (ScheduledTrigger-514-thread-2) [n:127.0.0.1:58350_solr    ] o.a.s.c.a.NodeAddedTrigger Found livenodes: 3
   [junit4]   2> 242073 DEBUG (ScheduledTrigger-514-thread-2) [n:127.0.0.1:58350_solr    ] o.a.s.c.a.NodeAddedTrigger NodeAddedTrigger node_added_triggerEFRS firing registered processor for nodes: [127.0.0.1:60218_solr] added at times [19550316670482126], now=19550326901363525
   [junit4]   2> 242073 DEBUG (ScheduledTrigger-514-thread-2) [n:127.0.0.1:58350_solr    ] o.a.s.c.a.ScheduledTriggers ++++++++ Cooldown inactive - processing event: {
   [junit4]   2>   "id":"4574e8d063f6ceT46fu4wjmr1q70wd9bxfydkxwn",
   [junit4]   2>   "source":"node_added_triggerEFRS",
   [junit4]   2>   "eventTime":19550316670482126,
   [junit4]   2>   "eventType":"NODEADDED",
   [junit4]   2>   "properties":{
   [junit4]   2>     "eventTimes":[19550316670482126],
   [junit4]   2>     "nodeNames":["127.0.0.1:60218_solr"]}}
   [junit4]   2> 242074 DEBUG (ScheduledTrigger-514-thread-2) [n:127.0.0.1:58350_solr    ] o.a.s.c.a.ScheduledTriggers Pausing all triggers: [.auto_add_replicas, node_added_triggerEFRS]
   [junit4]   2> 242074 INFO  (ScheduledTrigger-514-thread-2) [n:127.0.0.1:58350_solr    ] o.a.s.c.a.SystemLogListener Collection .system does not exist, disabling logging.
   [junit4]   2> 242076 DEBUG (AutoscalingActionExecutor-515-thread-1-processing-n:127.0.0.1:58350_solr) [n:127.0.0.1:58350_solr    ] o.a.s.c.a.ScheduledTriggers -- processing actions for {
   [junit4]   2>   "id":"4574e8d063f6ceT46fu4wjmr1q70wd9bxfydkxwn",
   [junit4]   2>   "source":"node_added_triggerEFRS",
   [junit4]   2>   "eventTime":19550316670482126,
   [junit4]   2>   "eventType":"NODEADDED",
   [junit4]   2>   "properties":{
   [junit4]   2>     "eventTimes":[19550316670482126],
   [junit4]   2>     "_enqueue_time_":19550326901845961,
   [junit4]   2>     "nodeNames":["127.0.0.1:60218_solr"]}}
   [junit4]   2> 242076 INFO  (TEST-TriggerIntegrationTest.testEventFromRestoredState-seed#[5EF3A043CD943FF9]) [    ] o.a.s.SolrTestCaseJ4 ###Ending testEventFromRestoredState
   [junit4]   2> 242093 INFO  (TEST-TriggerIntegrationTest.testContinueTriggersOnOverseerRestart-seed#[5EF3A043CD943FF9]) [    ] o.a.s.SolrTestCaseJ4 ###Starting testContinueTriggersOnOverseerRestart
   [junit4]   2> 242094 INFO  (qtp1052346107-1787) [n:127.0.0.1:51462_solr    ] o.a.s.h.a.CollectionsHandler Invoked Collection Action :overseerstatus with params action=OVERSEERSTATUS&wt=javabin&version=2 and sendToOCPQueue=true
   [junit4]   2> 242098 DEBUG (AutoscalingActionExecutor-515-thread-1-processing-n:127.0.0.1:58350_solr) [n:127.0.0.1:58350_solr    ] o.a.s.c.a.ScheduledTriggers Resuming trigger: .auto_add_replicas after 5000ms
   [junit4]   2> 242098 DEBUG (AutoscalingActionExecutor-515-thread-1-processing-n:127.0.0.1:58350_solr) [n:127.0.0.1:58350_solr    ] o.a.s.c.a.ScheduledTriggers Resuming trigger: node_added_triggerEFRS after 5000ms
   [junit4]   2> 242098 DEBUG (AutoscalingActionExecutor-515-thread-1-processing-n:127.0.0.1:58350_solr) [n:127.0.0.1:58350_solr    ] o.a.s.c.a.ScheduledTriggers -- processing took 21 ms for event id=4574e8d063f6ceT46fu4wjmr1q70wd9bxfydkxwn
   [junit4]   2> 242103 INFO  (qtp1052346107-1787) [n:127.0.0.1:51462_solr    ] o.a.s.s.HttpSolrCall [admin] webapp=null path=/admin/collections params={action=OVERSEERSTATUS&wt=javabin&version=2} status=0 QTime=9
   [junit4]   2> 242104 INFO  (TEST-TriggerIntegrationTest.testContinueTriggersOnOverseerRestart-seed#[5EF3A043CD943FF9]) [    ] o.a.s.c.a.ScheduledTriggers -- removing trigger: .auto_add_replicas
   [junit4]   2> 242105 INFO  (TEST-TriggerIntegrationTest.testContinueTriggersOnOverseerRestart-seed#[5EF3A043CD943FF9]) [    ] o.a.s.c.a.ScheduledTriggers -- removing trigger: node_added_triggerEFRS
   [junit4]   2> 242106 INFO  (TEST-TriggerIntegrationTest.testContinueTriggersOnOverseerRestart-seed#[5EF3A043CD943FF9]) [    ] o.a.s.c.a.TriggerIntegrationTest /autoscaling.json reset, new znode version 5
   [junit4]   2> 242106 DEBUG (zkCallback-319-thread-1-processing-n:127.0.0.1:58350_solr) [n:127.0.0.1:58350_solr    ] o.a.s.c.a.OverseerTriggerThread Refreshing /autoscaling.json with znode version 5
   [junit4]   2> 242106 DEBUG (OverseerAutoScalingTriggerThread-73338842170851339-127.0.0.1:58350_solr-n_0000000002) [n:127.0.0.1:58350_solr    ] o.a.s.c.a.OverseerTriggerThread Processed trigger updates upto znodeVersion 5
   [junit4]   2> 242106 DEBUG (OverseerAutoScalingTriggerThread-73338842170851339-127.0.0.1:58350_solr-n_0000000002) [n:127.0.0.1:58350_solr    ] o.a.s.c.a.OverseerTriggerThread -- clean old nodeLost markers
   [junit4]   2> 242106 DEBUG (OverseerAutoScalingTriggerThread-73338842170851339-127.0.0.1:58350_solr-n_0000000002) [n:127.0.0.1:58350_solr    ] o.a.s.c.a.OverseerTriggerThread -- clean old nodeAdded markers
   [junit4]   2> 242106 DEBUG (OverseerAutoScalingTriggerThread-73338842170851339-127.0.0.1:58350_solr-n_0000000002) [n:127.0.0.1:58350_solr    ] o.a.s.c.a.OverseerTriggerThread Current znodeVersion 5, lastZnodeVersion 5
   [junit4]   2> 242107 INFO  (TEST-TriggerIntegrationTest.testContinueTriggersOnOverseerRestart-seed#[5EF3A043CD943FF9]) [    ] o.a.s.c.c.ZkStateReader Updated live nodes from ZooKeeper... (0) -> (3)
   [junit4]   2> 242112 INFO  (TEST-TriggerIntegrationTest.testContinueTriggersOnOverseerRestart-seed#[5EF3A043CD943FF9]) [    ] o.e.j.s.AbstractConnector Stopped ServerConnector@6500e398{HTTP/1.1,[http/1.1]}{127.0.0.1:0}
   [junit4]   2> 242113 INFO  (TEST-TriggerIntegrationTest.testContinueTriggersOnOverseerRestart-seed#[5EF3A043CD943FF9]) [    ] o.a.s.c.CoreContainer Shutting down CoreContainer instance=466317021
   [junit4]   2> 242113 INFO  (TEST-TriggerIntegrationTest.testContinueTriggersOnOverseerRestart-seed#[5EF3A043CD943FF9]) [    ] o.a.s.m.SolrMetricManager Closing metric reporters for registry=solr.node, tag=null
   [junit4]   2> 242113 INFO  (TEST-TriggerIntegrationTest.testContinueTriggersOnOverseerRestart-seed#[5EF3A043CD943FF9]) [    ] o.a.s.m.

[...truncated too long message...]

ection1] o.a.s.u.LoggingInfoStream [IW][coreCloseExecutor-193-thread-1]: rollback: done finish merges
   [junit4]   2> 65576 INFO  (coreCloseExecutor-193-thread-1) [    x:collection1] o.a.s.u.LoggingInfoStream [DW][coreCloseExecutor-193-thread-1]: abort
   [junit4]   2> 65576 INFO  (coreCloseExecutor-193-thread-1) [    x:collection1] o.a.s.u.LoggingInfoStream [DW][coreCloseExecutor-193-thread-1]: done abort success=true
   [junit4]   2> 65576 INFO  (coreCloseExecutor-193-thread-1) [    x:collection1] o.a.s.u.LoggingInfoStream [IW][coreCloseExecutor-193-thread-1]: rollback: infos=_1e(7.3.0):C12
   [junit4]   2> 65576 INFO  (coreCloseExecutor-193-thread-1) [    x:collection1] o.a.s.u.LoggingInfoStream [IFD][coreCloseExecutor-193-thread-1]: now checkpoint "_1e(7.3.0):C12" [1 segments ; isCommit = false]
   [junit4]   2> 65576 INFO  (coreCloseExecutor-193-thread-1) [    x:collection1] o.a.s.u.LoggingInfoStream [IFD][coreCloseExecutor-193-thread-1]: 0 msec to checkpoint
   [junit4]   2> 65583 INFO  (SUITE-SolrExampleBinaryTest-seed#[776DBAFE3D0068DD]-worker) [    ] o.e.j.s.h.ContextHandler Stopped o.e.j.s.ServletContextHandler@1c159c8c{/solr,null,UNAVAILABLE}
   [junit4]   2> 65583 INFO  (SUITE-SolrExampleBinaryTest-seed#[776DBAFE3D0068DD]-worker) [    ] o.e.j.s.session Stopped scavenging
   [junit4]   2> 95584 WARN  (SUITE-SolrExampleBinaryTest-seed#[776DBAFE3D0068DD]-worker) [    ] o.e.j.u.t.QueuedThreadPool QueuedThreadPool@qtp1958745{STOPPING,8<=8<=10000,i=0,q=1} Couldn't stop Thread[qtp1958745-776,5,TGRP-SolrExampleBinaryTest]
   [junit4]   2> 95584 INFO  (SUITE-SolrExampleBinaryTest-seed#[776DBAFE3D0068DD]-worker) [    ] o.a.s.SolrTestCaseJ4 ------------------------------------------------------- Done waiting for tracked resources to be released
   [junit4]   2> Feb 22, 2018 12:13:14 PM com.carrotsearch.randomizedtesting.ThreadLeakControl checkThreadLeaks
   [junit4]   2> WARNING: Will linger awaiting termination of 1 leaked thread(s).
   [junit4]   2> Feb 22, 2018 12:13:34 PM com.carrotsearch.randomizedtesting.ThreadLeakControl checkThreadLeaks
   [junit4]   2> SEVERE: 1 thread leaked from SUITE scope at org.apache.solr.client.solrj.SolrExampleBinaryTest: 
   [junit4]   2>    1) Thread[id=776, name=qtp1958745-776, state=TIMED_WAITING, group=TGRP-SolrExampleBinaryTest]
   [junit4]   2>         at sun.misc.Unsafe.park(Native Method)
   [junit4]   2>         at java.util.concurrent.locks.LockSupport.parkNanos(LockSupport.java:215)
   [junit4]   2>         at java.util.concurrent.locks.AbstractQueuedSynchronizer$ConditionObject.await(AbstractQueuedSynchronizer.java:2163)
   [junit4]   2>         at org.eclipse.jetty.util.thread.ReservedThreadExecutor$ReservedThread.reservedWait(ReservedThreadExecutor.java:308)
   [junit4]   2>         at org.eclipse.jetty.util.thread.ReservedThreadExecutor$ReservedThread.run(ReservedThreadExecutor.java:373)
   [junit4]   2>         at org.eclipse.jetty.util.thread.QueuedThreadPool.runJob(QueuedThreadPool.java:708)
   [junit4]   2>         at org.eclipse.jetty.util.thread.QueuedThreadPool$2.run(QueuedThreadPool.java:626)
   [junit4]   2>         at java.lang.Thread.run(Thread.java:748)
   [junit4]   2> Feb 22, 2018 12:13:34 PM com.carrotsearch.randomizedtesting.ThreadLeakControl tryToInterruptAll
   [junit4]   2> INFO: Starting to interrupt leaked threads:
   [junit4]   2>    1) Thread[id=776, name=qtp1958745-776, state=TIMED_WAITING, group=TGRP-SolrExampleBinaryTest]
   [junit4]   2> Feb 22, 2018 12:13:37 PM com.carrotsearch.randomizedtesting.ThreadLeakControl tryToInterruptAll
   [junit4]   2> SEVERE: There are still zombie threads that couldn't be terminated:
   [junit4]   2>    1) Thread[id=776, name=qtp1958745-776, state=TIMED_WAITING, group=TGRP-SolrExampleBinaryTest]
   [junit4]   2>         at sun.misc.Unsafe.park(Native Method)
   [junit4]   2>         at java.util.concurrent.locks.LockSupport.parkNanos(LockSupport.java:215)
   [junit4]   2>         at java.util.concurrent.locks.AbstractQueuedSynchronizer$ConditionObject.await(AbstractQueuedSynchronizer.java:2163)
   [junit4]   2>         at org.eclipse.jetty.util.thread.ReservedThreadExecutor$ReservedThread.reservedWait(ReservedThreadExecutor.java:308)
   [junit4]   2>         at org.eclipse.jetty.util.thread.ReservedThreadExecutor$ReservedThread.run(ReservedThreadExecutor.java:373)
   [junit4]   2>         at org.eclipse.jetty.util.thread.QueuedThreadPool.runJob(QueuedThreadPool.java:708)
   [junit4]   2>         at org.eclipse.jetty.util.thread.QueuedThreadPool$2.run(QueuedThreadPool.java:626)
   [junit4]   2>         at java.lang.Thread.run(Thread.java:748)
   [junit4]   2> NOTE: test params are: codec=Asserting(Lucene70): {}, docValues:{}, maxPointsInLeafNode=1704, maxMBSortInHeap=6.785800483612476, sim=RandomSimilarity(queryNorm=false): {}, locale=is, timezone=Antarctica/Davis
   [junit4]   2> NOTE: Linux 3.13.0-88-generic amd64/Oracle Corporation 1.8.0_144 (64-bit)/cpus=4,threads=2,free=239706336,total=408420352
   [junit4]   2> NOTE: All tests run in this JVM: [AppendEvaluatorTest, JsonValidatorTest, CloudSolrClientMultiConstructorTest, OrEvaluatorTest, BasicHttpSolrClientTest, CommonAdminParamsTest, ModuloEvaluatorTest, RoundEvaluatorTest, SolrExampleStreamingBinaryTest, AbsoluteValueEvaluatorTest, UniformDistributionEvaluatorTest, SolrQueryTest, TestDelegationTokenRequest, TestDocumentObjectBinder, JDBCStreamTest, FloorEvaluatorTest, SolrZkClientTest, SolrPingTest, ArcTangentEvaluatorTest, RecursiveEvaluatorTest, GraphTest, MergeIndexesEmbeddedTest, EqualToEvaluatorTest, SolrExampleStreamingTest, SolrExampleBinaryTest]
   [junit4]   2> NOTE: reproduce with: ant test  -Dtestcase=SolrExampleBinaryTest -Dtests.seed=776DBAFE3D0068DD -Dtests.multiplier=2 -Dtests.slow=true -Dtests.locale=is -Dtests.timezone=Antarctica/Davis -Dtests.asserts=true -Dtests.file.encoding=UTF-8
   [junit4] ERROR   0.00s J1 | SolrExampleBinaryTest (suite) <<<
   [junit4]    > Throwable #1: com.carrotsearch.randomizedtesting.ThreadLeakError: 1 thread leaked from SUITE scope at org.apache.solr.client.solrj.SolrExampleBinaryTest: 
   [junit4]    >    1) Thread[id=776, name=qtp1958745-776, state=TIMED_WAITING, group=TGRP-SolrExampleBinaryTest]
   [junit4]    >         at sun.misc.Unsafe.park(Native Method)
   [junit4]    >         at java.util.concurrent.locks.LockSupport.parkNanos(LockSupport.java:215)
   [junit4]    >         at java.util.concurrent.locks.AbstractQueuedSynchronizer$ConditionObject.await(AbstractQueuedSynchronizer.java:2163)
   [junit4]    >         at org.eclipse.jetty.util.thread.ReservedThreadExecutor$ReservedThread.reservedWait(ReservedThreadExecutor.java:308)
   [junit4]    >         at org.eclipse.jetty.util.thread.ReservedThreadExecutor$ReservedThread.run(ReservedThreadExecutor.java:373)
   [junit4]    >         at org.eclipse.jetty.util.thread.QueuedThreadPool.runJob(QueuedThreadPool.java:708)
   [junit4]    >         at org.eclipse.jetty.util.thread.QueuedThreadPool$2.run(QueuedThreadPool.java:626)
   [junit4]    >         at java.lang.Thread.run(Thread.java:748)
   [junit4]    > 	at __randomizedtesting.SeedInfo.seed([776DBAFE3D0068DD]:0)Throwable #2: com.carrotsearch.randomizedtesting.ThreadLeakError: There are still zombie threads that couldn't be terminated:
   [junit4]    >    1) Thread[id=776, name=qtp1958745-776, state=TIMED_WAITING, group=TGRP-SolrExampleBinaryTest]
   [junit4]    >         at sun.misc.Unsafe.park(Native Method)
   [junit4]    >         at java.util.concurrent.locks.LockSupport.parkNanos(LockSupport.java:215)
   [junit4]    >         at java.util.concurrent.locks.AbstractQueuedSynchronizer$ConditionObject.await(AbstractQueuedSynchronizer.java:2163)
   [junit4]    >         at org.eclipse.jetty.util.thread.ReservedThreadExecutor$ReservedThread.reservedWait(ReservedThreadExecutor.java:308)
   [junit4]    >         at org.eclipse.jetty.util.thread.ReservedThreadExecutor$ReservedThread.run(ReservedThreadExecutor.java:373)
   [junit4]    >         at org.eclipse.jetty.util.thread.QueuedThreadPool.runJob(QueuedThreadPool.java:708)
   [junit4]    >         at org.eclipse.jetty.util.thread.QueuedThreadPool$2.run(QueuedThreadPool.java:626)
   [junit4]    >         at java.lang.Thread.run(Thread.java:748)
   [junit4]    > 	at __randomizedtesting.SeedInfo.seed([776DBAFE3D0068DD]:0)
   [junit4] Completed [96/146 (1!)] on J1 in 59.94s, 35 tests, 2 errors <<< FAILURES!

[...truncated 5493 lines...]
   [junit4] Suite: org.apache.solr.handler.extraction.TestExtractionDateUtil
   [junit4]   2> NOTE: reproduce with: ant test  -Dtestcase=TestExtractionDateUtil -Dtests.method=testParseDate -Dtests.seed=4CE51B213315124B -Dtests.multiplier=2 -Dtests.slow=true -Dtests.locale=zh -Dtests.timezone=America/Metlakatla -Dtests.asserts=true -Dtests.file.encoding=UTF-8
   [junit4] FAILURE 0.03s J1 | TestExtractionDateUtil.testParseDate <<<
   [junit4]    > Throwable #1: java.lang.AssertionError: Incorrect parsed timestamp: 1226583351000 != 1226579751000 (Thu Nov 13 04:35:51 AKST 2008)
   [junit4]    > 	at __randomizedtesting.SeedInfo.seed([4CE51B213315124B:6FC631448BC65FE]:0)
   [junit4]    > 	at org.apache.solr.handler.extraction.TestExtractionDateUtil.assertParsedDate(TestExtractionDateUtil.java:59)
   [junit4]    > 	at org.apache.solr.handler.extraction.TestExtractionDateUtil.testParseDate(TestExtractionDateUtil.java:54)
   [junit4]    > 	at java.lang.Thread.run(Thread.java:748)
   [junit4]   2> NOTE: test params are: codec=Asserting(Lucene70): {}, docValues:{}, maxPointsInLeafNode=670, maxMBSortInHeap=6.484138481001478, sim=RandomSimilarity(queryNorm=true): {}, locale=zh, timezone=America/Metlakatla
   [junit4]   2> NOTE: Linux 3.13.0-88-generic amd64/Oracle Corporation 1.8.0_144 (64-bit)/cpus=4,threads=1,free=200762776,total=253231104
   [junit4]   2> NOTE: All tests run in this JVM: [TestExtractionDateUtil]
   [junit4] Completed [1/4 (1!)] on J1 in 1.09s, 2 tests, 1 failure <<< FAILURES!

[...truncated 43858 lines...]

Mime
View raw message