lucene-dev mailing list archives

Site index · List index
Message view « Date » · « Thread »
Top « Date » · « Thread »
From Policeman Jenkins Server <jenk...@thetaphi.de>
Subject [JENKINS] Lucene-Solr-7.x-Windows (64bit/jdk1.8.0_144) - Build # 470 - Still Unstable!
Date Thu, 22 Feb 2018 12:22:53 GMT
Build: https://jenkins.thetaphi.de/job/Lucene-Solr-7.x-Windows/470/
Java: 64bit/jdk1.8.0_144 -XX:+UseCompressedOops -XX:+UseConcMarkSweepGC

7 tests failed.
FAILED:  junit.framework.TestSuite.org.apache.lucene.codecs.lucene50.TestBlockPostingsFormat

Error Message:
Could not remove the following files (in the order of attempts):    C:\Users\jenkins\workspace\Lucene-Solr-7.x-Windows\lucene\build\core\test\J1\temp\lucene.codecs.lucene50.TestBlockPostingsFormat_8CA9A2C5FB294042-001\testPostingsEnumReuse-001: java.nio.file.AccessDeniedException: C:\Users\jenkins\workspace\Lucene-Solr-7.x-Windows\lucene\build\core\test\J1\temp\lucene.codecs.lucene50.TestBlockPostingsFormat_8CA9A2C5FB294042-001\testPostingsEnumReuse-001    C:\Users\jenkins\workspace\Lucene-Solr-7.x-Windows\lucene\build\core\test\J1\temp\lucene.codecs.lucene50.TestBlockPostingsFormat_8CA9A2C5FB294042-001: java.nio.file.DirectoryNotEmptyException: C:\Users\jenkins\workspace\Lucene-Solr-7.x-Windows\lucene\build\core\test\J1\temp\lucene.codecs.lucene50.TestBlockPostingsFormat_8CA9A2C5FB294042-001 

Stack Trace:
java.io.IOException: Could not remove the following files (in the order of attempts):
   C:\Users\jenkins\workspace\Lucene-Solr-7.x-Windows\lucene\build\core\test\J1\temp\lucene.codecs.lucene50.TestBlockPostingsFormat_8CA9A2C5FB294042-001\testPostingsEnumReuse-001: java.nio.file.AccessDeniedException: C:\Users\jenkins\workspace\Lucene-Solr-7.x-Windows\lucene\build\core\test\J1\temp\lucene.codecs.lucene50.TestBlockPostingsFormat_8CA9A2C5FB294042-001\testPostingsEnumReuse-001
   C:\Users\jenkins\workspace\Lucene-Solr-7.x-Windows\lucene\build\core\test\J1\temp\lucene.codecs.lucene50.TestBlockPostingsFormat_8CA9A2C5FB294042-001: java.nio.file.DirectoryNotEmptyException: C:\Users\jenkins\workspace\Lucene-Solr-7.x-Windows\lucene\build\core\test\J1\temp\lucene.codecs.lucene50.TestBlockPostingsFormat_8CA9A2C5FB294042-001

	at __randomizedtesting.SeedInfo.seed([8CA9A2C5FB294042]:0)
	at org.apache.lucene.util.IOUtils.rm(IOUtils.java:329)
	at org.apache.lucene.util.TestRuleTemporaryFilesCleanup.afterAlways(TestRuleTemporaryFilesCleanup.java:216)
	at com.carrotsearch.randomizedtesting.rules.TestRuleAdapter$1.afterAlways(TestRuleAdapter.java:31)
	at com.carrotsearch.randomizedtesting.rules.StatementAdapter.evaluate(StatementAdapter.java:43)
	at com.carrotsearch.randomizedtesting.rules.StatementAdapter.evaluate(StatementAdapter.java:36)
	at org.apache.lucene.util.TestRuleAssertionsRequired$1.evaluate(TestRuleAssertionsRequired.java:53)
	at org.apache.lucene.util.TestRuleMarkFailure$1.evaluate(TestRuleMarkFailure.java:47)
	at org.apache.lucene.util.TestRuleIgnoreAfterMaxFailures$1.evaluate(TestRuleIgnoreAfterMaxFailures.java:64)
	at org.apache.lucene.util.TestRuleIgnoreTestSuites$1.evaluate(TestRuleIgnoreTestSuites.java:54)
	at com.carrotsearch.randomizedtesting.rules.StatementAdapter.evaluate(StatementAdapter.java:36)
	at com.carrotsearch.randomizedtesting.ThreadLeakControl$StatementRunner.run(ThreadLeakControl.java:368)
	at java.lang.Thread.run(Thread.java:748)


FAILED:  junit.framework.TestSuite.org.apache.lucene.codecs.lucene50.TestLucene50CompoundFormat

Error Message:
Could not remove the following files (in the order of attempts):    C:\Users\jenkins\workspace\Lucene-Solr-7.x-Windows\lucene\build\core\test\J1\temp\lucene.codecs.lucene50.TestLucene50CompoundFormat_8CA9A2C5FB294042-001\justSoYouGetSomeChannelErrors-001: java.nio.file.DirectoryNotEmptyException: C:\Users\jenkins\workspace\Lucene-Solr-7.x-Windows\lucene\build\core\test\J1\temp\lucene.codecs.lucene50.TestLucene50CompoundFormat_8CA9A2C5FB294042-001\justSoYouGetSomeChannelErrors-001    C:\Users\jenkins\workspace\Lucene-Solr-7.x-Windows\lucene\build\core\test\J1\temp\lucene.codecs.lucene50.TestLucene50CompoundFormat_8CA9A2C5FB294042-001\justSoYouGetSomeChannelErrors-001\_0.fdx: java.nio.file.AccessDeniedException: C:\Users\jenkins\workspace\Lucene-Solr-7.x-Windows\lucene\build\core\test\J1\temp\lucene.codecs.lucene50.TestLucene50CompoundFormat_8CA9A2C5FB294042-001\justSoYouGetSomeChannelErrors-001\_0.fdx    C:\Users\jenkins\workspace\Lucene-Solr-7.x-Windows\lucene\build\core\test\J1\temp\lucene.codecs.lucene50.TestLucene50CompoundFormat_8CA9A2C5FB294042-001: java.nio.file.DirectoryNotEmptyException: C:\Users\jenkins\workspace\Lucene-Solr-7.x-Windows\lucene\build\core\test\J1\temp\lucene.codecs.lucene50.TestLucene50CompoundFormat_8CA9A2C5FB294042-001 

Stack Trace:
java.io.IOException: Could not remove the following files (in the order of attempts):
   C:\Users\jenkins\workspace\Lucene-Solr-7.x-Windows\lucene\build\core\test\J1\temp\lucene.codecs.lucene50.TestLucene50CompoundFormat_8CA9A2C5FB294042-001\justSoYouGetSomeChannelErrors-001: java.nio.file.DirectoryNotEmptyException: C:\Users\jenkins\workspace\Lucene-Solr-7.x-Windows\lucene\build\core\test\J1\temp\lucene.codecs.lucene50.TestLucene50CompoundFormat_8CA9A2C5FB294042-001\justSoYouGetSomeChannelErrors-001
   C:\Users\jenkins\workspace\Lucene-Solr-7.x-Windows\lucene\build\core\test\J1\temp\lucene.codecs.lucene50.TestLucene50CompoundFormat_8CA9A2C5FB294042-001\justSoYouGetSomeChannelErrors-001\_0.fdx: java.nio.file.AccessDeniedException: C:\Users\jenkins\workspace\Lucene-Solr-7.x-Windows\lucene\build\core\test\J1\temp\lucene.codecs.lucene50.TestLucene50CompoundFormat_8CA9A2C5FB294042-001\justSoYouGetSomeChannelErrors-001\_0.fdx
   C:\Users\jenkins\workspace\Lucene-Solr-7.x-Windows\lucene\build\core\test\J1\temp\lucene.codecs.lucene50.TestLucene50CompoundFormat_8CA9A2C5FB294042-001: java.nio.file.DirectoryNotEmptyException: C:\Users\jenkins\workspace\Lucene-Solr-7.x-Windows\lucene\build\core\test\J1\temp\lucene.codecs.lucene50.TestLucene50CompoundFormat_8CA9A2C5FB294042-001

	at __randomizedtesting.SeedInfo.seed([8CA9A2C5FB294042]:0)
	at org.apache.lucene.util.IOUtils.rm(IOUtils.java:329)
	at org.apache.lucene.util.TestRuleTemporaryFilesCleanup.afterAlways(TestRuleTemporaryFilesCleanup.java:216)
	at com.carrotsearch.randomizedtesting.rules.TestRuleAdapter$1.afterAlways(TestRuleAdapter.java:31)
	at com.carrotsearch.randomizedtesting.rules.StatementAdapter.evaluate(StatementAdapter.java:43)
	at com.carrotsearch.randomizedtesting.rules.StatementAdapter.evaluate(StatementAdapter.java:36)
	at org.apache.lucene.util.TestRuleAssertionsRequired$1.evaluate(TestRuleAssertionsRequired.java:53)
	at org.apache.lucene.util.TestRuleMarkFailure$1.evaluate(TestRuleMarkFailure.java:47)
	at org.apache.lucene.util.TestRuleIgnoreAfterMaxFailures$1.evaluate(TestRuleIgnoreAfterMaxFailures.java:64)
	at org.apache.lucene.util.TestRuleIgnoreTestSuites$1.evaluate(TestRuleIgnoreTestSuites.java:54)
	at com.carrotsearch.randomizedtesting.rules.StatementAdapter.evaluate(StatementAdapter.java:36)
	at com.carrotsearch.randomizedtesting.ThreadLeakControl$StatementRunner.run(ThreadLeakControl.java:368)
	at java.lang.Thread.run(Thread.java:748)


FAILED:  org.apache.solr.cloud.ReplaceNodeNoTargetTest.test

Error Message:


Stack Trace:
java.lang.AssertionError
	at __randomizedtesting.SeedInfo.seed([FB36AFF52DC38886:7362902F833FE57E]:0)
	at org.junit.Assert.fail(Assert.java:92)
	at org.junit.Assert.assertTrue(Assert.java:43)
	at org.junit.Assert.assertTrue(Assert.java:54)
	at org.apache.solr.cloud.ReplaceNodeNoTargetTest.test(ReplaceNodeNoTargetTest.java:92)
	at sun.reflect.NativeMethodAccessorImpl.invoke0(Native Method)
	at sun.reflect.NativeMethodAccessorImpl.invoke(NativeMethodAccessorImpl.java:62)
	at sun.reflect.DelegatingMethodAccessorImpl.invoke(DelegatingMethodAccessorImpl.java:43)
	at java.lang.reflect.Method.invoke(Method.java:498)
	at com.carrotsearch.randomizedtesting.RandomizedRunner.invoke(RandomizedRunner.java:1737)
	at com.carrotsearch.randomizedtesting.RandomizedRunner$8.evaluate(RandomizedRunner.java:934)
	at com.carrotsearch.randomizedtesting.RandomizedRunner$9.evaluate(RandomizedRunner.java:970)
	at com.carrotsearch.randomizedtesting.RandomizedRunner$10.evaluate(RandomizedRunner.java:984)
	at com.carrotsearch.randomizedtesting.rules.SystemPropertiesRestoreRule$1.evaluate(SystemPropertiesRestoreRule.java:57)
	at org.apache.lucene.util.TestRuleSetupTeardownChained$1.evaluate(TestRuleSetupTeardownChained.java:49)
	at org.apache.lucene.util.AbstractBeforeAfterRule$1.evaluate(AbstractBeforeAfterRule.java:45)
	at org.apache.lucene.util.TestRuleThreadAndTestName$1.evaluate(TestRuleThreadAndTestName.java:48)
	at org.apache.lucene.util.TestRuleIgnoreAfterMaxFailures$1.evaluate(TestRuleIgnoreAfterMaxFailures.java:64)
	at org.apache.lucene.util.TestRuleMarkFailure$1.evaluate(TestRuleMarkFailure.java:47)
	at com.carrotsearch.randomizedtesting.rules.StatementAdapter.evaluate(StatementAdapter.java:36)
	at com.carrotsearch.randomizedtesting.ThreadLeakControl$StatementRunner.run(ThreadLeakControl.java:368)
	at com.carrotsearch.randomizedtesting.ThreadLeakControl.forkTimeoutingTask(ThreadLeakControl.java:817)
	at com.carrotsearch.randomizedtesting.ThreadLeakControl$3.evaluate(ThreadLeakControl.java:468)
	at com.carrotsearch.randomizedtesting.RandomizedRunner.runSingleTest(RandomizedRunner.java:943)
	at com.carrotsearch.randomizedtesting.RandomizedRunner$5.evaluate(RandomizedRunner.java:829)
	at com.carrotsearch.randomizedtesting.RandomizedRunner$6.evaluate(RandomizedRunner.java:879)
	at com.carrotsearch.randomizedtesting.RandomizedRunner$7.evaluate(RandomizedRunner.java:890)
	at com.carrotsearch.randomizedtesting.rules.StatementAdapter.evaluate(StatementAdapter.java:36)
	at com.carrotsearch.randomizedtesting.rules.SystemPropertiesRestoreRule$1.evaluate(SystemPropertiesRestoreRule.java:57)
	at org.apache.lucene.util.AbstractBeforeAfterRule$1.evaluate(AbstractBeforeAfterRule.java:45)
	at com.carrotsearch.randomizedtesting.rules.StatementAdapter.evaluate(StatementAdapter.java:36)
	at org.apache.lucene.util.TestRuleStoreClassName$1.evaluate(TestRuleStoreClassName.java:41)
	at com.carrotsearch.randomizedtesting.rules.NoShadowingOrOverridesOnMethodsRule$1.evaluate(NoShadowingOrOverridesOnMethodsRule.java:40)
	at com.carrotsearch.randomizedtesting.rules.NoShadowingOrOverridesOnMethodsRule$1.evaluate(NoShadowingOrOverridesOnMethodsRule.java:40)
	at com.carrotsearch.randomizedtesting.rules.StatementAdapter.evaluate(StatementAdapter.java:36)
	at com.carrotsearch.randomizedtesting.rules.StatementAdapter.evaluate(StatementAdapter.java:36)
	at com.carrotsearch.randomizedtesting.rules.StatementAdapter.evaluate(StatementAdapter.java:36)
	at org.apache.lucene.util.TestRuleAssertionsRequired$1.evaluate(TestRuleAssertionsRequired.java:53)
	at org.apache.lucene.util.TestRuleMarkFailure$1.evaluate(TestRuleMarkFailure.java:47)
	at org.apache.lucene.util.TestRuleIgnoreAfterMaxFailures$1.evaluate(TestRuleIgnoreAfterMaxFailures.java:64)
	at org.apache.lucene.util.TestRuleIgnoreTestSuites$1.evaluate(TestRuleIgnoreTestSuites.java:54)
	at com.carrotsearch.randomizedtesting.rules.StatementAdapter.evaluate(StatementAdapter.java:36)
	at com.carrotsearch.randomizedtesting.ThreadLeakControl$StatementRunner.run(ThreadLeakControl.java:368)
	at java.lang.Thread.run(Thread.java:748)


FAILED:  junit.framework.TestSuite.org.apache.solr.cloud.SolrXmlInZkTest

Error Message:
Could not remove the following files (in the order of attempts):    C:\Users\jenkins\workspace\Lucene-Solr-7.x-Windows\solr\build\solr-core\test\J0\temp\solr.cloud.SolrXmlInZkTest_FB36AFF52DC38886-001\tempDir-005\home\myCollect: java.nio.file.DirectoryNotEmptyException: C:\Users\jenkins\workspace\Lucene-Solr-7.x-Windows\solr\build\solr-core\test\J0\temp\solr.cloud.SolrXmlInZkTest_FB36AFF52DC38886-001\tempDir-005\home\myCollect    C:\Users\jenkins\workspace\Lucene-Solr-7.x-Windows\solr\build\solr-core\test\J0\temp\solr.cloud.SolrXmlInZkTest_FB36AFF52DC38886-001\tempDir-005\home: java.nio.file.DirectoryNotEmptyException: C:\Users\jenkins\workspace\Lucene-Solr-7.x-Windows\solr\build\solr-core\test\J0\temp\solr.cloud.SolrXmlInZkTest_FB36AFF52DC38886-001\tempDir-005\home    C:\Users\jenkins\workspace\Lucene-Solr-7.x-Windows\solr\build\solr-core\test\J0\temp\solr.cloud.SolrXmlInZkTest_FB36AFF52DC38886-001\tempDir-005: java.nio.file.DirectoryNotEmptyException: C:\Users\jenkins\workspace\Lucene-Solr-7.x-Windows\solr\build\solr-core\test\J0\temp\solr.cloud.SolrXmlInZkTest_FB36AFF52DC38886-001\tempDir-005 

Stack Trace:
java.io.IOException: Could not remove the following files (in the order of attempts):
   C:\Users\jenkins\workspace\Lucene-Solr-7.x-Windows\solr\build\solr-core\test\J0\temp\solr.cloud.SolrXmlInZkTest_FB36AFF52DC38886-001\tempDir-005\home\myCollect: java.nio.file.DirectoryNotEmptyException: C:\Users\jenkins\workspace\Lucene-Solr-7.x-Windows\solr\build\solr-core\test\J0\temp\solr.cloud.SolrXmlInZkTest_FB36AFF52DC38886-001\tempDir-005\home\myCollect
   C:\Users\jenkins\workspace\Lucene-Solr-7.x-Windows\solr\build\solr-core\test\J0\temp\solr.cloud.SolrXmlInZkTest_FB36AFF52DC38886-001\tempDir-005\home: java.nio.file.DirectoryNotEmptyException: C:\Users\jenkins\workspace\Lucene-Solr-7.x-Windows\solr\build\solr-core\test\J0\temp\solr.cloud.SolrXmlInZkTest_FB36AFF52DC38886-001\tempDir-005\home
   C:\Users\jenkins\workspace\Lucene-Solr-7.x-Windows\solr\build\solr-core\test\J0\temp\solr.cloud.SolrXmlInZkTest_FB36AFF52DC38886-001\tempDir-005: java.nio.file.DirectoryNotEmptyException: C:\Users\jenkins\workspace\Lucene-Solr-7.x-Windows\solr\build\solr-core\test\J0\temp\solr.cloud.SolrXmlInZkTest_FB36AFF52DC38886-001\tempDir-005

	at __randomizedtesting.SeedInfo.seed([FB36AFF52DC38886]:0)
	at org.apache.lucene.util.IOUtils.rm(IOUtils.java:329)
	at org.apache.lucene.util.TestRuleTemporaryFilesCleanup.afterAlways(TestRuleTemporaryFilesCleanup.java:216)
	at com.carrotsearch.randomizedtesting.rules.TestRuleAdapter$1.afterAlways(TestRuleAdapter.java:31)
	at com.carrotsearch.randomizedtesting.rules.StatementAdapter.evaluate(StatementAdapter.java:43)
	at com.carrotsearch.randomizedtesting.rules.StatementAdapter.evaluate(StatementAdapter.java:36)
	at org.apache.lucene.util.TestRuleAssertionsRequired$1.evaluate(TestRuleAssertionsRequired.java:53)
	at org.apache.lucene.util.TestRuleMarkFailure$1.evaluate(TestRuleMarkFailure.java:47)
	at org.apache.lucene.util.TestRuleIgnoreAfterMaxFailures$1.evaluate(TestRuleIgnoreAfterMaxFailures.java:64)
	at org.apache.lucene.util.TestRuleIgnoreTestSuites$1.evaluate(TestRuleIgnoreTestSuites.java:54)
	at com.carrotsearch.randomizedtesting.rules.StatementAdapter.evaluate(StatementAdapter.java:36)
	at com.carrotsearch.randomizedtesting.ThreadLeakControl$StatementRunner.run(ThreadLeakControl.java:368)
	at java.lang.Thread.run(Thread.java:748)


FAILED:  junit.framework.TestSuite.org.apache.solr.handler.V2StandaloneTest

Error Message:
Could not remove the following files (in the order of attempts):    C:\Users\jenkins\workspace\Lucene-Solr-7.x-Windows\solr\build\solr-core\test\J0\temp\solr.handler.V2StandaloneTest_FB36AFF52DC38886-001\tempDir-001: java.nio.file.AccessDeniedException: C:\Users\jenkins\workspace\Lucene-Solr-7.x-Windows\solr\build\solr-core\test\J0\temp\solr.handler.V2StandaloneTest_FB36AFF52DC38886-001\tempDir-001    C:\Users\jenkins\workspace\Lucene-Solr-7.x-Windows\solr\build\solr-core\test\J0\temp\solr.handler.V2StandaloneTest_FB36AFF52DC38886-001: java.nio.file.DirectoryNotEmptyException: C:\Users\jenkins\workspace\Lucene-Solr-7.x-Windows\solr\build\solr-core\test\J0\temp\solr.handler.V2StandaloneTest_FB36AFF52DC38886-001 

Stack Trace:
java.io.IOException: Could not remove the following files (in the order of attempts):
   C:\Users\jenkins\workspace\Lucene-Solr-7.x-Windows\solr\build\solr-core\test\J0\temp\solr.handler.V2StandaloneTest_FB36AFF52DC38886-001\tempDir-001: java.nio.file.AccessDeniedException: C:\Users\jenkins\workspace\Lucene-Solr-7.x-Windows\solr\build\solr-core\test\J0\temp\solr.handler.V2StandaloneTest_FB36AFF52DC38886-001\tempDir-001
   C:\Users\jenkins\workspace\Lucene-Solr-7.x-Windows\solr\build\solr-core\test\J0\temp\solr.handler.V2StandaloneTest_FB36AFF52DC38886-001: java.nio.file.DirectoryNotEmptyException: C:\Users\jenkins\workspace\Lucene-Solr-7.x-Windows\solr\build\solr-core\test\J0\temp\solr.handler.V2StandaloneTest_FB36AFF52DC38886-001

	at __randomizedtesting.SeedInfo.seed([FB36AFF52DC38886]:0)
	at org.apache.lucene.util.IOUtils.rm(IOUtils.java:329)
	at org.apache.lucene.util.TestRuleTemporaryFilesCleanup.afterAlways(TestRuleTemporaryFilesCleanup.java:216)
	at com.carrotsearch.randomizedtesting.rules.TestRuleAdapter$1.afterAlways(TestRuleAdapter.java:31)
	at com.carrotsearch.randomizedtesting.rules.StatementAdapter.evaluate(StatementAdapter.java:43)
	at com.carrotsearch.randomizedtesting.rules.StatementAdapter.evaluate(StatementAdapter.java:36)
	at org.apache.lucene.util.TestRuleAssertionsRequired$1.evaluate(TestRuleAssertionsRequired.java:53)
	at org.apache.lucene.util.TestRuleMarkFailure$1.evaluate(TestRuleMarkFailure.java:47)
	at org.apache.lucene.util.TestRuleIgnoreAfterMaxFailures$1.evaluate(TestRuleIgnoreAfterMaxFailures.java:64)
	at org.apache.lucene.util.TestRuleIgnoreTestSuites$1.evaluate(TestRuleIgnoreTestSuites.java:54)
	at com.carrotsearch.randomizedtesting.rules.StatementAdapter.evaluate(StatementAdapter.java:36)
	at com.carrotsearch.randomizedtesting.ThreadLeakControl$StatementRunner.run(ThreadLeakControl.java:368)
	at java.lang.Thread.run(Thread.java:748)


FAILED:  junit.framework.TestSuite.org.apache.lucene.index.TestBackwardsCompatibility

Error Message:
Could not remove the following files (in the order of attempts):    C:\Users\jenkins\workspace\Lucene-Solr-7.x-Windows\lucene\build\backward-codecs\test\J0\temp\lucene.index.TestBackwardsCompatibility_4EC7B7379B598B5B-001\3.5.0-cfs-001: java.nio.file.DirectoryNotEmptyException: C:\Users\jenkins\workspace\Lucene-Solr-7.x-Windows\lucene\build\backward-codecs\test\J0\temp\lucene.index.TestBackwardsCompatibility_4EC7B7379B598B5B-001\3.5.0-cfs-001 

Stack Trace:
java.io.IOException: Could not remove the following files (in the order of attempts):
   C:\Users\jenkins\workspace\Lucene-Solr-7.x-Windows\lucene\build\backward-codecs\test\J0\temp\lucene.index.TestBackwardsCompatibility_4EC7B7379B598B5B-001\3.5.0-cfs-001: java.nio.file.DirectoryNotEmptyException: C:\Users\jenkins\workspace\Lucene-Solr-7.x-Windows\lucene\build\backward-codecs\test\J0\temp\lucene.index.TestBackwardsCompatibility_4EC7B7379B598B5B-001\3.5.0-cfs-001

	at __randomizedtesting.SeedInfo.seed([4EC7B7379B598B5B]:0)
	at org.apache.lucene.util.IOUtils.rm(IOUtils.java:329)
	at org.apache.lucene.util.TestRuleTemporaryFilesCleanup.afterAlways(TestRuleTemporaryFilesCleanup.java:216)
	at com.carrotsearch.randomizedtesting.rules.TestRuleAdapter$1.afterAlways(TestRuleAdapter.java:31)
	at com.carrotsearch.randomizedtesting.rules.StatementAdapter.evaluate(StatementAdapter.java:43)
	at com.carrotsearch.randomizedtesting.rules.StatementAdapter.evaluate(StatementAdapter.java:36)
	at org.apache.lucene.util.TestRuleAssertionsRequired$1.evaluate(TestRuleAssertionsRequired.java:53)
	at org.apache.lucene.util.TestRuleMarkFailure$1.evaluate(TestRuleMarkFailure.java:47)
	at org.apache.lucene.util.TestRuleIgnoreAfterMaxFailures$1.evaluate(TestRuleIgnoreAfterMaxFailures.java:64)
	at org.apache.lucene.util.TestRuleIgnoreTestSuites$1.evaluate(TestRuleIgnoreTestSuites.java:54)
	at com.carrotsearch.randomizedtesting.rules.StatementAdapter.evaluate(StatementAdapter.java:36)
	at com.carrotsearch.randomizedtesting.ThreadLeakControl$StatementRunner.run(ThreadLeakControl.java:368)
	at java.lang.Thread.run(Thread.java:748)


FAILED:  junit.framework.TestSuite.org.apache.solr.update.processor.TestOpenNLPExtractNamedEntitiesUpdateProcessorFactory

Error Message:
Could not remove the following files (in the order of attempts):    C:\Users\jenkins\workspace\Lucene-Solr-7.x-Windows\solr\build\contrib\solr-analysis-extras\test\J1\temp\solr.update.processor.TestOpenNLPExtractNamedEntitiesUpdateProcessorFactory_B06BF4A0B89B51A2-001\tempDir-001\collection1\conf: java.nio.file.DirectoryNotEmptyException: C:\Users\jenkins\workspace\Lucene-Solr-7.x-Windows\solr\build\contrib\solr-analysis-extras\test\J1\temp\solr.update.processor.TestOpenNLPExtractNamedEntitiesUpdateProcessorFactory_B06BF4A0B89B51A2-001\tempDir-001\collection1\conf    C:\Users\jenkins\workspace\Lucene-Solr-7.x-Windows\solr\build\contrib\solr-analysis-extras\test\J1\temp\solr.update.processor.TestOpenNLPExtractNamedEntitiesUpdateProcessorFactory_B06BF4A0B89B51A2-001\tempDir-001\collection1: java.nio.file.DirectoryNotEmptyException: C:\Users\jenkins\workspace\Lucene-Solr-7.x-Windows\solr\build\contrib\solr-analysis-extras\test\J1\temp\solr.update.processor.TestOpenNLPExtractNamedEntitiesUpdateProcessorFactory_B06BF4A0B89B51A2-001\tempDir-001\collection1    C:\Users\jenkins\workspace\Lucene-Solr-7.x-Windows\solr\build\contrib\solr-analysis-extras\test\J1\temp\solr.update.processor.TestOpenNLPExtractNamedEntitiesUpdateProcessorFactory_B06BF4A0B89B51A2-001\tempDir-001: java.nio.file.DirectoryNotEmptyException: C:\Users\jenkins\workspace\Lucene-Solr-7.x-Windows\solr\build\contrib\solr-analysis-extras\test\J1\temp\solr.update.processor.TestOpenNLPExtractNamedEntitiesUpdateProcessorFactory_B06BF4A0B89B51A2-001\tempDir-001    C:\Users\jenkins\workspace\Lucene-Solr-7.x-Windows\solr\build\contrib\solr-analysis-extras\test\J1\temp\solr.update.processor.TestOpenNLPExtractNamedEntitiesUpdateProcessorFactory_B06BF4A0B89B51A2-001\tempDir-001\collection1\conf\en-test-ner-person.bin: java.nio.file.AccessDeniedException: C:\Users\jenkins\workspace\Lucene-Solr-7.x-Windows\solr\build\contrib\solr-analysis-extras\test\J1\temp\solr.update.processor.TestOpenNLPExtractNamedEntitiesUpdateProcessorFactory_B06BF4A0B89B51A2-001\tempDir-001\collection1\conf\en-test-ner-person.bin    C:\Users\jenkins\workspace\Lucene-Solr-7.x-Windows\solr\build\contrib\solr-analysis-extras\test\J1\temp\solr.update.processor.TestOpenNLPExtractNamedEntitiesUpdateProcessorFactory_B06BF4A0B89B51A2-001\tempDir-001\collection1\conf\en-test-sent.bin: java.nio.file.AccessDeniedException: C:\Users\jenkins\workspace\Lucene-Solr-7.x-Windows\solr\build\contrib\solr-analysis-extras\test\J1\temp\solr.update.processor.TestOpenNLPExtractNamedEntitiesUpdateProcessorFactory_B06BF4A0B89B51A2-001\tempDir-001\collection1\conf\en-test-sent.bin    C:\Users\jenkins\workspace\Lucene-Solr-7.x-Windows\solr\build\contrib\solr-analysis-extras\test\J1\temp\solr.update.processor.TestOpenNLPExtractNamedEntitiesUpdateProcessorFactory_B06BF4A0B89B51A2-001\tempDir-001\collection1\conf\en-test-tokenizer.bin: java.nio.file.AccessDeniedException: C:\Users\jenkins\workspace\Lucene-Solr-7.x-Windows\solr\build\contrib\solr-analysis-extras\test\J1\temp\solr.update.processor.TestOpenNLPExtractNamedEntitiesUpdateProcessorFactory_B06BF4A0B89B51A2-001\tempDir-001\collection1\conf\en-test-tokenizer.bin    C:\Users\jenkins\workspace\Lucene-Solr-7.x-Windows\solr\build\contrib\solr-analysis-extras\test\J1\temp\solr.update.processor.TestOpenNLPExtractNamedEntitiesUpdateProcessorFactory_B06BF4A0B89B51A2-001: java.nio.file.DirectoryNotEmptyException: C:\Users\jenkins\workspace\Lucene-Solr-7.x-Windows\solr\build\contrib\solr-analysis-extras\test\J1\temp\solr.update.processor.TestOpenNLPExtractNamedEntitiesUpdateProcessorFactory_B06BF4A0B89B51A2-001 

Stack Trace:
java.io.IOException: Could not remove the following files (in the order of attempts):
   C:\Users\jenkins\workspace\Lucene-Solr-7.x-Windows\solr\build\contrib\solr-analysis-extras\test\J1\temp\solr.update.processor.TestOpenNLPExtractNamedEntitiesUpdateProcessorFactory_B06BF4A0B89B51A2-001\tempDir-001\collection1\conf: java.nio.file.DirectoryNotEmptyException: C:\Users\jenkins\workspace\Lucene-Solr-7.x-Windows\solr\build\contrib\solr-analysis-extras\test\J1\temp\solr.update.processor.TestOpenNLPExtractNamedEntitiesUpdateProcessorFactory_B06BF4A0B89B51A2-001\tempDir-001\collection1\conf
   C:\Users\jenkins\workspace\Lucene-Solr-7.x-Windows\solr\build\contrib\solr-analysis-extras\test\J1\temp\solr.update.processor.TestOpenNLPExtractNamedEntitiesUpdateProcessorFactory_B06BF4A0B89B51A2-001\tempDir-001\collection1: java.nio.file.DirectoryNotEmptyException: C:\Users\jenkins\workspace\Lucene-Solr-7.x-Windows\solr\build\contrib\solr-analysis-extras\test\J1\temp\solr.update.processor.TestOpenNLPExtractNamedEntitiesUpdateProcessorFactory_B06BF4A0B89B51A2-001\tempDir-001\collection1
   C:\Users\jenkins\workspace\Lucene-Solr-7.x-Windows\solr\build\contrib\solr-analysis-extras\test\J1\temp\solr.update.processor.TestOpenNLPExtractNamedEntitiesUpdateProcessorFactory_B06BF4A0B89B51A2-001\tempDir-001: java.nio.file.DirectoryNotEmptyException: C:\Users\jenkins\workspace\Lucene-Solr-7.x-Windows\solr\build\contrib\solr-analysis-extras\test\J1\temp\solr.update.processor.TestOpenNLPExtractNamedEntitiesUpdateProcessorFactory_B06BF4A0B89B51A2-001\tempDir-001
   C:\Users\jenkins\workspace\Lucene-Solr-7.x-Windows\solr\build\contrib\solr-analysis-extras\test\J1\temp\solr.update.processor.TestOpenNLPExtractNamedEntitiesUpdateProcessorFactory_B06BF4A0B89B51A2-001\tempDir-001\collection1\conf\en-test-ner-person.bin: java.nio.file.AccessDeniedException: C:\Users\jenkins\workspace\Lucene-Solr-7.x-Windows\solr\build\contrib\solr-analysis-extras\test\J1\temp\solr.update.processor.TestOpenNLPExtractNamedEntitiesUpdateProcessorFactory_B06BF4A0B89B51A2-001\tempDir-001\collection1\conf\en-test-ner-person.bin
   C:\Users\jenkins\workspace\Lucene-Solr-7.x-Windows\solr\build\contrib\solr-analysis-extras\test\J1\temp\solr.update.processor.TestOpenNLPExtractNamedEntitiesUpdateProcessorFactory_B06BF4A0B89B51A2-001\tempDir-001\collection1\conf\en-test-sent.bin: java.nio.file.AccessDeniedException: C:\Users\jenkins\workspace\Lucene-Solr-7.x-Windows\solr\build\contrib\solr-analysis-extras\test\J1\temp\solr.update.processor.TestOpenNLPExtractNamedEntitiesUpdateProcessorFactory_B06BF4A0B89B51A2-001\tempDir-001\collection1\conf\en-test-sent.bin
   C:\Users\jenkins\workspace\Lucene-Solr-7.x-Windows\solr\build\contrib\solr-analysis-extras\test\J1\temp\solr.update.processor.TestOpenNLPExtractNamedEntitiesUpdateProcessorFactory_B06BF4A0B89B51A2-001\tempDir-001\collection1\conf\en-test-tokenizer.bin: java.nio.file.AccessDeniedException: C:\Users\jenkins\workspace\Lucene-Solr-7.x-Windows\solr\build\contrib\solr-analysis-extras\test\J1\temp\solr.update.processor.TestOpenNLPExtractNamedEntitiesUpdateProcessorFactory_B06BF4A0B89B51A2-001\tempDir-001\collection1\conf\en-test-tokenizer.bin
   C:\Users\jenkins\workspace\Lucene-Solr-7.x-Windows\solr\build\contrib\solr-analysis-extras\test\J1\temp\solr.update.processor.TestOpenNLPExtractNamedEntitiesUpdateProcessorFactory_B06BF4A0B89B51A2-001: java.nio.file.DirectoryNotEmptyException: C:\Users\jenkins\workspace\Lucene-Solr-7.x-Windows\solr\build\contrib\solr-analysis-extras\test\J1\temp\solr.update.processor.TestOpenNLPExtractNamedEntitiesUpdateProcessorFactory_B06BF4A0B89B51A2-001

	at __randomizedtesting.SeedInfo.seed([B06BF4A0B89B51A2]:0)
	at org.apache.lucene.util.IOUtils.rm(IOUtils.java:329)
	at org.apache.lucene.util.TestRuleTemporaryFilesCleanup.afterAlways(TestRuleTemporaryFilesCleanup.java:216)
	at com.carrotsearch.randomizedtesting.rules.TestRuleAdapter$1.afterAlways(TestRuleAdapter.java:31)
	at com.carrotsearch.randomizedtesting.rules.StatementAdapter.evaluate(StatementAdapter.java:43)
	at com.carrotsearch.randomizedtesting.rules.StatementAdapter.evaluate(StatementAdapter.java:36)
	at org.apache.lucene.util.TestRuleAssertionsRequired$1.evaluate(TestRuleAssertionsRequired.java:53)
	at org.apache.lucene.util.TestRuleMarkFailure$1.evaluate(TestRuleMarkFailure.java:47)
	at org.apache.lucene.util.TestRuleIgnoreAfterMaxFailures$1.evaluate(TestRuleIgnoreAfterMaxFailures.java:64)
	at org.apache.lucene.util.TestRuleIgnoreTestSuites$1.evaluate(TestRuleIgnoreTestSuites.java:54)
	at com.carrotsearch.randomizedtesting.rules.StatementAdapter.evaluate(StatementAdapter.java:36)
	at com.carrotsearch.randomizedtesting.ThreadLeakControl$StatementRunner.run(ThreadLeakControl.java:368)
	at java.lang.Thread.run(Thread.java:748)




Build Log:
[...truncated 739 lines...]
   [junit4] Suite: org.apache.lucene.codecs.lucene50.TestBlockPostingsFormat
   [junit4]   2> NOTE: test params are: codec=Asserting(Lucene70): {}, docValues:{}, maxPointsInLeafNode=1402, maxMBSortInHeap=7.096805974414174, sim=RandomSimilarity(queryNorm=false): {f_DOCS_AND_FREQS=BM25(k1=1.2,b=0.75), field=DFR I(n)L1, f_DOCS_AND_FREQS_AND_POSITIONS_AND_OFFSETS=DFR I(n)L3(800.0), f_DOCS_AND_FREQS_AND_POSITIONS=DFR I(F)B3(800.0), body=DFR I(F)B3(800.0), f_DOCS=DFR I(F)B1}, locale=da, timezone=Europe/Tirane
   [junit4]   2> NOTE: Windows 10 10.0 amd64/Oracle Corporation 1.8.0_144 (64-bit)/cpus=3,threads=1,free=186347328,total=269938688
   [junit4]   2> NOTE: All tests run in this JVM: [TestShardSearching, TestSegmentMerger, TestSimpleExplanations, Test2BPagedBytes, TestApproximationSearchEquivalence, TestFrequencyTrackingRingBuffer, TestMultiDocValues, TestSpanFirstQuery, TestDocIDMerger, TestPerSegmentDeletes, TestCharsRefBuilder, TestElevationComparator, TestSizeBoundedForceMerge, TestFilterWeight, TestOfflineSorter, TestFieldMaskingSpanQuery, TestDisjunctionMaxQuery, TestNormsFieldExistsQuery, TestMathUtil, TestSpanMultiTermQueryWrapper, TestSegmentCacheables, TestField, TestBooleanScorer, TestBKD, FuzzyTermOnShortTermsTest, TestDeletionPolicy, TestDuelingCodecsAtNight, TestFlex, TestSortRandom, Test2BPositions, TestFutureObjects, TestCloseableThreadLocal, TestTermContext, TestMutableValues, TestDoubleRange, TestPrefixCodedTerms, TestNativeFSLockFactory, TestIOUtils, TestTimSorter, TestSynonymQuery, TestIndexWriterOutOfFileDescriptors, TestBoostQuery, TestPerFieldPostingsFormat, TestIntsRef, TestSortedSetSelector, TestAutomaton, TestAllFilesCheckIndexHeader, TestRadixSelector, TestIndexWriterReader, TestBooleanSimilarity, TestTopFieldCollector, TestMultiFields, TestSimilarityBase, FiniteStringsIteratorTest, TestTotalHitCountCollector, TestBoolean2ScorerSupplier, TestStopFilter, TestStressDeletes, TestTermsEnum, TestMergeSchedulerExternal, TestFilterDirectory, TestSloppyPhraseQuery2, TestIndexedDISI, TestIndexOrDocValuesQuery, TestTermRangeQuery, TestTwoPhaseCommitTool, TestSmallFloat, Test2BPostingsBytes, TestIndexReaderClose, TestUniqueTermCount, TestSetOnce, TestCharsRef, TestTrackingDirectoryWrapper, TestNearSpansOrdered, TestPayloads, TestDocValuesRewriteMethod, TestMultiset, TestIntRangeFieldQueries, TestSearchAfter, TestSimilarity, TestDirectoryReaderReopen, TestCheckIndex, TestFuzzyQuery, TestMultiCollector, Test4GBStoredFields, TestFieldReuse, TestMaxPosition, TestCachingCollector, TestTopFieldCollectorEarlyTermination, TestRollback, TestCachingTokenFilter, TestIntroSorter, TestSubScorerFreqs, TestNGramPhraseQuery, TestLogMergePolicy, TestGraphTokenizers, TestBytesRefHash, TestBytesStore, TestMultiPhraseQuery, TestCharTermAttributeImpl, TestFastDecompressionMode, TestPersistentSnapshotDeletionPolicy, TestTermsEnum2, TestFilterSpans, TestOrdinalMap, TestNoMergeScheduler, TestBlockPostingsFormat3, TestStringHelper, TestTerms, TestBlockPostingsFormat]
   [junit4]   2> NOTE: reproduce with: ant test  -Dtestcase=TestBlockPostingsFormat -Dtests.seed=8CA9A2C5FB294042 -Dtests.slow=true -Dtests.locale=da -Dtests.timezone=Europe/Tirane -Dtests.asserts=true -Dtests.file.encoding=UTF-8
   [junit4] ERROR   0.00s J1 | TestBlockPostingsFormat (suite) <<<
   [junit4]    > Throwable #1: java.io.IOException: Could not remove the following files (in the order of attempts):
   [junit4]    >    C:\Users\jenkins\workspace\Lucene-Solr-7.x-Windows\lucene\build\core\test\J1\temp\lucene.codecs.lucene50.TestBlockPostingsFormat_8CA9A2C5FB294042-001\testPostingsEnumReuse-001: java.nio.file.AccessDeniedException: C:\Users\jenkins\workspace\Lucene-Solr-7.x-Windows\lucene\build\core\test\J1\temp\lucene.codecs.lucene50.TestBlockPostingsFormat_8CA9A2C5FB294042-001\testPostingsEnumReuse-001
   [junit4]    >    C:\Users\jenkins\workspace\Lucene-Solr-7.x-Windows\lucene\build\core\test\J1\temp\lucene.codecs.lucene50.TestBlockPostingsFormat_8CA9A2C5FB294042-001: java.nio.file.DirectoryNotEmptyException: C:\Users\jenkins\workspace\Lucene-Solr-7.x-Windows\lucene\build\core\test\J1\temp\lucene.codecs.lucene50.TestBlockPostingsFormat_8CA9A2C5FB294042-001
   [junit4]    > 	at __randomizedtesting.SeedInfo.seed([8CA9A2C5FB294042]:0)
   [junit4]    > 	at org.apache.lucene.util.IOUtils.rm(IOUtils.java:329)
   [junit4]    > 	at java.lang.Thread.run(Thread.java:748)
   [junit4] Completed [145/466 (1!)] on J1 in 2.37s, 27 tests, 1 error <<< FAILURES!

[...truncated 765 lines...]
   [junit4] Suite: org.apache.lucene.codecs.lucene50.TestLucene50CompoundFormat
   [junit4]   2> NOTE: test params are: codec=Asserting(Lucene70): {}, docValues:{}, maxPointsInLeafNode=1232, maxMBSortInHeap=6.903237785253279, sim=RandomSimilarity(queryNorm=true): {body=IB LL-L1}, locale=uk, timezone=America/Kentucky/Monticello
   [junit4]   2> NOTE: Windows 10 10.0 amd64/Oracle Corporation 1.8.0_144 (64-bit)/cpus=3,threads=1,free=232220800,total=349757440
   [junit4]   2> NOTE: All tests run in this JVM: [TestShardSearching, TestSegmentMerger, TestSimpleExplanations, Test2BPagedBytes, TestApproximationSearchEquivalence, TestFrequencyTrackingRingBuffer, TestMultiDocValues, TestSpanFirstQuery, TestDocIDMerger, TestPerSegmentDeletes, TestCharsRefBuilder, TestElevationComparator, TestSizeBoundedForceMerge, TestFilterWeight, TestOfflineSorter, TestFieldMaskingSpanQuery, TestDisjunctionMaxQuery, TestNormsFieldExistsQuery, TestMathUtil, TestSpanMultiTermQueryWrapper, TestSegmentCacheables, TestField, TestBooleanScorer, TestBKD, FuzzyTermOnShortTermsTest, TestDeletionPolicy, TestDuelingCodecsAtNight, TestFlex, TestSortRandom, Test2BPositions, TestFutureObjects, TestCloseableThreadLocal, TestTermContext, TestMutableValues, TestDoubleRange, TestPrefixCodedTerms, TestNativeFSLockFactory, TestIOUtils, TestTimSorter, TestSynonymQuery, TestIndexWriterOutOfFileDescriptors, TestBoostQuery, TestPerFieldPostingsFormat, TestIntsRef, TestSortedSetSelector, TestAutomaton, TestAllFilesCheckIndexHeader, TestRadixSelector, TestIndexWriterReader, TestBooleanSimilarity, TestTopFieldCollector, TestMultiFields, TestSimilarityBase, FiniteStringsIteratorTest, TestTotalHitCountCollector, TestBoolean2ScorerSupplier, TestStopFilter, TestStressDeletes, TestTermsEnum, TestMergeSchedulerExternal, TestFilterDirectory, TestSloppyPhraseQuery2, TestIndexedDISI, TestIndexOrDocValuesQuery, TestTermRangeQuery, TestTwoPhaseCommitTool, TestSmallFloat, Test2BPostingsBytes, TestIndexReaderClose, TestUniqueTermCount, TestSetOnce, TestCharsRef, TestTrackingDirectoryWrapper, TestNearSpansOrdered, TestPayloads, TestDocValuesRewriteMethod, TestMultiset, TestIntRangeFieldQueries, TestSearchAfter, TestSimilarity, TestDirectoryReaderReopen, TestCheckIndex, TestFuzzyQuery, TestMultiCollector, Test4GBStoredFields, TestFieldReuse, TestMaxPosition, TestCachingCollector, TestTopFieldCollectorEarlyTermination, TestRollback, TestCachingTokenFilter, TestIntroSorter, TestSubScorerFreqs, TestNGramPhraseQuery, TestLogMergePolicy, TestGraphTokenizers, TestBytesRefHash, TestBytesStore, TestMultiPhraseQuery, TestCharTermAttributeImpl, TestFastDecompressionMode, TestPersistentSnapshotDeletionPolicy, TestTermsEnum2, TestFilterSpans, TestOrdinalMap, TestNoMergeScheduler, TestBlockPostingsFormat3, TestStringHelper, TestTerms, TestBlockPostingsFormat, TestSortRescorer, TestPagedBytes, TestAutomatonQuery, TestReaderClosed, TestNumericDocValuesUpdates, TestSegmentTermDocs, TestIndexWriter, TestPerFieldDocValuesFormat, TestPackedInts, TestAddIndexes, TestMultiMMap, TestSearcherManager, TestBooleanOr, TestBasics, TestFlushByRamOrCountsPolicy, TestSloppyPhraseQuery, TestIndexWriterDelete, TestNRTThreads, TestBoolean2, TestStressAdvance, TestIndexWriterCommit, TestSearchWithThreads, TestConcurrentMergeScheduler, TestLongPostings, TestStressIndexing, TestIndexWriterUnicode, TestTieredMergePolicy, TestByteSlices, TestConsistentFieldNumbers, TestDirectoryReader, TestCollectionUtil, TestComplexExplanations, TestParallelCompositeReader, TestIndexWriterNRTIsCurrent, TestPerFieldPostingsFormat2, TestToken, TestCustomSearcherSort, TestBooleanMinShouldMatch, TestSpans, TestPostingsOffsets, TestTransactionRollback, TestFastCompressionMode, TestStressIndexing2, TestDeterminism, TestDocsAndPositions, TestTermVectorsWriter, TestCodecs, TestStressNRT, TestOmitTf, TestCrashCausesCorruptIndex, TestMultiTermConstantScore, TestDoc, TestSimilarity2, TestNoDeletionPolicy, TestRegexpQuery, TestIntBlockPool, TestSegmentTermEnum, TestUnicodeUtil, TestMaxTermFrequency, TestFileSwitchDirectory, TestSentinelIntSet, TestRegexpRandom, TestBooleanQueryVisitSubscorers, TestConstantScoreQuery, TestParallelTermEnum, TestBinaryTerms, TestRecyclingIntBlockAllocator, TestMultiTermQueryRewrites, TestFilterLeafReader, TestDateTools, Test2BPostings, TestDocCount, TestAutomatonQueryUnicode, TestRecyclingByteBlockAllocator, TestIsCurrent, TestIndexWriterLockRelease, TestDemo, TestCharFilter, TestIndexWriterOnJRECrash, TestScoreCachingWrappingScorer, TestIndexCommit, TestNewestSegment, Test2BBinaryDocValues, TestCharacterUtils, TestReusableStringReader, TestLucene50CompoundFormat]
   [junit4]   2> NOTE: reproduce with: ant test  -Dtestcase=TestLucene50CompoundFormat -Dtests.seed=8CA9A2C5FB294042 -Dtests.slow=true -Dtests.locale=uk -Dtests.timezone=America/Kentucky/Monticello -Dtests.asserts=true -Dtests.file.encoding=UTF-8
   [junit4] ERROR   0.00s J1 | TestLucene50CompoundFormat (suite) <<<
   [junit4]    > Throwable #1: java.io.IOException: Could not remove the following files (in the order of attempts):
   [junit4]    >    C:\Users\jenkins\workspace\Lucene-Solr-7.x-Windows\lucene\build\core\test\J1\temp\lucene.codecs.lucene50.TestLucene50CompoundFormat_8CA9A2C5FB294042-001\justSoYouGetSomeChannelErrors-001: java.nio.file.DirectoryNotEmptyException: C:\Users\jenkins\workspace\Lucene-Solr-7.x-Windows\lucene\build\core\test\J1\temp\lucene.codecs.lucene50.TestLucene50CompoundFormat_8CA9A2C5FB294042-001\justSoYouGetSomeChannelErrors-001
   [junit4]    >    C:\Users\jenkins\workspace\Lucene-Solr-7.x-Windows\lucene\build\core\test\J1\temp\lucene.codecs.lucene50.TestLucene50CompoundFormat_8CA9A2C5FB294042-001\justSoYouGetSomeChannelErrors-001\_0.fdx: java.nio.file.AccessDeniedException: C:\Users\jenkins\workspace\Lucene-Solr-7.x-Windows\lucene\build\core\test\J1\temp\lucene.codecs.lucene50.TestLucene50CompoundFormat_8CA9A2C5FB294042-001\justSoYouGetSomeChannelErrors-001\_0.fdx
   [junit4]    >    C:\Users\jenkins\workspace\Lucene-Solr-7.x-Windows\lucene\build\core\test\J1\temp\lucene.codecs.lucene50.TestLucene50CompoundFormat_8CA9A2C5FB294042-001: java.nio.file.DirectoryNotEmptyException: C:\Users\jenkins\workspace\Lucene-Solr-7.x-Windows\lucene\build\core\test\J1\temp\lucene.codecs.lucene50.TestLucene50CompoundFormat_8CA9A2C5FB294042-001
   [junit4]    > 	at __randomizedtesting.SeedInfo.seed([8CA9A2C5FB294042]:0)
   [junit4]    > 	at org.apache.lucene.util.IOUtils.rm(IOUtils.java:329)
   [junit4]    > 	at java.lang.Thread.run(Thread.java:748)
   [junit4] Completed [382/466 (2!)] on J1 in 6.75s, 26 tests, 1 error <<< FAILURES!

[...truncated 3390 lines...]
   [junit4] Suite: org.apache.lucene.index.TestBackwardsCompatibility
   [junit4] IGNOR/A 0.00s J0 | TestBackwardsCompatibility.testCreateEmptyIndex
   [junit4]    > Assumption #1: backcompat creation tests must be run with -Dtests.bwcdir=/path/to/write/indexes
   [junit4] IGNOR/A 0.00s J0 | TestBackwardsCompatibility.testCreateSingleSegmentNoCFS
   [junit4]    > Assumption #1: backcompat creation tests must be run with -Dtests.bwcdir=/path/to/write/indexes
   [junit4] IGNOR/A 0.00s J0 | TestBackwardsCompatibility.testCreateSingleSegmentCFS
   [junit4]    > Assumption #1: backcompat creation tests must be run with -Dtests.bwcdir=/path/to/write/indexes
   [junit4] IGNOR/A 0.00s J0 | TestBackwardsCompatibility.testCreateMoreTermsIndex
   [junit4]    > Assumption #1: backcompat creation tests must be run with -Dtests.bwcdir=/path/to/write/indexes
   [junit4] IGNOR/A 0.00s J0 | TestBackwardsCompatibility.testCreateNoCFS
   [junit4]    > Assumption #1: backcompat creation tests must be run with -Dtests.bwcdir=/path/to/write/indexes
   [junit4] IGNOR/A 0.00s J0 | TestBackwardsCompatibility.testCreateCFS
   [junit4]    > Assumption #1: backcompat creation tests must be run with -Dtests.bwcdir=/path/to/write/indexes
   [junit4] IGNOR/A 0.00s J0 | TestBackwardsCompatibility.testCreateIndexWithDocValuesUpdates
   [junit4]    > Assumption #1: backcompat creation tests must be run with -Dtests.bwcdir=/path/to/write/indexes
   [junit4] IGNOR/A 0.00s J0 | TestBackwardsCompatibility.testCreateSortedIndex
   [junit4]    > Assumption #1: backcompat creation tests must be run with -Dtests.bwcdir=/path/to/write/indexes
   [junit4]   2> NOTE: test params are: codec=Asserting(Lucene70): {content6=FST50, content5=PostingsFormat(name=LuceneVarGapDocFreqInterval), content4=PostingsFormat(name=LuceneVarGapFixedInterval), trieInt=FST50, content3=TestBloomFilteredLucenePostings(BloomFilteringPostingsFormat(Lucene50(blocksize=128))), content2=FST50, fie?ld=FST50, utf8=FST50, trieLong=PostingsFormat(name=LuceneVarGapDocFreqInterval), id=PostingsFormat(name=LuceneVarGapFixedInterval), content=FST50, autf8=PostingsFormat(name=LuceneVarGapDocFreqInterval)}, docValues:{utf8=DocValuesFormat(name=Memory), fie?ld=DocValuesFormat(name=Memory), dvShort=DocValuesFormat(name=Asserting), dvInt=DocValuesFormat(name=Memory), longPoint2d=DocValuesFormat(name=Direct), dvBytesSortedVar=DocValuesFormat(name=Memory), dvSortedSet=DocValuesFormat(name=Lucene70), content=DocValuesFormat(name=Memory), floatPoint1d=DocValuesFormat(name=Lucene70), intPoint1d=DocValuesFormat(name=Direct), doublePoint2d=DocValuesFormat(name=Memory), trieLong=DocValuesFormat(name=Asserting), dvBytesDerefVar=DocValuesFormat(name=Asserting), id=DocValuesFormat(name=Lucene70), binaryPoint2d=DocValuesFormat(name=Memory), dvSortedNumeric=DocValuesFormat(name=Direct), dvBytesDerefFixed=DocValuesFormat(name=Lucene70), autf8=DocValuesFormat(name=Asserting), dvBytesSortedFixed=DocValuesFormat(name=Asserting), trieInt=DocValuesFormat(name=Memory), dvBytesStraightVar=DocValuesFormat(name=Direct), dvBytesStraightFixed=DocValuesFormat(name=Memory), dvLong=DocValuesFormat(name=Direct), longPoint1d=DocValuesFormat(name=Lucene70), floatPoint2d=DocValuesFormat(name=Asserting), dvDouble=DocValuesFormat(name=Lucene70), dvFloat=DocValuesFormat(name=Asserting), content6=DocValuesFormat(name=Memory), content5=DocValuesFormat(name=Asserting), dvPacked=DocValuesFormat(name=Direct), intPoint2d=DocValuesFormat(name=Lucene70), content4=DocValuesFormat(name=Lucene70), content3=DocValuesFormat(name=Direct), content2=DocValuesFormat(name=Memory), doublePoint1d=DocValuesFormat(name=Direct), dvByte=DocValuesFormat(name=Direct), binaryPoint1d=DocValuesFormat(name=Asserting)}, maxPointsInLeafNode=1141, maxMBSortInHeap=6.515697658065666, sim=RandomSimilarity(queryNorm=false): {content6=IB SPL-LZ(0.3), content5=IB SPL-L1, content2=DFI(Saturated), utf8=DFR G2, fie?ld=IB LL-LZ(0.3), content=IB SPL-L1, autf8=DFR GL3(800.0)}, locale=de-AT, timezone=UTC
   [junit4]   2> NOTE: Windows 10 10.0 amd64/Oracle Corporation 1.8.0_144 (64-bit)/cpus=3,threads=1,free=69224000,total=97320960
   [junit4]   2> NOTE: All tests run in this JVM: [TestIndexWriterOnOldIndex, TestLucene62SegmentInfoFormat, TestLucene50SegmentInfoFormat, TestBackwardsCompatibility]
   [junit4]   2> NOTE: reproduce with: ant test  -Dtestcase=TestBackwardsCompatibility -Dtests.seed=4EC7B7379B598B5B -Dtests.slow=true -Dtests.locale=de-AT -Dtests.timezone=UTC -Dtests.asserts=true -Dtests.file.encoding=US-ASCII
   [junit4] ERROR   0.00s J0 | TestBackwardsCompatibility (suite) <<<
   [junit4]    > Throwable #1: java.io.IOException: Could not remove the following files (in the order of attempts):
   [junit4]    >    C:\Users\jenkins\workspace\Lucene-Solr-7.x-Windows\lucene\build\backward-codecs\test\J0\temp\lucene.index.TestBackwardsCompatibility_4EC7B7379B598B5B-001\3.5.0-cfs-001: java.nio.file.DirectoryNotEmptyException: C:\Users\jenkins\workspace\Lucene-Solr-7.x-Windows\lucene\build\backward-codecs\test\J0\temp\lucene.index.TestBackwardsCompatibility_4EC7B7379B598B5B-001\3.5.0-cfs-001
   [junit4]    > 	at __randomizedtesting.SeedInfo.seed([4EC7B7379B598B5B]:0)
   [junit4]    > 	at org.apache.lucene.util.IOUtils.rm(IOUtils.java:329)
   [junit4]    > 	at java.lang.Thread.run(Thread.java:748)
   [junit4] Completed [7/9 (1!)] on J0 in 50.90s, 30 tests, 1 error, 8 skipped <<< FAILURES!

[...truncated 8282 lines...]
   [junit4] Suite: org.apache.solr.cloud.ReplaceNodeNoTargetTest
   [junit4]   2> Creating dataDir: C:\Users\jenkins\workspace\Lucene-Solr-7.x-Windows\solr\build\solr-core\test\J0\temp\solr.cloud.ReplaceNodeNoTargetTest_FB36AFF52DC38886-001\init-core-data-001
   [junit4]   2> 1705518 INFO  (SUITE-ReplaceNodeNoTargetTest-seed#[FB36AFF52DC38886]-worker) [    ] o.a.s.SolrTestCaseJ4 Using PointFields (NUMERIC_POINTS_SYSPROP=true) w/NUMERIC_DOCVALUES_SYSPROP=true
   [junit4]   2> 1705519 INFO  (SUITE-ReplaceNodeNoTargetTest-seed#[FB36AFF52DC38886]-worker) [    ] o.a.s.SolrTestCaseJ4 Randomized ssl (false) and clientAuth (false) via: @org.apache.solr.util.RandomizeSSL(reason=, value=NaN, ssl=NaN, clientAuth=NaN)
   [junit4]   2> 1705519 INFO  (SUITE-ReplaceNodeNoTargetTest-seed#[FB36AFF52DC38886]-worker) [    ] o.a.s.SolrTestCaseJ4 SecureRandom sanity checks: test.solr.allowed.securerandom=null & java.security.egd=file:/dev/./urandom
   [junit4]   2> 1705521 INFO  (SUITE-ReplaceNodeNoTargetTest-seed#[FB36AFF52DC38886]-worker) [    ] o.a.s.c.MiniSolrCloudCluster Starting cluster of 6 servers in C:\Users\jenkins\workspace\Lucene-Solr-7.x-Windows\solr\build\solr-core\test\J0\temp\solr.cloud.ReplaceNodeNoTargetTest_FB36AFF52DC38886-001\tempDir-001
   [junit4]   2> 1705521 INFO  (SUITE-ReplaceNodeNoTargetTest-seed#[FB36AFF52DC38886]-worker) [    ] o.a.s.c.ZkTestServer STARTING ZK TEST SERVER
   [junit4]   2> 1705521 INFO  (Thread-3415) [    ] o.a.s.c.ZkTestServer client port:0.0.0.0/0.0.0.0:0
   [junit4]   2> 1705521 INFO  (Thread-3415) [    ] o.a.s.c.ZkTestServer Starting server
   [junit4]   2> 1705524 ERROR (Thread-3415) [    ] o.a.z.s.ZooKeeperServer ZKShutdownHandler is not registered, so ZooKeeper server won't take any action on ERROR or SHUTDOWN server state changes
   [junit4]   2> 1705621 INFO  (SUITE-ReplaceNodeNoTargetTest-seed#[FB36AFF52DC38886]-worker) [    ] o.a.s.c.ZkTestServer start zk server on port:58813
   [junit4]   2> 1705626 INFO  (zkConnectionManagerCallback-6563-thread-1) [    ] o.a.s.c.c.ConnectionManager zkClient has connected
   [junit4]   2> 1705630 INFO  (jetty-launcher-6560-thread-2) [    ] o.e.j.s.Server jetty-9.4.8.v20171121, build timestamp: 2017-11-21T21:27:37Z, git hash: 82b8fb23f757335bb3329d540ce37a2a2615f0a8
   [junit4]   2> 1705630 INFO  (jetty-launcher-6560-thread-1) [    ] o.e.j.s.Server jetty-9.4.8.v20171121, build timestamp: 2017-11-21T21:27:37Z, git hash: 82b8fb23f757335bb3329d540ce37a2a2615f0a8
   [junit4]   2> 1705630 INFO  (jetty-launcher-6560-thread-2) [    ] o.e.j.s.session DefaultSessionIdManager workerName=node0
   [junit4]   2> 1705630 INFO  (jetty-launcher-6560-thread-2) [    ] o.e.j.s.session No SessionScavenger set, using defaults
   [junit4]   2> 1705630 INFO  (jetty-launcher-6560-thread-2) [    ] o.e.j.s.session Scavenging every 600000ms
   [junit4]   2> 1705630 INFO  (jetty-launcher-6560-thread-1) [    ] o.e.j.s.session DefaultSessionIdManager workerName=node0
   [junit4]   2> 1705630 INFO  (jetty-launcher-6560-thread-4) [    ] o.e.j.s.Server jetty-9.4.8.v20171121, build timestamp: 2017-11-21T21:27:37Z, git hash: 82b8fb23f757335bb3329d540ce37a2a2615f0a8
   [junit4]   2> 1705630 INFO  (jetty-launcher-6560-thread-1) [    ] o.e.j.s.session No SessionScavenger set, using defaults
   [junit4]   2> 1705631 INFO  (jetty-launcher-6560-thread-1) [    ] o.e.j.s.session Scavenging every 660000ms
   [junit4]   2> 1705631 INFO  (jetty-launcher-6560-thread-4) [    ] o.e.j.s.session DefaultSessionIdManager workerName=node0
   [junit4]   2> 1705631 INFO  (jetty-launcher-6560-thread-5) [    ] o.e.j.s.Server jetty-9.4.8.v20171121, build timestamp: 2017-11-21T21:27:37Z, git hash: 82b8fb23f757335bb3329d540ce37a2a2615f0a8
   [junit4]   2> 1705631 INFO  (jetty-launcher-6560-thread-6) [    ] o.e.j.s.Server jetty-9.4.8.v20171121, build timestamp: 2017-11-21T21:27:37Z, git hash: 82b8fb23f757335bb3329d540ce37a2a2615f0a8
   [junit4]   2> 1705631 INFO  (jetty-launcher-6560-thread-2) [    ] o.e.j.s.h.ContextHandler Started o.e.j.s.ServletContextHandler@1e8debf5{/solr,null,AVAILABLE}
   [junit4]   2> 1705631 INFO  (jetty-launcher-6560-thread-6) [    ] o.e.j.s.session DefaultSessionIdManager workerName=node0
   [junit4]   2> 1705631 INFO  (jetty-launcher-6560-thread-6) [    ] o.e.j.s.session No SessionScavenger set, using defaults
   [junit4]   2> 1705631 INFO  (jetty-launcher-6560-thread-6) [    ] o.e.j.s.session Scavenging every 660000ms
   [junit4]   2> 1705631 INFO  (jetty-launcher-6560-thread-4) [    ] o.e.j.s.session No SessionScavenger set, using defaults
   [junit4]   2> 1705631 INFO  (jetty-launcher-6560-thread-4) [    ] o.e.j.s.session Scavenging every 660000ms
   [junit4]   2> 1705631 INFO  (jetty-launcher-6560-thread-6) [    ] o.e.j.s.h.ContextHandler Started o.e.j.s.ServletContextHandler@1057f38{/solr,null,AVAILABLE}
   [junit4]   2> 1705631 INFO  (jetty-launcher-6560-thread-4) [    ] o.e.j.s.h.ContextHandler Started o.e.j.s.ServletContextHandler@ab637a0{/solr,null,AVAILABLE}
   [junit4]   2> 1705632 INFO  (jetty-launcher-6560-thread-2) [    ] o.e.j.s.AbstractConnector Started ServerConnector@c74d00c{HTTP/1.1,[http/1.1]}{127.0.0.1:58817}
   [junit4]   2> 1705632 INFO  (jetty-launcher-6560-thread-2) [    ] o.e.j.s.Server Started @1713897ms
   [junit4]   2> 1705632 INFO  (jetty-launcher-6560-thread-2) [    ] o.a.s.c.s.e.JettySolrRunner Jetty properties: {hostContext=/solr, hostPort=58817}
   [junit4]   2> 1705632 INFO  (jetty-launcher-6560-thread-6) [    ] o.e.j.s.AbstractConnector Started ServerConnector@6b720f39{HTTP/1.1,[http/1.1]}{127.0.0.1:58820}
   [junit4]   2> 1705632 ERROR (jetty-launcher-6560-thread-2) [    ] o.a.s.u.StartupLoggingUtils Missing Java Option solr.log.dir. Logging may be missing or incomplete.
   [junit4]   2> 1705632 INFO  (jetty-launcher-6560-thread-2) [    ] o.a.s.s.SolrDispatchFilter  ___      _       Welcome to Apache Solr? version 7.3.0
   [junit4]   2> 1705632 INFO  (jetty-launcher-6560-thread-1) [    ] o.e.j.s.h.ContextHandler Started o.e.j.s.ServletContextHandler@7fb4468e{/solr,null,AVAILABLE}
   [junit4]   2> 1705632 INFO  (jetty-launcher-6560-thread-5) [    ] o.e.j.s.session DefaultSessionIdManager workerName=node0
   [junit4]   2> 1705632 INFO  (jetty-launcher-6560-thread-4) [    ] o.e.j.s.AbstractConnector Started ServerConnector@16f18c7f{HTTP/1.1,[http/1.1]}{127.0.0.1:58821}
   [junit4]   2> 1705632 INFO  (jetty-launcher-6560-thread-5) [    ] o.e.j.s.session No SessionScavenger set, using defaults
   [junit4]   2> 1705632 INFO  (jetty-launcher-6560-thread-4) [    ] o.e.j.s.Server Started @1713897ms
   [junit4]   2> 1705632 INFO  (jetty-launcher-6560-thread-5) [    ] o.e.j.s.session Scavenging every 600000ms
   [junit4]   2> 1705632 INFO  (jetty-launcher-6560-thread-4) [    ] o.a.s.c.s.e.JettySolrRunner Jetty properties: {hostContext=/solr, hostPort=58821}
   [junit4]   2> 1705632 INFO  (jetty-launcher-6560-thread-5) [    ] o.e.j.s.h.ContextHandler Started o.e.j.s.ServletContextHandler@4f3ce364{/solr,null,AVAILABLE}
   [junit4]   2> 1705632 ERROR (jetty-launcher-6560-thread-4) [    ] o.a.s.u.StartupLoggingUtils Missing Java Option solr.log.dir. Logging may be missing or incomplete.
   [junit4]   2> 1705632 INFO  (jetty-launcher-6560-thread-1) [    ] o.e.j.s.AbstractConnector Started ServerConnector@14b21aa1{HTTP/1.1,[http/1.1]}{127.0.0.1:58826}
   [junit4]   2> 1705632 INFO  (jetty-launcher-6560-thread-4) [    ] o.a.s.s.SolrDispatchFilter  ___      _       Welcome to Apache Solr? version 7.3.0
   [junit4]   2> 1705632 INFO  (jetty-launcher-6560-thread-6) [    ] o.e.j.s.Server Started @1713897ms
   [junit4]   2> 1705633 INFO  (jetty-launcher-6560-thread-6) [    ] o.a.s.c.s.e.JettySolrRunner Jetty properties: {hostContext=/solr, hostPort=58820}
   [junit4]   2> 1705633 INFO  (jetty-launcher-6560-thread-4) [    ] o.a.s.s.SolrDispatchFilter / __| ___| |_ _   Starting in cloud mode on port null
   [junit4]   2> 1705633 INFO  (jetty-launcher-6560-thread-4) [    ] o.a.s.s.SolrDispatchFilter \__ \/ _ \ | '_|  Install dir: null
   [junit4]   2> 1705633 INFO  (jetty-launcher-6560-thread-5) [    ] o.e.j.s.AbstractConnector Started ServerConnector@3d2f6b0c{HTTP/1.1,[http/1.1]}{127.0.0.1:58829}
   [junit4]   2> 1705633 ERROR (jetty-launcher-6560-thread-6) [    ] o.a.s.u.StartupLoggingUtils Missing Java Option solr.log.dir. Logging may be missing or incomplete.
   [junit4]   2> 1705632 INFO  (jetty-launcher-6560-thread-1) [    ] o.e.j.s.Server Started @1713897ms
   [junit4]   2> 1705633 INFO  (jetty-launcher-6560-thread-6) [    ] o.a.s.s.SolrDispatchFilter  ___      _       Welcome to Apache Solr? version 7.3.0
   [junit4]   2> 1705633 INFO  (jetty-launcher-6560-thread-1) [    ] o.a.s.c.s.e.JettySolrRunner Jetty properties: {hostContext=/solr, hostPort=58826}
   [junit4]   2> 1705633 INFO  (jetty-launcher-6560-thread-6) [    ] o.a.s.s.SolrDispatchFilter / __| ___| |_ _   Starting in cloud mode on port null
   [junit4]   2> 1705632 INFO  (jetty-launcher-6560-thread-2) [    ] o.a.s.s.SolrDispatchFilter / __| ___| |_ _   Starting in cloud mode on port null
   [junit4]   2> 1705633 ERROR (jetty-launcher-6560-thread-1) [    ] o.a.s.u.StartupLoggingUtils Missing Java Option solr.log.dir. Logging may be missing or incomplete.
   [junit4]   2> 1705633 INFO  (jetty-launcher-6560-thread-2) [    ] o.a.s.s.SolrDispatchFilter \__ \/ _ \ | '_|  Install dir: null
   [junit4]   2> 1705633 INFO  (jetty-launcher-6560-thread-1) [    ] o.a.s.s.SolrDispatchFilter  ___      _       Welcome to Apache Solr? version 7.3.0
   [junit4]   2> 1705633 INFO  (jetty-launcher-6560-thread-2) [    ] o.a.s.s.SolrDispatchFilter |___/\___/_|_|    Start time: 2018-02-22T11:21:16.404Z
   [junit4]   2> 1705633 INFO  (jetty-launcher-6560-thread-1) [    ] o.a.s.s.SolrDispatchFilter / __| ___| |_ _   Starting in cloud mode on port null
   [junit4]   2> 1705633 INFO  (jetty-launcher-6560-thread-6) [    ] o.a.s.s.SolrDispatchFilter \__ \/ _ \ | '_|  Install dir: null
   [junit4]   2> 1705633 INFO  (jetty-launcher-6560-thread-1) [    ] o.a.s.s.SolrDispatchFilter \__ \/ _ \ | '_|  Install dir: null
   [junit4]   2> 1705633 INFO  (jetty-launcher-6560-thread-6) [    ] o.a.s.s.SolrDispatchFilter |___/\___/_|_|    Start time: 2018-02-22T11:21:16.404Z
   [junit4]   2> 1705633 INFO  (jetty-launcher-6560-thread-1) [    ] o.a.s.s.SolrDispatchFilter |___/\___/_|_|    Start time: 2018-02-22T11:21:16.404Z
   [junit4]   2> 1705633 INFO  (jetty-launcher-6560-thread-5) [    ] o.e.j.s.Server Started @1713898ms
   [junit4]   2> 1705633 INFO  (jetty-launcher-6560-thread-5) [    ] o.a.s.c.s.e.JettySolrRunner Jetty properties: {hostContext=/solr, hostPort=58829}
   [junit4]   2> 1705633 ERROR (jetty-launcher-6560-thread-5) [    ] o.a.s.u.StartupLoggingUtils Missing Java Option solr.log.dir. Logging may be missing or incomplete.
   [junit4]   2> 1705633 INFO  (jetty-launcher-6560-thread-5) [    ] o.a.s.s.SolrDispatchFilter  ___      _       Welcome to Apache Solr? version 7.3.0
   [junit4]   2> 1705634 INFO  (jetty-launcher-6560-thread-5) [    ] o.a.s.s.SolrDispatchFilter / __| ___| |_ _   Starting in cloud mode on port null
   [junit4]   2> 1705634 INFO  (jetty-launcher-6560-thread-5) [    ] o.a.s.s.SolrDispatchFilter \__ \/ _ \ | '_|  Install dir: null
   [junit4]   2> 1705634 INFO  (jetty-launcher-6560-thread-5) [    ] o.a.s.s.SolrDispatchFilter |___/\___/_|_|    Start time: 2018-02-22T11:21:16.405Z
   [junit4]   2> 1705633 INFO  (jetty-launcher-6560-thread-4) [    ] o.a.s.s.SolrDispatchFilter |___/\___/_|_|    Start time: 2018-02-22T11:21:16.404Z
   [junit4]   2> 1705635 INFO  (jetty-launcher-6560-thread-3) [    ] o.e.j.s.Server jetty-9.4.8.v20171121, build timestamp: 2017-11-21T21:27:37Z, git hash: 82b8fb23f757335bb3329d540ce37a2a2615f0a8
   [junit4]   2> 1705635 INFO  (jetty-launcher-6560-thread-3) [    ] o.e.j.s.session DefaultSessionIdManager workerName=node0
   [junit4]   2> 1705635 INFO  (jetty-launcher-6560-thread-3) [    ] o.e.j.s.session No SessionScavenger set, using defaults
   [junit4]   2> 1705636 INFO  (jetty-launcher-6560-thread-3) [    ] o.e.j.s.session Scavenging every 600000ms
   [junit4]   2> 1705636 INFO  (jetty-launcher-6560-thread-3) [    ] o.e.j.s.h.ContextHandler Started o.e.j.s.ServletContextHandler@7438970a{/solr,null,AVAILABLE}
   [junit4]   2> 1705636 INFO  (jetty-launcher-6560-thread-3) [    ] o.e.j.s.AbstractConnector Started ServerConnector@2fe29663{HTTP/1.1,[http/1.1]}{127.0.0.1:58842}
   [junit4]   2> 1705636 INFO  (jetty-launcher-6560-thread-3) [    ] o.e.j.s.Server Started @1713902ms
   [junit4]   2> 1705636 INFO  (jetty-launcher-6560-thread-3) [    ] o.a.s.c.s.e.JettySolrRunner Jetty properties: {hostContext=/solr, hostPort=58842}
   [junit4]   2> 1705637 ERROR (jetty-launcher-6560-thread-3) [    ] o.a.s.u.StartupLoggingUtils Missing Java Option solr.log.dir. Logging may be missing or incomplete.
   [junit4]   2> 1705637 INFO  (jetty-launcher-6560-thread-3) [    ] o.a.s.s.SolrDispatchFilter  ___      _       Welcome to Apache Solr? version 7.3.0
   [junit4]   2> 1705637 INFO  (jetty-launcher-6560-thread-3) [    ] o.a.s.s.SolrDispatchFilter / __| ___| |_ _   Starting in cloud mode on port null
   [junit4]   2> 1705638 INFO  (jetty-launcher-6560-thread-3) [    ] o.a.s.s.SolrDispatchFilter \__ \/ _ \ | '_|  Install dir: null
   [junit4]   2> 1705638 INFO  (jetty-launcher-6560-thread-3) [    ] o.a.s.s.SolrDispatchFilter |___/\___/_|_|    Start time: 2018-02-22T11:21:16.409Z
   [junit4]   2> 1705642 INFO  (zkConnectionManagerCallback-6567-thread-1) [    ] o.a.s.c.c.ConnectionManager zkClient has connected
   [junit4]   2> 1705642 INFO  (zkConnectionManagerCallback-6573-thread-1) [    ] o.a.s.c.c.ConnectionManager zkClient has connected
   [junit4]   2> 1705642 INFO  (zkConnectionManagerCallback-6569-thread-1) [    ] o.a.s.c.c.ConnectionManager zkClient has connected
   [junit4]   2> 1705642 INFO  (zkConnectionManagerCallback-6565-thread-1) [    ] o.a.s.c.c.ConnectionManager zkClient has connected
   [junit4]   2> 1705643 INFO  (jetty-launcher-6560-thread-6) [    ] o.a.s.s.SolrDispatchFilter solr.xml found in ZooKeeper. Loading...
   [junit4]   2> 1705643 INFO  (jetty-launcher-6560-thread-1) [    ] o.a.s.s.SolrDispatchFilter solr.xml found in ZooKeeper. Loading...
   [junit4]   2> 1705643 INFO  (jetty-launcher-6560-thread-4) [    ] o.a.s.s.SolrDispatchFilter solr.xml found in ZooKeeper. Loading...
   [junit4]   2> 1705643 INFO  (jetty-launcher-6560-thread-2) [    ] o.a.s.s.SolrDispatchFilter solr.xml found in ZooKeeper. Loading...
   [junit4]   2> 1705643 INFO  (zkConnectionManagerCallback-6571-thread-1) [    ] o.a.s.c.c.ConnectionManager zkClient has connected
   [junit4]   2> 1705643 INFO  (zkConnectionManagerCallback-6575-thread-1) [    ] o.a.s.c.c.ConnectionManager zkClient has connected
   [junit4]   2> 1705644 INFO  (jetty-launcher-6560-thread-5) [    ] o.a.s.s.SolrDispatchFilter solr.xml found in ZooKeeper. Loading...
   [junit4]   2> 1705644 INFO  (jetty-launcher-6560-thread-3) [    ] o.a.s.s.SolrDispatchFilter solr.xml found in ZooKeeper. Loading...
   [junit4]   2> 1705657 WARN  (NIOServerCxn.Factory:0.0.0.0/0.0.0.0:0) [    ] o.a.z.s.NIOServerCnxn Unable to read additional data from client sessionid 0x100a74af8c00005, likely client has closed socket
   [junit4]   2> 1705662 INFO  (jetty-launcher-6560-thread-5) [    ] o.a.s.c.ZkContainer Zookeeper client=127.0.0.1:58813/solr
   [junit4]   2> 1705663 INFO  (jetty-launcher-6560-thread-1) [    ] o.a.s.c.ZkContainer Zookeeper client=127.0.0.1:58813/solr
   [junit4]   2> 1705664 INFO  (jetty-launcher-6560-thread-2) [    ] o.a.s.c.ZkContainer Zookeeper client=127.0.0.1:58813/solr
   [junit4]   2> 1705665 INFO  (jetty-launcher-6560-thread-4) [    ] o.a.s.c.ZkContainer Zookeeper client=127.0.0.1:58813/solr
   [junit4]   2> 1705665 INFO  (jetty-launcher-6560-thread-3) [    ] o.a.s.c.ZkContainer Zookeeper client=127.0.0.1:58813/solr
   [junit4]   2> 1705667 INFO  (jetty-launcher-6560-thread-6) [    ] o.a.s.c.ZkContainer Zookeeper client=127.0.0.1:58813/solr
   [junit4]   2> 1705670 INFO  (zkConnectionManagerCallback-6579-thread-1) [    ] o.a.s.c.c.ConnectionManager zkClient has connected
   [junit4]   2> 1705671 INFO  (zkConnectionManagerCallback-6583-thread-1) [    ] o.a.s.c.c.ConnectionManager zkClient has connected
   [junit4]   2> 1705671 INFO  (zkConnectionManagerCallback-6588-thread-1) [    ] o.a.s.c.c.ConnectionManager zkClient has connected
   [junit4]   2> 1705671 WARN  (NIOServerCxn.Factory:0.0.0.0/0.0.0.0:0) [    ] o.a.z.s.NIOServerCnxn Unable to read additional data from client sessionid 0x100a74af8c00007, likely client has closed socket
   [junit4]   2> 1705674 INFO  (zkConnectionManagerCallback-6593-thread-1) [    ] o.a.s.c.c.ConnectionManager zkClient has connected
   [junit4]   2> 1705674 INFO  (zkConnectionManagerCallback-6595-thread-1) [    ] o.a.s.c.c.ConnectionManager zkClient has connected
   [junit4]   2> 1705674 INFO  (zkConnectionManagerCallback-6599-thread-1) [    ] o.a.s.c.c.ConnectionManager zkClient has connected
   [junit4]   2> 1705680 INFO  (zkConnectionManagerCallback-6601-thread-1-processing-n:127.0.0.1:58829_solr) [n:127.0.0.1:58829_solr    ] o.a.s.c.c.ConnectionManager zkClient has connected
   [junit4]   2> 1705680 INFO  (zkConnectionManagerCallback-6605-thread-1-processing-n:127.0.0.1:58817_solr) [n:127.0.0.1:58817_solr    ] o.a.s.c.c.ConnectionManager zkClient has connected
   [junit4]   2> 1705681 INFO  (zkConnectionManagerCallback-6604-thread-1-processing-n:127.0.0.1:58826_solr) [n:127.0.0.1:58826_solr    ] o.a.s.c.c.ConnectionManager zkClient has connected
   [junit4]   2> 1705681 INFO  (zkConnectionManagerCallback-6609-thread-1-processing-n:127.0.0.1:58842_solr) [n:127.0.0.1:58842_solr    ] o.a.s.c.c.ConnectionManager zkClient has connected
   [junit4]   2> 1705681 INFO  (zkConnectionManagerCallback-6607-thread-1-processing-n:127.0.0.1:58820_solr) [n:127.0.0.1:58820_solr    ] o.a.s.c.c.ConnectionManager zkClient has connected
   [junit4]   2> 1705681 INFO  (zkConnectionManagerCallback-6611-thread-1-processing-n:127.0.0.1:58821_solr) [n:127.0.0.1:58821_solr    ] o.a.s.c.c.ConnectionManager zkClient has connected
   [junit4]   2> 1705893 INFO  (jetty-launcher-6560-thread-2) [n:127.0.0.1:58817_solr    ] o.a.s.c.Overseer Overseer (id=null) closing
   [junit4]   2> 1705893 INFO  (jetty-launcher-6560-thread-6) [n:127.0.0.1:58820_solr    ] o.a.s.c.Overseer Overseer (id=null) closing
   [junit4]   2> 1705900 INFO  (jetty-launcher-6560-thread-2) [n:127.0.0.1:58817_solr    ] o.a.s.c.OverseerElectionContext I am going to be the leader 127.0.0.1:58817_solr
   [junit4]   2> 1705901 INFO  (jetty-launcher-6560-thread-6) [n:127.0.0.1:58820_solr    ] o.a.s.c.ZkController Register node as live in ZooKeeper:/live_nodes/127.0.0.1:58820_solr
   [junit4]   2> 1705903 INFO  (jetty-launcher-6560-thread-2) [n:127.0.0.1:58817_solr    ] o.a.s.c.Overseer Overseer (id=72241534480678926-127.0.0.1:58817_solr-n_0000000000) starting
   [junit4]   2> 1705929 INFO  (jetty-launcher-6560-thread-2) [n:127.0.0.1:58817_solr    ] o.a.s.c.ZkController Register node as live in ZooKeeper:/live_nodes/127.0.0.1:58817_solr
   [junit4]   2> 1706011 INFO  (zkCallback-6606-thread-1-processing-n:127.0.0.1:58820_solr) [n:127.0.0.1:58820_solr    ] o.a.s.c.c.ZkStateReader Updated live nodes from ZooKeeper... (0) -> (2)
   [junit4]   2> 1706011 INFO  (zkCallback-6603-thread-1-processing-n:127.0.0.1:58817_solr) [n:127.0.0.1:58817_solr    ] o.a.s.c.c.ZkStateReader Updated live nodes from ZooKeeper... (0) -> (2)
   [junit4]   2> 1706018 INFO  (jetty-launcher-6560-thread-5) [n:127.0.0.1:58829_solr    ] o.a.s.c.c.ZkStateReader Updated live nodes from ZooKeeper... (0) -> (2)
   [junit4]   2> 1706024 INFO  (jetty-launcher-6560-thread-5) [n:127.0.0.1:58829_solr    ] o.a.s.c.Overseer Overseer (id=null) closing
   [junit4]   2> 1706028 INFO  (jetty-launcher-6560-thread-5) [n:127.0.0.1:58829_solr    ] o.a.s.c.ZkController Register node as live in ZooKeeper:/live_nodes/127.0.0.1:58829_solr
   [junit4]   2> 1706031 INFO  (zkCallback-6606-thread-1-processing-n:127.0.0.1:58820_solr) [n:127.0.0.1:58820_solr    ] o.a.s.c.c.ZkStateReader Updated live nodes from ZooKeeper... (2) -> (3)
   [junit4]   2> 1706031 INFO  (zkCallback-6603-thread-1-processing-n:127.0.0.1:58817_solr) [n:127.0.0.1:58817_solr    ] o.a.s.c.c.ZkStateReader Updated live nodes from ZooKeeper... (2) -> (3)
   [junit4]   2> 1706033 INFO  (jetty-launcher-6560-thread-1) [n:127.0.0.1:58826_solr    ] o.a.s.c.c.ZkStateReader Updated live nodes from ZooKeeper... (0) -> (3)
   [junit4]   2> 1706037 INFO  (jetty-launcher-6560-thread-3) [n:127.0.0.1:58842_solr    ] o.a.s.c.c.ZkStateReader Updated live nodes from ZooKeeper... (0) -> (3)
   [junit4]   2> 1706038 INFO  (jetty-launcher-6560-thread-1) [n:127.0.0.1:58826_solr    ] o.a.s.c.Overseer Overseer (id=null) closing
   [junit4]   2> 1706042 INFO  (jetty-launcher-6560-thread-1) [n:127.0.0.1:58826_solr    ] o.a.s.c.ZkController Register node as live in ZooKeeper:/live_nodes/127.0.0.1:58826_solr
   [junit4]   2> 1706042 INFO  (jetty-launcher-6560-thread-3) [n:127.0.0.1:58842_solr    ] o.a.s.c.Overseer Overseer (id=null) closing
   [junit4]   2> 1706057 INFO  (zkCallback-6606-thread-1-processing-n:127.0.0.1:58820_solr) [n:127.0.0.1:58820_solr    ] o.a.s.c.c.ZkStateReader Updated live nodes from ZooKeeper... (3) -> (4)
   [junit4]   2> 1706057 INFO  (zkCallback-6603-thread-1-processing-n:127.0.0.1:58817_solr) [n:127.0.0.1:58817_solr    ] o.a.s.c.c.ZkStateReader Updated live nodes from ZooKeeper... (3) -> (4)
   [junit4]   2> 1706059 INFO  (jetty-launcher-6560-thread-4) [n:127.0.0.1:58821_solr    ] o.a.s.c.c.ZkStateReader Updated live nodes from ZooKeeper... (0) -> (4)
   [junit4]   2> 1706065 INFO  (jetty-launcher-6560-thread-3) [n:127.0.0.1:58842_solr    ] o.a.s.c.ZkController Register node as live in ZooKeeper:/live_nodes/127.0.0.1:58842_solr
   [junit4]   2> 1706068 INFO  (zkCallback-6606-thread-1-processing-n:127.0.0.1:58820_solr) [n:127.0.0.1:58820_solr    ] o.a.s.c.c.ZkStateReader Updated live nodes from ZooKeeper... (4) -> (5)
   [junit4]   2> 1706069 INFO  (zkCallback-6603-thread-1-processing-n:127.0.0.1:58817_solr) [n:127.0.0.1:58817_solr    ] o.a.s.c.c.ZkStateReader Updated live nodes from ZooKeeper... (4) -> (5)
   [junit4]   2> 1706071 INFO  (jetty-launcher-6560-thread-4) [n:127.0.0.1:58821_solr    ] o.a.s.c.Overseer Overseer (id=null) closing
   [junit4]   2> 1706087 INFO  (jetty-launcher-6560-thread-4) [n:127.0.0.1:58821_solr    ] o.a.s.c.ZkController Register node as live in ZooKeeper:/live_nodes/127.0.0.1:58821_solr
   [junit4]   2> 1706093 INFO  (zkCallback-6606-thread-1-processing-n:127.0.0.1:58820_solr) [n:127.0.0.1:58820_solr    ] o.a.s.c.c.ZkStateReader Updated live nodes from ZooKeeper... (5) -> (6)
   [junit4]   2> 1706093 INFO  (zkCallback-6603-thread-1-processing-n:127.0.0.1:58817_solr) [n:127.0.0.1:58817_solr    ] o.a.s.c.c.ZkStateReader Updated live nodes from ZooKeeper... (5) -> (6)
   [junit4]   2> 1706174 INFO  (zkCallback-6610-thread-1-processing-n:127.0.0.1:58821_solr) [n:127.0.0.1:58821_solr    ] o.a.s.c.c.ZkStateReader Updated live nodes from ZooKeeper... (4) -> (6)
   [junit4]   2> 1706177 INFO  (zkCallback-6602-thread-1-processing-n:127.0.0.1:58826_solr) [n:127.0.0.1:58826_solr    ] o.a.s.c.c.ZkStateReader Updated live nodes from ZooKeeper... (3) -> (6)
   [junit4]   2> 1706191 INFO  (zkCallback-6600-thread-1-processing-n:127.0.0.1:58829_solr) [n:127.0.0.1:58829_solr    ] o.a.s.c.c.ZkStateReader Updated live nodes from ZooKeeper... (2) -> (6)
   [junit4]   2> 1706191 INFO  (zkCallback-6608-thread-1-processing-n:127.0.0.1:58842_solr) [n:127.0.0.1:58842_solr    ] o.a.s.c.c.ZkStateReader Updated live nodes from ZooKeeper... (3) -> (6)
   [junit4]   2> 1706256 INFO  (jetty-launcher-6560-thread-6) [n:127.0.0.1:58820_solr    ] o.a.s.m.r.SolrJmxReporter JMX monitoring for 'solr_58820.solr.node' (registry 'solr.node') enabled at server: com.sun.jmx.mbeanserver.JmxMBeanServer@1c2fe540
   [junit4]   2> 1706259 INFO  (jetty-launcher-6560-thread-2) [n:127.0.0.1:58817_solr    ] o.a.s.m.r.SolrJmxReporter JMX monitoring for 'solr_58817.solr.node' (registry 'solr.node') enabled at server: com.sun.jmx.mbeanserver.JmxMBeanServer@1c2fe540
   [junit4]   2> 1706260 INFO  (jetty-launcher-6560-thread-3) [n:127.0.0.1:58842_solr    ] o.a.s.m.r.SolrJmxReporter JMX monitoring for 'solr_58842.solr.node' (registry 'solr.node') enabled at server: com.sun.jmx.mbeanserver.JmxMBeanServer@1c2fe540
   [junit4]   2> 1706260 INFO  (jetty-launcher-6560-thread-4) [n:127.0.0.1:58821_solr    ] o.a.s.m.r.SolrJmxReporter JMX monitoring for 'solr_58821.solr.node' (registry 'solr.node') enabled at server: com.sun.jmx.mbeanserver.JmxMBeanServer@1c2fe540
   [junit4]   2> 1706273 INFO  (jetty-launcher-6560-thread-6) [n:127.0.0.1:58820_solr    ] o.a.s.m.r.SolrJmxReporter JMX monitoring for 'solr_58820.solr.jvm' (registry 'solr.jvm') enabled at server: com.sun.jmx.mbeanserver.JmxMBeanServer@1c2fe540
   [junit4]   2> 1706273 INFO  (jetty-launcher-6560-thread-6) [n:127.0.0.1:58820_solr    ] o.a.s.m.r.SolrJmxReporter JMX monitoring for 'solr_58820.solr.jetty' (registry 'solr.jetty') enabled at server: com.sun.jmx.mbeanserver.JmxMBeanServer@1c2fe540
   [junit4]   2> 1706275 INFO  (jetty-launcher-6560-thread-6) [n:127.0.0.1:58820_solr    ] o.a.s.c.CorePropertiesLocator Found 0 core definitions underneath C:\Users\jenkins\workspace\Lucene-Solr-7.x-Windows\solr\build\solr-core\test\J0\temp\solr.cloud.ReplaceNodeNoTargetTest_FB36AFF52DC38886-001\tempDir-001\node6\.
   [junit4]   2> 1706276 INFO  (jetty-launcher-6560-thread-2) [n:127.0.0.1:58817_solr    ] o.a.s.m.r.SolrJmxReporter JMX monitoring for 'solr_58817.solr.jvm' (registry 'solr.jvm') enabled at server: com.sun.jmx.mbeanserver.JmxMBeanServer@1c2fe540
   [junit4]   2> 1706276 INFO  (jetty-launcher-6560-thread-2) [n:127.0.0.1:58817_solr    ] o.a.s.m.r.SolrJmxReporter JMX monitoring for 'solr_58817.solr.jetty' (registry 'solr.jetty') enabled at server: com.sun.jmx.mbeanserver.JmxMBeanServer@1c2fe540
   [junit4]   2> 1706277 INFO  (jetty-launcher-6560-thread-3) [n:127.0.0.1:58842_solr    ] o.a.s.m.r.SolrJmxReporter JMX monitoring for 'solr_58842.solr.jvm' (registry 'solr.jvm') enabled at server: com.sun.jmx.mbeanserver.JmxMBeanServer@1c2fe540
   [junit4]   2> 1706277 INFO  (jetty-launcher-6560-thread-3) [n:127.0.0.1:58842_solr    ] o.a.s.m.r.SolrJmxReporter JMX monitoring for 'solr_58842.solr.jetty' (registry 'solr.jetty') enabled at server: com.sun.jmx.mbeanserver.JmxMBeanServer@1c2fe540
   [junit4]   2> 1706278 INFO  (jetty-launcher-6560-thread-2) [n:127.0.0.1:58817_solr    ] o.a.s.c.CorePropertiesLocator Found 0 core definitions underneath C:\Users\jenkins\workspace\Lucene-Solr-7.x-Windows\solr\build\solr-core\test\J0\temp\solr.cloud.ReplaceNodeNoTargetTest_FB36AFF52DC38886-001\tempDir-001\node2\.
   [junit4]   2> 1706279 INFO  (jetty-launcher-6560-thread-4) [n:127.0.0.1:58821_solr    ] o.a.s.m.r.SolrJmxReporter JMX monitoring for 'solr_58821.solr.jvm' (registry 'solr.jvm') enabled at server: com.sun.jmx.mbeanserver.JmxMBeanServer@1c2fe540
   [junit4]   2> 1706279 INFO  (jetty-launcher-6560-thread-4) [n:127.0.0.1:58821_solr    ] o.a.s.m.r.SolrJmxReporter JMX monitoring for 'solr_58821.solr.jetty' (registry 'solr.jetty') enabled at server: com.sun.jmx.mbeanserver.JmxMBeanServer@1c2fe540
   [junit4]   2> 1706282 INFO  (jetty-launcher-6560-thread-3) [n:127.0.0.1:58842_solr    ] o.a.s.c.CorePropertiesLocator Found 0 core definitions underneath C:\Users\jenkins\workspace\Lucene-Solr-7.x-Windows\solr\build\solr-core\test\J0\temp\solr.cloud.ReplaceNodeNoTargetTest_FB36AFF52DC38886-001\tempDir-001\node3\.
   [junit4]   2> 1706283 INFO  (jetty-launcher-6560-thread-4) [n:127.0.0.1:58821_solr    ] o.a.s.c.CorePropertiesLocator Found 0 core definitions underneath C:\Users\jenkins\workspace\Lucene-Solr-7.x-Windows\solr\build\solr-core\test\J0\temp\solr.cloud.ReplaceNodeNoTargetTest_FB36AFF52DC38886-001\tempDir-001\node4\.
   [junit4]   2> 1706292 INFO  (jetty-launcher-6560-thread-5) [n:127.0.0.1:58829_solr    ] o.a.s.m.r.SolrJmxReporter JMX monitoring for 'solr_58829.solr.node' (registry 'solr.node') enabled at server: com.sun.jmx.mbeanserver.JmxMBeanServer@1c2fe540
   [junit4]   2> 1706301 INFO  (jetty-launcher-6560-thread-5) [n:127.0.0.1:58829_solr    ] o.a.s.m.r.SolrJmxReporter JMX monitoring for 'solr_58829.solr.jvm' (registry 'solr.jvm') enabled at server: com.sun.jmx.mbeanserver.JmxMBeanServer@1c2fe540
   [junit4]   2> 1706301 INFO  (jetty-launcher-6560-thread-5) [n:127.0.0.1:58829_solr    ] o.a.s.m.r.SolrJmxReporter JMX monitoring for 'solr_58829.solr.jetty' (registry 'solr.jetty') enabled at server: com.sun.jmx.mbeanserver.JmxMBeanServer@1c2fe540
   [junit4]   2> 1706303 INFO  (jetty-launcher-6560-thread-5) [n:127.0.0.1:58829_solr    ] o.a.s.c.CorePropertiesLocator Found 0 core definitions underneath C:\Users\jenkins\workspace\Lucene-Solr-7.x-Windows\solr\build\solr-core\test\J0\temp\solr.cloud.ReplaceNodeNoTargetTest_FB36AFF52DC38886-001\tempDir-001\node5\.
   [junit4]   2> 1706307 INFO  (jetty-launcher-6560-thread-1) [n:127.0.0.1:58826_solr    ] o.a.s.m.r.SolrJmxReporter JMX monitoring for 'solr_58826.solr.node' (registry 'solr.node') enabled at server: com.sun.jmx.mbeanserver.JmxMBeanServer@1c2fe540
   [junit4]   2> 1706312 INFO  (jetty-launcher-6560-thread-1) [n:127.0.0.1:58826_solr    ] o.a.s.m.r.SolrJmxReporter JMX monitoring for 'solr_58826.solr.jvm' (registry 'solr.jvm') enabled at server: com.sun.jmx.mbeanserver.JmxMBeanServer@1c2fe540
   [junit4]   2> 1706312 INFO  (jetty-launcher-6560-thread-1) [n:127.0.0.1:58826_solr    ] o.a.s.m.r.SolrJmxReporter JMX monitoring for 'solr_58826.solr.jetty' (registry 'solr.jetty') enabled at server: com.sun.jmx.mbeanserver.JmxMBeanServer@1c2fe540
   [junit4]   2> 1706313 INFO  (jetty-launcher-6560-thread-1) [n:127.0.0.1:58826_solr    ] o.a.s.c.CorePropertiesLocator Found 0 core definitions underneath C:\Users\jenkins\workspace\Lucene-Solr-7.x-Windows\solr\build\solr-core\test\J0\temp\solr.cloud.ReplaceNodeNoTargetTest_FB36AFF52DC38886-001\tempDir-001\node1\.
   [junit4]   2> 1706535 INFO  (zkConnectionManagerCallback-6625-thread-1) [    ] o.a.s.c.c.ConnectionManager zkClient has connected
   [junit4]   2> 1706539 INFO  (zkConnectionManagerCallback-6629-thread-1) [    ] o.a.s.c.c.ConnectionManager zkClient has connected
   [junit4]   2> 1706541 INFO  (SUITE-ReplaceNodeNoTargetTest-seed#[FB36AFF52DC38886]-worker) [    ] o.a.s.c.c.ZkStateReader Updated live nodes from ZooKeeper... (0) -> (6)
   [junit4]   2> 1706542 INFO  (SUITE-ReplaceNodeNoTargetTest-seed#[FB36AFF52DC38886]-worker) [    ] o.a.s.c.s.i.ZkClientClusterStateProvider Cluster at 127.0.0.1:58813/solr ready
   [junit4]   2> 1706587 INFO  (TEST-ReplaceNodeNoTargetTest.test-seed#[FB36AFF52DC38886]) [    ] o.a.s.SolrTestCaseJ4 ###Starting test
   [junit4]   2> 1706589 INFO  (zkConnectionManagerCallback-6631-thread-1) [    ] o.a.s.c.c.ConnectionManager zkClient has connected
   [junit4]   2> 1706589 WARN  (NIOServerCxn.Factory:0.0.0.0/0.0.0.0:0) [    ] o.a.z.s.NIOServerCnxn Unable to read additional data from client sessionid 0x100a74af8c00015, likely client has closed socket
   [junit4]   2> 1706589 INFO  (TEST-ReplaceNodeNoTargetTest.test-seed#[FB36AFF52DC38886]) [    ] o.a.s.c.ReplaceNodeNoTargetTest total_jettys: 6
   [junit4]   2> 1706594 INFO  (qtp81946620-21894) [n:127.0.0.1:58817_solr    ] o.a.s.s.HttpSolrCall [admin] webapp=null path=/admin/metrics params={prefix=CONTAINER.fs.usableSpace,CORE.coreName&wt=javabin&version=2&group=solr.node,solr.core} status=0 QTime=0
   [junit4]   2> 1706597 INFO  (qtp1548141603-21925) [n:127.0.0.1:58820_solr    ] o.a.s.s.HttpSolrCall [admin] webapp=null path=/admin/metrics params={prefix=CONTAINER.fs.usableSpace,CORE.coreName&wt=javabin&version=2&group=solr.node,solr.core} status=0 QTime=1
   [junit4]   2> 1706600 INFO  (qtp154952179-21912) [n:127.0.0.1:58821_solr    ] o.a.s.s.HttpSolrCall [admin] webapp=null path=/admin/metrics params={prefix=CONTAINER.fs.usableSpace,CORE.coreName&wt=javabin&version=2&group=solr.node,solr.core} status=0 QTime=0
   [junit4]   2> 1706602 INFO  (qtp1327607018-21902) [n:127.0.0.1:58826_solr    ] o.a.s.s.HttpSolrCall [admin] webapp=null path=/admin/metrics params={prefix=CONTAINER.fs.usableSpace,CORE.coreName&wt=javabin&version=2&group=solr.node,solr.core} status=0 QTime=1
   [junit4]   2> 1706604 INFO  (qtp204807636-21967) [n:127.0.0.1:58829_solr    ] o.a.s.s.HttpSolrCall [admin] webapp=null path=/admin/metrics params={prefix=CONTAINER.fs.usableSpace,CORE.coreName&wt=javabin&version=2&group=solr.node,solr.core} status=0 QTime=0
   [junit4]   2> 1706606 INFO  (qtp1735455159-21949) [n:127.0.0.1:58842_solr    ] o.a.s.s.HttpSolrCall [admin] webapp=null path=/admin/metrics params={prefix=CONTAINER.fs.usableSpace,CORE.coreName&wt=javabin&version=2&group=solr.node,solr.core} status=0 QTime=0
   [junit4]   2> 1706606 INFO  (qtp204807636-21919) [n:127.0.0.1:58829_solr    ] o.a.s.s.HttpSolrCall [admin] webapp=null path=/cluster/autoscaling params={wt=javabin&version=2} status=0 QTime=14
   [junit4]   2> 1706607 INFO  (qtp204807636-21936) [n:127.0.0.1:58829_solr    ] o.a.s.h.a.CollectionsHandler Invoked Collection Action :create with params pullReplicas=0&replicationFactor=2&collection.configName=conf1&name=replacenodetest_coll_notarget&nrtReplicas=2&action=CREATE&numShards=5&tlogReplicas=0&wt=javabin&version=2 and sendToOCPQueue=true
   [junit4]   2> 1706612 INFO  (OverseerThreadFactory-6619-thread-1-processing-n:127.0.0.1:58817_solr) [n:127.0.0.1:58817_solr    ] o.a.s.c.a.c.CreateCollectionCmd Create collection replacenodetest_coll_notarget
   [junit4]   2> 1706615 INFO  (qtp81946620-21899) [n:127.0.0.1:58817_solr    ] o.a.s.s.HttpSolrCall [admin] webapp=null path=/admin/metrics params={prefix=CONTAINER.fs.usableSpace,CORE.coreName&wt=javabin&version=2&group=solr.node,solr.core} status=0 QTime=1
   [junit4]   2> 1706617 INFO  (qtp1548141603-21930) [n:127.0.0.1:58820_solr    ] o.a.s.s.HttpSolrCall [admin] webapp=null path=/admin/metrics params={prefix=CONTAINER.fs.usableSpace,CORE.coreName&wt=javabin&version=2&group=solr.node,solr.core} status=0 QTime=1
   [junit4]   2> 1706619 INFO  (qtp154952179-21916) [n:127.0.0.1:58821_solr    ] o.a.s.s.HttpSolrCall [admin] webapp=null path=/admin/metrics params={prefix=CONTAINER.fs.usableSpace,CORE.coreName&wt=javabin&version=2&group=solr.node,solr.core} status=0 QTime=0
   [junit4]   2> 1706621 INFO  (qtp1327607018-21907) [n:127.0.0.1:58826_solr    ] o.a.s.s.HttpSolrCall [admin] webapp=null path=/admin/metrics params={prefix=CONTAINER.fs.usableSpace,CORE.coreName&wt=javabin&version=2&group=solr.node,solr.core} status=0 QTime=1
   [junit4]   2> 1706623 INFO  (qtp204807636-21922) [n:127.0.0.1:58829_solr    ] o.a.s.s.HttpSolrCall [admin] webapp=null path=/admin/metrics params={prefix=CONTAINER.fs.usableSpace,CORE.coreName&wt=javabin&version=2&group=solr.node,solr.core} status=0 QTime=1
   [junit4]   2> 1706625 INFO  (qtp1735455159-21954) [n:127.0.0.1:58842_solr    ] o.a.s.s.HttpSolrCall [admin] webapp=null path=/admin/metrics params={prefix=CONTAINER.fs.usableSpace,CORE.coreName&wt=javabin&version=2&group=solr.node,solr.core} status=0 QTime=0
   [junit4]   2> 1706628 INFO  (OverseerThreadFactory-6619-thread-1-processing-n:127.0.0.1:58817_solr) [n:127.0.0.1:58817_solr    ] o.a.s.c.s.c.a.PolicyHelper returnSession, curr-time 2806709520 sessionWrapper.createTime 2806709517600316, this.sessionWrapper.createTime 2806709517600316 
   [junit4]   2> 1706737 INFO  (OverseerStateUpdate-72241534480678926-127.0.0.1:58817_solr-n_0000000000) [n:127.0.0.1:58817_solr    ] o.a.s.c.o.SliceMutator createReplica() {
   [junit4]   2>   "operation":"ADDREPLICA",
   [junit4]   2>   "collection":"replacenodetest_coll_notarget",
   [junit4]   2>   "shard":"shard1",
   [junit4]   2>   "core":"replacenodetest_coll_notarget_shard1_replica_n1",
   [junit4]   2>   "state":"down",
   [junit4]   2>   "base_url":"http://127.0.0.1:58842/solr",
   [junit4]   2>   "type":"NRT",
   [junit4]   2>   "waitForFinalState":"false"} 
   [junit4]   2> 1706738 INFO  (OverseerStateUpdate-72241534480678926-127.0.0.1:58817_solr-n_0000000000) [n:127.0.0.1:58817_solr    ] o.a.s.c.o.SliceMutator createReplica() {
   [junit4]   2>   "operation":"ADDREPLICA",
   [junit4]   2>   "collection":"replacenodetest_coll_notarget",
   [junit4]   2>   "shard":"shard1",
   [junit4]   2>   "core":"replacenodetest_coll_notarget_shard1_replica_n2",
   [junit4]   2>   "state":"down",
   [junit4]   2>   "base_url":"http://127.0.0.1:58829/solr",
   [junit4]   2>   "type":"NRT",
   [junit4]   2>   "waitForFinalState":"false"} 
   [junit4]   2> 1706741 INFO  (OverseerStateUpdate-72241534480678926-127.0.0.1:58817_solr-n_0000000000) [n:127.0.0.1:58817_solr    ] o.a.s.c.o.SliceMutator createReplica() {
   [junit4]   2>   "operation":"ADDREPLICA",
   [junit4]   2>   "collection":"replacenodetest_coll_notarget",
   [junit4]   2>   "shard":"shard2",
   [junit4]   2>   "core":"replacenodetest_coll_notarget_shard2_replica_n4",
   [junit4]   2>   "state":"down",
   [junit4]   2>   "base_url":"http://127.0.0.1:58826/solr",
   [junit4]   2>   "type":"NRT",
   [junit4]   2>   "waitForFinalState":"false"} 
   [junit4]   2> 1706743 INFO  (OverseerStateUpdate-72241534480678926-127.0.0.1:58817_solr-n_0000000000) [n:127.0.0.1:58817_solr    ] o.a.s.c.o.SliceMutator createReplica() {
   [junit4]   2>   "operation":"ADDREPLICA",
   [junit4]   2>   "collection":"replacenodetest_coll_notarget",
   [junit4]   2>   "shard":"shard2",
   [junit4]   2>   "core":"replacenodetest_coll_notarget_shard2_replica_n6",
   [junit4]   2>   "state":"down",
   [junit4]   2>   "base_url":"http://127.0.0.1:58821/solr",
   [junit4]   2>   "type":"NRT",
   [junit4]   2>   "waitForFinalState":"false"} 
   [junit4]   2> 1706746 INFO  (OverseerStateUpdate-72241534480678926-127.0.0.1:58817_solr-n_0000000000) [n:127.0.0.1:58817_solr    ] o.a.s.c.o.SliceMutator createReplica() {
   [junit4]   2>   "operation":"ADDREPLICA",
   [junit4]   2>   "collection":"replacenodetest_coll_notarget",
   [junit4]   2>   "shard":"shard3",
   [junit4]   2>   "core":"replacenodetest_coll_notarget_shard3_replica_n8",
   [junit4]   2>   "state":"down",
   [junit4]   2>   "base_url":"http://127.0.0.1:58820/solr",
   [junit4]   2>   "type":"NRT",
   [junit4]   2>   "waitForFinalState":"false"} 
   [junit4]   2> 1706747 INFO  (OverseerStateUpdate-72241534480678926-127.0.0.1:58817_solr-n_0000000000) [n:127.0.0.1:58817_solr    ] o.a.s.c.o.SliceMutator createReplica() {
   [junit4]   2>   "operation":"ADDREPLICA",
   [junit4]   2>   "collection":"replacenodetest_coll_notarget",
   [junit4]   2>   "shard":"shard3",
   [junit4]   2>   "core":"replacenodetest_coll_notarget_shard3_replica_n10",
   [junit4]   2>   "state":"down",
   [junit4]   2>   "base_url":"http://127.0.0.1:58817/solr",
   [junit4]   2>   "type":"NRT",
   [junit4]   2>   "waitForFinalState":"false"} 
   [junit4]   2> 1706750 INFO  (OverseerStateUpdate-72241534480678926-127.0.0.1:58817_solr-n_0000000000) [n:127.0.0.1:58817_solr    ] o.a.s.c.o.SliceMutator createReplica() {
   [junit4]   2>   "operation":"ADDREPLICA",
   [junit4]   2>   "collection":"replacenodetest_coll_notarget",
   [junit4]   2>   "shard":"shard4",
   [junit4]   2>   "core":"replacenodetest_coll_notarget_shard4_replica_n12",
   [junit4]   2>   "state":"down",
   [junit4]   2>   "base_url":"http://127.0.0.1:58817/solr",
   [junit4]   2>   "type":"NRT",
   [junit4]   2>   "waitForFinalState":"false"} 
   [junit4]   2> 1706751 INFO  (OverseerStateUpdate-72241534480678926-127.0.0.1:58817_solr-n_0000000000) [n:127.0.0.1:58817_solr    ] o.a.s.c.o.SliceMutator createReplica() {
   [junit4]   2>   "operation":"ADDREPLICA",
   [junit4]   2>   "collection":"replacenodetest_coll_notarget",
   [junit4]   2>   "shard":"shard4",
   [junit4]   2>   "core":"replacenodetest_coll_notarget_shard4_replica_n14",
   [junit4]   2>   "state":"down",
   [junit4]   2>   "base_url":"http://127.0.0.1:58820/solr",
   [junit4]   2>   "type":"NRT",
   [junit4]   2>   "waitForFinalState":"false"} 
   [junit4]   2> 1706753 INFO  (OverseerStateUpdate-72241534480678926-127.0.0.1:58817_solr-n_0000000000) [n:127.0.0.1:58817_solr    ] o.a.s.c.o.SliceMutator createReplica() {
   [junit4]   2>   "operation":"ADDREPLICA",
   [junit4]   2>   "collection":"replacenodetest_coll_notarget",
   [junit4]   2>   "shard":"shard5",
   [junit4]   2>   "core":"replacenodetest_coll_notarget_shard5_replica_n16",
   [junit4]   2>   "state":"down",
   [junit4]   2>   "base_url":"http://127.0.0.1:58821/solr",
   [junit4]   2>   "type":"NRT",
   [junit4]   2>   "waitForFinalState":"false"} 
   [junit4]   2> 1706755 INFO  (OverseerStateUpdate-72241534480678926-127.0.0.1:58817_solr-n_0000000000) [n:127.0.0.1:58817_solr    ] o.a.s.c.o.SliceMutator createReplica() {
   [junit4]   2>   "operation":"ADDREPLICA",
   [junit4]   2>   "collection":"replacenodetest_coll_notarget",
   [junit4]   2>   "shard":"shard5",
   [junit4]   2>   "core":"replacenodetest_coll_notarget_shard5_replica_n18",
   [junit4]   2>   "state":"down",
   [junit4]   2>   "base_url":"http://127.0.0.1:58826/solr",
   [junit4]   2>   "type":"NRT",
   [junit4]   2>   "waitForFinalState":"false"} 
   [junit4]   2> 1706959 INFO  (qtp204807636-21922) [n:127.0.0.1:58829_solr    ] o.a.s.h.a.CoreAdminOperation core create command qt=/admin/cores&coreNodeName=core_node5&collection.configName=conf1&newCollection=true&name=replacenodetest_coll_notarget_shard1_replica_n2&action=CREATE&numShards=5&collection=replacenodetest_coll_notarget&shard=shard1&wt=javabin&version=2&replicaType=NRT
   [junit4]   2> 1706959 INFO  (qtp1735455159-21954) [n:127.0.0.1:58842_solr    ] o.a.s.h.a.CoreAdminOperation core create command qt=/admin/cores&coreNodeName=core_node3&collection.configName=conf1&newCollection=true&name=replacenodetest_coll_notarget_shard1_replica_n1&action=CREATE&numShards=5&collection=replacenodetest_coll_notarget&shard=shard1&wt=javabin&version=2&replicaType=NRT
   [junit4]   2> 1706960 INFO  (qtp1735455159-21954) [n:127.0.0.1:58842_solr    ] o.a.s.c.TransientSolrCoreCacheDefault Allocating transient cache for 2147483647 transient cores
   [junit4]   2> 1706961 INFO  (qtp204807636-21922) [n:127.0.0.1:58829_solr    ] o.a.s.c.TransientSolrCoreCacheDefault Allocating transient cache for 2147483647 transient cores
   [junit4]   2> 1706964 INFO  (qtp1327607018-21907) [n:127.0.0.1:58826_solr    ] o.a.s.h.a.CoreAdminOperation core create command qt=/admin/cores&coreNodeName=core_node7&collection.configName=conf1&newCollection=true&name=replacenodetest_coll_notarget_shard2_replica_n4&action=CREATE&numShards=5&collection=replacenodetest_coll_notarget&shard=shard2&wt=javabin&version=2&replicaType=NRT
   [junit4]   2> 1706966 INFO  (qtp1327607018-21908) [n:127.0.0.1:58826_solr    ] o.a.s.h.a.CoreAdminOperation core create command qt=/admin/cores&coreNodeName=core_node20&collection.configName=conf1&newCollection=true&name=replacenodetest_coll_notarget_shard5_replica_n18&action=CREATE&numShards=5&collection=replacenodetest_coll_notarget&shard=shard5&wt=javabin&version=2&replicaType=NRT
   [junit4]   2> 1706967 INFO  (qtp154952179-21914) [n:127.0.0.1:58821_solr    ] o.a.s.h.a.CoreAdminOperation core create command qt=/admin/cores&coreNodeName=core_node9&collection.configName=conf1&newCollection=true&name=replacenodetest_coll_notarget_shard2_replica_n6&action=CREATE&numShards=5&collection=replacenodetest_coll_notarget&shard=shard2&wt=javabin&version=2&replicaType=NRT
   [junit4]   2> 1706967 INFO  (qtp81946620-21897) [n:127.0.0.1:58817_solr    ] o.a.s.h.a.CoreAdminOperation core create command qt=/admin/cores&coreNodeName=core_node15&collection.configName=conf1&newCollection=true&name=replacenodetest_coll_notarget_shard4_replica_n12&action=CREATE&numShards=5&collection=replacenodetest_coll_notarget&shard=shard4&wt=javabin&version=2&replicaType=NRT
   [junit4]   2> 1706968 INFO  (qtp154952179-21914) [n:127.0.0.1:58821_solr    ] o.a.s.c.TransientSolrCoreCacheDefault Allocating transient cache for 2147483647 transient cores
   [junit4]   2> 1706968 INFO  (qtp81946620-21897) [n:127.0.0.1:58817_solr    ] o.a.s.c.TransientSolrCoreCacheDefault Allocating transient cache for 2147483647 transient cores
   [junit4]   2> 1706967 INFO  (qtp1548141603-21924) [n:127.0.0.1:58820_solr    ] o.a.s.h.a.CoreAdminOperation core create command qt=/admin/cores&coreNodeName=core_node17&collection.configName=conf1&newCollection=true&name=replacenodetest_coll_notarget_shard4_replica_n14&action=CREATE&numShards=5&collection=replacenodetest_coll_notarget&shard=shard4&wt=javabin&version=2&replicaType=NRT
   [junit4]   2> 1706968 INFO  (qtp154952179-21916) [n:127.0.0.1:58821_solr    ] o.

[...truncated too long message...]

h, TestDistributedGrouping, TestRecovery, TestHashPartitioner, DistributedSpellCheckComponentTest, TermVectorComponentDistributedTest, TestJoin, TestReload, TestCoreContainer, TestSolr4Spatial, TestGroupingSearch, SolrCmdDistributorTest, QueryElevationComponentTest, ConvertedLegacyTest, TestFiltering, BasicFunctionalityTest, DirectUpdateHandlerTest, TestIndexSearcher, SoftAutoCommitTest, ShowFileRequestHandlerTest, SolrIndexSplitterTest, SimplePostToolTest, TestCoreDiscovery, AnalysisAfterCoreReloadTest, SignatureUpdateProcessorFactoryTest, TestExtendedDismaxParser, TestFoldingMultitermQuery, TestCSVLoader, NoCacheHeaderTest, SolrCoreCheckLockOnStartupTest, TestPseudoReturnFields, TestUpdate, DirectUpdateHandlerOptimizeTest, DefaultValueUpdateProcessorTest, StatelessScriptUpdateProcessorFactoryTest, SortByFunctionTest, CacheHeaderTest, IndexBasedSpellCheckerTest, LukeRequestHandlerTest, TestQueryUtils, TestWriterPerf, XmlUpdateRequestHandlerTest, RequestHandlersTest, DocumentBuilderTest, TestValueSourceCache, TermVectorComponentTest, RequiredFieldsTest, FastVectorHighlighterTest, LoggingHandlerTest, RegexBoostProcessorTest, TestCollationField, TestCSVResponseWriter, MBeansHandlerTest, TestSolrIndexConfig, TestQuerySenderNoQuery, TestMergePolicyConfig, TestSolrCoreProperties, TestPostingsSolrHighlighter, SpellPossibilityIteratorTest, TestCharFilters, SynonymTokenizerTest, TestXIncludeConfig, EchoParamsTest, TestDFRSimilarityFactory, ResourceLoaderTest, URLClassifyProcessorTest, DateMathParserTest, TestSuggestSpellingConverter, RAMDirectoryFactoryTest, TestSolrJ, TestDocumentBuilder, DistributedMLTComponentTest, TestLuceneIndexBackCompat, AliasIntegrationTest, CloudExitableDirectoryReaderTest, ConfigSetsAPITest, ConnectionManagerTest, CreateCollectionCleanupTest, DeleteStatusTest, DistribDocExpirationUpdateProcessorTest, DistributedQueueTest, ForceLeaderTest, OutOfBoxZkACLAndCredentialsProvidersTest, OverriddenZkACLAndCredentialsProvidersTest, OverseerCollectionConfigSetProcessorTest, OverseerTaskQueueTest, RecoveryAfterSoftCommitTest, SharedFSAutoReplicaFailoverTest, SolrXmlInZkTest, TestCloudJSONFacetJoinDomain, TestCloudPseudoReturnFields, TestClusterProperties, TestConfigSetsAPI, TestDistributedMap, TestLeaderElectionWithEmptyReplica, TestPullReplica, TestRandomRequestDistribution, TestRebalanceLeaders, TestRequestForwarding, TestShortCircuitedRequests, TestSolrCloudWithSecureImpersonation, TestTlogReplica, AssignTest, CollectionsAPIAsyncDistributedZkTest, HdfsCollectionsAPIDistributedZkTest, SimpleCollectionCreateDeleteTest, TestLocalFSCloudBackupRestore, TestRequestStatusCollectionAPI, AutoAddReplicasIntegrationTest, TestPolicyCloud, HdfsNNFailoverTest, HdfsUnloadDistributedZkTest, HdfsWriteToMultipleCollectionsTest, ZkStateReaderTest, RulesTest, TestSolrCoreSnapshots, ResponseBuilderTest, SearchHandlerTest, TestCoreBackup, TestReplicationHandlerBackup, TestReqParamsAPI, TestRestoreCore, TestSolrConfigHandlerCloud, V2StandaloneTest]
   [junit4]   2> NOTE: reproduce with: ant test  -Dtestcase=V2StandaloneTest -Dtests.seed=FB36AFF52DC38886 -Dtests.slow=true -Dtests.locale=nl -Dtests.timezone=Eire -Dtests.asserts=true -Dtests.file.encoding=ISO-8859-1
   [junit4] ERROR   0.00s J0 | V2StandaloneTest (suite) <<<
   [junit4]    > Throwable #1: java.io.IOException: Could not remove the following files (in the order of attempts):
   [junit4]    >    C:\Users\jenkins\workspace\Lucene-Solr-7.x-Windows\solr\build\solr-core\test\J0\temp\solr.handler.V2StandaloneTest_FB36AFF52DC38886-001\tempDir-001: java.nio.file.AccessDeniedException: C:\Users\jenkins\workspace\Lucene-Solr-7.x-Windows\solr\build\solr-core\test\J0\temp\solr.handler.V2StandaloneTest_FB36AFF52DC38886-001\tempDir-001
   [junit4]    >    C:\Users\jenkins\workspace\Lucene-Solr-7.x-Windows\solr\build\solr-core\test\J0\temp\solr.handler.V2StandaloneTest_FB36AFF52DC38886-001: java.nio.file.DirectoryNotEmptyException: C:\Users\jenkins\workspace\Lucene-Solr-7.x-Windows\solr\build\solr-core\test\J0\temp\solr.handler.V2StandaloneTest_FB36AFF52DC38886-001
   [junit4]    > 	at __randomizedtesting.SeedInfo.seed([FB36AFF52DC38886]:0)
   [junit4]    > 	at org.apache.lucene.util.IOUtils.rm(IOUtils.java:329)
   [junit4]    > 	at java.lang.Thread.run(Thread.java:748)
   [junit4] Completed [629/777 (3!)] on J0 in 0.21s, 1 test, 1 error <<< FAILURES!

[...truncated 2907 lines...]
   [junit4] Suite: org.apache.solr.update.processor.TestOpenNLPExtractNamedEntitiesUpdateProcessorFactory
   [junit4]   2> Creating dataDir: C:\Users\jenkins\workspace\Lucene-Solr-7.x-Windows\solr\build\contrib\solr-analysis-extras\test\J1\temp\solr.update.processor.TestOpenNLPExtractNamedEntitiesUpdateProcessorFactory_B06BF4A0B89B51A2-001\init-core-data-001
   [junit4]   2> log4j:WARN No appenders could be found for logger (org.apache.solr.SolrTestCaseJ4).
   [junit4]   2> log4j:WARN Please initialize the log4j system properly.
   [junit4]   2> log4j:WARN See http://logging.apache.org/log4j/1.2/faq.html#noconfig for more info.
   [junit4]   2> NOTE: test params are: codec=Asserting(Lucene70): {}, docValues:{}, maxPointsInLeafNode=1383, maxMBSortInHeap=5.4871489893733685, sim=RandomSimilarity(queryNorm=false): {}, locale=et-EE, timezone=America/Nassau
   [junit4]   2> NOTE: Windows 10 10.0 amd64/Oracle Corporation 1.8.0_144 (64-bit)/cpus=3,threads=1,free=65739472,total=97320960
   [junit4]   2> NOTE: All tests run in this JVM: [TestOpenNLPExtractNamedEntitiesUpdateProcessorFactory]
   [junit4]   2> NOTE: reproduce with: ant test  -Dtestcase=TestOpenNLPExtractNamedEntitiesUpdateProcessorFactory -Dtests.seed=B06BF4A0B89B51A2 -Dtests.slow=true -Dtests.locale=et-EE -Dtests.timezone=America/Nassau -Dtests.asserts=true -Dtests.file.encoding=ISO-8859-1
   [junit4] ERROR   0.00s J1 | TestOpenNLPExtractNamedEntitiesUpdateProcessorFactory (suite) <<<
   [junit4]    > Throwable #1: java.io.IOException: Could not remove the following files (in the order of attempts):
   [junit4]    >    C:\Users\jenkins\workspace\Lucene-Solr-7.x-Windows\solr\build\contrib\solr-analysis-extras\test\J1\temp\solr.update.processor.TestOpenNLPExtractNamedEntitiesUpdateProcessorFactory_B06BF4A0B89B51A2-001\tempDir-001\collection1\conf: java.nio.file.DirectoryNotEmptyException: C:\Users\jenkins\workspace\Lucene-Solr-7.x-Windows\solr\build\contrib\solr-analysis-extras\test\J1\temp\solr.update.processor.TestOpenNLPExtractNamedEntitiesUpdateProcessorFactory_B06BF4A0B89B51A2-001\tempDir-001\collection1\conf
   [junit4]    >    C:\Users\jenkins\workspace\Lucene-Solr-7.x-Windows\solr\build\contrib\solr-analysis-extras\test\J1\temp\solr.update.processor.TestOpenNLPExtractNamedEntitiesUpdateProcessorFactory_B06BF4A0B89B51A2-001\tempDir-001\collection1: java.nio.file.DirectoryNotEmptyException: C:\Users\jenkins\workspace\Lucene-Solr-7.x-Windows\solr\build\contrib\solr-analysis-extras\test\J1\temp\solr.update.processor.TestOpenNLPExtractNamedEntitiesUpdateProcessorFactory_B06BF4A0B89B51A2-001\tempDir-001\collection1
   [junit4]    >    C:\Users\jenkins\workspace\Lucene-Solr-7.x-Windows\solr\build\contrib\solr-analysis-extras\test\J1\temp\solr.update.processor.TestOpenNLPExtractNamedEntitiesUpdateProcessorFactory_B06BF4A0B89B51A2-001\tempDir-001: java.nio.file.DirectoryNotEmptyException: C:\Users\jenkins\workspace\Lucene-Solr-7.x-Windows\solr\build\contrib\solr-analysis-extras\test\J1\temp\solr.update.processor.TestOpenNLPExtractNamedEntitiesUpdateProcessorFactory_B06BF4A0B89B51A2-001\tempDir-001
   [junit4]    >    C:\Users\jenkins\workspace\Lucene-Solr-7.x-Windows\solr\build\contrib\solr-analysis-extras\test\J1\temp\solr.update.processor.TestOpenNLPExtractNamedEntitiesUpdateProcessorFactory_B06BF4A0B89B51A2-001\tempDir-001\collection1\conf\en-test-ner-person.bin: java.nio.file.AccessDeniedException: C:\Users\jenkins\workspace\Lucene-Solr-7.x-Windows\solr\build\contrib\solr-analysis-extras\test\J1\temp\solr.update.processor.TestOpenNLPExtractNamedEntitiesUpdateProcessorFactory_B06BF4A0B89B51A2-001\tempDir-001\collection1\conf\en-test-ner-person.bin
   [junit4]    >    C:\Users\jenkins\workspace\Lucene-Solr-7.x-Windows\solr\build\contrib\solr-analysis-extras\test\J1\temp\solr.update.processor.TestOpenNLPExtractNamedEntitiesUpdateProcessorFactory_B06BF4A0B89B51A2-001\tempDir-001\collection1\conf\en-test-sent.bin: java.nio.file.AccessDeniedException: C:\Users\jenkins\workspace\Lucene-Solr-7.x-Windows\solr\build\contrib\solr-analysis-extras\test\J1\temp\solr.update.processor.TestOpenNLPExtractNamedEntitiesUpdateProcessorFactory_B06BF4A0B89B51A2-001\tempDir-001\collection1\conf\en-test-sent.bin
   [junit4]    >    C:\Users\jenkins\workspace\Lucene-Solr-7.x-Windows\solr\build\contrib\solr-analysis-extras\test\J1\temp\solr.update.processor.TestOpenNLPExtractNamedEntitiesUpdateProcessorFactory_B06BF4A0B89B51A2-001\tempDir-001\collection1\conf\en-test-tokenizer.bin: java.nio.file.AccessDeniedException: C:\Users\jenkins\workspace\Lucene-Solr-7.x-Windows\solr\build\contrib\solr-analysis-extras\test\J1\temp\solr.update.processor.TestOpenNLPExtractNamedEntitiesUpdateProcessorFactory_B06BF4A0B89B51A2-001\tempDir-001\collection1\conf\en-test-tokenizer.bin
   [junit4]    >    C:\Users\jenkins\workspace\Lucene-Solr-7.x-Windows\solr\build\contrib\solr-analysis-extras\test\J1\temp\solr.update.processor.TestOpenNLPExtractNamedEntitiesUpdateProcessorFactory_B06BF4A0B89B51A2-001: java.nio.file.DirectoryNotEmptyException: C:\Users\jenkins\workspace\Lucene-Solr-7.x-Windows\solr\build\contrib\solr-analysis-extras\test\J1\temp\solr.update.processor.TestOpenNLPExtractNamedEntitiesUpdateProcessorFactory_B06BF4A0B89B51A2-001
   [junit4]    > 	at __randomizedtesting.SeedInfo.seed([B06BF4A0B89B51A2]:0)
   [junit4]    > 	at org.apache.lucene.util.IOUtils.rm(IOUtils.java:329)
   [junit4]    > 	at java.lang.Thread.run(Thread.java:748)
   [junit4] Completed [1/5 (1!)] on J1 in 13.83s, 8 tests, 1 error <<< FAILURES!

[...truncated 47831 lines...]

Mime
View raw message