lucene-dev mailing list archives

Site index · List index
Message view « Date » · « Thread »
Top « Date » · « Thread »
From Policeman Jenkins Server <jenk...@thetaphi.de>
Subject [JENKINS] Lucene-Solr-7.x-MacOSX (64bit/jdk-9) - Build # 463 - Failure!
Date Tue, 20 Feb 2018 12:12:42 GMT
Build: https://jenkins.thetaphi.de/job/Lucene-Solr-7.x-MacOSX/463/
Java: 64bit/jdk-9 -XX:-UseCompressedOops -XX:+UseParallelGC

2 tests failed.
FAILED:  junit.framework.TestSuite.org.apache.solr.analytics.facet.ValueFacetTest

Error Message:
1 thread leaked from SUITE scope at org.apache.solr.analytics.facet.ValueFacetTest:     1)
Thread[id=680, name=qtp1702623346-680, state=TIMED_WAITING, group=TGRP-ValueFacetTest]   
     at java.base@9/jdk.internal.misc.Unsafe.park(Native Method)         at java.base@9/java.util.concurrent.locks.LockSupport.parkNanos(LockSupport.java:234)
        at java.base@9/java.util.concurrent.locks.AbstractQueuedSynchronizer$ConditionObject.await(AbstractQueuedSynchronizer.java:2192)
        at app//org.eclipse.jetty.util.thread.ReservedThreadExecutor$ReservedThread.reservedWait(ReservedThreadExecutor.java:308)
        at app//org.eclipse.jetty.util.thread.ReservedThreadExecutor$ReservedThread.run(ReservedThreadExecutor.java:373)
        at app//org.eclipse.jetty.util.thread.QueuedThreadPool.runJob(QueuedThreadPool.java:708)
        at app//org.eclipse.jetty.util.thread.QueuedThreadPool$2.run(QueuedThreadPool.java:626)
        at java.base@9/java.lang.Thread.run(Thread.java:844)

Stack Trace:
com.carrotsearch.randomizedtesting.ThreadLeakError: 1 thread leaked from SUITE scope at org.apache.solr.analytics.facet.ValueFacetTest:

   1) Thread[id=680, name=qtp1702623346-680, state=TIMED_WAITING, group=TGRP-ValueFacetTest]
        at java.base@9/jdk.internal.misc.Unsafe.park(Native Method)
        at java.base@9/java.util.concurrent.locks.LockSupport.parkNanos(LockSupport.java:234)
        at java.base@9/java.util.concurrent.locks.AbstractQueuedSynchronizer$ConditionObject.await(AbstractQueuedSynchronizer.java:2192)
        at app//org.eclipse.jetty.util.thread.ReservedThreadExecutor$ReservedThread.reservedWait(ReservedThreadExecutor.java:308)
        at app//org.eclipse.jetty.util.thread.ReservedThreadExecutor$ReservedThread.run(ReservedThreadExecutor.java:373)
        at app//org.eclipse.jetty.util.thread.QueuedThreadPool.runJob(QueuedThreadPool.java:708)
        at app//org.eclipse.jetty.util.thread.QueuedThreadPool$2.run(QueuedThreadPool.java:626)
        at java.base@9/java.lang.Thread.run(Thread.java:844)
	at __randomizedtesting.SeedInfo.seed([7DBA490494AB0410]:0)


FAILED:  junit.framework.TestSuite.org.apache.solr.analytics.facet.ValueFacetTest

Error Message:
There are still zombie threads that couldn't be terminated:    1) Thread[id=680, name=qtp1702623346-680,
state=TIMED_WAITING, group=TGRP-ValueFacetTest]         at java.base@9/jdk.internal.misc.Unsafe.park(Native
Method)         at java.base@9/java.util.concurrent.locks.LockSupport.parkNanos(LockSupport.java:234)
        at java.base@9/java.util.concurrent.locks.AbstractQueuedSynchronizer$ConditionObject.await(AbstractQueuedSynchronizer.java:2192)
        at app//org.eclipse.jetty.util.thread.ReservedThreadExecutor$ReservedThread.reservedWait(ReservedThreadExecutor.java:308)
        at app//org.eclipse.jetty.util.thread.ReservedThreadExecutor$ReservedThread.run(ReservedThreadExecutor.java:373)
        at app//org.eclipse.jetty.util.thread.QueuedThreadPool.runJob(QueuedThreadPool.java:708)
        at app//org.eclipse.jetty.util.thread.QueuedThreadPool$2.run(QueuedThreadPool.java:626)
        at java.base@9/java.lang.Thread.run(Thread.java:844)

Stack Trace:
com.carrotsearch.randomizedtesting.ThreadLeakError: There are still zombie threads that couldn't
be terminated:
   1) Thread[id=680, name=qtp1702623346-680, state=TIMED_WAITING, group=TGRP-ValueFacetTest]
        at java.base@9/jdk.internal.misc.Unsafe.park(Native Method)
        at java.base@9/java.util.concurrent.locks.LockSupport.parkNanos(LockSupport.java:234)
        at java.base@9/java.util.concurrent.locks.AbstractQueuedSynchronizer$ConditionObject.await(AbstractQueuedSynchronizer.java:2192)
        at app//org.eclipse.jetty.util.thread.ReservedThreadExecutor$ReservedThread.reservedWait(ReservedThreadExecutor.java:308)
        at app//org.eclipse.jetty.util.thread.ReservedThreadExecutor$ReservedThread.run(ReservedThreadExecutor.java:373)
        at app//org.eclipse.jetty.util.thread.QueuedThreadPool.runJob(QueuedThreadPool.java:708)
        at app//org.eclipse.jetty.util.thread.QueuedThreadPool$2.run(QueuedThreadPool.java:626)
        at java.base@9/java.lang.Thread.run(Thread.java:844)
	at __randomizedtesting.SeedInfo.seed([7DBA490494AB0410]:0)




Build Log:
[...truncated 17882 lines...]
   [junit4] Suite: org.apache.solr.analytics.facet.ValueFacetTest
   [junit4]   2> Creating dataDir: /Users/jenkins/workspace/Lucene-Solr-7.x-MacOSX/solr/build/contrib/solr-analytics/test/J0/temp/solr.analytics.facet.ValueFacetTest_7DBA490494AB0410-001/init-core-data-001
   [junit4]   2> Feb 20, 2018 12:08:46 PM com.carrotsearch.randomizedtesting.ThreadLeakControl
checkThreadLeaks
   [junit4]   2> WARNING: Will linger awaiting termination of 2 leaked thread(s).
   [junit4]   2> Feb 20, 2018 12:09:06 PM com.carrotsearch.randomizedtesting.ThreadLeakControl
checkThreadLeaks
   [junit4]   2> SEVERE: 1 thread leaked from SUITE scope at org.apache.solr.analytics.facet.ValueFacetTest:

   [junit4]   2>    1) Thread[id=680, name=qtp1702623346-680, state=TIMED_WAITING, group=TGRP-ValueFacetTest]
   [junit4]   2>         at java.base@9/jdk.internal.misc.Unsafe.park(Native Method)
   [junit4]   2>         at java.base@9/java.util.concurrent.locks.LockSupport.parkNanos(LockSupport.java:234)
   [junit4]   2>         at java.base@9/java.util.concurrent.locks.AbstractQueuedSynchronizer$ConditionObject.await(AbstractQueuedSynchronizer.java:2192)
   [junit4]   2>         at app//org.eclipse.jetty.util.thread.ReservedThreadExecutor$ReservedThread.reservedWait(ReservedThreadExecutor.java:308)
   [junit4]   2>         at app//org.eclipse.jetty.util.thread.ReservedThreadExecutor$ReservedThread.run(ReservedThreadExecutor.java:373)
   [junit4]   2>         at app//org.eclipse.jetty.util.thread.QueuedThreadPool.runJob(QueuedThreadPool.java:708)
   [junit4]   2>         at app//org.eclipse.jetty.util.thread.QueuedThreadPool$2.run(QueuedThreadPool.java:626)
   [junit4]   2>         at java.base@9/java.lang.Thread.run(Thread.java:844)
   [junit4]   2> Feb 20, 2018 12:09:06 PM com.carrotsearch.randomizedtesting.ThreadLeakControl
tryToInterruptAll
   [junit4]   2> INFO: Starting to interrupt leaked threads:
   [junit4]   2>    1) Thread[id=680, name=qtp1702623346-680, state=TIMED_WAITING, group=TGRP-ValueFacetTest]
   [junit4]   2> Feb 20, 2018 12:09:09 PM com.carrotsearch.randomizedtesting.ThreadLeakControl
tryToInterruptAll
   [junit4]   2> SEVERE: There are still zombie threads that couldn't be terminated:
   [junit4]   2>    1) Thread[id=680, name=qtp1702623346-680, state=TIMED_WAITING, group=TGRP-ValueFacetTest]
   [junit4]   2>         at java.base@9/jdk.internal.misc.Unsafe.park(Native Method)
   [junit4]   2>         at java.base@9/java.util.concurrent.locks.LockSupport.parkNanos(LockSupport.java:234)
   [junit4]   2>         at java.base@9/java.util.concurrent.locks.AbstractQueuedSynchronizer$ConditionObject.await(AbstractQueuedSynchronizer.java:2192)
   [junit4]   2>         at app//org.eclipse.jetty.util.thread.ReservedThreadExecutor$ReservedThread.reservedWait(ReservedThreadExecutor.java:308)
   [junit4]   2>         at app//org.eclipse.jetty.util.thread.ReservedThreadExecutor$ReservedThread.run(ReservedThreadExecutor.java:373)
   [junit4]   2>         at app//org.eclipse.jetty.util.thread.QueuedThreadPool.runJob(QueuedThreadPool.java:708)
   [junit4]   2>         at app//org.eclipse.jetty.util.thread.QueuedThreadPool$2.run(QueuedThreadPool.java:626)
   [junit4]   2>         at java.base@9/java.lang.Thread.run(Thread.java:844)
   [junit4]   2> NOTE: test params are: codec=Asserting(Lucene70): {string_s=PostingsFormat(name=Direct),
id=Lucene50(blocksize=128), string_sm=BlockTreeOrds(blocksize=128)}, docValues:{int_i=DocValuesFormat(name=Lucene70),
double_dm=DocValuesFormat(name=Lucene70), float_fm=DocValuesFormat(name=Asserting), int_im=DocValuesFormat(name=Asserting),
date_dt=DocValuesFormat(name=Lucene70), date_dtm=DocValuesFormat(name=Direct), long_lm=DocValuesFormat(name=Direct),
double_d=DocValuesFormat(name=Asserting), float_f=DocValuesFormat(name=Lucene70), long_l=DocValuesFormat(name=Lucene70),
_version_=DocValuesFormat(name=Direct), string_s=DocValuesFormat(name=Lucene70), id=DocValuesFormat(name=Lucene70),
string_sm=DocValuesFormat(name=Asserting)}, maxPointsInLeafNode=902, maxMBSortInHeap=7.736711387865962,
sim=RandomSimilarity(queryNorm=true): {}, locale=as-IN, timezone=Asia/Saigon
   [junit4]   2> NOTE: Mac OS X 10.11.6 x86_64/Oracle Corporation 9 (64-bit)/cpus=3,threads=2,free=73684888,total=261095424
   [junit4]   2> NOTE: All tests run in this JVM: [OverallAnalyticsTest, FloorFunctionTest,
CastingDateValueTest, StringFieldsTest, TopFunctionTest, LegacyRangeFacetCloudTest, DateParseFunctionTest,
LegacyAbstractAnalyticsTest, AddFunctionTest, LTEFunctionTest, LegacyNoFacetTest, CastingStringValueTest,
BooleanFieldsTest, ConcatFunctionTest, CastingIntValueTest, QueryFacetTest, StringCastFunctionTest,
ExpressionFactoryTest, ReplaceFunctionTest, BottomFunctionTest, ValueFacetTest]
   [junit4]   2> NOTE: reproduce with: ant test  -Dtestcase=ValueFacetTest -Dtests.seed=7DBA490494AB0410
-Dtests.slow=true -Dtests.locale=as-IN -Dtests.timezone=Asia/Saigon -Dtests.asserts=true -Dtests.file.encoding=UTF-8
   [junit4] ERROR   0.00s J0 | ValueFacetTest (suite) <<<
   [junit4]    > Throwable #1: com.carrotsearch.randomizedtesting.ThreadLeakError: 1 thread
leaked from SUITE scope at org.apache.solr.analytics.facet.ValueFacetTest: 
   [junit4]    >    1) Thread[id=680, name=qtp1702623346-680, state=TIMED_WAITING, group=TGRP-ValueFacetTest]
   [junit4]    >         at java.base@9/jdk.internal.misc.Unsafe.park(Native Method)
   [junit4]    >         at java.base@9/java.util.concurrent.locks.LockSupport.parkNanos(LockSupport.java:234)
   [junit4]    >         at java.base@9/java.util.concurrent.locks.AbstractQueuedSynchronizer$ConditionObject.await(AbstractQueuedSynchronizer.java:2192)
   [junit4]    >         at app//org.eclipse.jetty.util.thread.ReservedThreadExecutor$ReservedThread.reservedWait(ReservedThreadExecutor.java:308)
   [junit4]    >         at app//org.eclipse.jetty.util.thread.ReservedThreadExecutor$ReservedThread.run(ReservedThreadExecutor.java:373)
   [junit4]    >         at app//org.eclipse.jetty.util.thread.QueuedThreadPool.runJob(QueuedThreadPool.java:708)
   [junit4]    >         at app//org.eclipse.jetty.util.thread.QueuedThreadPool$2.run(QueuedThreadPool.java:626)
   [junit4]    >         at java.base@9/java.lang.Thread.run(Thread.java:844)
   [junit4]    > 	at __randomizedtesting.SeedInfo.seed([7DBA490494AB0410]:0)Throwable #2:
com.carrotsearch.randomizedtesting.ThreadLeakError: There are still zombie threads that couldn't
be terminated:
   [junit4]    >    1) Thread[id=680, name=qtp1702623346-680, state=TIMED_WAITING, group=TGRP-ValueFacetTest]
   [junit4]    >         at java.base@9/jdk.internal.misc.Unsafe.park(Native Method)
   [junit4]    >         at java.base@9/java.util.concurrent.locks.LockSupport.parkNanos(LockSupport.java:234)
   [junit4]    >         at java.base@9/java.util.concurrent.locks.AbstractQueuedSynchronizer$ConditionObject.await(AbstractQueuedSynchronizer.java:2192)
   [junit4]    >         at app//org.eclipse.jetty.util.thread.ReservedThreadExecutor$ReservedThread.reservedWait(ReservedThreadExecutor.java:308)
   [junit4]    >         at app//org.eclipse.jetty.util.thread.ReservedThreadExecutor$ReservedThread.run(ReservedThreadExecutor.java:373)
   [junit4]    >         at app//org.eclipse.jetty.util.thread.QueuedThreadPool.runJob(QueuedThreadPool.java:708)
   [junit4]    >         at app//org.eclipse.jetty.util.thread.QueuedThreadPool$2.run(QueuedThreadPool.java:626)
   [junit4]    >         at java.base@9/java.lang.Thread.run(Thread.java:844)
   [junit4]    > 	at __randomizedtesting.SeedInfo.seed([7DBA490494AB0410]:0)
   [junit4] Completed [78/78 (1!)] on J0 in 58.00s, 11 tests, 2 errors <<< FAILURES!

[...truncated 6091 lines...]
-validate-source-patterns:
[source-patterns] invalid logging pattern [not private static final, uses static class name]:
solr/contrib/prometheus-exporter/src/java/org/apache/solr/prometheus/collector/SolrCollector.java
[source-patterns] invalid logging pattern [not private static final, uses static class name]:
solr/contrib/prometheus-exporter/src/java/org/apache/solr/prometheus/exporter/SolrExporter.java
[source-patterns] invalid logging pattern [not private static final, uses static class name]:
solr/contrib/prometheus-exporter/src/java/org/apache/solr/prometheus/scraper/SolrScraper.java

BUILD FAILED
/Users/jenkins/workspace/Lucene-Solr-7.x-MacOSX/build.xml:618: The following error occurred
while executing this line:
/Users/jenkins/workspace/Lucene-Solr-7.x-MacOSX/build.xml:128: Found 3 violations in source
files (invalid logging pattern [not private static final, uses static class name]).

Total time: 98 minutes 36 seconds
Build step 'Invoke Ant' marked build as failure
Archiving artifacts
[WARNINGS] Skipping publisher since build result is FAILURE
Recording test results
Email was triggered for: Failure - Any
Sending email for trigger: Failure - Any

Mime
View raw message