lucene-dev mailing list archives

Site index · List index
Message view « Date » · « Thread »
Top « Date » · « Thread »
From Apache Jenkins Server <jenk...@builds.apache.org>
Subject [JENKINS] Lucene-Solr-SmokeRelease-master - Build # 951 - Still Failing
Date Tue, 13 Feb 2018 20:10:25 GMT
Build: https://builds.apache.org/job/Lucene-Solr-SmokeRelease-master/951/

No tests ran.

Build Log:
[...truncated 28740 lines...]
prepare-release-no-sign:
    [mkdir] Created dir: /home/jenkins/jenkins-slave/workspace/Lucene-Solr-SmokeRelease-master/lucene/build/smokeTestRelease/dist
     [copy] Copying 491 files to /home/jenkins/jenkins-slave/workspace/Lucene-Solr-SmokeRelease-master/lucene/build/smokeTestRelease/dist/lucene
     [copy] Copying 215 files to /home/jenkins/jenkins-slave/workspace/Lucene-Solr-SmokeRelease-master/lucene/build/smokeTestRelease/dist/solr
   [smoker] Java 1.8 JAVA_HOME=/home/jenkins/tools/java/latest1.8
   [smoker] Java 9 JAVA_HOME=/home/jenkins/tools/java/latest1.9
   [smoker] NOTE: output encoding is UTF-8
   [smoker] 
   [smoker] Load release URL "file:/home/jenkins/jenkins-slave/workspace/Lucene-Solr-SmokeRelease-master/lucene/build/smokeTestRelease/dist/"...
   [smoker] 
   [smoker] Test Lucene...
   [smoker]   test basics...
   [smoker]   get KEYS
   [smoker]     0.2 MB in 0.01 sec (35.2 MB/sec)
   [smoker]   check changes HTML...
   [smoker]   download lucene-8.0.0-src.tgz...
   [smoker]     30.2 MB in 0.03 sec (1152.4 MB/sec)
   [smoker]     verify md5/sha1 digests
   [smoker]   download lucene-8.0.0.tgz...
   [smoker]     73.9 MB in 0.06 sec (1137.2 MB/sec)
   [smoker]     verify md5/sha1 digests
   [smoker]   download lucene-8.0.0.zip...
   [smoker]     84.4 MB in 0.07 sec (1143.3 MB/sec)
   [smoker]     verify md5/sha1 digests
   [smoker]   unpack lucene-8.0.0.tgz...
   [smoker]     verify JAR metadata/identity/no javax.* or java.* classes...
   [smoker]     test demo with 1.8...
   [smoker]       got 6247 hits for query "lucene"
   [smoker]     checkindex with 1.8...
   [smoker]     test demo with 9...
   [smoker]       got 6247 hits for query "lucene"
   [smoker]     checkindex with 9...
   [smoker]     check Lucene's javadoc JAR
   [smoker]   unpack lucene-8.0.0.zip...
   [smoker]     verify JAR metadata/identity/no javax.* or java.* classes...
   [smoker]     test demo with 1.8...
   [smoker]       got 6247 hits for query "lucene"
   [smoker]     checkindex with 1.8...
   [smoker]     test demo with 9...
   [smoker]       got 6247 hits for query "lucene"
   [smoker]     checkindex with 9...
   [smoker]     check Lucene's javadoc JAR
   [smoker]   unpack lucene-8.0.0-src.tgz...
   [smoker]     make sure no JARs/WARs in src dist...
   [smoker]     run "ant validate"
   [smoker]     run tests w/ Java 8 and testArgs='-Dtests.slow=false'...
   [smoker]     test demo with 1.8...
   [smoker]       got 214 hits for query "lucene"
   [smoker]     checkindex with 1.8...
   [smoker]     generate javadocs w/ Java 8...
   [smoker] 
   [smoker] Crawl/parse...
   [smoker] 
   [smoker] Verify...
   [smoker]     run tests w/ Java 9 and testArgs='-Dtests.slow=false'...
   [smoker] 
   [smoker] command "export JAVA_HOME="/home/jenkins/tools/java/latest1.9" PATH="/home/jenkins/tools/java/latest1.9/bin:$PATH" JAVACMD="/home/jenkins/tools/java/latest1.9/bin/java"; ant clean test -Dtests.slow=false" failed:
   [smoker] Buildfile: /home/jenkins/jenkins-slave/workspace/Lucene-Solr-SmokeRelease-master/lucene/build/smokeTestRelease/tmp/unpack/lucene-8.0.0/build.xml
   [smoker] 
   [smoker] clean:
   [smoker]    [delete] Deleting directory /home/jenkins/jenkins-slave/workspace/Lucene-Solr-SmokeRelease-master/lucene/build/smokeTestRelease/tmp/unpack/lucene-8.0.0/build
   [smoker] 
   [smoker] ivy-availability-check:
   [smoker] [loadresource] Do not set property disallowed.ivy.jars.list as its length is 0.
   [smoker] 
   [smoker] -ivy-fail-disallowed-ivy-version:
   [smoker] 
   [smoker] ivy-fail:
   [smoker] 
   [smoker] ivy-configure:
   [smoker] [ivy:configure] :: Apache Ivy 2.4.0 - 20141213170938 :: http://ant.apache.org/ivy/ ::
   [smoker] [ivy:configure] :: loading settings :: file = /home/jenkins/jenkins-slave/workspace/Lucene-Solr-SmokeRelease-master/lucene/build/smokeTestRelease/tmp/unpack/lucene-8.0.0/top-level-ivy-settings.xml
   [smoker] 
   [smoker] -clover.load:
   [smoker] 
   [smoker] resolve-groovy:
   [smoker] [ivy:cachepath] :: resolving dependencies :: org.codehaus.groovy#groovy-all-caller;working
   [smoker] [ivy:cachepath] 	confs: [default]
   [smoker] [ivy:cachepath] 	found org.codehaus.groovy#groovy-all;2.4.13 in public
   [smoker] [ivy:cachepath] :: resolution report :: resolve 700ms :: artifacts dl 2ms
   [smoker] 	---------------------------------------------------------------------
   [smoker] 	|                  |            modules            ||   artifacts   |
   [smoker] 	|       conf       | number| search|dwnlded|evicted|| number|dwnlded|
   [smoker] 	---------------------------------------------------------------------
   [smoker] 	|      default     |   1   |   0   |   0   |   0   ||   1   |   0   |
   [smoker] 	---------------------------------------------------------------------
   [smoker] 
   [smoker] -init-totals:
   [smoker] 
   [smoker] test-core:
   [smoker] 
   [smoker] -clover.disable:
   [smoker] 
   [smoker] ivy-availability-check:
   [smoker] [loadresource] Do not set property disallowed.ivy.jars.list as its length is 0.
   [smoker] 
   [smoker] -ivy-fail-disallowed-ivy-version:
   [smoker] 
   [smoker] ivy-fail:
   [smoker] 
   [smoker] ivy-configure:
   [smoker] [ivy:configure] :: loading settings :: file = /home/jenkins/jenkins-slave/workspace/Lucene-Solr-SmokeRelease-master/lucene/build/smokeTestRelease/tmp/unpack/lucene-8.0.0/top-level-ivy-settings.xml
   [smoker] 
   [smoker] -clover.load:
   [smoker] 
   [smoker] -clover.classpath:
   [smoker] 
   [smoker] -clover.setup:
   [smoker] 
   [smoker] clover:
   [smoker] 
   [smoker] -check-git-state:
   [smoker] 
   [smoker] -git-cleanroot:
   [smoker] 
   [smoker] -copy-git-state:
   [smoker] 
   [smoker] git-autoclean:
   [smoker] 
   [smoker] resolve:
   [smoker] 
   [smoker] init:
   [smoker] 
   [smoker] compile-core:
   [smoker]     [mkdir] Created dir: /home/jenkins/jenkins-slave/workspace/Lucene-Solr-SmokeRelease-master/lucene/build/smokeTestRelease/tmp/unpack/lucene-8.0.0/build/core/classes/java
   [smoker]     [javac] Compiling 831 source files to /home/jenkins/jenkins-slave/workspace/Lucene-Solr-SmokeRelease-master/lucene/build/smokeTestRelease/tmp/unpack/lucene-8.0.0/build/core/classes/java
   [smoker]     [javac] Note: Some input files use or override a deprecated API.
   [smoker]     [javac] Note: Recompile with -Xlint:deprecation for details.
   [smoker]     [javac] Creating empty /home/jenkins/jenkins-slave/workspace/Lucene-Solr-SmokeRelease-master/lucene/build/smokeTestRelease/tmp/unpack/lucene-8.0.0/build/core/classes/java/org/apache/lucene/util/graph/package-info.class
   [smoker]     [javac] Creating empty /home/jenkins/jenkins-slave/workspace/Lucene-Solr-SmokeRelease-master/lucene/build/smokeTestRelease/tmp/unpack/lucene-8.0.0/build/core/classes/java/org/apache/lucene/document/package-info.class
   [smoker]     [javac] Creating empty /home/jenkins/jenkins-slave/workspace/Lucene-Solr-SmokeRelease-master/lucene/build/smokeTestRelease/tmp/unpack/lucene-8.0.0/build/core/classes/java/org/apache/lucene/package-info.class
   [smoker]     [javac] Creating empty /home/jenkins/jenkins-slave/workspace/Lucene-Solr-SmokeRelease-master/lucene/build/smokeTestRelease/tmp/unpack/lucene-8.0.0/build/core/classes/java/org/apache/lucene/util/bkd/package-info.class
   [smoker]     [javac] Creating empty /home/jenkins/jenkins-slave/workspace/Lucene-Solr-SmokeRelease-master/lucene/build/smokeTestRelease/tmp/unpack/lucene-8.0.0/build/core/classes/java/org/apache/lucene/codecs/compressing/package-info.class
   [smoker]     [javac] Creating empty /home/jenkins/jenkins-slave/workspace/Lucene-Solr-SmokeRelease-master/lucene/build/smokeTestRelease/tmp/unpack/lucene-8.0.0/build/core/classes/java/org/apache/lucene/codecs/lucene60/package-info.class
   [smoker]     [javac] Creating empty /home/jenkins/jenkins-slave/workspace/Lucene-Solr-SmokeRelease-master/lucene/build/smokeTestRelease/tmp/unpack/lucene-8.0.0/build/core/classes/java/org/apache/lucene/codecs/package-info.class
   [smoker]     [javac] Creating empty /home/jenkins/jenkins-slave/workspace/Lucene-Solr-SmokeRelease-master/lucene/build/smokeTestRelease/tmp/unpack/lucene-8.0.0/build/core/classes/java/org/apache/lucene/util/package-info.class
   [smoker]     [javac] Creating empty /home/jenkins/jenkins-slave/workspace/Lucene-Solr-SmokeRelease-master/lucene/build/smokeTestRelease/tmp/unpack/lucene-8.0.0/build/core/classes/java/org/apache/lucene/index/package-info.class
   [smoker]     [javac] Creating empty /home/jenkins/jenkins-slave/workspace/Lucene-Solr-SmokeRelease-master/lucene/build/smokeTestRelease/tmp/unpack/lucene-8.0.0/build/core/classes/java/org/apache/lucene/util/fst/package-info.class
   [smoker]     [javac] Creating empty /home/jenkins/jenkins-slave/workspace/Lucene-Solr-SmokeRelease-master/lucene/build/smokeTestRelease/tmp/unpack/lucene-8.0.0/build/core/classes/java/org/apache/lucene/analysis/tokenattributes/package-info.class
   [smoker]     [javac] Creating empty /home/jenkins/jenkins-slave/workspace/Lucene-Solr-SmokeRelease-master/lucene/build/smokeTestRelease/tmp/unpack/lucene-8.0.0/build/core/classes/java/org/apache/lucene/search/package-info.class
   [smoker]     [javac] Creating empty /home/jenkins/jenkins-slave/workspace/Lucene-Solr-SmokeRelease-master/lucene/build/smokeTestRelease/tmp/unpack/lucene-8.0.0/build/core/classes/java/org/apache/lucene/codecs/lucene62/package-info.class
   [smoker]     [javac] Creating empty /home/jenkins/jenkins-slave/workspace/Lucene-Solr-SmokeRelease-master/lucene/build/smokeTestRelease/tmp/unpack/lucene-8.0.0/build/core/classes/java/org/apache/lucene/util/packed/package-info.class
   [smoker]     [javac] Creating empty /home/jenkins/jenkins-slave/workspace/Lucene-Solr-SmokeRelease-master/lucene/build/smokeTestRelease/tmp/unpack/lucene-8.0.0/build/core/classes/java/org/apache/lucene/util/mutable/package-info.class
   [smoker]     [javac] Creating empty /home/jenkins/jenkins-slave/workspace/Lucene-Solr-SmokeRelease-master/lucene/build/smokeTestRelease/tmp/unpack/lucene-8.0.0/build/core/classes/java/org/apache/lucene/codecs/lucene70/package-info.class
   [smoker]     [javac] Creating empty /home/jenkins/jenkins-slave/workspace/Lucene-Solr-SmokeRelease-master/lucene/build/smokeTestRelease/tmp/unpack/lucene-8.0.0/build/core/classes/java/org/apache/lucene/codecs/perfield/package-info.class
   [smoker]     [javac] Creating empty /home/jenkins/jenkins-slave/workspace/Lucene-Solr-SmokeRelease-master/lucene/build/smokeTestRelease/tmp/unpack/lucene-8.0.0/build/core/classes/java/org/apache/lucene/analysis/package-info.class
   [smoker]     [javac] Creating empty /home/jenkins/jenkins-slave/workspace/Lucene-Solr-SmokeRelease-master/lucene/build/smokeTestRelease/tmp/unpack/lucene-8.0.0/build/core/classes/java/org/apache/lucene/analysis/standard/package-info.class
   [smoker]     [javac] Creating empty /home/jenkins/jenkins-slave/workspace/Lucene-Solr-SmokeRelease-master/lucene/build/smokeTestRelease/tmp/unpack/lucene-8.0.0/build/core/classes/java/org/apache/lucene/store/package-info.class
   [smoker]     [javac] Creating empty /home/jenkins/jenkins-slave/workspace/Lucene-Solr-SmokeRelease-master/lucene/build/smokeTestRelease/tmp/unpack/lucene-8.0.0/build/core/classes/java/org/apache/lucene/codecs/blocktree/package-info.class
   [smoker]     [javac] Creating empty /home/jenkins/jenkins-slave/workspace/Lucene-Solr-SmokeRelease-master/lucene/build/smokeTestRelease/tmp/unpack/lucene-8.0.0/build/core/classes/java/org/apache/lucene/search/spans/package-info.class
   [smoker]     [javac] Creating empty /home/jenkins/jenkins-slave/workspace/Lucene-Solr-SmokeRelease-master/lucene/build/smokeTestRelease/tmp/unpack/lucene-8.0.0/build/core/classes/java/org/apache/lucene/search/similarities/package-info.class
   [smoker]     [javac] Creating empty /home/jenkins/jenkins-slave/workspace/Lucene-Solr-SmokeRelease-master/lucene/build/smokeTestRelease/tmp/unpack/lucene-8.0.0/build/core/classes/java/org/apache/lucene/util/automaton/package-info.class
   [smoker]     [javac] Creating empty /home/jenkins/jenkins-slave/workspace/Lucene-Solr-SmokeRelease-master/lucene/build/smokeTestRelease/tmp/unpack/lucene-8.0.0/build/core/classes/java/org/apache/lucene/codecs/lucene50/package-info.class
   [smoker]     [javac] Creating empty /home/jenkins/jenkins-slave/workspace/Lucene-Solr-SmokeRelease-master/lucene/build/smokeTestRelease/tmp/unpack/lucene-8.0.0/build/core/classes/java/org/apache/lucene/geo/package-info.class
   [smoker]      [copy] Copying 3 files to /home/jenkins/jenkins-slave/workspace/Lucene-Solr-SmokeRelease-master/lucene/build/smokeTestRelease/tmp/unpack/lucene-8.0.0/build/core/classes/java
   [smoker] 
   [smoker] compile-test-framework:
   [smoker] 
   [smoker] -check-git-state:
   [smoker] 
   [smoker] -git-cleanroot:
   [smoker] 
   [smoker] -copy-git-state:
   [smoker] 
   [smoker] git-autoclean:
   [smoker] 
   [smoker] ivy-availability-check:
   [smoker] [loadresource] Do not set property disallowed.ivy.jars.list as its length is 0.
   [smoker] 
   [smoker] -ivy-fail-disallowed-ivy-version:
   [smoker] 
   [smoker] ivy-fail:
   [smoker] 
   [smoker] ivy-configure:
   [smoker] [ivy:configure] :: loading settings :: file = /home/jenkins/jenkins-slave/workspace/Lucene-Solr-SmokeRelease-master/lucene/build/smokeTestRelease/tmp/unpack/lucene-8.0.0/top-level-ivy-settings.xml
   [smoker] 
   [smoker] resolve:
   [smoker] 
   [smoker] init:
   [smoker] 
   [smoker] compile-lucene-core:
   [smoker] 
   [smoker] -check-git-state:
   [smoker] 
   [smoker] -git-cleanroot:
   [smoker] 
   [smoker] -copy-git-state:
   [smoker] 
   [smoker] git-autoclean:
   [smoker] 
   [smoker] ivy-availability-check:
   [smoker] [loadresource] Do not set property disallowed.ivy.jars.list as its length is 0.
   [smoker] 
   [smoker] -ivy-fail-disallowed-ivy-version:
   [smoker] 
   [smoker] ivy-fail:
   [smoker] 
   [smoker] ivy-configure:
   [smoker] [ivy:configure] :: loading settings :: file = /home/jenkins/jenkins-slave/workspace/Lucene-Solr-SmokeRelease-master/lucene/build/smokeTestRelease/tmp/unpack/lucene-8.0.0/top-level-ivy-settings.xml
   [smoker] 
   [smoker] resolve:
   [smoker] 
   [smoker] init:
   [smoker] 
   [smoker] -clover.disable:
   [smoker] 
   [smoker] -clover.load:
   [smoker] 
   [smoker] -clover.classpath:
   [smoker] 
   [smoker] -clover.setup:
   [smoker] 
   [smoker] clover:
   [smoker] 
   [smoker] compile-core:
   [smoker] 
   [smoker] compile-codecs:
   [smoker] 
   [smoker] -check-git-state:
   [smoker] 
   [smoker] -git-cleanroot:
   [smoker] 
   [smoker] -copy-git-state:
   [smoker] 
   [smoker] git-autoclean:
   [smoker] 
   [smoker] ivy-availability-check:
   [smoker] [loadresource] Do not set property disallowed.ivy.jars.list as its length is 0.
   [smoker] 
   [smoker] -ivy-fail-disallowed-ivy-version:
   [smoker] 
   [smoker] ivy-fail:
   [smoker] 
   [smoker] ivy-configure:
   [smoker] [ivy:configure] :: loading settings :: file = /home/jenkins/jenkins-slave/workspace/Lucene-Solr-SmokeRelease-master/lucene/build/smokeTestRelease/tmp/unpack/lucene-8.0.0/top-level-ivy-settings.xml
   [smoker] 
   [smoker] resolve:
   [smoker] 
   [smoker] common.init:
   [smoker] 
   [smoker] compile-lucene-core:
   [smoker] 
   [smoker] init:
   [smoker] 
   [smoker] -clover.disable:
   [smoker] 
   [smoker] -clover.load:
   [smoker] 
   [smoker] -clover.classpath:
   [smoker] 
   [smoker] -clover.setup:
   [smoker] 
   [smoker] clover:
   [smoker] 
   [smoker] compile-core:
   [smoker]     [mkdir] Created dir: /home/jenkins/jenkins-slave/workspace/Lucene-Solr-SmokeRelease-master/lucene/build/smokeTestRelease/tmp/unpack/lucene-8.0.0/build/codecs/classes/java
   [smoker]     [javac] Compiling 67 source files to /home/jenkins/jenkins-slave/workspace/Lucene-Solr-SmokeRelease-master/lucene/build/smokeTestRelease/tmp/unpack/lucene-8.0.0/build/codecs/classes/java
   [smoker]     [javac] Note: Some input files use or override a deprecated API.
   [smoker]     [javac] Note: Recompile with -Xlint:deprecation for details.
   [smoker]     [javac] Creating empty /home/jenkins/jenkins-slave/workspace/Lucene-Solr-SmokeRelease-master/lucene/build/smokeTestRelease/tmp/unpack/lucene-8.0.0/build/codecs/classes/java/org/apache/lucene/codecs/bloom/package-info.class
   [smoker]     [javac] Creating empty /home/jenkins/jenkins-slave/workspace/Lucene-Solr-SmokeRelease-master/lucene/build/smokeTestRelease/tmp/unpack/lucene-8.0.0/build/codecs/classes/java/org/apache/lucene/codecs/memory/package-info.class
   [smoker]     [javac] Creating empty /home/jenkins/jenkins-slave/workspace/Lucene-Solr-SmokeRelease-master/lucene/build/smokeTestRelease/tmp/unpack/lucene-8.0.0/build/codecs/classes/java/org/apache/lucene/codecs/simpletext/package-info.class
   [smoker]     [javac] Creating empty /home/jenkins/jenkins-slave/workspace/Lucene-Solr-SmokeRelease-master/lucene/build/smokeTestRelease/tmp/unpack/lucene-8.0.0/build/codecs/classes/java/org/apache/lucene/codecs/blockterms/package-info.class
   [smoker]     [javac] Creating empty /home/jenkins/jenkins-slave/workspace/Lucene-Solr-SmokeRelease-master/lucene/build/smokeTestRelease/tmp/unpack/lucene-8.0.0/build/codecs/classes/java/org/apache/lucene/codecs/blocktreeords/package-info.class
   [smoker]      [copy] Copying 3 files to /home/jenkins/jenkins-slave/workspace/Lucene-Solr-SmokeRelease-master/lucene/build/smokeTestRelease/tmp/unpack/lucene-8.0.0/build/codecs/classes/java
   [smoker] 
   [smoker] -clover.disable:
   [smoker] 
   [smoker] -clover.load:
   [smoker] 
   [smoker] -clover.classpath:
   [smoker] 
   [smoker] -clover.setup:
   [smoker] 
   [smoker] clover:
   [smoker] 
   [smoker] common.compile-core:
   [smoker]     [mkdir] Created dir: /home/jenkins/jenkins-slave/workspace/Lucene-Solr-SmokeRelease-master/lucene/build/smokeTestRelease/tmp/unpack/lucene-8.0.0/build/test-framework/classes/java
   [smoker]     [javac] Compiling 190 source files to /home/jenkins/jenkins-slave/workspace/Lucene-Solr-SmokeRelease-master/lucene/build/smokeTestRelease/tmp/unpack/lucene-8.0.0/build/test-framework/classes/java
   [smoker]     [javac] Note: Some input files use or override a deprecated API.
   [smoker]     [javac] Note: Recompile with -Xlint:deprecation for details.
   [smoker]     [javac] Creating empty /home/jenkins/jenkins-slave/workspace/Lucene-Solr-SmokeRelease-master/lucene/build/smokeTestRelease/tmp/unpack/lucene-8.0.0/build/test-framework/classes/java/org/apache/lucene/codecs/asserting/package-info.class
   [smoker]     [javac] Creating empty /home/jenkins/jenkins-slave/workspace/Lucene-Solr-SmokeRelease-master/lucene/build/smokeTestRelease/tmp/unpack/lucene-8.0.0/build/test-framework/classes/java/org/apache/lucene/codecs/ramonly/package-info.class
   [smoker]     [javac] Creating empty /home/jenkins/jenkins-slave/workspace/Lucene-Solr-SmokeRelease-master/lucene/build/smokeTestRelease/tmp/unpack/lucene-8.0.0/build/test-framework/classes/java/org/apache/lucene/mockfile/package-info.class
   [smoker]     [javac] Creating empty /home/jenkins/jenkins-slave/workspace/Lucene-Solr-SmokeRelease-master/lucene/build/smokeTestRelease/tmp/unpack/lucene-8.0.0/build/test-framework/classes/java/org/apache/lucene/codecs/cheapbastard/package-info.class
   [smoker]     [javac] Creating empty /home/jenkins/jenkins-slave/workspace/Lucene-Solr-SmokeRelease-master/lucene/build/smokeTestRelease/tmp/unpack/lucene-8.0.0/build/test-framework/classes/java/org/apache/lucene/codecs/mockrandom/package-info.class
   [smoker]     [javac] Creating empty /home/jenkins/jenkins-slave/workspace/Lucene-Solr-SmokeRelease-master/lucene/build/smokeTestRelease/tmp/unpack/lucene-8.0.0/build/test-framework/classes/java/org/apache/lucene/codecs/cranky/package-info.class
   [smoker]     [javac] Creating empty /home/jenkins/jenkins-slave/workspace/Lucene-Solr-SmokeRelease-master/lucene/build/smokeTestRelease/tmp/unpack/lucene-8.0.0/build/test-framework/classes/java/org/apache/lucene/codecs/compressing/dummy/package-info.class
   [smoker]      [copy] Copying 4 files to /home/jenkins/jenkins-slave/workspace/Lucene-Solr-SmokeRelease-master/lucene/build/smokeTestRelease/tmp/unpack/lucene-8.0.0/build/test-framework/classes/java
   [smoker] 
   [smoker] compile-core:
   [smoker] 
   [smoker] compile-test:
   [smoker]     [mkdir] Created dir: /home/jenkins/jenkins-slave/workspace/Lucene-Solr-SmokeRelease-master/lucene/build/smokeTestRelease/tmp/unpack/lucene-8.0.0/build/core/classes/test
   [smoker]     [javac] Compiling 491 source files to /home/jenkins/jenkins-slave/workspace/Lucene-Solr-SmokeRelease-master/lucene/build/smokeTestRelease/tmp/unpack/lucene-8.0.0/build/core/classes/test
   [smoker]     [javac] Note: Some input files use or override a deprecated API.
   [smoker]     [javac] Note: Recompile with -Xlint:deprecation for details.
   [smoker]      [copy] Copying 3 files to /home/jenkins/jenkins-slave/workspace/Lucene-Solr-SmokeRelease-master/lucene/build/smokeTestRelease/tmp/unpack/lucene-8.0.0/build/core/classes/test
   [smoker] 
   [smoker] -mrjar-classes-uptodate:
   [smoker] 
   [smoker] resolve-groovy:
   [smoker] 
   [smoker] patch-mrjar-classes:
   [smoker] WARNING: An illegal reflective access operation has occurred
   [smoker] WARNING: Illegal reflective access by org.codehaus.groovy.reflection.CachedClass (file:/home/jenkins/.ivy2/cache/org.codehaus.groovy/groovy-all/jars/groovy-all-2.4.13.jar) to method java.lang.Object.finalize()
   [smoker] WARNING: Please consider reporting this to the maintainers of org.codehaus.groovy.reflection.CachedClass
   [smoker] WARNING: Use --illegal-access=warn to enable warnings of further illegal reflective access operations
   [smoker] WARNING: All illegal access operations will be denied in a future release
   [smoker] [patch-cls] Remapped: org/apache/lucene/analysis/tokenattributes/CharTermAttributeImpl
   [smoker] [patch-cls] Remapped: org/apache/lucene/codecs/compressing/LZ4
   [smoker] [patch-cls] Remapped: org/apache/lucene/document/BinaryPoint$2
   [smoker] [patch-cls] Remapped: org/apache/lucene/document/DoubleRange
   [smoker] [patch-cls] Remapped: org/apache/lucene/document/FloatRange
   [smoker] [patch-cls] Remapped: org/apache/lucene/document/IntRange
   [smoker] [patch-cls] Remapped: org/apache/lucene/document/LongRange
   [smoker] [patch-cls] Remapped: org/apache/lucene/index/BitsSlice
   [smoker] [patch-cls] Remapped: org/apache/lucene/index/CodecReader
   [smoker] [patch-cls] Remapped: org/apache/lucene/index/MergeReaderWrapper
   [smoker] [patch-cls] Remapped: org/apache/lucene/search/BooleanScorer$TailPriorityQueue
   [smoker] [patch-cls] Remapped: org/apache/lucene/util/BytesRef
   [smoker] [patch-cls] Remapped: org/apache/lucene/util/BytesRefArray
   [smoker] [patch-cls] Remapped: org/apache/lucene/util/CharsRef$UTF16SortedAsUTF8Comparator
   [smoker] [patch-cls] Remapped: org/apache/lucene/util/CharsRef
   [smoker] [patch-cls] Remapped: org/apache/lucene/util/IntsRef
   [smoker] [patch-cls] Remapped: org/apache/lucene/util/LongsRef
   [smoker] [patch-cls] Remapped: org/apache/lucene/util/StringHelper
   [smoker] [patch-cls] Remapped: org/apache/lucene/util/automaton/Automaton$Builder
   [smoker] [patch-cls] Remapped: org/apache/lucene/util/automaton/Automaton
   [smoker] [patch-cls] Remapped 20 class files for Java 9 to: /home/jenkins/jenkins-slave/workspace/Lucene-Solr-SmokeRelease-master/lucene/build/smokeTestRelease/tmp/unpack/lucene-8.0.0/build/core/classes/java9
   [smoker]     [touch] Creating /home/jenkins/jenkins-slave/workspace/Lucene-Solr-SmokeRelease-master/lucene/build/smokeTestRelease/tmp/unpack/lucene-8.0.0/build/core/patch-mrjar.stamp
   [smoker] 
   [smoker] install-junit4-taskdef:
   [smoker] 
   [smoker] validate:
   [smoker] 
   [smoker] -init-totals:
   [smoker] 
   [smoker] -test:
   [smoker]     [mkdir] Created dir: /home/jenkins/jenkins-slave/workspace/Lucene-Solr-SmokeRelease-master/lucene/build/smokeTestRelease/tmp/unpack/lucene-8.0.0/build/core/test
   [smoker]     [mkdir] Created dir: /home/jenkins/jenkins-slave/workspace/Lucene-Solr-SmokeRelease-master/lucene/build/smokeTestRelease/tmp/unpack/lucene-8.0.0/build/core/test/temp
   [smoker]    [junit4] <JUnit4> says olá! Master seed: DB5206DD3DC1384E
   [smoker]    [junit4] Executing 481 suites with 3 JVMs.
   [smoker]    [junit4] 
   [smoker]    [junit4] Started J2 PID(3485@lucene2-us-west.apache.org).
   [smoker]    [junit4] Started J1 PID(3486@lucene2-us-west.apache.org).
   [smoker]    [junit4] Started J0 PID(3484@lucene2-us-west.apache.org).
   [smoker]    [junit4] Suite: org.apache.lucene.index.TestIndexWriterLockRelease
   [smoker]    [junit4] Completed [1/481] on J2 in 4.61s, 1 test
   [smoker]    [junit4] 
   [smoker]    [junit4] Suite: org.apache.lucene.search.TestWildcard
   [smoker]    [junit4] Completed [2/481] on J2 in 5.36s, 8 tests
   [smoker]    [junit4] 
   [smoker]    [junit4] Suite: org.apache.lucene.util.TestCharsRef
   [smoker]    [junit4] Completed [3/481] on J2 in 0.77s, 5 tests
   [smoker]    [junit4] 
   [smoker]    [junit4] Suite: org.apache.lucene.index.TestDocIDMerger
   [smoker]    [junit4] Completed [4/481] on J2 in 0.42s, 2 tests
   [smoker]    [junit4] 
   [smoker]    [junit4] Suite: org.apache.lucene.search.TestMultiset
   [smoker]    [junit4] Completed [5/481] on J2 in 0.18s, 2 tests
   [smoker]    [junit4] 
   [smoker]    [junit4] Suite: org.apache.lucene.store.TestMmapDirectory
   [smoker]    [junit4] Completed [6/481] on J1 in 15.72s, 43 tests, 1 skipped
   [smoker]    [junit4] 
   [smoker]    [junit4] Suite: org.apache.lucene.index.TestForTooMuchCloning
   [smoker]    [junit4] Completed [7/481] on J2 in 5.32s, 1 test
   [smoker]    [junit4] 
   [smoker]    [junit4] Suite: org.apache.lucene.codecs.lucene50.TestForUtil
   [smoker]    [junit4] Completed [8/481] on J1 in 1.48s, 1 test
   [smoker]    [junit4] 
   [smoker]    [junit4] Suite: org.apache.lucene.search.spans.TestSpanBoostQuery
   [smoker]    [junit4] Completed [9/481] on J1 in 0.37s, 2 tests
   [smoker]    [junit4] 
   [smoker]    [junit4] Suite: org.apache.lucene.index.TestTerm
   [smoker]    [junit4] Completed [10/481] on J1 in 0.20s, 1 test
   [smoker]    [junit4] 
   [smoker]    [junit4] Suite: org.apache.lucene.index.TestPostingsOffsets
   [smoker]    [junit4] Completed [11/481] on J0 in 19.43s, 13 tests
   [smoker]    [junit4] 
   [smoker]    [junit4] Suite: org.apache.lucene.index.TestIndexWriterOnVMError
   [smoker]    [junit4] IGNOR/A 0.04s J2 | TestIndexWriterOnVMError.testCheckpoint
   [smoker]    [junit4]    > Assumption #1: 'nightly' test group is disabled (@Nightly())
   [smoker]    [junit4] Completed [12/481] on J2 in 7.88s, 3 tests, 1 skipped
   [smoker]    [junit4] 
   [smoker]    [junit4] Suite: org.apache.lucene.index.TestIndexTooManyDocs
   [smoker]    [junit4] Completed [13/481] on J1 in 8.87s, 1 test
   [smoker]    [junit4] 
   [smoker]    [junit4] Suite: org.apache.lucene.index.TestNeverDelete
   [smoker]    [junit4] Completed [14/481] on J2 in 3.86s, 1 test
   [smoker]    [junit4] 
   [smoker]    [junit4] Suite: org.apache.lucene.search.TestPositiveScoresOnlyCollector
   [smoker]    [junit4] Completed [15/481] on J2 in 0.55s, 1 test
   [smoker]    [junit4] 
   [smoker]    [junit4] Suite: org.apache.lucene.search.similarities.TestAxiomaticSimilarity
   [smoker]    [junit4] Completed [16/481] on J2 in 0.45s, 3 tests
   [smoker]    [junit4] 
   [smoker]    [junit4] Suite: org.apache.lucene.index.TestIndexWriterConfig
   [smoker]    [junit4] Completed [17/481] on J2 in 1.49s, 8 tests
   [smoker]    [junit4] 
   [smoker]    [junit4] Suite: org.apache.lucene.codecs.compressing.TestFastCompressionMode
   [smoker]    [junit4] Completed [18/481] on J1 in 5.90s, 11 tests
   [smoker]    [junit4] 
   [smoker]    [junit4] Suite: org.apache.lucene.index.TestDocValues
   [smoker]    [junit4] Completed [19/481] on J1 in 1.33s, 7 tests
   [smoker]    [junit4] 
   [smoker]    [junit4] Suite: org.apache.lucene.util.Test2BPagedBytes
   [smoker]    [junit4] IGNOR/A 0.04s J1 | Test2BPagedBytes.test
   [smoker]    [junit4]    > Assumption #1: 'monster' test group is disabled (@Monster(value="You must increase heap to > 2 G to run this"))
   [smoker]    [junit4] Completed [20/481] on J1 in 0.28s, 1 test, 1 skipped
   [smoker]    [junit4] 
   [smoker]    [junit4] Suite: org.apache.lucene.search.TestTimeLimitingCollector
   [smoker]    [junit4] Completed [21/481] on J2 in 25.14s, 7 tests
   [smoker]    [junit4] 
   [smoker]    [junit4] Suite: org.apache.lucene.search.TestSearchWithThreads
   [smoker]    [junit4] Completed [22/481] on J1 in 22.22s, 1 test
   [smoker]    [junit4] 
   [smoker]    [junit4] Suite: org.apache.lucene.index.TestTermsEnum2
   [smoker]    [junit4] Completed [23/481] on J1 in 7.95s, 4 tests
   [smoker]    [junit4] 
   [smoker]    [junit4] Suite: org.apache.lucene.search.TestMultiTermConstantScore
   [smoker]    [junit4] Completed [24/481] on J1 in 8.24s, 7 tests
   [smoker]    [junit4] 
   [smoker]    [junit4] Suite: org.apache.lucene.index.TestStressAdvance
   [smoker]    [junit4] Completed [25/481] on J1 in 9.19s, 1 test
   [smoker]    [junit4] 
   [smoker]    [junit4] Suite: org.apache.lucene.index.TestIndexWriterExceptions2
   [smoker]    [junit4] Completed [26/481] on J0 in 66.28s, 1 test
   [smoker]    [junit4] 
   [smoker]    [junit4] Suite: org.apache.lucene.search.spans.TestNearSpansOrdered
   [smoker]    [junit4] Completed [27/481] on J0 in 1.35s, 19 tests
   [smoker]    [junit4] 
   [smoker]    [junit4] Suite: org.apache.lucene.util.TestOfflineSorter
   [smoker]    [junit4] IGNOR/A 0.00s J2 | TestOfflineSorter.testLargerRandom
   [smoker]    [junit4]    > Assumption #1: 'nightly' test group is disabled (@Nightly())
   [smoker]    [junit4] Completed [28/481] on J2 in 31.85s, 15 tests, 1 skipped
   [smoker]    [junit4] 
   [smoker]    [junit4] Suite: org.apache.lucene.index.TestCheckIndex
   [smoker]    [junit4] Completed [29/481] on J2 in 5.46s, 4 tests
   [smoker]    [junit4] 
   [smoker]    [junit4] Suite: org.apache.lucene.codecs.TestCompetitiveFreqNormAccumulator
   [smoker]    [junit4] Completed [30/481] on J2 in 0.22s, 4 tests
   [smoker]    [junit4] 
   [smoker]    [junit4] Suite: org.apache.lucene.util.TestInPlaceMergeSorter
   [smoker]    [junit4] Completed [31/481] on J2 in 0.80s, 9 tests
   [smoker]    [junit4] 
   [smoker]    [junit4] Suite: org.apache.lucene.index.TestTerms
   [smoker]    [junit4] Completed [32/481] on J2 in 0.26s, 2 tests
   [smoker]    [junit4] 
   [smoker]    [junit4] Suite: org.apache.lucene.search.TestMinShouldMatch2
   [smoker]    [junit4] Completed [33/481] on J2 in 38.08s, 6 tests
   [smoker]    [junit4] 
   [smoker]    [junit4] Suite: org.apache.lucene.search.spans.TestFilterSpans
   [smoker]    [junit4] Completed [34/481] on J2 in 0.35s, 1 test
   [smoker]    [junit4] 
   [smoker]    [junit4] Suite: org.apache.lucene.index.TestTryDelete
   [smoker]    [junit4] Completed [35/481] on J2 in 0.58s, 3 tests
   [smoker]    [junit4] 
   [smoker]    [junit4] HEARTBEAT J0 PID(3484@lucene2-us-west.apache.org): 2018-02-13T18:21:19, stalled for 63.2s at: TestIndependenceStandardized.testRandomScoring
   [smoker]    [junit4] Suite: org.apache.lucene.index.TestAddIndexes
   [smoker]    [junit4] Completed [36/481] on J2 in 19.22s, 25 tests
   [smoker]    [junit4] 
   [smoker]    [junit4] Suite: org.apache.lucene.util.TestRamUsageEstimator
   [smoker]    [junit4] IGNOR/A 0.04s J2 | TestRamUsageEstimator.testPrintValues
   [smoker]    [junit4]    > Assumption #1: Specify -Dtests.verbose=true to print constants of RamUsageEstimator.
   [smoker]    [junit4] Completed [37/481] on J2 in 0.71s, 5 tests, 1 skipped
   [smoker]    [junit4] 
   [smoker]    [junit4] Suite: org.apache.lucene.document.TestField
   [smoker]    [junit4] Completed [38/481] on J2 in 0.77s, 23 tests
   [smoker]    [junit4] 
   [smoker]    [junit4] Suite: org.apache.lucene.codecs.lucene50.TestBlockPostingsFormat
   [smoker]    [junit4] IGNOR/A 0.00s J1 | TestBlockPostingsFormat.testRamBytesUsed
   [smoker]    [junit4]    > Assumption #1: 'slow' test group is disabled (@Slow())
   [smoker]    [junit4] Completed [39/481] on J1 in 73.80s, 28 tests, 1 skipped
   [smoker]    [junit4] 
   [smoker]    [junit4] Suite: org.apache.lucene.search.spans.TestSpanFirstQuery
   [smoker]    [junit4] Completed [40/481] on J1 in 0.24s, 1 test
   [smoker]    [junit4] 
   [smoker]    [junit4] Suite: org.apache.lucene.search.TestSortedSetSelector
   [smoker]    [junit4] Completed [41/481] on J1 in 1.10s, 15 tests
   [smoker]    [junit4] 
   [smoker]    [junit4] Suite: org.apache.lucene.index.TestIndexReaderClose
   [smoker]    [junit4] Completed [42/481] on J2 in 2.78s, 3 tests
   [smoker]    [junit4] 
   [smoker]    [junit4] Suite: org.apache.lucene.util.TestStringHelper
   [smoker]    [junit4] Completed [43/481] on J2 in 0.30s, 7 tests
   [smoker]    [junit4] 
   [smoker]    [junit4] Suite: org.apache.lucene.index.TestIndexWriterCommit
   [smoker]    [junit4] Completed [44/481] on J2 in 10.65s, 14 tests
   [smoker]    [junit4] 
   [smoker]    [junit4] Suite: org.apache.lucene.util.TestSentinelIntSet
   [smoker]    [junit4] Completed [45/481] on J2 in 1.60s, 2 tests
   [smoker]    [junit4] 
   [smoker]    [junit4] Suite: org.apache.lucene.search.similarities.TestIndependenceStandardized
   [smoker]    [junit4] Completed [46/481] on J0 in 84.78s, 1 test
   [smoker]    [junit4] 
   [smoker]    [junit4] Suite: org.apache.lucene.search.TestNormsFieldExistsQuery
   [smoker]    [junit4] Completed [47/481] on J0 in 13.28s, 6 tests
   [smoker]    [junit4] 
   [smoker]    [junit4] Suite: org.apache.lucene.codecs.compressing.TestHighCompressionMode
   [smoker]    [junit4] Completed [48/481] on J0 in 5.91s, 7 tests
   [smoker]    [junit4] 
   [smoker]    [junit4] Suite: org.apache.lucene.search.spans.TestSpanContainQuery
   [smoker]    [junit4] Completed [49/481] on J0 in 1.24s, 4 tests
   [smoker]    [junit4] 
   [smoker]    [junit4] Suite: org.apache.lucene.search.TestEarlyTermination
   [smoker]    [junit4] Completed [50/481] on J0 in 0.76s, 1 test
   [smoker]    [junit4] 
   [smoker]    [junit4] Suite: org.apache.lucene.analysis.TestToken
   [smoker]    [junit4] Completed [51/481] on J0 in 0.25s, 5 tests
   [smoker]    [junit4] 
   [smoker]    [junit4] Suite: org.apache.lucene.search.TestLongValuesSource
   [smoker]    [junit4] Completed [52/481] on J0 in 6.68s, 4 tests
   [smoker]    [junit4] 
   [smoker]    [junit4] Suite: org.apache.lucene.index.TestParallelReaderEmptyIndex
   [smoker]    [junit4] Completed [53/481] on J0 in 0.27s, 2 tests
   [smoker]    [junit4] 
   [smoker]    [junit4] Suite: org.apache.lucene.index.TestNorms
   [smoker]    [junit4] IGNOR/A 0.00s J0 | TestNorms.testMaxByteNorms
   [smoker]    [junit4]    > Assumption #1: 'slow' test group is disabled (@Slow())
   [smoker]    [junit4] IGNOR/A 0.02s J0 | TestNorms.testEmptyValueVsNoValue
   [smoker]    [junit4]    > Assumption #1: 'slow' test group is disabled (@Slow())
   [smoker]    [junit4] Completed [54/481] on J0 in 0.12s, 2 tests, 2 skipped
   [smoker]    [junit4] 
   [smoker]    [junit4] Suite: org.apache.lucene.util.fst.TestFSTs
   [smoker]    [junit4] IGNOR/A 0.00s J0 | TestFSTs.testShortestPaths
   [smoker]    [junit4]    > Assumption #1: 'slow' test group is disabled (@Slow())
   [smoker]    [junit4] IGNOR/A 0.00s J0 | TestFSTs.testNonFinalStopNode
   [smoker]    [junit4]    > Assumption #1: 'slow' test group is disabled (@Slow())
   [smoker]    [junit4] IGNOR/A 0.00s J0 | TestFSTs.testRandomWords
   [smoker]    [junit4]    > Assumption #1: 'slow' test group is disabled (@Slow())
   [smoker]    [junit4] IGNOR/A 0.00s J0 | TestFSTs.testBigSet
   [smoker]    [junit4]    > Assumption #1: 'nightly' test group is disabled (@Nightly())
   [smoker]    [junit4] IGNOR/A 0.00s J0 | TestFSTs.testFinalOutputOnEndState
   [smoker]    [junit4]    > Assumption #1: 'slow' test group is disabled (@Slow())
   [smoker]    [junit4] IGNOR/A 0.00s J0 | TestFSTs.testRandomTermLookup
   [smoker]    [junit4]    > Assumption #1: 'slow' test group is disabled (@Slow())
   [smoker]    [junit4] IGNOR/A 0.00s J0 | TestFSTs.testShortestPathsRandom
   [smoker]    [junit4]    > Assumption #1: 'slow' test group is disabled (@Slow())
   [smoker]    [junit4] IGNOR/A 0.00s J0 | TestFSTs.testIllegallyModifyRootArc
   [smoker]    [junit4]    > Assumption #1: 'slow' test group is disabled (@Slow())
   [smoker]    [junit4] IGNOR/A 0.00s J0 | TestFSTs.testSimple
   [smoker]    [junit4]    > Assumption #1: 'slow' test group is disabled (@Slow())
   [smoker]    [junit4] IGNOR/A 0.00s J0 | TestFSTs.testShortestPathsWFSTRandom
   [smoker]    [junit4]    > Assumption #1: 'slow' test group is disabled (@Slow())
   [smoker]    [junit4] IGNOR/A 0.00s J0 | TestFSTs.testRealTerms
   [smoker]    [junit4]    > Assumption #1: 'slow' test group is disabled (@Slow())
   [smoker]    [junit4] IGNOR/A 0.00s J0 | TestFSTs.testDuplicateFSAString
   [smoker]    [junit4]    > Assumption #1: 'slow' test group is disabled (@Slow())
   [smoker]    [junit4] IGNOR/A 0.00s J0 | TestFSTs.testPrimaryKeys
   [smoker]    [junit4]    > Assumption #1: 'slow' test group is disabled (@Slow())
   [smoker]    [junit4] IGNOR/A 0.00s J0 | TestFSTs.testLargeOutputsOnArrayArcs
   [smoker]    [junit4]    > Assumption #1: 'slow' test group is disabled (@Slow())
   [smoker]    [junit4] IGNOR/A 0.00s J0 | TestFSTs.testBasicFSA
   [smoker]    [junit4]    > Assumption #1: 'slow' test group is disabled (@Slow())
   [smoker]    [junit4] IGNOR/A 0.00s J0 | TestFSTs.testShortestPathsWFST
   [smoker]    [junit4]    > Assumption #1: 'slow' test group is disabled (@Slow())
   [smoker]    [junit4] IGNOR/A 0.00s J0 | TestFSTs.testRejectNoLimits
   [smoker]    [junit4]    > Assumption #1: 'slow' test group is disabled (@Slow())
   [smoker]    [junit4] IGNOR/A 0.02s J0 | TestFSTs.testInternalFinalState
   [smoker]    [junit4]    > Assumption #1: 'slow' test group is disabled (@Slow())
   [smoker]    [junit4] IGNOR/A 0.00s J0 | TestFSTs.testExpandedCloseToRoot
   [smoker]    [junit4]    > Assumption #1: 'slow' test group is disabled (@Slow())
   [smoker]    [junit4] IGNOR/A 0.00s J0 | TestFSTs.testSingleString
   [smoker]    [junit4]    > Assumption #1: 'slow' test group is disabled (@Slow())
   [smoker]    [junit4] Completed [55/481] on J0 in 0.13s, 20 tests, 20 skipped
   [smoker]    [junit4] 
   [smoker]    [junit4] Suite: org.apache.lucene.search.TestPointQueries
   [smoker]    [junit4] IGNOR/A 0.00s J1 | TestPointQueries.testRandomBinaryBig
   [smoker]    [junit4]    > Assumption #1: 'nightly' test group is disabled (@Nightly())
   [smoker]    [junit4] IGNOR/A 0.00s J1 | TestPointQueries.testRandomLongsBig
   [smoker]    [junit4]    > Assumption #1: 'nightly' test group is disabled (@Nightly())
   [smoker]    [junit4] Completed [56/481] on J1 in 57.18s, 49 tests, 2 skipped
   [smoker]    [junit4] 
   [smoker]    [junit4] Suite: org.apache.lucene.util.automaton.TestUTF32ToUTF8
   [smoker]    [junit4] Completed [57/481] on J0 in 15.99s, 6 tests
   [smoker]    [junit4] 
   [smoker]    [junit4] Suite: org.apache.lucene.search.similarities.TestBooleanSimilarity
   [smoker]    [junit4] Completed [58/481] on J2 in 47.33s, 4 tests
   [smoker]    [junit4] 
   [smoker]    [junit4] Suite: org.apache.lucene.index.Test2BPoints
   [smoker]    [junit4] IGNOR/A 0.00s J2 | Test2BPoints.test2D
   [smoker]    [junit4]    > Assumption #1: 'monster' test group is disabled (@Monster(value="takes at least 4 hours and consumes many GB of temp disk space"))
   [smoker]    [junit4] IGNOR/A 0.00s J2 | Test2BPoints.test1D
   [smoker]    [junit4]    > Assumption #1: 'monster' test group is disabled (@Monster(value="takes at least 4 hours and consumes many GB of temp disk space"))
   [smoker]    [junit4] Completed [59/481] on J2 in 0.16s, 2 tests, 2 skipped
   [smoker]    [junit4] 
   [smoker]    [junit4] Suite: org.apache.lucene.search.TestReqOptSumScorer
   [smoker]    [junit4] Completed [60/481] on J1 in 3.46s, 3 tests
   [smoker]    [junit4] 
   [smoker]    [junit4] Suite: org.apache.lucene.index.TestParallelLeafReader
   [smoker]    [junit4] Completed [61/481] on J1 in 2.94s, 10 tests
   [smoker]    [junit4] 
   [smoker]    [junit4] Suite: org.apache.lucene.search.MultiCollectorTest
   [smoker]    [junit4] Completed [62/481] on J1 in 0.49s, 4 tests
   [smoker]    [junit4] 
   [smoker]    [junit4] Suite: org.apache.lucene.store.TestNIOFSDirectory
   [smoker]    [junit4] Completed [63/481] on J2 in 8.79s, 42 tests
   [smoker]    [junit4] 
   [smoker]    [junit4] Suite: org.apache.lucene.search.TermInSetQueryTest
   [smoker]    [junit4] Completed [64/481] on J1 in 5.23s, 10 tests
   [smoker]    [junit4] 
   [smoker]    [junit4] Suite: org.apache.lucene.search.TestWANDScorer
   [smoker]    [junit4] Completed [65/481] on J0 in 11.99s, 4 tests
   [smoker]    [junit4] 
   [smoker]    [junit4] Suite: org.apache.lucene.util.packed.TestDirectPacked
   [smoker]    [junit4] Completed [66/481] on J2 in 6.58s, 4 tests
   [smoker]    [junit4] 
   [smoker]    [junit4] Suite: org.apache.lucene.store.TestFilterDirectory
   [smoker]    [junit4] IGNOR/A 0.05s J0 | TestFilterDirectory.testPendingDeletions
   [smoker]    [junit4]    > Assumption #1: we can only install VirusCheckingFS on an FSDirectory
   [smoker]    [junit4] IGNOR/A 0.00s J0 | TestFilterDirectory.testFsyncDoesntCreateNewFiles
   [smoker]    [junit4]    > Assumption #1: test only works for FSDirectory subclasses
   [smoker]    [junit4] Completed [67/481] on J0 in 7.55s, 44 tests, 2 skipped
   [smoker]    [junit4] 
   [smoker]    [junit4] Suite: org.apache.lucene.index.TestAllFilesCheckIndexHeader
   [smoker]    [junit4] Completed [68/481] on J0 in 4.05s, 1 test
   [smoker]    [junit4] 
   [smoker]    [junit4] Suite: org.apache.lucene.index.TestDocumentWriter
   [smoker]    [junit4] Completed [69/481] on J0 in 1.45s, 6 tests
   [smoker]    [junit4] 
   [smoker]    [junit4] Suite: org.apache.lucene.index.Test2BBinaryDocValues
   [smoker]    [junit4] IGNOR/A 0.00s J0 | Test2BBinaryDocValues.testVariableBinary
   [smoker]    [junit4]    > Assumption #1: 'monster' test group is disabled (@Monster(value="takes ~ 6 hours if the heap is 5gb"))
   [smoker]    [junit4] IGNOR/A 0.00s J0 | Test2BBinaryDocValues.testFixedBinary
   [smoker]    [junit4]    > Assumption #1: 'monster' test group is disabled (@Monster(value="takes ~ 6 hours if the heap is 5gb"))
   [smoker]    [junit4] Completed [70/481] on J0 in 0.04s, 2 tests, 2 skipped
   [smoker]    [junit4] 
   [smoker]    [junit4] Suite: org.apache.lucene.search.similarities.TestAxiomaticF1EXP
   [smoker]    [junit4] Completed [71/481] on J1 in 54.13s, 1 test
   [smoker]    [junit4] 
   [smoker]    [junit4] Suite: org.apache.lucene.search.similarities.TestAxiomaticF3LOG
   [smoker]    [junit4] Completed [72/481] on J2 in 51.72s, 1 test
   [smoker]    [junit4] 
   [smoker]    [junit4] HEARTBEAT J0 PID(3484@lucene2-us-west.apache.org): 2018-02-13T18:23:55, stalled for 63.8s at: TestLMDirichletSimilarity.testRandomScoring
   [smoker]    [junit4] Suite: org.apache.lucene.codecs.lucene50.TestLucene50StoredFieldsFormatHighCompression
   [smoker]    [junit4] IGNOR/A 0.00s J2 | TestLucene50StoredFieldsFormatHighCompression.testBigDocuments
   [smoker]    [junit4]    > Assumption #1: 'nightly' test group is disabled (@Nightly())
   [smoker]    [junit4] IGNOR/A 0.00s J2 | TestLucene50StoredFieldsFormatHighCompression.testRamBytesUsed
   [smoker]    [junit4]    > Assumption #1: 'slow' test group is disabled (@Slow())
   [smoker]    [junit4] Completed [73/481] on J2 in 27.55s, 19 tests, 2 skipped
   [smoker]    [junit4] 
   [smoker]    [junit4] Suite: org.apache.lucene.search.TestLRUQueryCache
   [smoker]    [junit4] IGNOR/A 0.11s J1 | TestLRUQueryCache.testRamBytesUsedAgreesWithRamUsageTester
   [smoker]    [junit4]    > Assumption #1: LUCENE-7595: RamUsageTester does not work exact in Java 9 (estimations for maps and lists)
   [smoker]    [junit4] IGNOR/A 0.02s J1 | TestLRUQueryCache.testDetectMutatedQueries
   [smoker]    [junit4]    > Assumption #1: LUCENE-7604: For some unknown reason the non-constant BadQuery#hashCode() does not trigger ConcurrentModificationException on Java 9 b150
   [smoker]    [junit4] IGNOR/A 0.00s J1 | TestLRUQueryCache.testRamBytesUsedConstantEntryOverhead
   [smoker]    [junit4]    > Assumption #1: LUCENE-7595: RamUsageTester does not work exact in Java 9 (estimations for maps and lists)
   [smoker]    [junit4] Completed [74/481] on J1 in 31.75s, 22 tests, 3 skipped
   [smoker]    [junit4] 
   [smoker]    [junit4] Suite: org.apache.lucene.search.similarities.TestLMDirichletSimilarity
   [smoker]    [junit4] Completed [75/481] on J0 in 71.41s, 1 test
   [smoker]    [junit4] 
   [smoker]    [junit4] Suite: org.apache.lucene.index.Test2BSortedDocValuesFixedSorted
   [smoker]    [junit4] IGNOR/A 0.00s J1 | Test2BSortedDocValuesFixedSorted.testFixedSorted
   [smoker]    [junit4]    > Assumption #1: 'monster' test group is disabled (@Monster(value="Takes ~ 6 hours if the heap is 5gb"))
   [smoker]    [junit4] Completed [76/481] on J1 in 0.13s, 1 test, 1 skipped
   [smoker]    [junit4] 
   [smoker]    [junit4] Suite: org.apache.lucene.search.spans.TestSpanCollection
   [smoker]    [junit4] Completed [77/481] on J0 in 0.60s, 3 tests
   [smoker]    [junit4] 
   [smoker]    [junit4] Suite: org.apache.lucene.search.TestIndexOrDocValuesQuery
   [smoker]    [junit4] Completed [78/481] on J1 in 0.51s, 1 test
   [smoker]    [junit4] 
   [smoker]    [junit4] Suite: org.apache.lucene.search.TestMatchAllDocsQuery
   [smoker]    [junit4] Completed [79/481] on J1 in 0.16s, 2 tests
   [smoker]    [junit4] 
   [smoker]    [junit4] Suite: org.apache.lucene.search.similarities.TestSimilarity2
   [smoker]    [junit4] Completed [80/481] on J2 in 1.31s, 8 tests
   [smoker]    [junit4] 
   [smoker]    [junit4] Suite: org.apache.lucene.search.TestPhrasePrefixQuery
   [smoker]    [junit4] Completed [81/481] on J2 in 0.20s, 1 test
   [smoker]    [junit4] 
   [smoker]    [junit4] Suite: org.apache.lucene.index.TestTermVectors
   [smoker]    [junit4] Completed [82/481] on J1 in 3.10s, 3 tests
   [smoker]    [junit4] 
   [smoker]    [junit4] Suite: org.apache.lucene.util.automaton.TestRegExp
   [smoker]    [junit4] Completed [83/481] on J1 in 0.86s, 6 tests
   [smoker]    [junit4] 
   [smoker]    [junit4] Suite: org.apache.lucene.search.spans.TestSpansEnum
   [smoker]    [junit4] Completed [84/481] on J1 in 1.18s, 7 tests
   [smoker]    [junit4] 
   [smoker]    [junit4] Suite: org.apache.lucene.index.TestIndexWriterWithThreads
   [smoker]    [junit4] IGNOR/A 0.00s J1 | TestIndexWriterWithThreads.testIOExceptionDuringWriteSegmentWithThreadsOnlyOnce
   [smoker]    [junit4]    > Assumption #1: 'slow' test group is disabled (@Slow())
   [smoker]    [junit4] IGNOR/A 0.00s J1 | TestIndexWriterWithThreads.testIOExceptionDuringAbortWithThreadsOnlyOnce
   [smoker]    [junit4]    > Assumption #1: 'slow' test group is disabled (@Slow())
   [smoker]    [junit4] IGNOR/A 0.00s J1 | TestIndexWriterWithThreads.testIOExceptionDuringAbortWithThreads
   [smoker]    [junit4]    > Assumption #1: 'slow' test group is disabled (@Slow())
   [smoker]    [junit4] IGNOR/A 0.00s J1 | TestIndexWriterWithThreads.testImmediateDiskFullWithThreads
   [smoker]    [junit4]    > Assumption #1: 'slow' test group is disabled (@Slow())
   [smoker]    [junit4] IGNOR/A 0.00s J1 | TestIndexWriterWithThreads.testIOExceptionDuringAbortOnlyOnce
   [smoker]    [junit4]    > Assumption #1: 'slow' test group is disabled (@Slow())
   [smoker]    [junit4] IGNOR/A 0.00s J1 | TestIndexWriterWithThreads.testOpenTwoIndexWritersOnDifferentThreads
   [smoker]    [junit4]    > Assumption #1: 'slow' test group is disabled (@Slow())
   [smoker]    [junit4] IGNOR/A 0.05s J1 | TestIndexWriterWithThreads.testIOExceptionDuringWriteSegment
   [smoker]    [junit4]    > Assumption #1: 'slow' test group is disabled (@Slow())
   [smoker]    [junit4] IGNOR/A 0.00s J1 | TestIndexWriterWithThreads.testIOExceptionDuringWriteSegmentOnlyOnce
   [smoker]    [junit4]    > Assumption #1: 'slow' test group is disabled (@Slow())
   [smoker]    [junit4] IGNOR/A 0.00s J1 | TestIndexWriterWithThreads.testIOExceptionDuringWriteSegmentWithThreads
   [smoker]    [junit4]    > Assumption #1: 'slow' test group is disabled (@Slow())
   [smoker]    [junit4] IGNOR/A 0.00s J1 | TestIndexWriterWithThreads.testCloseWithThreads
   [smoker]    [junit4]    > Assumption #1: 'slow' test group is disabled (@Slow())
   [smoker]    [junit4] IGNOR/A 0.00s J1 | TestIndexWriterWithThreads.testIOExceptionDuringAbort
   [smoker]    [junit4]    > Assumption #1: 'slow' test group is disabled (@Slow())
   [smoker]    [junit4] IGNOR/A 0.00s J1 | TestIndexWriterWithThreads.testRollbackAndCommitWithThreads
   [smoker]    [junit4]    > Assumption #1: 'slow' test group is disabled (@Slow())
   [smoker]    [junit4] Completed [85/481] on J1 in 0.11s, 12 tests, 12 skipped
   [smoker]    [junit4] 
   [smoker]    [junit4] Suite: org.apache.lucene.index.TestCustomNorms
   [smoker]    [junit4] Completed [86/481] on J0 in 6.12s, 1 test
   [smoker]    [junit4] 
   [smoker]    [junit4] Suite: org.apache.lucene.util.TestNamedSPILoader
   [smoker]    [junit4] Completed [87/481] on J0 in 0.42s, 3 tests
   [smoker]    [junit4] 
   [smoker]    [junit4] Suite: org.apache.lucene.search.TestNeedsScores
   [smoker]    [junit4] Completed [88/481] on J0 in 0.39s, 4 tests
   [smoker]    [junit4] 
   [smoker]    [junit4] Suite: org.apache.lucene.index.TestFieldsReader
   [smoker]    [junit4] Completed [89/481] on J1 in 5.42s, 2 tests
   [smoker]    [junit4] 
   [smoker]    [junit4] Suite: org.apache.lucene.search.TestSimpleExplanations
   [smoker]    [junit4] Completed [90/481] on J0 in 18.02s, 70 tests
   [smoker]    [junit4] 
   [smoker]    [junit4] Suite: org.apache.lucene.index.TestIndexableField
   [smoker]    [junit4] Completed [91/481] on J0 in 1.96s, 2 tests
   [smoker]    [junit4] 
   [smoker]    [junit4] Suite: org.apache.lucene.index.TestSegmentReader
   [smoker]    [junit4] Completed [92/481] on J0 in 6.07s, 7 tests
   [smoker]    [junit4] 
   [smoker]    [junit4] Suite: org.apache.lucene.codecs.lucene70.TestIndexedDISI
   [smoker]    [junit4] Completed [93/481] on J1 in 23.58s, 10 tests
   [smoker]    [junit4] 
   [smoker]    [junit4] Suite: org.apache.lucene.util.TestFixedBitDocIdSet
   [smoker]    [junit4] Completed [94/481] on J0 in 5.76s, 5 tests
   [smoker]    [junit4] 
   [smoker]    [junit4] Suite: org.apache.lucene.search.spans.TestSpanExplanationsOfNonMatches
   [smoker]    [junit4] Completed [95/481] on J0 in 1.16s, 30 tests
   [smoker]    [junit4] 
   [smoker]    [junit4] Suite: org.apache.lucene.index.TestManyFields
   [smoker]    [junit4] Completed [96/481] on J1 in 6.06s, 3 tests
   [smoker]    [junit4] 
   [smoker]    [junit4] Suite: org.apache.lucene.util.TestLongBitSet
   [smoker]    [junit4] IGNOR/A 0.00s J0 | TestLongBitSet.testHugeCapacity
   [smoker]    [junit4]    > Assumption #1: 'nightly' test group is disabled (@Nightly())
   [smoker]    [junit4] Completed [97/481] on J0 in 2.15s, 11 tests, 1 skipped
   [smoker]    [junit4] 
   [smoker]    [junit4] Suite: org.apache.lucene.util.automaton.TestDeterminism
   [smoker]    [junit4] Completed [98/481] on J1 in 6.23s, 2 tests
   [smoker]    [junit4] 
   [smoker]    [junit4] Suite: org.apache.lucene.index.TestOrdinalMap
   [smoker]    [junit4] Completed [99/481] on J1 in 0.57s, 1 test
   [smoker]    [junit4] 
   [smoker]    [junit4] HEARTBEAT J2 PID(3485@lucene2-us-west.apache.org): 2018-02-13T18:25:07, stalled for 63.2s at: TestBasicModelG.testRandomScoring
   [smoker]    [junit4] Suite: org.apache.lucene.util.bkd.TestBKD
   [smoker]    [junit4] IGNOR/A 0.00s J1 | TestBKD.testRandomBinaryBig
   [smoker]    [junit4]    > Assumption #1: 'nightly' test group is disabled (@Nightly())
   [smoker]    [junit4] Completed [100/481] on J1 in 37.40s, 19 tests, 1 skipped
   [smoker]    [junit4] 
   [smoker]    [junit4] Suite: org.apache.lucene.util.automaton.FiniteStringsIteratorTest
   [smoker]    [junit4] Completed [101/481] on J1 in 8.70s, 7 tests
   [smoker]    [junit4] 
   [smoker]    [junit4] Suite: org.apache.lucene.index.TestParallelTermEnum
   [smoker]    [junit4] Completed [102/481] on J1 in 0.71s, 1 test
   [smoker]    [junit4] 
   [smoker]    [junit4] HEARTBEAT J2 PID(3485@lucene2-us-west.apache.org): 2018-02-13T18:26:07, stalled for  123s at: TestBasicModelG.testRandomScoring
   [smoker]    [junit4] Suite: org.apache.lucene.util.packed.TestPackedInts
   [smoker]    [junit4] IGNOR/A 0.00s J1 | TestPackedInts.testBlockReaderOverflow
   [smoker]    [junit4]    > Assumption #1: 'nightly' test group is disabled (@Nightly())
   [smoker]    [junit4] Completed [103/481] on J1 in 41.67s, 28 tests, 3 skipped
   [smoker]    [junit4] 
   [smoker]    [junit4] Suite: org.apache.lucene.search.similarities.TestBasicModelG
   [smoker]    [junit4] Completed [104/481] on J2 in 176.94s, 1 test
   [smoker]    [junit4] 
   [smoker]    [junit4] Suite: org.apache.lucene.index.TestAllFilesHaveChecksumFooter
   [smoker]    [junit4] Completed [105/481] on J2 in 2.54s, 1 test
   [smoker]    [junit4] 
   [smoker]    [junit4] Suite: org.apache.lucene.TestExternalCodecs
   [smoker]    [junit4] Completed [106/481] on J2 in 2.24s, 1 test
   [smoker]    [junit4] 
   [smoker]    [junit4] Suite: org.apache.lucene.util.automaton.LimitedFiniteStringsIteratorTest
   [smoker]    [junit4] Completed [107/481] on J2 in 2.50s, 6 tests
   [smoker]    [junit4] 
   [smoker]    [junit4] Suite: org.apache.lucene.index.TestSortedSetDocValues
   [smoker]    [junit4] Completed [108/481] on J2 in 0.39s, 1 test
   [smoker]    [junit4] 
   [smoker]    [junit4] Suite: org.apache.lucene.index.TestMergePolicyWrapper
   [smoker]    [junit4] Completed [109/481] on J2 in 0.36s, 1 test
   [smoker]    [junit4] 
   [smoker]    [junit4] Suite: org.apache.lucene.index.TestIndexWriterUnicode
   [smoker]    [junit4] Completed [110/481] on J2 in 11.87s, 5 tests
   [smoker]    [junit4] 
   [smoker]    [junit4] Suite: org.apache.lucene.search.TestTopDocsCollector
   [smoker]    [junit4] Completed [111/481] on J2 in 0.77s, 10 tests
   [smoker]    [junit4] 
   [smoker]    [junit4] Suite: org.apache.lucene.search.similarities.TestIndependenceChiSquared
   [smoker]    [junit4] Completed [112/481] on J1 in 64.06s, 1 test
   [smoker]    [junit4] 
   [smoker]    [junit4] Suite: org.apache.lucene.search.TestFieldValueQuery
   [smoker]    [junit4] Completed [113/481] on J2 in 6.05s, 6 tests
   [smoker]    [junit4] 
   [smoker]    [junit4] Suite: org.apache.lucene.search.spans.TestSpanNearQuery
   [smoker]    [junit4] Completed [114/481] on J2 in 0.32s, 4 tests
   [smoker]    [junit4] 
   [smoker]    [junit4] Suite: org.apache.lucene.util.TestRoaringDocIdSet
   [smoker]    [junit4] Completed [115/481] on J1 in 4.15s, 5 tests
   [smoker]    [junit4] 
   [smoker]    [junit4] Suite: org.apache.lucene.index.Test2BPostingsBytes
   [smoker]    [junit4] IGNOR/A 0.00s J1 | Test2BPostingsBytes.test
   [smoker]    [junit4]    > Assumption #1: 'monster' test group is disabled (@Monster(value="takes ~20GB-30GB of space and 10 minutes"))
   [smoker]    [junit4] Completed [116/481] on J1 in 0.04s, 1 test, 1 skipped
   [smoker]    [junit4] 
   [smoker]    [junit4] Suite: org.apache.lucene.index.TestThreadedForceMerge
   [smoker]    [junit4] Completed [117/481] on J2 in 3.43s, 1 test
   [smoker]    [junit4] 
   [smoker]    [junit4] Suite: org.apache.lucene.index.TestDocInverterPerFieldErrorInfo
   [smoker]    [junit4] Completed [118/481] on J2 in 0.95s, 2 tests
   [smoker]    [junit4] 
   [smoker]    [junit4] Suite: org.apache.lucene.search.TestSimpleExplanationsWithFillerDocs
   [smoker]    [junit4] IGNOR/A 0.03s J2 | TestSimpleExplanationsWithFillerDocs.testDMQ3
   [smoker]    [junit4]    > Assumption #1: 'slow' test group is disabled (@Slow())
   [smoker]    [junit4] IGNOR/A 0.00s J2 | TestSimpleExplanationsWithFillerDocs.testDMQ7
   [smoker]    [junit4]    > Assumption #1: 'slow' test group is disabled (@Slow())
   [smoker]    [junit4] IGNOR/A 0.00s J2 | TestSimpleExplanationsWithFillerDocs.testMultiFieldBQ5
   [smoker]    [junit4]    > Assumption #1: 'slow' test group is disabled (@Slow())
   [smoker]    [junit4] IGNOR/A 0.00s J2 | TestSimpleExplanationsWithFillerDocs.testCSQ3
   [smoker]    [junit4]    > Assumption #1: 'slow' test group is disabled (@Slow())
   [smoker]    [junit4] IGNOR/A 0.00s J2 | TestSimpleExplanationsWithFillerDocs.testBQ20
   [smoker]    [junit4]    > Assumption #1: 'slow' test group is disabled (@Slow())
   [smoker]    [junit4] IGNOR/A 0.00s J2 | TestSimpleExplanationsWithFillerDocs.testDMQ8
   [smoker]    [junit4]    > Assumption #1: 'slow' test group is disabled (@Slow())
   [smoker]    [junit4] IGNOR/A 0.00s J2 | TestSimpleExplanationsWithFillerDocs.testMultiFieldBQofPQ1
   [smoker]    [junit4]    > Assumption #1: 'slow' test group is disabled (@Slow())
   [smoker]    [junit4] IGNOR/A 0.00s J2 | TestSimpleExplanationsWithFillerDocs.testMultiFieldBQ10
   [smoker]    [junit4]    > Assumption #1: 'slow' test group is disabled (@Slow())
   [smoker]    [junit4] IGNOR/A 0.00s J2 | TestSimpleExplanationsWithFillerDocs.testMPQ5
   [smoker]    [junit4]    > Assumption #1: 'slow' test group is disabled (@Slow())
   [smoker]    [junit4] IGNOR/A 0.00s J2 | TestSimpleExplanationsWithFillerDocs.testEquality
   [smoker]    [junit4]    > Assumption #1: 'slow' test group is disabled (@Slow())
   [smoker]    [junit4] IGNOR/A 0.00s J2 | TestSimpleExplanationsWithFillerDocs.testBQ26
   [smoker]    [junit4]    > Assumption #1: 'slow' test group is disabled (@Slow())
   [smoker]    [junit4] IGNOR/A 0.00s J2 | TestSimpleExplanationsWithFillerDocs.testP7
   [smoker]    [junit4]    > Assumption #1: 'slow' test group is disabled (@Slow())
   [smoker]    [junit4] IGNOR/A 0.07s J2 | TestSimpleExplanationsWithFillerDocs.testMPQ3
   [smoker]    [junit4]    > Assumption #1: 'slow' test group is disabled (@Slow())
   [smoker]    [junit4] IGNOR/A 0.00s J2 | TestSimpleExplanationsWithFillerDocs.testBQ14
   [smoker]    [junit4]    > Assumption #1: 'slow' test group is disabled (@Slow())
   [smoker]    [junit4] IGNOR/A 0.00s J2 | TestSimpleExplanationsWithFillerDocs.testMultiFieldBQ6
   [smoker]    [junit4]    > Assumption #1: 'slow' test group is disabled (@Slow())
   [smoker]    [junit4] IGNOR/A 0.00s J2 | TestSimpleExplanationsWithFillerDocs.testMultiFieldBQ7
   [smoker]    [junit4]    > Assumption #1: 'slow' test group is disabled (@Slow())
   [smoker]    [junit4] IGNOR/A 0.00s J2 | TestSimpleExplanationsWithFillerDocs.testMultiFieldBQofPQ6
   [smoker]    [junit4]    > Assumption #1: 'slow' test group is disabled (@Slow())
   [smoker]    [junit4] IGNOR/A 0.00s J2 | TestSimpleExplanationsWithFillerDocs.testDMQ9
   [smoker]    [junit4]    > Assumption #1: 'slow' test group is disabled (@Slow())
   [smoker]    [junit4] IGNOR/A 0.00s J2 | TestSimpleExplanationsWithFillerDocs.testMPQ4
   [smoker]    [junit4]    > Assumption #1: 'slow' test group is disabled (@Slow())
   [smoker]    [junit4] IGNOR/A 0.00s J2 | TestSimpleExplanationsWithFillerDocs.testBQ8
   [smoker]    [junit4]    > Assumption #1: 'slow' test group is disabled (@Slow())
   [smoker]    [junit4] IGNOR/A 0.00s J2 | TestSimpleExplanationsWithFillerDocs.testBQ19
   [smoker]    [junit4]    > Assumption #1: 'slow' test group is disabled (@Slow())
   [smoker]    [junit4] IGNOR/A 0.00s J2 | TestSimpleExplanationsWithFillerDocs.testMPQ1
   [smoker]    [junit4]    > Assumption #1: 'slow' test group is disabled (@Slow())
   [smoker]    [junit4] IGNOR/A 0.00s J2 | TestSimpleExplanationsWithFillerDocs.testBQ6
   [smoker]    [junit4]    > Assumption #1: 'slow' test group is disabled (@Slow())
   [smoker]    [junit4] IGNOR/A 0.00s J2 | TestSimpleExplanationsWithFillerDocs.testT1
   [smoker]    [junit4]    > Assumption #1: 'slow' test group is disabled (@Slow())
   [smoker]    [junit4] IGNOR/A 0.00s J2 | TestSimpleExplanationsWithFillerDocs.testMultiFieldBQofPQ5
   [smoker]    [junit4]    > Assumption #1: 'slow' test group is disabled (@Slow())
   [smoker]    [junit4] IGNOR/A 0.00s J2 | TestSimpleExplanationsWithFillerDocs.testBQ16
   [smoker]    [junit4]    > Assumption #1: 'slow' test group is disabled (@Slow())
   [smoker]    [junit4] IGNOR/A 0.00s J2 | TestSimpleExplanationsWithFillerDocs.testMultiFieldBQ3
   [smoker]    [junit4]    > Assumption #1: 'slow' test group is disabled (@Slow())
   [smoker]    [junit4] IGNOR/A 0.00s J2 | TestSimpleExplanationsWithFillerDocs.testBQ9
   [smoker]    [junit4]    > Assumption #1: 'slow' test group is disabled (@Slow())
   [smoker]    [junit4] IGNOR/A 0.00s J2 | TestSimpleExplanationsWithFillerDocs.testDMQ6
   [smoker]    [junit4]    > Assumption #1: 'slow' test group is disabled (@Slow())
   [smoker]    [junit4] IGNOR/A 0.00s J2 | TestSimpleExplanationsWithFillerDocs.testBQ5
   [smoker]    [junit4]    > Assumption #1: 'slow' test group is disabled (@Slow())
   [smoker]    [junit4] IGNOR/A 0.00s J2 | TestSimpleExplanationsWithFillerDocs.testBQ1
   [smoker]    [junit4]    > Assumption #1: 'slow' test group is disabled (@Slow())
   [smoker]    [junit4] IGNOR/A 0.00s J2 | TestSimpleExplanationsWithFillerDocs.testT2
   [smoker]    [junit4]    > Assumption #1: 'slow' test group is disabled (@Slow())
   [smoker]    [junit4] IGNOR/A 0.02s J2 | TestSimpleExplanationsWithFillerDocs.testBQ15
   [smoker]    [junit4]    > Assumption #1: 'slow' test group is disabled (@Slow())
   [smoker]    [junit4] IGNOR/A 0.00s J2 | TestSimpleExplanationsWithFillerDocs.testBQ21
   [smoker]    [junit4]    > Assumption #1: 'slow' test group is disabled (@Slow())
   [smoker]    [junit4] IGNOR/A 0.00s J2 | TestSimpleExplanationsWithFillerDocs.testBQ23
   [smoker]    [junit4]    > Assumption #1: 'slow' test group is disabled (@Slow())
   [smoker]    [junit4] IGNOR/A 0.00s J2 | TestSimpleExplanationsWithFillerDocs.testP3
   [smoker]    [junit4]    > Assumption #1: 'slow' test group is disabled (@Slow())
   [smoker]    [junit4] IGNOR/A 0.00s J2 | TestSimpleExplanationsWithFillerDocs.testBQ24
   [smoker]    [junit4]    > Assumption #1: 'slow' test group is disabled (@Slow())
   [smoker]    [junit4] IGNOR/A 0.00s J2 | TestSimpleExplanationsWithFillerDocs.testP2
   [smoker]    [junit4]    > Assumption #1: 'slow' test group is disabled (@Slow())
   [smoker]    [junit4] IGNOR/A 0.00s J2 | TestSimpleExplanationsWithFillerDocs.testDMQ1
   [smoker]    [junit4]    > Assumption #1: 'slow' test group is disabled (@Slow())
   [smoker]    [junit4] IGNOR/A 0.00s J2 | TestSimpleExplanationsWithFillerDocs.testBQ3
   [smoker]    [junit4]    > Assumption #1: 'slow' test group is disabled (@Slow())
   [smoker]    [junit4] IGNOR/A 0.00s J2 | TestSimpleExplanationsWithFillerDocs.testMA1
   [smoker]    [junit4]    > Assumption #1: 'slow' test group is disabled (@Slow())
   [smoker]    [junit4] IGNOR/A 0.00s J2 | TestSimpleExplanationsWithFillerDocs.testMultiFieldBQofPQ3
   [smoker]    [junit4]    > Assumption #1: 'slow' test group is disabled (@Slow())
   [smoker]    [junit4] IGNOR/A 0.00s J2 | TestSimpleExplanationsWithFillerDocs.testMultiFieldBQ1
   [smoker]    [junit4]    > Assumption #1: 'slow' test group is disabled (@Slow())
   [smoker]    [junit4] IGNOR/A 0.00s J2 | TestSimpleExplanationsWithFillerDocs.testMultiFieldBQofPQ2
   [smoker]    [junit4]    > Assumption #1: 'slow' test group is disabled (@Slow())
   [smoker]    [junit4] IGNOR/A 0.00s J2 | TestSimpleExplanationsWithFillerDocs.testP1
   [smoker]    [junit4]    > Assumption #1: 'slow' test group is disabled (@Slow())
   [smoker]    [junit4] IGNOR/A 0.00s J2 | TestSimpleExplanationsWithFillerDocs.testCSQ2
   [smoker]    [junit4]    > Assumption #1: 'slow' test group is disabled (@Slow())
   [smoker]    [junit4] IGNOR/A 0.00s J2 | TestSimpleExplanationsWithFillerDocs.testSynonymQuery
   [smoker]    [junit4]    > Assumption #1: 'slow' test group is disabled (@Slow())
   [smoker]    [junit4] IGNOR/A 0.00s J2 | TestSimpleExplanationsWithFillerDocs.testP6
   [smoker]    [junit4]    > Assumption #1: 'slow' test group is disabled (@Slow())
   [smoker]    [junit4] IGNOR/A 0.00s J2 | TestSimpleExplanationsWithFillerDocs.testP4
   [smoker]    [junit4]    > Assumption #1: 'slow' test group is disabled (@Slow())
   [smoker]    [junit4] IGNOR/A 0.00s J2 | TestSimpleExplanationsWithFillerDocs.testBQ25
   [smoker]    [junit4]    > Assumption #1: 'slow' test group is disabled (@Slow())
   [smoker]    [junit4] IGNOR/A 0.00s J2 | TestSimpleExplanationsWithFillerDocs.testMultiFieldBQ4
   [smoker]    [junit4]    > Assumption #1: 'slow' test group is disabled (@Slow())
   [smoker]    [junit4] IGNOR/A 0.00s J2 | TestSimpleExplanationsWithFillerDocs.testBQ10
   [smoker]    [junit4]    > Assumption #1: 'slow' test group is disabled (@Slow())
   [smoker]    [junit4] IGNOR/A 0.00s J2 | TestSimpleExplanationsWithFillerDocs.testDMQ4
   [smoker]    [junit4]    > Assumption #1: 'slow' test group is disabled (@Slow())
   [smoker]    [junit4] IGNOR/A 0.00s J2 | TestSimpleExplanationsWithFillerDocs.testMA2
   [smoker]    [junit4]    > Assumption #1: 'slow' test group is disabled (@Slow())
   [smoker]    [junit4] IGNOR/A 0.00s J2 | TestSimpleExplanationsWithFillerDocs.testDMQ5
   [smoker]    [junit4]    > Assumption #1: 'slow' test group is disabled (@Slow())
   [smoker]    [junit4] IGNOR/A 0.00s J2 | TestSimpleExplanationsWithFillerDocs.testMultiFieldBQ2
   [smoker]    [junit4]    > Assumption #1: 'slow' test group is disabled (@Slow())
   [smoker]    [junit4] IGNOR/A 0.00s J2 | TestSimpleExplanationsWithFillerDocs.testBQ4
   [smoker]    [junit4]    > Assumption #1: 'slow' test group is disabled (@Slow())
   [smoker]    [junit4] IGNOR/A 0.00s J2 | TestSimpleExplanationsWithFillerDocs.testMultiFieldBQofPQ7
   [smoker]    [junit4]    > Assumption #1: 'slow' test group is disabled (@Slow())
   [smoker]    [junit4] IGNOR/A 0.00s J2 | TestSimpleExplanationsWithFillerDocs.testCSQ1
   [smoker]    [junit4]    > Assumption #1: 'slow' test group is disabled (@Slow())
   [smoker]    [junit4] IGNOR/A 0.00s J2 | TestSimpleExplanationsWithFillerDocs.testBQ17
   [smoker]    [junit4]    > Assumption #1: 'slow' test group is disabled (@Slow())
   [smoker]    [junit4] IGNOR/A 0.00s J2 | TestSimpleExplanationsWithFillerDocs.testBQ11
   [smoker]    [junit4]    > Assumption #1: 'slow' test group is disabled (@Slow())
   [smoker]    [junit4] IGNOR/A 0.00s J2 | TestSimpleExplanationsWithFillerDocs.testBQ2
   [smoker]    [junit4]    > Assumption #1: 'slow' test group is disabled (@Slow())
   [smoker]    [junit4] IGNOR/A 0.00s J2 | TestSimpleExplanationsWithFillerDocs.testMultiFieldBQ8
   [smoker]    [junit4]    > Assumption #1: 'slow' test group is disabled (@Slow())
   [smoker]    [junit4] IGNOR/A 0.00s J2 | TestSimpleExplanationsWithFillerDocs.testMultiFieldBQ9
   [smoker]    [junit4]    > Assumption #1: 'slow' test group is disabled (@Slow())
   [smoker]    [junit4] IGNOR/A 0.00s J2 | TestSimpleExplanationsWithFillerDocs.testMPQ6
   [smoker]    [junit4]    > Assumption #1: 'slow' test group is disabled (@Slow())
   [smoker]    [junit4] IGNOR/A 0.00s J2 | TestSimpleExplanationsWithFillerDocs.testMPQ2
   [smoker]    [junit4]    > Assumption #1: 'slow' test group is disabled (@Slow())
   [smoker]    [junit4] IGNOR/A 0.00s J2 | TestSimpleExplanationsWithFillerDocs.testDMQ2
   [smoker]    [junit4]    > Assumption #1: 'slow' test group is disabled (@Slow())
   [smoker]    [junit4] IGNOR/A 0.00s J2 | TestSimpleExplanationsWithFillerDocs.testMultiFieldBQofPQ4
   [smoker]    [junit4]    > Assumption #1: 'slow' test group is disabled (@Slow())
   [smoker]    [junit4] IGNOR/A 0.00s J2 | TestSimpleExplanationsWithFillerDocs.testP5
   [smoker]    [junit4]    > Assumption #1: 'slow' test group is disabled (@Slow())
   [smoker]    [junit4] IGNOR/A 0.00s J2 | TestSimpleExplanationsWithFillerDocs.testBQ7
   [smoker]    [junit4]    > Assumption #1: 'slow' test group is disabled (@Slow())
   [smoker]    [junit4] Completed [119/481] on J2 in 0.18s, 70 tests, 70 skipped
   [smoker]    [junit4] 
   [smoker]    [junit4] Suite: org.apache.lucene.util.TestBytesRefArray
   [smoker]    [junit4] Completed [120/481] on J2 in 0.81s, 2 tests
   [smoker]    [junit4] 
   [smoker]    [junit4] Suite: org.apache.lucene.index.TestIndexWriterReader
   [smoker]    [junit4] IGNOR/A 0.00s J1 | TestIndexWriterReader.testAddIndexesAndDoDeletesThreads
   [smoker]    [junit4]    > Assumption #1: 'slow' test group is disabled (@Slow())
   [smoker]    [junit4] IGNOR/A 0.00s J1 | TestIndexWriterReader.testDuringAddIndexes
   [smoker]    [junit4]    > Assumption #1: 'nightly' test group is disabled (@Nightly())
   [smoker]    [junit4] Completed [121/481] on J1 in 28.74s, 23 tests, 2 skipped
   [smoker]    [junit4] 
   [smoker]    [junit4] Suite: org.apache.lucene.codecs.lucene70.TestLucene70DocValuesFormat
   [smoker]    [junit4] IGNOR/A 0.00s J0 | TestLucene70DocValuesFormat.testSortedNumericBlocksOfVariousBitsPerValue
   [smoker]    [junit4]    > Assumption #1: 'slow' test group is disabled (@Slow())
   [smoker]    [junit4] IGNOR/A 0.00s J0 | TestLucene70DocValuesFormat.testSortedSetVariableLengthBigVsStoredFields
   [smoker]    [junit4]    > Assumption #1: 'slow' test group is disabled (@Slow())
   [smoker]    [junit4] IGNOR/A 0.00s J0 | TestLucene70DocValuesFormat.testThreads3
   [smoker]    [junit4]    > Assumption #1: 'slow' test group is disabled (@Slow())
   [smoker]    [junit4] IGNOR/A 0.00s J0 | TestLucene70DocValuesFormat.testNumericBlocksOfVariousBitsPerValue
   [smoker]    [junit4]    > Assumption #1: 'slow' test group is disabled (@Slow())
   [smoker]    [junit4] IGNOR/A 0.00s J0 | TestLucene70DocValuesFormat.testSortedSetAroundBlockSize
   [smoker]    [junit4]    > Assumption #1: 'slow' test group is disabled (@Slow())
   [smoker]    [junit4] IGNOR/A 0.00s J0 | TestLucene70DocValuesFormat.testSparseNumericBlocksOfVariousBitsPerValue
   [smoker]    [junit4]    > Assumption #1: 'slow' test group is disabled (@Slow())
   [smoker]    [junit4] IGNOR/A 0.00s J0 | TestLucene70DocValuesFormat.testSortedSetVariableLengthManyVsStoredFields
   [smoker]    [junit4]    > Assumption #1: 'nightly' test group is disabled (@Nightly())
   [smoker]    [junit4] IGNOR/A 0.00s J0 | TestLucene70DocValuesFormat.testThreads2
   [smoker]    [junit4]    > Assumption #1: 'slow' test group is disabled (@Slow())
   [smoker]    [junit4] IGNOR/A 0.00s J0 | TestLucene70DocValuesFormat.testSortedVariableLengthBigVsStoredFields
   [smoker]    [junit4]    > Assumption #1: 'slow' test group is disabled (@Slow())
   [smoker]    [junit4] IGNOR/A 0.00s J0 | TestLucene70DocValuesFormat.testSparseSortedNumericBlocksOfVariousBitsPerValue
   [smoker]    [junit4]    > Assumption #1: 'slow' test group is disabled (@Slow())
   [smoker]    [junit4] IGNOR/A 0.00s J0 | TestLucene70DocValuesFormat.testSortedVariableLengthManyVsStoredFields
   [smoker]    [junit4]    > Assumption #1: 'nightly' test group is disabled (@Nightly())
   [smoker]    [junit4] IGNOR/A 0.03s J0 | TestLucene70DocValuesFormat.testTermsEnumRandomMany
   [smoker]    [junit4]    > Assumption #1: 'nightly' test group is disabled (@Nightly())
   [smoker]    [junit4] IGNOR/A 0.00s J0 | TestLucene70DocValuesFormat.testTermsEnumVariableWidth
   [smoker]    [junit4]    > Assumption #1: 'slow' test group is disabled (@Slow())
   [smoker]    [junit4] IGNOR/A 0.00s J0 | TestLucene70DocValuesFormat.testSortedNumericAroundBlockSize
   [smoker]    [junit4]    > Assumption #1: 'slow' test group is disabled (@Slow())
   [smoker]    [junit4] IGNOR/A 0.00s J0 | TestLucene70DocValuesFormat.testTermsEnumFixedWidth
   [smoker]    [junit4]    > Assumption #1: 'slow' test group is disabled (@Slow())
   [smoker]    [junit4] IGNOR/A 0.00s J0 | TestLucene70DocValuesFormat.testSparseDocValuesVsStoredFields
   [smoker]    [junit4]    > Assumption #1: 'slow' test group is disabled (@Slow())
   [smoker]    [junit4] IGNOR/A 0.00s J0 | TestLucene70DocValuesFormat.testRamBytesUsed
   [smoker]    [junit4]    > Assumption #1: 'slow' test group is disabled (@Slow())
   [smoker]    [junit4] Completed [122/481] on J0 in 205.43s, 126 tests, 17 skipped
   [smoker]    [junit4] 
   [smoker]    [junit4] Suite: org.apache.lucene.index.TestFlex
   [smoker]    [junit4] Completed [123/481] on J0 in 1.02s, 2 tests
   [smoker]    [junit4] 
   [smoker]    [junit4] Suite: org.apache.lucene.index.TestTragicIndexWriterDeadlock
   [smoker]    [junit4] Completed [124/481] on J0 in 0.49s, 2 tests
   [smoker]    [junit4] 
   [smoker]    [junit4] Suite: org.apache.lucene.search.TestNot
   [smoker]    [junit4] Completed [125/481] on J0 in 0.18s, 1 test
   [smoker]    [junit4] 
   [smoker]    [junit4] Suite: org.apache.lucene.search.TestIndexSearcher
   [smoker]    [junit4] Completed [126/481] on J0 in 1.43s, 5 tests
   [smoker]    [junit4] 
   [smoker]    [junit4] Suite: org.apache.lucene.search.similarities.TestSimilarityBase
   [smoker]    [junit4] Completed [127/481] on J0 in 2.81s, 27 tests
   [smoker]    [junit4] 
   [smoker]    [junit4] Suite: org.apache.lucene.index.TestDuelingCodecsAtNight
   [smoker]    [junit4] IGNOR/A 0.00s J0 | TestDuelingCodecsAtNight.testEquals
   [smoker]    [junit4]    > Assumption #1: 'nightly' test group is disabled (@Nightly())
   [smoker]    [junit4] IGNOR/A 0.00s J0 | TestDuelingCodecsAtNight.testCrazyReaderEquals
   [smoker]    [junit4]    > Assumption #1: 'nightly' test group is disabled (@Nightly())
   [smoker]    [junit4] IGNOR/A 0.00s J0 | TestDuelingCodecsAtNight.testBigEquals
   [smoker]    [junit4]    > Assumption #1: 'nightly' test group is disabled (@Nightly())
   [smoker]    [junit4] Completed [128/481] on J0 in 0.03s, 3 tests, 3 skipped
   [smoker]    [junit4] 
   [smoker]    [junit4] Suite: org.apache.lucene.util.TestSmallFloat
   [smoker]    [junit4] Completed [129/481] on J0 in 1.26s, 4 tests
   [smoker]    [junit4] 
   [smoker]    [junit4] Suite: org.apache.lucene.search.TestLongRangeFieldQueries
   [smoker]    [junit4] IGNOR/A 0.00s J2 | TestLongRangeFieldQueries.testRandomBig
   [smoker]    [junit4]    > Assumption #1: 'nightly' test group is disabled (@Nightly())
   [smoker]    [junit4] Completed [130/481] on J2 in 50.71s, 5 tests, 1 skipped
   [smoker]    [junit4] 
   [smoker]    [junit4] Suite: org.apache.lucene.index.TestTermVectorsReader
   [smoker]    [junit4] Completed [131/481] on J2 in 2.25s, 13 tests
   [smoker]    [junit4] 
   [smoker]    [junit4] Suite: org.apache.lucene.index.TestIndexCommit
   [smoker]    [junit4] Completed [132/481] on J2 in 0.17s, 1 test
   [smoker]    [junit4] 
   [smoker]    [junit4] Suite: org.apache.lucene.search.TestSloppyPhraseQuery
   [smoker]    [junit4] Completed [133/481] on J0 in 8.10s, 9 tests
   [smoker]    [junit4] 
   [smoker]    [junit4] Suite: org.apache.lucene.index.TestFieldInvertState
   [smoker]    [junit4] Completed [134/481] on J2 in 0.59s, 2 tests
   [smoker]    [junit4] 
   [smoker]    [junit4] Suite: org.apache.lucene.index.TestNoMergePolicy
   [smoker]    [junit4] Completed [135/481] on J2 in 0.45s, 4 tests
   [smoker]    [junit4] 
   [smoker]    [junit4] Suite: org.apache.lucene.util.TestPagedBytes
   [smoker]    [junit4] Completed [136/481] on J1 in 36.81s, 4 tests, 1 skipped
   [smoker]    [junit4] 
   [smoker]    [junit4] Suite: org.apache.lucene.index.TestNRTThreads
   [smoker]    [junit4] Completed [137/481] on J2 in 7.28s, 1 test
   [smoker]    [junit4] 
   [smoker]    [junit4] Suite: org.apache.lucene.index.TestTransactions
   [smoker]    [junit4] Completed [138/481] on J1 in 1.91s, 1 test
   [smoker]    [junit4] 
   [smoker]    [junit4] Suite: org.apache.lucene.document.TestDateTools
   [smoker]    [junit4] Completed [139/481] on J1 in 0.72s, 5 tests
   [smoker]    [junit4] 
   [smoker]    [junit4] Suite: org.apache.lucene.search.TestShardSearching
   [smoker]    [junit4] Completed [140/481] on J0 in 11.99s, 1 test
   [smoker]    [junit4] 
   [smoker]    [junit4] Suite: org.apache.lucene.util.TestPriorityQueue
   [smoker]    [junit4] Completed [141/481] on J2 in 5.45s, 9 tests
   [smoker]    [junit4] 
   [smoker]    [junit4] Suite: org.apache.lucene.index.TestFlushByRamOrCountsPolicy
   [smoker]    [junit4] Completed [142/481] on J2 in 22.02s, 5 tests
   [smoker]    [junit4] 
   [smoker]    [junit4] Suite: org.apache.lucene.util.automaton.TestOperations
   [smoker]    [junit4] Completed [143/481] on J2 in 9.14s, 7 tests
   [smoker]    [junit4] 
   [smoker]    [junit4] Suite: org.apache.lucene.index.TestMaxTermFrequency
   [smoker]    [junit4] Completed [144/481] on J2 in 1.41s, 1 test
   [smoker]    [junit4] 
   [smoker]    [junit4] Suite: org.apache.lucene.index.TestCodecs
   [smoker]    [junit4] Completed [145/481] on J2 in 2.19s, 3 tests
   [smoker]    [junit4] 
   [smoker]    [junit4] Suite: org.apache.lucene.search.TestQueryRescorer
   [smoker]    [junit4] Completed [146/481] on J2 in 6.59s, 6 tests
   [smoker]    [junit4] 
   [smoker]    [junit4] Suite: org.apache.lucene.search.TestSearchAfter
   [smoker]    [junit4] Completed [147/481] on J2 in 3.50s, 1 test
   [smoker]    [junit4] 
   [smoker]    [junit4] Suite: org.apache.lucene.index.TestCodecHoldsOpenFiles
   [smoker]    [junit4] Completed [148/481] on J2 in 0.31s, 1 test
   [smoker]    [junit4] 
   [smoker]    [junit4] Suite: org.apache.lucene.index.TestReadOnlyIndex
   [smoker]    [junit4] Completed [149/481] on J2 in 1.37s, 1 test
   [smoker]    [junit4] 
   [smoker]    [junit4] Suite: org.apache.lucene.search.TestDoubleRangeFieldQueries
   [smoker]    [junit4] IGNOR/A 0.00s J1 | TestDoubleRangeFieldQueries.testRandomBig
   [smoker]    [junit4]    > Assumption #1: 'nightly' test group is disabled (@Nightly())
   [smoker]    [junit4] Completed [150/481] on J1 in 56.86s, 5 tests, 1 skipped
   [smoker]    [junit4] 
   [smoker]    [junit4] Suite: org.apache.lucene.index.TestMultiLevelSkipList
   [smoker]    [junit4] Completed [151/481] on J1 in 0.62s, 1 test
   [smoker]    [junit4] 
   [smoker]    [junit4] HEARTBEAT J2 PID(3485@lucene2-us-west.apache.org): 2018-02-13T18:30:31, stalled for 63.3s at: TestAxiomaticF2LOG.testRandomScoring
   [smoker]    [junit4] Suite: org.apache.lucene.search.similarities.TestAxiomaticF2LOG
   [smoker]    [junit4] Completed [152/481] on J2 in 64.12s, 1 test
   [smoker]    [junit4] 
   [smoker]    [junit4] Suite: org.apache.lucene.util.TestTimSorterWorstCase
   [smoker]    [junit4] IGNOR/A 0.00s J2 | TestTimSorterWorstCase.testWorstCaseStackSize
   [smoker]    [junit4]    > Assumption #1: 'slow' test group is disabled (@Slow())
   [smoker]    [junit4] Completed [153/481] on J2 in 0.05s, 1 test, 1 skipped
   [smoker]    [junit4] 
   [smoker]    [junit4] Suite: org.apache.lucene.search.TestWildcardRandom
   [smoker]    [junit4] Completed [154/481] on J2 in 0.95s, 1 test
   [smoker]    [junit4] 
   [smoker]    [junit4] Suite: org.apache.lucene.index.TestIndexWriterOnJRECrash
   [smoker]    [junit4] IGNOR/A 0.00s J2 | TestIndexWriterOnJRECrash.testNRTThreads
   [smoker]    [junit4]    > Assumption #1: 'nightly' test group is disabled (@Nightly())
   [smoker]    [junit4] Completed [155/481] on J2 in 0.06s, 1 test, 1 skipped
   [smoker]    [junit4] 
   [smoker]    [junit4] Suite: org.apache.lucene.search.TestBooleanQuery
   [smoker]    [junit4] Completed [156/481] on J2 in 3.47s, 22 tests
   [smoker]    [junit4] 
   [smoker]    [junit4] HEARTBEAT J1 PID(3486@lucene2-us-west.apache.org): 2018-02-13T18:30:43, stalled for 69.1s at: TestBasicModelIne.testRandomScoring
   [smoker]    [junit4] Suite: org.apache.lucene.codecs.perfield.TestPerFieldDocValuesFormat
   [smoker]    [junit4] IGNOR/A 0.00s J0 | TestPerFieldDocValuesFormat.testRamBytesUsed
   [smoker]    [junit4]    > Assumption #1: 'slow' test group is disabled (@Slow())
   [smoker]    [junit4] IGNOR/A 0.00s J0 | TestPerFieldDocValuesFormat.testThreads2
   [smoker]    [junit4]    > Assumption #1: 'slow' test group is disabled (@Slow())
   [smoker]    [junit4] IGNOR/A 0.00s J0 | TestPerFieldDocValuesFormat.testThreads3
   [smoker]    [junit4]    > Assumption #1: 'slow' test group is disabled (@Slow())
   [smoker]    [junit4] Completed [157/481] on J0 in 140.87s, 110 tests, 3 skipped
   [smoker]    [junit4] 
   [smoker]    [junit4] Suite: org.apache.lucene.search.TestDocValuesQueries
   [smoker]    [junit4] Completed [158/481] on J2 in 23.43s, 10 tests
   [smoker]    [junit4] 
   [smoker]    [junit4] Suite: org.apache.lucene.analysis.TestCachingTokenFilter
   [smoker]    [junit4] Completed [159/481] on J0 in 0.18s, 2 tests
   [smoker]    [junit4] 
   [smoker]    [junit4] Suite: org.apache.lucene.util.automaton.TestMinimize
   [smoker]    [junit4] Completed [160/481] on J0 in 9.92s, 3 tests
   [smoker]    [junit4] 
   [smoker]    [junit4] Suite: org.apache.lucene.store.TestBufferedIndexInput
   [smoker]    [junit4] Completed [161/481] on J0 in 1.99s, 4 tests
   [smoker]    [junit4] 
   [smoker]    [junit4] Suite: org.apache.lucene.index.TestBagOfPositions
   [smoker]    [junit4] Completed [162/481] on J0 in 29.64s, 1 test
   [smoker]    [junit4] 
   [smoker]    [junit4] Suite: org.apache.lucene.index.TestMultiTermsEnum
   [smoker]    [junit4] Completed [163/481] on J0 in 0.23s, 1 test
   [smoker]    [junit4] 
   [smoker]    [junit4] Suite: org.apache.lucene.store.TestRateLimiter
   [smoker]    [junit4] IGNOR/A 0.66s J0 | TestRateLimiter.testThreads
   [smoker]    [junit4]    > Assumption #1: actualMBPerSec=17.9311451616577 targetMBPerSec=21.071242631354174
   [smoker]    [junit4] Completed [164/481] on J0 in 0.83s, 2 tests, 1 skipped
   [smoker]    [junit4] 
   [smoker]    [junit4] Suite: org.apache.lucene.search.TestSimilarity
   [smoker]    [junit4] Completed [165/481] on J0 in 0.28s, 1 test
   [smoker]    [junit4] 
   [smoker]    [junit4] HEARTBEAT J1 PID(3486@lucene2-us-west.apache.org): 2018-02-13T18:31:43, stalled for  129s at: TestBasicModelIne.testRandomScoring
   [smoker]    [junit4] Suite: org.apache.lucene.codecs.lucene70.TestLucene70NormsFormat
   [smoker]    [junit4] IGNOR/A 0.02s J2 | TestLucene70NormsFormat.testSparseNCommonBig
   [smoker]    [junit4]    > Assumption #1: 'nightly' test group is disabled (@Nightly())
   [smoker]    [junit4] IGNOR/A 0.01s J2 | TestLucene70NormsFormat.testRamBytesUsed
   [smoker]    [junit4]    > Assumption #1: 'slow' test group is disabled (@Slow())
   [smoker]    [junit4] IGNOR/A 0.18s J2 | TestLucene70NormsFormat.testMergeStability
   [smoker]    [junit4]    > Assumption #1: The MockRandom PF randomizes content on the fly, so we can't check it
   [smoker]    [junit4] IGNOR/A 0.00s J2 | TestLucene70NormsFormat.testNCommonBig
   [smoker]    [junit4]    > Assumption #1: 'nightly' test group is disabled (@Nightly())
   [smoker]    [junit4] Completed [166/481] on J2 in 56.08s, 29 tests, 4 skipped
   [smoker]    [junit4] 
   [smoker]    [junit4] Suite: org.apache.lucene.util.TestUnicodeUtil
   [smoker]    [junit4] Completed [167/481] on J2 in 3.39s, 5 tests
   [smoker]    [junit4] 
   [smoker]    [junit4] Suite: org.apache.lucene.store.TestTrackingDirectoryWrapper
   [smoker]    [junit4] IGNOR/A 0.00s J2 | TestTrackingDirectoryWrapper.testFsyncDoesntCreateNewFiles
   [smoker]    [junit4]    > Assumption #1: test only works for FSDirectory subclasses
   [smoker]    [junit4] IGNOR/A 0.06s J2 | TestTrackingDirectoryWrapper.testPendingDeletions
   [smoker]    [junit4]    > Assumption #1: we can only install VirusCheckingFS on an FSDirectory
   [smoker]    [junit4] Completed [168/481] on J2 in 7.01s, 47 tests, 2 skipped
   [smoker]    [junit4] 
   [smoker]    [junit4] Suite: org.apache.lucene.search.spans.TestSpanMultiTermQueryWrapper
   [smoker]    [junit4] Completed [169/481] on J2 in 1.19s, 9 tests
   [smoker]    [junit4] 
   [smoker]    [junit4] Suite: org.apache.lucene.util.TestBytesRef
   [smoker]    [junit4] Completed [170/481] on J2 in 0.37s, 3 tests
   [smoker]    [junit4] 
   [smoker]    [junit4] Suite: org.apache.lucene.util.TestBytesRefHash
   [smoker]    [junit4] Completed [171/481] on J2 in 6.68s, 8 tests
   [smoker]    [junit4] 
   [smoker]    [junit4] Suite: org.apache.lucene.search.TestMultiPhraseEnum
   [smoker]    [junit4] Completed [172/481] on J2 in 0.12s, 2 tests
   [smoker]    [junit4] 
   [smoker]    [junit4] Suite: org.apache.lucene.search.similarities.TestBasicModelIne
   [smoker]    [junit4] Completed [173/481] on J1 in 167.64s, 1 test
   [smoker]    [junit4] 
   [smoker]    [junit4] Suite: org.apache.lucene.analysis.tokenattributes.TestSimpleAttributeImpl
   [smoker]    [junit4] Completed [174/481] on J1 in 0.08s, 1 test
   [smoker]    [junit4] 
   [smoker]    [junit4] Suite: org.apache.lucene.analysis.TestCharacterUtils
   [smoker]    [junit4] Completed [175/481] on J1 in 0.09s, 4 tests
   [smoker]    [junit4] 
   [smoker]    [junit4] Suite: org.apache.lucene.index.TestDocsAndPositions
   [smoker]    [junit4] Completed [176/481] on J1 in 3.74s, 6 tests
   [smoker]    [junit4] 
   [smoker]    [junit4] Suite: org.apache.lucene.analysis.standard.TestStandardAnalyzer
   [smoker]    [junit4] IGNOR/A 0.00s J0 | TestStandardAnalyzer.testLargePartiallyMatchingToken
   [smoker]    [junit4]    > Assumption #1: 'slow' test group is disabled (@Slow())
   [smoker]    [junit4] Completed [177/481] on J0 in 53.41s, 36 tests, 1 skipped
   [smoker]    [junit4] 
   [smoker]    [junit4] Suite: org.apache.lucene.index.TestCustomTermFreq
   [smoker]    [junit4] Completed [178/481] on J0 in 1.54s, 12 tests
   [smoker]    [junit4] 
   [smoker]    [junit4] Suite: org.apache.lucene.util.TestDocIdSetBuilder
   [smoker]    [junit4] Completed [179/481] on J0 in 6.80s, 7 tests
   [smoker]    [junit4] 
   [smoker]    [junit4] Suite: org.apache.lucene.util.TestMSBRadixSorter
   [smoker]    [junit4] Completed [180/481] on J1 in 20.13s, 8 tests
   [smoker]    [junit4] 
   [smoker]    [junit4] Suite: org.apache.lucene.search.TestComplexExplanations
   [smoker]    [junit4] Completed [181/481] on J0 in 7.74s, 21 tests
   [smoker]    [junit4] 
   [smoker]    [junit4] Suite: org.apache.lucene.index.TestOmitPositions
   [smoker]    [junit4] Completed [182/481] on J0 in 1.88s, 4 tests
   [smoker]    [junit4] 
   [smoker]    [junit4] Suite: org.apache.lucene.index.TestTermStates
   [smoker]    [junit4] Completed [183/481] on J0 in 0.20s, 1 test
   [smoker]    [junit4] 
   [smoker]    [junit4] Suite: org.apache.lucene.search.spans.TestBasics
   [smoker]    [junit4] Completed [184/481] on J1 in 11.78s, 27 tests
   [smoker]    [junit4] 
   [smoker]    [junit4] Suite: org.apache.lucene.geo.TestPolygon
   [smoker]    [junit4] Completed [185/481] on J1 in 0.53s, 15 tests
   [smoker]    [junit4] 
   [smoker]    [junit4] Suite: org.apache.lucene.search.TestMaxScoreSumPropagator
   [smoker]    [junit4] Completed [186/481] on J1 in 0.69s, 6 tests
   [smoker]    [junit4] 
   [smoker]    [junit4] Suite: org.apache.lucene.index.TestCrash
   [smoker]    [junit4] Completed [187/481] on J1 in 1.96s, 5 tests
   [smoker]    [junit4] 
   [smoker]    [junit4] Suite: org.apache.lucene.index.TestIndexWriterDeleteByQuery
   [smoker]    [junit4] Completed [188/481] on J1 in 0.15s, 1 test
   [smoker]    [junit4] 
   [smoker]    [junit4] Suite: org.apache.lucene.search.TestSegmentCacheables
   [smoker]    [junit4] Completed [189/481] on J1 in 0.27s, 1 test
   [smoker]    [junit4] 
   [smoker]    [junit4] Suite: org.apache.lucene.search.TestRegexpQuery
   [smoker]    [junit4] Completed [190/481] on J1 in 0.16s, 7 tests
   [smoker]    [junit4] 
   [smoker]    [junit4] Suite: org.apache.lucene.search.TestFieldCacheRewriteMethod
   [smoker]    [junit4] Completed [191/481] on J1 in 9.51s, 2 tests
   [smoker]    [junit4] 
   [smoker]    [junit4] Suite: org.apache.lucene.store.TestSimpleFSLockFactory
   [smoker]    [junit4] IGNOR/A 0.00s J0 | TestSimpleFSLockFactory.testStressLocks
   [smoker]    [junit4]    > Assumption #1: cannot handle buggy Files.delete
   [smoker]    [junit4] Completed [192/481] on J0 in 16.89s, 7 tests, 1 skipped
   [smoker]    [junit4] 
   [smoker]    [junit4] Suite: org.apache.lucene.util.TestMathUtil
   [smoker]    [junit4] Completed [193/481] on J0 in 0.11s, 5 tests
   [smoker]    [junit4] 
   [smoker]    [junit4] Suite: org.apache.lucene.search.TestSynonymQuery
   [smoker]    [junit4] Completed [194/481] on J0 in 0.15s, 4 tests
   [smoker]    [junit4] 
   [smoker]    [junit4] Suite: org.apache.lucene.index.TestNoDeletionPolicy
   [smoker]    [junit4] Completed [195/481] on J0 in 0.37s, 4 tests
   [smoker]    [junit4] 
   [smoker]    [junit4] Suite: org.apache.lucene.util.TestIntroSorter
   [smoker]    [junit4] Completed [196/481] on J0 in 1.19s, 9 tests
   [smoker]    [junit4] 
   [smoker]    [junit4] HEARTBEAT J2 PID(3485@lucene2-us-west.apache.org): 2018-02-13T18:33:19, stalled for 64.2s at: TestDistributionSPL.testRandomScoring
   [smoker]    [junit4] Suite: org.apache.lucene.index.TestIndexWriterMerging
   [smoker]    [junit4] IGNOR/A 0.00s J0 | TestIndexWriterMerging.testNoWaitClose
   [smoker]    [junit4]    > Assumption #1: 'slow' test group is disabled (@Slow())
   [smoker]    [junit4] Completed [197/481] on J0 in 7.80s, 6 tests, 1 skipped
   [smoker]    [junit4] 
   [smoker]    [junit4] Suite: org.apache.lucene.util.TestCloseableThreadLocal
   [smoker]    [junit4] Completed [198/481] on J0 in 0.55s, 3 tests
   [smoker]    [junit4] 
   [smoker]    [junit4] Suite: org.apache.lucene.util.bkd.Test2BBKDPoints
   [smoker]    [junit4] IGNOR/A 0.00s J0 | Test2BBKDPoints.test2D
   [smoker]    [junit4]    > Assumption #1: 'monster' test group is disabled (@Monster(value="takes at least 4 hours and consumes many GB of 

[...truncated too long message...]

  [junit4] Completed [2/18] on J1 in 0.06s, 3 tests
   [smoker]    [junit4] 
   [smoker]    [junit4] Suite: org.apache.lucene.spatial3d.geom.GeoBBoxTest
   [smoker]    [junit4] Completed [3/18] on J1 in 0.21s, 6 tests
   [smoker]    [junit4] 
   [smoker]    [junit4] Suite: org.apache.lucene.spatial3d.geom.SimpleGeoPolygonRelationshipsTest
   [smoker]    [junit4] Completed [4/18] on J1 in 0.47s, 14 tests
   [smoker]    [junit4] 
   [smoker]    [junit4] Suite: org.apache.lucene.spatial3d.geom.GeoPolygonTest
   [smoker]    [junit4] Completed [5/18] on J1 in 0.36s, 24 tests
   [smoker]    [junit4] 
   [smoker]    [junit4] Suite: org.apache.lucene.spatial3d.geom.GeoCircleTest
   [smoker]    [junit4] Completed [6/18] on J2 in 3.83s, 6 tests
   [smoker]    [junit4] 
   [smoker]    [junit4] Suite: org.apache.lucene.spatial3d.geom.RandomGeoPolygonTest
   [smoker]    [junit4] Completed [7/18] on J2 in 1.01s, 12 tests
   [smoker]    [junit4] 
   [smoker]    [junit4] Suite: org.apache.lucene.spatial3d.geom.RandomBinaryCodecTest
   [smoker]    [junit4] Completed [8/18] on J2 in 11.07s, 210 tests
   [smoker]    [junit4] 
   [smoker]    [junit4] Suite: org.apache.lucene.spatial3d.geom.CompositeGeoPolygonRelationshipsTest
   [smoker]    [junit4] Completed [9/18] on J2 in 0.35s, 16 tests
   [smoker]    [junit4] 
   [smoker]    [junit4] Suite: org.apache.lucene.spatial3d.geom.RandomPlaneTest
   [smoker]    [junit4]   2> NOTE: reproduce with: ant test  -Dtestcase=RandomPlaneTest -Dtests.method=testPlaneThreePointsAccuracy -Dtests.seed=AF530D5BB3E29D37 -Dtests.multiplier=2 -Dtests.locale=hy-AM -Dtests.timezone=CAT -Dtests.asserts=true -Dtests.file.encoding=UTF-8
   [smoker]    [junit4] FAILURE 0.35s J2 | RandomPlaneTest.testPlaneThreePointsAccuracy {seed=[AF530D5BB3E29D37:67333841FC91DFF4]} <<<
   [smoker]    [junit4]    > Throwable #1: java.lang.AssertionError: -9.99866855977416E-13 PlanetModel.SPHERE point 1: [lat=-0.014383560214672818, lon=0.41800053100596907([X=0.9138078833986019, Y=0.4058919556989371, Z=-0.014383064258334952])], point 2: [lat=0.6932931355139935, lon=-0.18388926426439056([X=0.7561778076398898, Y=-0.14064184629683377, Z=0.6390735437358892])], point 3: [lat=-0.014383560214674136, lon=0.41800053101150425([X=0.9138078833963552, Y=0.4058919557039952, Z=-0.014383064258336268])] , check: [lat=-0.08323537864940594, lon=0.4347906232623258([X=0.9038183078528319, Y=0.4197622219929782, Z=-0.08313930104085177])]
   [smoker]    [junit4]    > 	at __randomizedtesting.SeedInfo.seed([AF530D5BB3E29D37:67333841FC91DFF4]:0)
   [smoker]    [junit4]    > 	at org.apache.lucene.spatial3d.geom.RandomPlaneTest.testPlaneThreePointsAccuracy(RandomPlaneTest.java:74)
   [smoker]    [junit4]    > 	at java.base/jdk.internal.reflect.NativeMethodAccessorImpl.invoke0(Native Method)
   [smoker]    [junit4]    > 	at java.base/jdk.internal.reflect.NativeMethodAccessorImpl.invoke(NativeMethodAccessorImpl.java:62)
   [smoker]    [junit4]    > 	at java.base/jdk.internal.reflect.DelegatingMethodAccessorImpl.invoke(DelegatingMethodAccessorImpl.java:43)
   [smoker]    [junit4]    > 	at java.base/java.lang.reflect.Method.invoke(Method.java:564)
   [smoker]    [junit4]    > 	at java.base/java.lang.Thread.run(Thread.java:844)
   [smoker]    [junit4]   2> NOTE: test params are: codec=Asserting(Lucene70): {}, docValues:{}, maxPointsInLeafNode=537, maxMBSortInHeap=7.561334272193783, sim=Asserting(org.apache.lucene.search.similarities.AssertingSimilarity@7b5f56e9), locale=hy-AM, timezone=CAT
   [smoker]    [junit4]   2> NOTE: Linux 4.4.0-112-generic amd64/Oracle Corporation 9.0.1 (64-bit)/cpus=4,threads=1,free=225585560,total=264241152
   [smoker]    [junit4]   2> NOTE: All tests run in this JVM: [GeoCircleTest, RandomGeoPolygonTest, RandomBinaryCodecTest, RandomPlaneTest]
   [smoker]    [junit4] Completed [10/18 (1!)] on J2 in 8.26s, 30 tests, 1 failure <<< FAILURES!
   [smoker]    [junit4] 
   [smoker]    [junit4] Suite: org.apache.lucene.spatial3d.geom.GeoExactCircleTest
   [smoker]    [junit4] Completed [11/18 (1!)] on J2 in 5.40s, 311 tests
   [smoker]    [junit4] 
   [smoker]    [junit4] Suite: org.apache.lucene.spatial3d.geom.RandomGeoShapeRelationshipTest
   [smoker]    [junit4] Completed [12/18 (1!)] on J1 in 28.59s, 26 tests
   [smoker]    [junit4] 
   [smoker]    [junit4] Suite: org.apache.lucene.spatial3d.geom.GeoPointTest
   [smoker]    [junit4] Completed [13/18 (1!)] on J2 in 0.99s, 4 tests
   [smoker]    [junit4] 
   [smoker]    [junit4] Suite: org.apache.lucene.spatial3d.geom.GeoPathTest
   [smoker]    [junit4] Completed [14/18 (1!)] on J1 in 0.33s, 8 tests
   [smoker]    [junit4] 
   [smoker]    [junit4] Suite: org.apache.lucene.spatial3d.TestGeo3DDocValues
   [smoker]    [junit4] Completed [15/18 (1!)] on J2 in 0.34s, 1 test
   [smoker]    [junit4] 
   [smoker]    [junit4] Suite: org.apache.lucene.spatial3d.geom.GeoConvexPolygonTest
   [smoker]    [junit4] Completed [16/18 (1!)] on J1 in 0.00s, 2 tests
   [smoker]    [junit4] 
   [smoker]    [junit4] Suite: org.apache.lucene.spatial3d.geom.GeoModelTest
   [smoker]    [junit4] Completed [17/18 (1!)] on J2 in 0.00s, 2 tests
   [smoker]    [junit4] 
   [smoker]    [junit4] Suite: org.apache.lucene.spatial3d.TestGeo3DPoint
   [smoker]    [junit4] IGNOR/A 0.02s J0 | TestGeo3DPoint.testRandomBig
   [smoker]    [junit4]    > Assumption #1: 'nightly' test group is disabled (@Nightly())
   [smoker]    [junit4] Completed [18/18 (1!)] on J0 in 75.73s, 14 tests, 1 skipped
   [smoker]    [junit4] 
   [smoker]    [junit4] 
   [smoker]    [junit4] Tests with failures [seed: AF530D5BB3E29D37]:
   [smoker]    [junit4]   - org.apache.lucene.spatial3d.geom.RandomPlaneTest.testPlaneThreePointsAccuracy {seed=[AF530D5BB3E29D37:67333841FC91DFF4]}
   [smoker]    [junit4] 
   [smoker]    [junit4] 
   [smoker]    [junit4] JVM J0:     2.67 ..    81.01 =    78.34s
   [smoker]    [junit4] JVM J1:     2.70 ..    39.42 =    36.72s
   [smoker]    [junit4] JVM J2:     2.76 ..    39.51 =    36.75s
   [smoker]    [junit4] Execution time total: 1 minute 21 seconds
   [smoker]    [junit4] Tests summary: 18 suites, 691 tests, 1 failure, 1 ignored (1 assumption)
   [smoker] 
   [smoker] BUILD FAILED
   [smoker] /home/jenkins/jenkins-slave/workspace/Lucene-Solr-SmokeRelease-master/lucene/build/smokeTestRelease/tmp/unpack/lucene-8.0.0/build.xml:493: The following error occurred while executing this line:
   [smoker] /home/jenkins/jenkins-slave/workspace/Lucene-Solr-SmokeRelease-master/lucene/build/smokeTestRelease/tmp/unpack/lucene-8.0.0/common-build.xml:2256: The following error occurred while executing this line:
   [smoker] /home/jenkins/jenkins-slave/workspace/Lucene-Solr-SmokeRelease-master/lucene/build/smokeTestRelease/tmp/unpack/lucene-8.0.0/module-build.xml:67: The following error occurred while executing this line:
   [smoker] /home/jenkins/jenkins-slave/workspace/Lucene-Solr-SmokeRelease-master/lucene/build/smokeTestRelease/tmp/unpack/lucene-8.0.0/common-build.xml:1560: The following error occurred while executing this line:
   [smoker] /home/jenkins/jenkins-slave/workspace/Lucene-Solr-SmokeRelease-master/lucene/build/smokeTestRelease/tmp/unpack/lucene-8.0.0/common-build.xml:1085: There were test failures: 18 suites, 691 tests, 1 failure, 1 ignored (1 assumption) [seed: AF530D5BB3E29D37]
   [smoker] 
   [smoker] Total time: 80 minutes 44 seconds
   [smoker] 
   [smoker] 
   [smoker] Traceback (most recent call last):
   [smoker]   File "/home/jenkins/jenkins-slave/workspace/Lucene-Solr-SmokeRelease-master/dev-tools/scripts/smokeTestRelease.py", line 1521, in <module>
   [smoker]     main()
   [smoker]   File "/home/jenkins/jenkins-slave/workspace/Lucene-Solr-SmokeRelease-master/dev-tools/scripts/smokeTestRelease.py", line 1465, in main
   [smoker]     smokeTest(c.java, c.url, c.revision, c.version, c.tmp_dir, c.is_signed, ' '.join(c.test_args))
   [smoker]   File "/home/jenkins/jenkins-slave/workspace/Lucene-Solr-SmokeRelease-master/dev-tools/scripts/smokeTestRelease.py", line 1503, in smokeTest
   [smoker]     unpackAndVerify(java, 'lucene', tmpDir, 'lucene-%s-src.tgz' % version, gitRevision, version, testArgs, baseURL)
   [smoker]   File "/home/jenkins/jenkins-slave/workspace/Lucene-Solr-SmokeRelease-master/dev-tools/scripts/smokeTestRelease.py", line 622, in unpackAndVerify
   [smoker]     verifyUnpacked(java, project, artifact, unpackPath, gitRevision, version, testArgs, tmpDir, baseURL)
   [smoker]   File "/home/jenkins/jenkins-slave/workspace/Lucene-Solr-SmokeRelease-master/dev-tools/scripts/smokeTestRelease.py", line 731, in verifyUnpacked
   [smoker]     java.run_java9('ant clean test %s' % testArgs, '%s/test.log' % unpackPath)
   [smoker]   File "/home/jenkins/jenkins-slave/workspace/Lucene-Solr-SmokeRelease-master/dev-tools/scripts/smokeTestRelease.py", line 1267, in run_java
   [smoker]     run('%s; %s' % (cmd_prefix, cmd), logfile)
   [smoker]   File "/home/jenkins/jenkins-slave/workspace/Lucene-Solr-SmokeRelease-master/dev-tools/scripts/smokeTestRelease.py", line 547, in run
   [smoker]     raise RuntimeError('command "%s" failed; see log file %s' % (command, logPath))
   [smoker] RuntimeError: command "export JAVA_HOME="/home/jenkins/tools/java/latest1.9" PATH="/home/jenkins/tools/java/latest1.9/bin:$PATH" JAVACMD="/home/jenkins/tools/java/latest1.9/bin/java"; ant clean test -Dtests.slow=false" failed; see log file /home/jenkins/jenkins-slave/workspace/Lucene-Solr-SmokeRelease-master/lucene/build/smokeTestRelease/tmp/unpack/lucene-8.0.0/test.log

BUILD FAILED
/home/jenkins/jenkins-slave/workspace/Lucene-Solr-SmokeRelease-master/build.xml:447: exec returned: 1

Total time: 172 minutes 19 seconds
Build step 'Invoke Ant' marked build as failure
Setting JDK_1_9_LATEST__HOME=/home/jenkins/tools/java/latest1.9
Email was triggered for: Failure - Any
Sending email for trigger: Failure - Any
Setting JDK_1_9_LATEST__HOME=/home/jenkins/tools/java/latest1.9
Setting JDK_1_9_LATEST__HOME=/home/jenkins/tools/java/latest1.9

Mime
View raw message