lucene-dev mailing list archives

Site index · List index
Message view « Date » · « Thread »
Top « Date » · « Thread »
From Apache Jenkins Server <jenk...@builds.apache.org>
Subject [JENKINS] Lucene-Solr-NightlyTests-master - Build # 1484 - Still Failing
Date Thu, 22 Feb 2018 17:28:12 GMT
Build: https://builds.apache.org/job/Lucene-Solr-NightlyTests-master/1484/

4 tests failed.
FAILED:  org.apache.solr.cloud.ReplaceNodeNoTargetTest.test

Error Message:


Stack Trace:
java.lang.AssertionError
	at __randomizedtesting.SeedInfo.seed([49E30565A85D27F4:C1B73ABF06A14A0C]:0)
	at org.junit.Assert.fail(Assert.java:92)
	at org.junit.Assert.assertTrue(Assert.java:43)
	at org.junit.Assert.assertTrue(Assert.java:54)
	at org.apache.solr.cloud.ReplaceNodeNoTargetTest.test(ReplaceNodeNoTargetTest.java:92)
	at sun.reflect.NativeMethodAccessorImpl.invoke0(Native Method)
	at sun.reflect.NativeMethodAccessorImpl.invoke(NativeMethodAccessorImpl.java:62)
	at sun.reflect.DelegatingMethodAccessorImpl.invoke(DelegatingMethodAccessorImpl.java:43)
	at java.lang.reflect.Method.invoke(Method.java:498)
	at com.carrotsearch.randomizedtesting.RandomizedRunner.invoke(RandomizedRunner.java:1737)
	at com.carrotsearch.randomizedtesting.RandomizedRunner$8.evaluate(RandomizedRunner.java:934)
	at com.carrotsearch.randomizedtesting.RandomizedRunner$9.evaluate(RandomizedRunner.java:970)
	at com.carrotsearch.randomizedtesting.RandomizedRunner$10.evaluate(RandomizedRunner.java:984)
	at com.carrotsearch.randomizedtesting.rules.SystemPropertiesRestoreRule$1.evaluate(SystemPropertiesRestoreRule.java:57)
	at org.apache.lucene.util.TestRuleSetupTeardownChained$1.evaluate(TestRuleSetupTeardownChained.java:49)
	at org.apache.lucene.util.AbstractBeforeAfterRule$1.evaluate(AbstractBeforeAfterRule.java:45)
	at org.apache.lucene.util.TestRuleThreadAndTestName$1.evaluate(TestRuleThreadAndTestName.java:48)
	at org.apache.lucene.util.TestRuleIgnoreAfterMaxFailures$1.evaluate(TestRuleIgnoreAfterMaxFailures.java:64)
	at org.apache.lucene.util.TestRuleMarkFailure$1.evaluate(TestRuleMarkFailure.java:47)
	at com.carrotsearch.randomizedtesting.rules.StatementAdapter.evaluate(StatementAdapter.java:36)
	at com.carrotsearch.randomizedtesting.ThreadLeakControl$StatementRunner.run(ThreadLeakControl.java:368)
	at com.carrotsearch.randomizedtesting.ThreadLeakControl.forkTimeoutingTask(ThreadLeakControl.java:817)
	at com.carrotsearch.randomizedtesting.ThreadLeakControl$3.evaluate(ThreadLeakControl.java:468)
	at com.carrotsearch.randomizedtesting.RandomizedRunner.runSingleTest(RandomizedRunner.java:943)
	at com.carrotsearch.randomizedtesting.RandomizedRunner$5.evaluate(RandomizedRunner.java:829)
	at com.carrotsearch.randomizedtesting.RandomizedRunner$6.evaluate(RandomizedRunner.java:879)
	at com.carrotsearch.randomizedtesting.RandomizedRunner$7.evaluate(RandomizedRunner.java:890)
	at com.carrotsearch.randomizedtesting.rules.StatementAdapter.evaluate(StatementAdapter.java:36)
	at com.carrotsearch.randomizedtesting.rules.SystemPropertiesRestoreRule$1.evaluate(SystemPropertiesRestoreRule.java:57)
	at org.apache.lucene.util.AbstractBeforeAfterRule$1.evaluate(AbstractBeforeAfterRule.java:45)
	at com.carrotsearch.randomizedtesting.rules.StatementAdapter.evaluate(StatementAdapter.java:36)
	at org.apache.lucene.util.TestRuleStoreClassName$1.evaluate(TestRuleStoreClassName.java:41)
	at com.carrotsearch.randomizedtesting.rules.NoShadowingOrOverridesOnMethodsRule$1.evaluate(NoShadowingOrOverridesOnMethodsRule.java:40)
	at com.carrotsearch.randomizedtesting.rules.NoShadowingOrOverridesOnMethodsRule$1.evaluate(NoShadowingOrOverridesOnMethodsRule.java:40)
	at com.carrotsearch.randomizedtesting.rules.StatementAdapter.evaluate(StatementAdapter.java:36)
	at com.carrotsearch.randomizedtesting.rules.StatementAdapter.evaluate(StatementAdapter.java:36)
	at com.carrotsearch.randomizedtesting.rules.StatementAdapter.evaluate(StatementAdapter.java:36)
	at org.apache.lucene.util.TestRuleAssertionsRequired$1.evaluate(TestRuleAssertionsRequired.java:53)
	at org.apache.lucene.util.TestRuleMarkFailure$1.evaluate(TestRuleMarkFailure.java:47)
	at org.apache.lucene.util.TestRuleIgnoreAfterMaxFailures$1.evaluate(TestRuleIgnoreAfterMaxFailures.java:64)
	at org.apache.lucene.util.TestRuleIgnoreTestSuites$1.evaluate(TestRuleIgnoreTestSuites.java:54)
	at com.carrotsearch.randomizedtesting.rules.StatementAdapter.evaluate(StatementAdapter.java:36)
	at com.carrotsearch.randomizedtesting.ThreadLeakControl$StatementRunner.run(ThreadLeakControl.java:368)
	at java.lang.Thread.run(Thread.java:748)


FAILED:  org.apache.solr.cloud.SharedFSAutoReplicaFailoverTest.test

Error Message:
Expected numSlices=5 numReplicas=1 but found DocCollection(solrj_collection4//collections/solrj_collection4/state.json/29)={   "pullReplicas":"0",   "replicationFactor":"1",   "shards":{     "shard1":{       "range":"80000000-b332ffff",       "state":"active",       "replicas":{"core_node3":{           "dataDir":"hdfs://lucene2-us-west.apache.org:36951/solr_hdfs_home/solrj_collection4/core_node3/data/",           "base_url":"http://127.0.0.1:32872/a_k",           "node_name":"127.0.0.1:32872_a_k",           "type":"NRT",           "ulogDir":"hdfs://lucene2-us-west.apache.org:36951/solr_hdfs_home/solrj_collection4/core_node3/data/tlog",           "core":"solrj_collection4_shard1_replica_n1",           "shared_storage":"true",           "state":"active",           "leader":"true"}}},     "shard2":{       "range":"b3330000-e665ffff",       "state":"active",       "replicas":{}},     "shard3":{       "range":"e6660000-1998ffff",       "state":"active",       "replicas":{"core_node7":{           "dataDir":"hdfs://lucene2-us-west.apache.org:36951/solr_hdfs_home/solrj_collection4/core_node7/data/",           "base_url":"http://127.0.0.1:35319/a_k",           "node_name":"127.0.0.1:35319_a_k",           "type":"NRT",           "ulogDir":"hdfs://lucene2-us-west.apache.org:36951/solr_hdfs_home/solrj_collection4/core_node7/data/tlog",           "core":"solrj_collection4_shard3_replica_n5",           "shared_storage":"true",           "state":"active",           "leader":"true"}}},     "shard4":{       "range":"19990000-4ccbffff",       "state":"active",       "replicas":{"core_node8":{           "dataDir":"hdfs://lucene2-us-west.apache.org:36951/solr_hdfs_home/solrj_collection4/core_node8/data/",           "base_url":"http://127.0.0.1:39757/a_k",           "node_name":"127.0.0.1:39757_a_k",           "type":"NRT",           "ulogDir":"hdfs://lucene2-us-west.apache.org:36951/solr_hdfs_home/solrj_collection4/core_node8/data/tlog",           "core":"solrj_collection4_shard4_replica_n6",           "shared_storage":"true",           "state":"active",           "leader":"true"}}},     "shard5":{       "range":"4ccc0000-7fffffff",       "state":"active",       "replicas":{"core_node10":{           "dataDir":"hdfs://lucene2-us-west.apache.org:36951/solr_hdfs_home/solrj_collection4/core_node10/data/",           "base_url":"http://127.0.0.1:35319/a_k",           "node_name":"127.0.0.1:35319_a_k",           "type":"NRT",           "ulogDir":"hdfs://lucene2-us-west.apache.org:36951/solr_hdfs_home/solrj_collection4/core_node10/data/tlog",           "core":"solrj_collection4_shard5_replica_n9",           "shared_storage":"true",           "state":"active",           "leader":"true"}}}},   "router":{     "field":"text",     "name":"compositeId"},   "maxShardsPerNode":"5",   "autoAddReplicas":"true",   "nrtReplicas":"1",   "tlogReplicas":"0"} with /live_nodes: [127.0.0.1:32872_a_k, 127.0.0.1:35319_a_k, 127.0.0.1:37271_a_k, 127.0.0.1:37612_a_k, 127.0.0.1:39757_a_k]

Stack Trace:
java.lang.AssertionError: Expected numSlices=5 numReplicas=1 but found DocCollection(solrj_collection4//collections/solrj_collection4/state.json/29)={
  "pullReplicas":"0",
  "replicationFactor":"1",
  "shards":{
    "shard1":{
      "range":"80000000-b332ffff",
      "state":"active",
      "replicas":{"core_node3":{
          "dataDir":"hdfs://lucene2-us-west.apache.org:36951/solr_hdfs_home/solrj_collection4/core_node3/data/",
          "base_url":"http://127.0.0.1:32872/a_k",
          "node_name":"127.0.0.1:32872_a_k",
          "type":"NRT",
          "ulogDir":"hdfs://lucene2-us-west.apache.org:36951/solr_hdfs_home/solrj_collection4/core_node3/data/tlog",
          "core":"solrj_collection4_shard1_replica_n1",
          "shared_storage":"true",
          "state":"active",
          "leader":"true"}}},
    "shard2":{
      "range":"b3330000-e665ffff",
      "state":"active",
      "replicas":{}},
    "shard3":{
      "range":"e6660000-1998ffff",
      "state":"active",
      "replicas":{"core_node7":{
          "dataDir":"hdfs://lucene2-us-west.apache.org:36951/solr_hdfs_home/solrj_collection4/core_node7/data/",
          "base_url":"http://127.0.0.1:35319/a_k",
          "node_name":"127.0.0.1:35319_a_k",
          "type":"NRT",
          "ulogDir":"hdfs://lucene2-us-west.apache.org:36951/solr_hdfs_home/solrj_collection4/core_node7/data/tlog",
          "core":"solrj_collection4_shard3_replica_n5",
          "shared_storage":"true",
          "state":"active",
          "leader":"true"}}},
    "shard4":{
      "range":"19990000-4ccbffff",
      "state":"active",
      "replicas":{"core_node8":{
          "dataDir":"hdfs://lucene2-us-west.apache.org:36951/solr_hdfs_home/solrj_collection4/core_node8/data/",
          "base_url":"http://127.0.0.1:39757/a_k",
          "node_name":"127.0.0.1:39757_a_k",
          "type":"NRT",
          "ulogDir":"hdfs://lucene2-us-west.apache.org:36951/solr_hdfs_home/solrj_collection4/core_node8/data/tlog",
          "core":"solrj_collection4_shard4_replica_n6",
          "shared_storage":"true",
          "state":"active",
          "leader":"true"}}},
    "shard5":{
      "range":"4ccc0000-7fffffff",
      "state":"active",
      "replicas":{"core_node10":{
          "dataDir":"hdfs://lucene2-us-west.apache.org:36951/solr_hdfs_home/solrj_collection4/core_node10/data/",
          "base_url":"http://127.0.0.1:35319/a_k",
          "node_name":"127.0.0.1:35319_a_k",
          "type":"NRT",
          "ulogDir":"hdfs://lucene2-us-west.apache.org:36951/solr_hdfs_home/solrj_collection4/core_node10/data/tlog",
          "core":"solrj_collection4_shard5_replica_n9",
          "shared_storage":"true",
          "state":"active",
          "leader":"true"}}}},
  "router":{
    "field":"text",
    "name":"compositeId"},
  "maxShardsPerNode":"5",
  "autoAddReplicas":"true",
  "nrtReplicas":"1",
  "tlogReplicas":"0"} with /live_nodes: [127.0.0.1:32872_a_k, 127.0.0.1:35319_a_k, 127.0.0.1:37271_a_k, 127.0.0.1:37612_a_k, 127.0.0.1:39757_a_k]
	at __randomizedtesting.SeedInfo.seed([49E30565A85D27F4:C1B73ABF06A14A0C]:0)
	at org.junit.Assert.fail(Assert.java:93)
	at org.apache.solr.cloud.SharedFSAutoReplicaFailoverTest.assertSliceAndReplicaCount(SharedFSAutoReplicaFailoverTest.java:414)
	at org.apache.solr.cloud.SharedFSAutoReplicaFailoverTest.testBasics(SharedFSAutoReplicaFailoverTest.java:259)
	at org.apache.solr.cloud.SharedFSAutoReplicaFailoverTest.test(SharedFSAutoReplicaFailoverTest.java:144)
	at sun.reflect.NativeMethodAccessorImpl.invoke0(Native Method)
	at sun.reflect.NativeMethodAccessorImpl.invoke(NativeMethodAccessorImpl.java:62)
	at sun.reflect.DelegatingMethodAccessorImpl.invoke(DelegatingMethodAccessorImpl.java:43)
	at java.lang.reflect.Method.invoke(Method.java:498)
	at com.carrotsearch.randomizedtesting.RandomizedRunner.invoke(RandomizedRunner.java:1737)
	at com.carrotsearch.randomizedtesting.RandomizedRunner$8.evaluate(RandomizedRunner.java:934)
	at com.carrotsearch.randomizedtesting.RandomizedRunner$9.evaluate(RandomizedRunner.java:970)
	at com.carrotsearch.randomizedtesting.RandomizedRunner$10.evaluate(RandomizedRunner.java:984)
	at org.apache.solr.BaseDistributedSearchTestCase$ShardsRepeatRule$ShardsFixedStatement.callStatement(BaseDistributedSearchTestCase.java:993)
	at org.apache.solr.BaseDistributedSearchTestCase$ShardsRepeatRule$ShardsStatement.evaluate(BaseDistributedSearchTestCase.java:968)
	at com.carrotsearch.randomizedtesting.rules.SystemPropertiesRestoreRule$1.evaluate(SystemPropertiesRestoreRule.java:57)
	at org.apache.lucene.util.TestRuleSetupTeardownChained$1.evaluate(TestRuleSetupTeardownChained.java:49)
	at org.apache.lucene.util.AbstractBeforeAfterRule$1.evaluate(AbstractBeforeAfterRule.java:45)
	at org.apache.lucene.util.TestRuleThreadAndTestName$1.evaluate(TestRuleThreadAndTestName.java:48)
	at org.apache.lucene.util.TestRuleIgnoreAfterMaxFailures$1.evaluate(TestRuleIgnoreAfterMaxFailures.java:64)
	at org.apache.lucene.util.TestRuleMarkFailure$1.evaluate(TestRuleMarkFailure.java:47)
	at com.carrotsearch.randomizedtesting.rules.StatementAdapter.evaluate(StatementAdapter.java:36)
	at com.carrotsearch.randomizedtesting.ThreadLeakControl$StatementRunner.run(ThreadLeakControl.java:368)
	at com.carrotsearch.randomizedtesting.ThreadLeakControl.forkTimeoutingTask(ThreadLeakControl.java:817)
	at com.carrotsearch.randomizedtesting.ThreadLeakControl$3.evaluate(ThreadLeakControl.java:468)
	at com.carrotsearch.randomizedtesting.RandomizedRunner.runSingleTest(RandomizedRunner.java:943)
	at com.carrotsearch.randomizedtesting.RandomizedRunner$5.evaluate(RandomizedRunner.java:829)
	at com.carrotsearch.randomizedtesting.RandomizedRunner$6.evaluate(RandomizedRunner.java:879)
	at com.carrotsearch.randomizedtesting.RandomizedRunner$7.evaluate(RandomizedRunner.java:890)
	at com.carrotsearch.randomizedtesting.rules.StatementAdapter.evaluate(StatementAdapter.java:36)
	at com.carrotsearch.randomizedtesting.rules.SystemPropertiesRestoreRule$1.evaluate(SystemPropertiesRestoreRule.java:57)
	at org.apache.lucene.util.AbstractBeforeAfterRule$1.evaluate(AbstractBeforeAfterRule.java:45)
	at com.carrotsearch.randomizedtesting.rules.StatementAdapter.evaluate(StatementAdapter.java:36)
	at org.apache.lucene.util.TestRuleStoreClassName$1.evaluate(TestRuleStoreClassName.java:41)
	at com.carrotsearch.randomizedtesting.rules.NoShadowingOrOverridesOnMethodsRule$1.evaluate(NoShadowingOrOverridesOnMethodsRule.java:40)
	at com.carrotsearch.randomizedtesting.rules.NoShadowingOrOverridesOnMethodsRule$1.evaluate(NoShadowingOrOverridesOnMethodsRule.java:40)
	at com.carrotsearch.randomizedtesting.rules.StatementAdapter.evaluate(StatementAdapter.java:36)
	at com.carrotsearch.randomizedtesting.rules.StatementAdapter.evaluate(StatementAdapter.java:36)
	at com.carrotsearch.randomizedtesting.rules.StatementAdapter.evaluate(StatementAdapter.java:36)
	at org.apache.lucene.util.TestRuleAssertionsRequired$1.evaluate(TestRuleAssertionsRequired.java:53)
	at org.apache.lucene.util.TestRuleMarkFailure$1.evaluate(TestRuleMarkFailure.java:47)
	at org.apache.lucene.util.TestRuleIgnoreAfterMaxFailures$1.evaluate(TestRuleIgnoreAfterMaxFailures.java:64)
	at org.apache.lucene.util.TestRuleIgnoreTestSuites$1.evaluate(TestRuleIgnoreTestSuites.java:54)
	at com.carrotsearch.randomizedtesting.rules.StatementAdapter.evaluate(StatementAdapter.java:36)
	at com.carrotsearch.randomizedtesting.ThreadLeakControl$StatementRunner.run(ThreadLeakControl.java:368)
	at java.lang.Thread.run(Thread.java:748)


FAILED:  org.apache.solr.cloud.TestUtilizeNode.test

Error Message:
no replica should be present in  127.0.0.1:42745_solr

Stack Trace:
java.lang.AssertionError: no replica should be present in  127.0.0.1:42745_solr
	at __randomizedtesting.SeedInfo.seed([49E30565A85D27F4:C1B73ABF06A14A0C]:0)
	at org.junit.Assert.fail(Assert.java:93)
	at org.junit.Assert.assertTrue(Assert.java:43)
	at org.apache.solr.cloud.TestUtilizeNode.test(TestUtilizeNode.java:99)
	at sun.reflect.NativeMethodAccessorImpl.invoke0(Native Method)
	at sun.reflect.NativeMethodAccessorImpl.invoke(NativeMethodAccessorImpl.java:62)
	at sun.reflect.DelegatingMethodAccessorImpl.invoke(DelegatingMethodAccessorImpl.java:43)
	at java.lang.reflect.Method.invoke(Method.java:498)
	at com.carrotsearch.randomizedtesting.RandomizedRunner.invoke(RandomizedRunner.java:1737)
	at com.carrotsearch.randomizedtesting.RandomizedRunner$8.evaluate(RandomizedRunner.java:934)
	at com.carrotsearch.randomizedtesting.RandomizedRunner$9.evaluate(RandomizedRunner.java:970)
	at com.carrotsearch.randomizedtesting.RandomizedRunner$10.evaluate(RandomizedRunner.java:984)
	at com.carrotsearch.randomizedtesting.rules.SystemPropertiesRestoreRule$1.evaluate(SystemPropertiesRestoreRule.java:57)
	at org.apache.lucene.util.TestRuleSetupTeardownChained$1.evaluate(TestRuleSetupTeardownChained.java:49)
	at org.apache.lucene.util.AbstractBeforeAfterRule$1.evaluate(AbstractBeforeAfterRule.java:45)
	at org.apache.lucene.util.TestRuleThreadAndTestName$1.evaluate(TestRuleThreadAndTestName.java:48)
	at org.apache.lucene.util.TestRuleIgnoreAfterMaxFailures$1.evaluate(TestRuleIgnoreAfterMaxFailures.java:64)
	at org.apache.lucene.util.TestRuleMarkFailure$1.evaluate(TestRuleMarkFailure.java:47)
	at com.carrotsearch.randomizedtesting.rules.StatementAdapter.evaluate(StatementAdapter.java:36)
	at com.carrotsearch.randomizedtesting.ThreadLeakControl$StatementRunner.run(ThreadLeakControl.java:368)
	at com.carrotsearch.randomizedtesting.ThreadLeakControl.forkTimeoutingTask(ThreadLeakControl.java:817)
	at com.carrotsearch.randomizedtesting.ThreadLeakControl$3.evaluate(ThreadLeakControl.java:468)
	at com.carrotsearch.randomizedtesting.RandomizedRunner.runSingleTest(RandomizedRunner.java:943)
	at com.carrotsearch.randomizedtesting.RandomizedRunner$5.evaluate(RandomizedRunner.java:829)
	at com.carrotsearch.randomizedtesting.RandomizedRunner$6.evaluate(RandomizedRunner.java:879)
	at com.carrotsearch.randomizedtesting.RandomizedRunner$7.evaluate(RandomizedRunner.java:890)
	at com.carrotsearch.randomizedtesting.rules.StatementAdapter.evaluate(StatementAdapter.java:36)
	at com.carrotsearch.randomizedtesting.rules.SystemPropertiesRestoreRule$1.evaluate(SystemPropertiesRestoreRule.java:57)
	at org.apache.lucene.util.AbstractBeforeAfterRule$1.evaluate(AbstractBeforeAfterRule.java:45)
	at com.carrotsearch.randomizedtesting.rules.StatementAdapter.evaluate(StatementAdapter.java:36)
	at org.apache.lucene.util.TestRuleStoreClassName$1.evaluate(TestRuleStoreClassName.java:41)
	at com.carrotsearch.randomizedtesting.rules.NoShadowingOrOverridesOnMethodsRule$1.evaluate(NoShadowingOrOverridesOnMethodsRule.java:40)
	at com.carrotsearch.randomizedtesting.rules.NoShadowingOrOverridesOnMethodsRule$1.evaluate(NoShadowingOrOverridesOnMethodsRule.java:40)
	at com.carrotsearch.randomizedtesting.rules.StatementAdapter.evaluate(StatementAdapter.java:36)
	at com.carrotsearch.randomizedtesting.rules.StatementAdapter.evaluate(StatementAdapter.java:36)
	at com.carrotsearch.randomizedtesting.rules.StatementAdapter.evaluate(StatementAdapter.java:36)
	at org.apache.lucene.util.TestRuleAssertionsRequired$1.evaluate(TestRuleAssertionsRequired.java:53)
	at org.apache.lucene.util.TestRuleMarkFailure$1.evaluate(TestRuleMarkFailure.java:47)
	at org.apache.lucene.util.TestRuleIgnoreAfterMaxFailures$1.evaluate(TestRuleIgnoreAfterMaxFailures.java:64)
	at org.apache.lucene.util.TestRuleIgnoreTestSuites$1.evaluate(TestRuleIgnoreTestSuites.java:54)
	at com.carrotsearch.randomizedtesting.rules.StatementAdapter.evaluate(StatementAdapter.java:36)
	at com.carrotsearch.randomizedtesting.ThreadLeakControl$StatementRunner.run(ThreadLeakControl.java:368)
	at java.lang.Thread.run(Thread.java:748)


FAILED:  org.apache.solr.handler.TestReplicationHandler.doTestReplicateAfterCoreReload

Error Message:
expected:<[{indexVersion=1519310817123,generation=2,filelist=[_6o.fdt, _6o.fdx, _6o.fnm, _6o.nvd, _6o.nvm, _6o.si, _6o_Direct_0.doc, _6o_Direct_0.tim, _6o_Direct_0.tip, _6p.cfe, _6p.cfs, _6p.si, _6q.cfe, _6q.cfs, _6q.si, _6r.cfe, _6r.cfs, _6r.si, _6s.cfe, _6s.cfs, _6s.si, _6t.cfe, _6t.cfs, _6t.si, _6u.cfe, _6u.cfs, _6u.si, _6v.cfe, _6v.cfs, _6v.si, segments_2]}]> but was:<[{indexVersion=1519310817123,generation=2,filelist=[_6o.fdt, _6o.fdx, _6o.fnm, _6o.nvd, _6o.nvm, _6o.si, _6o_Direct_0.doc, _6o_Direct_0.tim, _6o_Direct_0.tip, _6p.cfe, _6p.cfs, _6p.si, _6q.cfe, _6q.cfs, _6q.si, _6r.cfe, _6r.cfs, _6r.si, _6s.cfe, _6s.cfs, _6s.si, _6t.cfe, _6t.cfs, _6t.si, _6u.cfe, _6u.cfs, _6u.si, _6v.cfe, _6v.cfs, _6v.si, segments_2]}, {indexVersion=1519310817123,generation=3,filelist=[_6w.fdt, _6w.fdx, _6w.fnm, _6w.nvd, _6w.nvm, _6w.si, _6w_Direct_0.doc, _6w_Direct_0.tim, _6w_Direct_0.tip, segments_3]}]>

Stack Trace:
java.lang.AssertionError: expected:<[{indexVersion=1519310817123,generation=2,filelist=[_6o.fdt, _6o.fdx, _6o.fnm, _6o.nvd, _6o.nvm, _6o.si, _6o_Direct_0.doc, _6o_Direct_0.tim, _6o_Direct_0.tip, _6p.cfe, _6p.cfs, _6p.si, _6q.cfe, _6q.cfs, _6q.si, _6r.cfe, _6r.cfs, _6r.si, _6s.cfe, _6s.cfs, _6s.si, _6t.cfe, _6t.cfs, _6t.si, _6u.cfe, _6u.cfs, _6u.si, _6v.cfe, _6v.cfs, _6v.si, segments_2]}]> but was:<[{indexVersion=1519310817123,generation=2,filelist=[_6o.fdt, _6o.fdx, _6o.fnm, _6o.nvd, _6o.nvm, _6o.si, _6o_Direct_0.doc, _6o_Direct_0.tim, _6o_Direct_0.tip, _6p.cfe, _6p.cfs, _6p.si, _6q.cfe, _6q.cfs, _6q.si, _6r.cfe, _6r.cfs, _6r.si, _6s.cfe, _6s.cfs, _6s.si, _6t.cfe, _6t.cfs, _6t.si, _6u.cfe, _6u.cfs, _6u.si, _6v.cfe, _6v.cfs, _6v.si, segments_2]}, {indexVersion=1519310817123,generation=3,filelist=[_6w.fdt, _6w.fdx, _6w.fnm, _6w.nvd, _6w.nvm, _6w.si, _6w_Direct_0.doc, _6w_Direct_0.tim, _6w_Direct_0.tip, segments_3]}]>
	at __randomizedtesting.SeedInfo.seed([49E30565A85D27F4:6C341E55D81529F7]:0)
	at org.junit.Assert.fail(Assert.java:93)
	at org.junit.Assert.failNotEquals(Assert.java:647)
	at org.junit.Assert.assertEquals(Assert.java:128)
	at org.junit.Assert.assertEquals(Assert.java:147)
	at org.apache.solr.handler.TestReplicationHandler.doTestReplicateAfterCoreReload(TestReplicationHandler.java:1277)
	at sun.reflect.NativeMethodAccessorImpl.invoke0(Native Method)
	at sun.reflect.NativeMethodAccessorImpl.invoke(NativeMethodAccessorImpl.java:62)
	at sun.reflect.DelegatingMethodAccessorImpl.invoke(DelegatingMethodAccessorImpl.java:43)
	at java.lang.reflect.Method.invoke(Method.java:498)
	at com.carrotsearch.randomizedtesting.RandomizedRunner.invoke(RandomizedRunner.java:1737)
	at com.carrotsearch.randomizedtesting.RandomizedRunner$8.evaluate(RandomizedRunner.java:934)
	at com.carrotsearch.randomizedtesting.RandomizedRunner$9.evaluate(RandomizedRunner.java:970)
	at com.carrotsearch.randomizedtesting.RandomizedRunner$10.evaluate(RandomizedRunner.java:984)
	at com.carrotsearch.randomizedtesting.rules.SystemPropertiesRestoreRule$1.evaluate(SystemPropertiesRestoreRule.java:57)
	at org.apache.lucene.util.TestRuleSetupTeardownChained$1.evaluate(TestRuleSetupTeardownChained.java:49)
	at org.apache.lucene.util.AbstractBeforeAfterRule$1.evaluate(AbstractBeforeAfterRule.java:45)
	at org.apache.lucene.util.TestRuleThreadAndTestName$1.evaluate(TestRuleThreadAndTestName.java:48)
	at org.apache.lucene.util.TestRuleIgnoreAfterMaxFailures$1.evaluate(TestRuleIgnoreAfterMaxFailures.java:64)
	at org.apache.lucene.util.TestRuleMarkFailure$1.evaluate(TestRuleMarkFailure.java:47)
	at com.carrotsearch.randomizedtesting.rules.StatementAdapter.evaluate(StatementAdapter.java:36)
	at com.carrotsearch.randomizedtesting.ThreadLeakControl$StatementRunner.run(ThreadLeakControl.java:368)
	at com.carrotsearch.randomizedtesting.ThreadLeakControl.forkTimeoutingTask(ThreadLeakControl.java:817)
	at com.carrotsearch.randomizedtesting.ThreadLeakControl$3.evaluate(ThreadLeakControl.java:468)
	at com.carrotsearch.randomizedtesting.RandomizedRunner.runSingleTest(RandomizedRunner.java:943)
	at com.carrotsearch.randomizedtesting.RandomizedRunner$5.evaluate(RandomizedRunner.java:829)
	at com.carrotsearch.randomizedtesting.RandomizedRunner$6.evaluate(RandomizedRunner.java:879)
	at com.carrotsearch.randomizedtesting.RandomizedRunner$7.evaluate(RandomizedRunner.java:890)
	at com.carrotsearch.randomizedtesting.rules.StatementAdapter.evaluate(StatementAdapter.java:36)
	at com.carrotsearch.randomizedtesting.rules.SystemPropertiesRestoreRule$1.evaluate(SystemPropertiesRestoreRule.java:57)
	at org.apache.lucene.util.AbstractBeforeAfterRule$1.evaluate(AbstractBeforeAfterRule.java:45)
	at com.carrotsearch.randomizedtesting.rules.StatementAdapter.evaluate(StatementAdapter.java:36)
	at org.apache.lucene.util.TestRuleStoreClassName$1.evaluate(TestRuleStoreClassName.java:41)
	at com.carrotsearch.randomizedtesting.rules.NoShadowingOrOverridesOnMethodsRule$1.evaluate(NoShadowingOrOverridesOnMethodsRule.java:40)
	at com.carrotsearch.randomizedtesting.rules.NoShadowingOrOverridesOnMethodsRule$1.evaluate(NoShadowingOrOverridesOnMethodsRule.java:40)
	at com.carrotsearch.randomizedtesting.rules.StatementAdapter.evaluate(StatementAdapter.java:36)
	at com.carrotsearch.randomizedtesting.rules.StatementAdapter.evaluate(StatementAdapter.java:36)
	at com.carrotsearch.randomizedtesting.rules.StatementAdapter.evaluate(StatementAdapter.java:36)
	at org.apache.lucene.util.TestRuleAssertionsRequired$1.evaluate(TestRuleAssertionsRequired.java:53)
	at org.apache.lucene.util.TestRuleMarkFailure$1.evaluate(TestRuleMarkFailure.java:47)
	at org.apache.lucene.util.TestRuleIgnoreAfterMaxFailures$1.evaluate(TestRuleIgnoreAfterMaxFailures.java:64)
	at org.apache.lucene.util.TestRuleIgnoreTestSuites$1.evaluate(TestRuleIgnoreTestSuites.java:54)
	at com.carrotsearch.randomizedtesting.rules.StatementAdapter.evaluate(StatementAdapter.java:36)
	at com.carrotsearch.randomizedtesting.ThreadLeakControl$StatementRunner.run(ThreadLeakControl.java:368)
	at java.lang.Thread.run(Thread.java:748)




Build Log:
[...truncated 13275 lines...]
   [junit4] Suite: org.apache.solr.handler.TestReplicationHandler
   [junit4]   2> 697290 INFO  (SUITE-TestReplicationHandler-seed#[49E30565A85D27F4]-worker) [    ] o.a.s.SolrTestCaseJ4 SecureRandom sanity checks: test.solr.allowed.securerandom=null & java.security.egd=file:/dev/./urandom
   [junit4]   2> Creating dataDir: /home/jenkins/jenkins-slave/workspace/Lucene-Solr-NightlyTests-master/checkout/solr/build/solr-core/test/J1/temp/solr.handler.TestReplicationHandler_49E30565A85D27F4-001/init-core-data-001
   [junit4]   2> 697293 INFO  (SUITE-TestReplicationHandler-seed#[49E30565A85D27F4]-worker) [    ] o.a.s.SolrTestCaseJ4 Using PointFields (NUMERIC_POINTS_SYSPROP=true) w/NUMERIC_DOCVALUES_SYSPROP=true
   [junit4]   2> 697295 INFO  (SUITE-TestReplicationHandler-seed#[49E30565A85D27F4]-worker) [    ] o.a.s.SolrTestCaseJ4 Randomized ssl (false) and clientAuth (false) via: @org.apache.solr.SolrTestCaseJ4$SuppressSSL(bugUrl=None)
   [junit4]   2> 697302 INFO  (TEST-TestReplicationHandler.doTestStopPoll-seed#[49E30565A85D27F4]) [    ] o.a.s.SolrTestCaseJ4 ###Starting doTestStopPoll
   [junit4]   2> 697302 INFO  (TEST-TestReplicationHandler.doTestStopPoll-seed#[49E30565A85D27F4]) [    ] o.a.s.SolrTestCaseJ4 Writing core.properties file to /home/jenkins/jenkins-slave/workspace/Lucene-Solr-NightlyTests-master/checkout/solr/build/solr-core/test/J1/temp/solr.handler.TestReplicationHandler_49E30565A85D27F4-001/solr-instance-001/collection1
   [junit4]   2> 697306 INFO  (TEST-TestReplicationHandler.doTestStopPoll-seed#[49E30565A85D27F4]) [    ] o.e.j.s.Server jetty-9.4.8.v20171121, build timestamp: 2017-11-22T00:27:37+03:00, git hash: 82b8fb23f757335bb3329d540ce37a2a2615f0a8
   [junit4]   2> 697309 INFO  (TEST-TestReplicationHandler.doTestStopPoll-seed#[49E30565A85D27F4]) [    ] o.e.j.s.session DefaultSessionIdManager workerName=node0
   [junit4]   2> 697309 INFO  (TEST-TestReplicationHandler.doTestStopPoll-seed#[49E30565A85D27F4]) [    ] o.e.j.s.session No SessionScavenger set, using defaults
   [junit4]   2> 697309 INFO  (TEST-TestReplicationHandler.doTestStopPoll-seed#[49E30565A85D27F4]) [    ] o.e.j.s.session Scavenging every 600000ms
   [junit4]   2> 697310 INFO  (TEST-TestReplicationHandler.doTestStopPoll-seed#[49E30565A85D27F4]) [    ] o.e.j.s.h.ContextHandler Started o.e.j.s.ServletContextHandler@28db1d7e{/solr,null,AVAILABLE}
   [junit4]   2> 697311 INFO  (TEST-TestReplicationHandler.doTestStopPoll-seed#[49E30565A85D27F4]) [    ] o.e.j.s.AbstractConnector Started ServerConnector@76eee6c4{HTTP/1.1,[http/1.1]}{127.0.0.1:43221}
   [junit4]   2> 697311 INFO  (TEST-TestReplicationHandler.doTestStopPoll-seed#[49E30565A85D27F4]) [    ] o.e.j.s.Server Started @708387ms
   [junit4]   2> 697312 INFO  (TEST-TestReplicationHandler.doTestStopPoll-seed#[49E30565A85D27F4]) [    ] o.a.s.c.s.e.JettySolrRunner Jetty properties: {solr.data.dir=/home/jenkins/jenkins-slave/workspace/Lucene-Solr-NightlyTests-master/checkout/solr/build/solr-core/test/J1/temp/solr.handler.TestReplicationHandler_49E30565A85D27F4-001/solr-instance-001/collection1/data, hostContext=/solr, hostPort=43221}
   [junit4]   2> 697312 ERROR (TEST-TestReplicationHandler.doTestStopPoll-seed#[49E30565A85D27F4]) [    ] o.a.s.u.StartupLoggingUtils Missing Java Option solr.log.dir. Logging may be missing or incomplete.
   [junit4]   2> 697312 INFO  (TEST-TestReplicationHandler.doTestStopPoll-seed#[49E30565A85D27F4]) [    ] o.a.s.s.SolrDispatchFilter  ___      _       Welcome to Apache Solr? version 8.0.0
   [junit4]   2> 697312 INFO  (TEST-TestReplicationHandler.doTestStopPoll-seed#[49E30565A85D27F4]) [    ] o.a.s.s.SolrDispatchFilter / __| ___| |_ _   Starting in standalone mode on port null
   [junit4]   2> 697312 INFO  (TEST-TestReplicationHandler.doTestStopPoll-seed#[49E30565A85D27F4]) [    ] o.a.s.s.SolrDispatchFilter \__ \/ _ \ | '_|  Install dir: null
   [junit4]   2> 697312 INFO  (TEST-TestReplicationHandler.doTestStopPoll-seed#[49E30565A85D27F4]) [    ] o.a.s.s.SolrDispatchFilter |___/\___/_|_|    Start time: 2018-02-22T14:45:11.062Z
   [junit4]   2> 697312 INFO  (TEST-TestReplicationHandler.doTestStopPoll-seed#[49E30565A85D27F4]) [    ] o.a.s.c.SolrXmlConfig Loading container configuration from /home/jenkins/jenkins-slave/workspace/Lucene-Solr-NightlyTests-master/checkout/solr/build/solr-core/test/J1/temp/solr.handler.TestReplicationHandler_49E30565A85D27F4-001/solr-instance-001/solr.xml
   [junit4]   2> 697319 INFO  (TEST-TestReplicationHandler.doTestStopPoll-seed#[49E30565A85D27F4]) [    ] o.a.s.c.SolrXmlConfig Configuration parameter autoReplicaFailoverWorkLoopDelay is ignored
   [junit4]   2> 697319 INFO  (TEST-TestReplicationHandler.doTestStopPoll-seed#[49E30565A85D27F4]) [    ] o.a.s.c.SolrXmlConfig Configuration parameter autoReplicaFailoverBadNodeExpiration is ignored
   [junit4]   2> 697320 INFO  (TEST-TestReplicationHandler.doTestStopPoll-seed#[49E30565A85D27F4]) [    ] o.a.s.c.SolrXmlConfig MBean server found: com.sun.jmx.mbeanserver.JmxMBeanServer@6b2a90e1, but no JMX reporters were configured - adding default JMX reporter.
   [junit4]   2> 697362 INFO  (TEST-TestReplicationHandler.doTestStopPoll-seed#[49E30565A85D27F4]) [    ] o.a.s.m.r.SolrJmxReporter JMX monitoring for 'solr.node' (registry 'solr.node') enabled at server: com.sun.jmx.mbeanserver.JmxMBeanServer@6b2a90e1
   [junit4]   2> 697370 INFO  (TEST-TestReplicationHandler.doTestStopPoll-seed#[49E30565A85D27F4]) [    ] o.a.s.m.r.SolrJmxReporter JMX monitoring for 'solr.jvm' (registry 'solr.jvm') enabled at server: com.sun.jmx.mbeanserver.JmxMBeanServer@6b2a90e1
   [junit4]   2> 697370 INFO  (TEST-TestReplicationHandler.doTestStopPoll-seed#[49E30565A85D27F4]) [    ] o.a.s.m.r.SolrJmxReporter JMX monitoring for 'solr.jetty' (registry 'solr.jetty') enabled at server: com.sun.jmx.mbeanserver.JmxMBeanServer@6b2a90e1
   [junit4]   2> 697372 INFO  (TEST-TestReplicationHandler.doTestStopPoll-seed#[49E30565A85D27F4]) [    ] o.a.s.c.CorePropertiesLocator Found 1 core definitions underneath /home/jenkins/jenkins-slave/workspace/Lucene-Solr-NightlyTests-master/checkout/solr/build/solr-core/test/J1/temp/solr.handler.TestReplicationHandler_49E30565A85D27F4-001/solr-instance-001/.
   [junit4]   2> 697373 INFO  (TEST-TestReplicationHandler.doTestStopPoll-seed#[49E30565A85D27F4]) [    ] o.a.s.c.CorePropertiesLocator Cores are: [collection1]
   [junit4]   2> 697373 INFO  (coreLoadExecutor-763-thread-1) [    ] o.a.s.c.TransientSolrCoreCacheDefault Allocating transient cache for 4 transient cores
   [junit4]   2> 697385 INFO  (coreLoadExecutor-763-thread-1) [    x:collection1] o.a.s.c.SolrConfig Using Lucene MatchVersion: 8.0.0
   [junit4]   2> 697393 INFO  (coreLoadExecutor-763-thread-1) [    x:collection1] o.a.s.s.IndexSchema [collection1] Schema name=test
   [junit4]   2> 697400 INFO  (coreLoadExecutor-763-thread-1) [    x:collection1] o.a.s.s.IndexSchema Loaded schema test/1.2 with uniqueid field id
   [junit4]   2> 697400 INFO  (coreLoadExecutor-763-thread-1) [    x:collection1] o.a.s.c.CoreContainer Creating SolrCore 'collection1' using configuration from instancedir /home/jenkins/jenkins-slave/workspace/Lucene-Solr-NightlyTests-master/checkout/solr/build/solr-core/test/J1/temp/solr.handler.TestReplicationHandler_49E30565A85D27F4-001/solr-instance-001/./collection1, trusted=true
   [junit4]   2> 697401 INFO  (coreLoadExecutor-763-thread-1) [    x:collection1] o.a.s.m.r.SolrJmxReporter JMX monitoring for 'solr.core.collection1' (registry 'solr.core.collection1') enabled at server: com.sun.jmx.mbeanserver.JmxMBeanServer@6b2a90e1
   [junit4]   2> 697401 INFO  (coreLoadExecutor-763-thread-1) [    x:collection1] o.a.s.c.SolrCore solr.RecoveryStrategy.Builder
   [junit4]   2> 697401 INFO  (coreLoadExecutor-763-thread-1) [    x:collection1] o.a.s.c.SolrCore [[collection1] ] Opening new SolrCore at [/home/jenkins/jenkins-slave/workspace/Lucene-Solr-NightlyTests-master/checkout/solr/build/solr-core/test/J1/temp/solr.handler.TestReplicationHandler_49E30565A85D27F4-001/solr-instance-001/collection1], dataDir=[/home/jenkins/jenkins-slave/workspace/Lucene-Solr-NightlyTests-master/checkout/solr/build/solr-core/test/J1/temp/solr.handler.TestReplicationHandler_49E30565A85D27F4-001/solr-instance-001/./collection1/data/]
   [junit4]   2> 697403 INFO  (coreLoadExecutor-763-thread-1) [    x:collection1] o.a.s.u.RandomMergePolicy RandomMergePolicy wrapping class org.apache.lucene.index.LogByteSizeMergePolicy: [LogByteSizeMergePolicy: minMergeSize=1677721, mergeFactor=20, maxMergeSize=2147483648, maxMergeSizeForForcedMerge=9223372036854775807, calibrateSizeByDeletes=true, maxMergeDocs=2147483647, maxCFSSegmentSizeMB=8.796093022207999E12, noCFSRatio=0.44727340503987356]
   [junit4]   2> 697442 INFO  (coreLoadExecutor-763-thread-1) [    x:collection1] o.a.s.u.CommitTracker Hard AutoCommit: disabled
   [junit4]   2> 697442 INFO  (coreLoadExecutor-763-thread-1) [    x:collection1] o.a.s.u.CommitTracker Soft AutoCommit: disabled
   [junit4]   2> 697443 INFO  (coreLoadExecutor-763-thread-1) [    x:collection1] o.a.s.u.RandomMergePolicy RandomMergePolicy wrapping class org.apache.lucene.index.TieredMergePolicy: [TieredMergePolicy: maxMergeAtOnce=8, maxMergeAtOnceExplicit=3, maxMergedSegmentMB=90.6220703125, floorSegmentMB=1.375, forceMergeDeletesPctAllowed=6.115585968776253, segmentsPerTier=36.0, maxCFSSegmentSizeMB=8.796093022207999E12, noCFSRatio=0.6551703298782884
   [junit4]   2> 697443 INFO  (coreLoadExecutor-763-thread-1) [    x:collection1] o.a.s.s.SolrIndexSearcher Opening [Searcher@2dbd4880[collection1] main]
   [junit4]   2> 697444 INFO  (coreLoadExecutor-763-thread-1) [    x:collection1] o.a.s.r.ManagedResourceStorage File-based storage initialized to use dir: /home/jenkins/jenkins-slave/workspace/Lucene-Solr-NightlyTests-master/checkout/solr/build/solr-core/test/J1/temp/solr.handler.TestReplicationHandler_49E30565A85D27F4-001/solr-instance-001/collection1/conf
   [junit4]   2> 697444 INFO  (coreLoadExecutor-763-thread-1) [    x:collection1] o.a.s.h.ReplicationHandler Replication enabled for following config files: schema.xml,xslt/dummy.xsl
   [junit4]   2> 697444 INFO  (coreLoadExecutor-763-thread-1) [    x:collection1] o.a.s.h.ReplicationHandler Commits will be reserved for 10000ms.
   [junit4]   2> 697446 INFO  (searcherExecutor-764-thread-1-processing-x:collection1) [    x:collection1] o.a.s.c.SolrCore [collection1] Registered new searcher Searcher@2dbd4880[collection1] main{ExitableDirectoryReader(UninvertingDirectoryReader())}
   [junit4]   2> 697447 INFO  (TEST-TestReplicationHandler.doTestStopPoll-seed#[49E30565A85D27F4]) [    ] o.a.s.SolrTestCaseJ4 Writing core.properties file to /home/jenkins/jenkins-slave/workspace/Lucene-Solr-NightlyTests-master/checkout/solr/build/solr-core/test/J1/temp/solr.handler.TestReplicationHandler_49E30565A85D27F4-001/solr-instance-002/collection1
   [junit4]   2> 697450 INFO  (TEST-TestReplicationHandler.doTestStopPoll-seed#[49E30565A85D27F4]) [    ] o.e.j.s.Server jetty-9.4.8.v20171121, build timestamp: 2017-11-22T00:27:37+03:00, git hash: 82b8fb23f757335bb3329d540ce37a2a2615f0a8
   [junit4]   2> 697450 INFO  (TEST-TestReplicationHandler.doTestStopPoll-seed#[49E30565A85D27F4]) [    ] o.e.j.s.session DefaultSessionIdManager workerName=node0
   [junit4]   2> 697450 INFO  (TEST-TestReplicationHandler.doTestStopPoll-seed#[49E30565A85D27F4]) [    ] o.e.j.s.session No SessionScavenger set, using defaults
   [junit4]   2> 697450 INFO  (TEST-TestReplicationHandler.doTestStopPoll-seed#[49E30565A85D27F4]) [    ] o.e.j.s.session Scavenging every 660000ms
   [junit4]   2> 697451 INFO  (TEST-TestReplicationHandler.doTestStopPoll-seed#[49E30565A85D27F4]) [    ] o.e.j.s.h.ContextHandler Started o.e.j.s.ServletContextHandler@2e6a941{/solr,null,AVAILABLE}
   [junit4]   2> 697451 INFO  (TEST-TestReplicationHandler.doTestStopPoll-seed#[49E30565A85D27F4]) [    ] o.e.j.s.AbstractConnector Started ServerConnector@4b6f6508{HTTP/1.1,[http/1.1]}{127.0.0.1:37764}
   [junit4]   2> 697451 INFO  (TEST-TestReplicationHandler.doTestStopPoll-seed#[49E30565A85D27F4]) [    ] o.e.j.s.Server Started @708527ms
   [junit4]   2> 697451 INFO  (TEST-TestReplicationHandler.doTestStopPoll-seed#[49E30565A85D27F4]) [    ] o.a.s.c.s.e.JettySolrRunner Jetty properties: {solr.data.dir=/home/jenkins/jenkins-slave/workspace/Lucene-Solr-NightlyTests-master/checkout/solr/build/solr-core/test/J1/temp/solr.handler.TestReplicationHandler_49E30565A85D27F4-001/solr-instance-002/collection1/data, hostContext=/solr, hostPort=37764}
   [junit4]   2> 697452 ERROR (TEST-TestReplicationHandler.doTestStopPoll-seed#[49E30565A85D27F4]) [    ] o.a.s.u.StartupLoggingUtils Missing Java Option solr.log.dir. Logging may be missing or incomplete.
   [junit4]   2> 697452 INFO  (TEST-TestReplicationHandler.doTestStopPoll-seed#[49E30565A85D27F4]) [    ] o.a.s.s.SolrDispatchFilter  ___      _       Welcome to Apache Solr? version 8.0.0
   [junit4]   2> 697452 INFO  (TEST-TestReplicationHandler.doTestStopPoll-seed#[49E30565A85D27F4]) [    ] o.a.s.s.SolrDispatchFilter / __| ___| |_ _   Starting in standalone mode on port null
   [junit4]   2> 697452 INFO  (TEST-TestReplicationHandler.doTestStopPoll-seed#[49E30565A85D27F4]) [    ] o.a.s.s.SolrDispatchFilter \__ \/ _ \ | '_|  Install dir: null
   [junit4]   2> 697452 INFO  (TEST-TestReplicationHandler.doTestStopPoll-seed#[49E30565A85D27F4]) [    ] o.a.s.s.SolrDispatchFilter |___/\___/_|_|    Start time: 2018-02-22T14:45:11.202Z
   [junit4]   2> 697452 INFO  (TEST-TestReplicationHandler.doTestStopPoll-seed#[49E30565A85D27F4]) [    ] o.a.s.c.SolrXmlConfig Loading container configuration from /home/jenkins/jenkins-slave/workspace/Lucene-Solr-NightlyTests-master/checkout/solr/build/solr-core/test/J1/temp/solr.handler.TestReplicationHandler_49E30565A85D27F4-001/solr-instance-002/solr.xml
   [junit4]   2> 697456 INFO  (TEST-TestReplicationHandler.doTestStopPoll-seed#[49E30565A85D27F4]) [    ] o.a.s.c.SolrXmlConfig Configuration parameter autoReplicaFailoverWorkLoopDelay is ignored
   [junit4]   2> 697456 INFO  (TEST-TestReplicationHandler.doTestStopPoll-seed#[49E30565A85D27F4]) [    ] o.a.s.c.SolrXmlConfig Configuration parameter autoReplicaFailoverBadNodeExpiration is ignored
   [junit4]   2> 697457 INFO  (TEST-TestReplicationHandler.doTestStopPoll-seed#[49E30565A85D27F4]) [    ] o.a.s.c.SolrXmlConfig MBean server found: com.sun.jmx.mbeanserver.JmxMBeanServer@6b2a90e1, but no JMX reporters were configured - adding default JMX reporter.
   [junit4]   2> 697491 INFO  (TEST-TestReplicationHandler.doTestStopPoll-seed#[49E30565A85D27F4]) [    ] o.a.s.m.r.SolrJmxReporter JMX monitoring for 'solr.node' (registry 'solr.node') enabled at server: com.sun.jmx.mbeanserver.JmxMBeanServer@6b2a90e1
   [junit4]   2> 697500 INFO  (TEST-TestReplicationHandler.doTestStopPoll-seed#[49E30565A85D27F4]) [    ] o.a.s.m.r.SolrJmxReporter JMX monitoring for 'solr.jvm' (registry 'solr.jvm') enabled at server: com.sun.jmx.mbeanserver.JmxMBeanServer@6b2a90e1
   [junit4]   2> 697501 INFO  (TEST-TestReplicationHandler.doTestStopPoll-seed#[49E30565A85D27F4]) [    ] o.a.s.m.r.SolrJmxReporter JMX monitoring for 'solr.jetty' (registry 'solr.jetty') enabled at server: com.sun.jmx.mbeanserver.JmxMBeanServer@6b2a90e1
   [junit4]   2> 697503 INFO  (TEST-TestReplicationHandler.doTestStopPoll-seed#[49E30565A85D27F4]) [    ] o.a.s.c.CorePropertiesLocator Found 1 core definitions underneath /home/jenkins/jenkins-slave/workspace/Lucene-Solr-NightlyTests-master/checkout/solr/build/solr-core/test/J1/temp/solr.handler.TestReplicationHandler_49E30565A85D27F4-001/solr-instance-002/.
   [junit4]   2> 697503 INFO  (TEST-TestReplicationHandler.doTestStopPoll-seed#[49E30565A85D27F4]) [    ] o.a.s.c.CorePropertiesLocator Cores are: [collection1]
   [junit4]   2> 697504 INFO  (coreLoadExecutor-773-thread-1) [    ] o.a.s.c.TransientSolrCoreCacheDefault Allocating transient cache for 4 transient cores
   [junit4]   2> 697517 INFO  (coreLoadExecutor-773-thread-1) [    x:collection1] o.a.s.c.SolrConfig Using Lucene MatchVersion: 8.0.0
   [junit4]   2> 697524 INFO  (coreLoadExecutor-773-thread-1) [    x:collection1] o.a.s.s.IndexSchema [collection1] Schema name=test
   [junit4]   2> 697526 INFO  (coreLoadExecutor-773-thread-1) [    x:collection1] o.a.s.s.IndexSchema Loaded schema test/1.2 with uniqueid field id
   [junit4]   2> 697526 INFO  (coreLoadExecutor-773-thread-1) [    x:collection1] o.a.s.c.CoreContainer Creating SolrCore 'collection1' using configuration from instancedir /home/jenkins/jenkins-slave/workspace/Lucene-Solr-NightlyTests-master/checkout/solr/build/solr-core/test/J1/temp/solr.handler.TestReplicationHandler_49E30565A85D27F4-001/solr-instance-002/./collection1, trusted=true
   [junit4]   2> 697527 INFO  (coreLoadExecutor-773-thread-1) [    x:collection1] o.a.s.m.r.SolrJmxReporter JMX monitoring for 'solr.core.collection1' (registry 'solr.core.collection1') enabled at server: com.sun.jmx.mbeanserver.JmxMBeanServer@6b2a90e1
   [junit4]   2> 697527 INFO  (coreLoadExecutor-773-thread-1) [    x:collection1] o.a.s.c.SolrCore solr.RecoveryStrategy.Builder
   [junit4]   2> 697527 INFO  (coreLoadExecutor-773-thread-1) [    x:collection1] o.a.s.c.SolrCore [[collection1] ] Opening new SolrCore at [/home/jenkins/jenkins-slave/workspace/Lucene-Solr-NightlyTests-master/checkout/solr/build/solr-core/test/J1/temp/solr.handler.TestReplicationHandler_49E30565A85D27F4-001/solr-instance-002/collection1], dataDir=[/home/jenkins/jenkins-slave/workspace/Lucene-Solr-NightlyTests-master/checkout/solr/build/solr-core/test/J1/temp/solr.handler.TestReplicationHandler_49E30565A85D27F4-001/solr-instance-002/./collection1/data/]
   [junit4]   2> 697528 INFO  (coreLoadExecutor-773-thread-1) [    x:collection1] o.a.s.u.RandomMergePolicy RandomMergePolicy wrapping class org.apache.lucene.index.LogByteSizeMergePolicy: [LogByteSizeMergePolicy: minMergeSize=1677721, mergeFactor=20, maxMergeSize=2147483648, maxMergeSizeForForcedMerge=9223372036854775807, calibrateSizeByDeletes=true, maxMergeDocs=2147483647, maxCFSSegmentSizeMB=8.796093022207999E12, noCFSRatio=0.44727340503987356]
   [junit4]   2> 697569 INFO  (coreLoadExecutor-773-thread-1) [    x:collection1] o.a.s.u.CommitTracker Hard AutoCommit: disabled
   [junit4]   2> 697569 INFO  (coreLoadExecutor-773-thread-1) [    x:collection1] o.a.s.u.CommitTracker Soft AutoCommit: disabled
   [junit4]   2> 697570 INFO  (coreLoadExecutor-773-thread-1) [    x:collection1] o.a.s.u.RandomMergePolicy RandomMergePolicy wrapping class org.apache.lucene.index.TieredMergePolicy: [TieredMergePolicy: maxMergeAtOnce=8, maxMergeAtOnceExplicit=3, maxMergedSegmentMB=90.6220703125, floorSegmentMB=1.375, forceMergeDeletesPctAllowed=6.115585968776253, segmentsPerTier=36.0, maxCFSSegmentSizeMB=8.796093022207999E12, noCFSRatio=0.6551703298782884
   [junit4]   2> 697571 INFO  (coreLoadExecutor-773-thread-1) [    x:collection1] o.a.s.s.SolrIndexSearcher Opening [Searcher@6284733a[collection1] main]
   [junit4]   2> 697571 INFO  (coreLoadExecutor-773-thread-1) [    x:collection1] o.a.s.r.ManagedResourceStorage File-based storage initialized to use dir: /home/jenkins/jenkins-slave/workspace/Lucene-Solr-NightlyTests-master/checkout/solr/build/solr-core/test/J1/temp/solr.handler.TestReplicationHandler_49E30565A85D27F4-001/solr-instance-002/collection1/conf
   [junit4]   2> 697573 INFO  (coreLoadExecutor-773-thread-1) [    x:collection1] o.a.s.h.ReplicationHandler Poll scheduled at an interval of 1000ms
   [junit4]   2> 697573 INFO  (coreLoadExecutor-773-thread-1) [    x:collection1] o.a.s.h.ReplicationHandler Commits will be reserved for 10000ms.
   [junit4]   2> 697575 INFO  (searcherExecutor-774-thread-1-processing-x:collection1) [    x:collection1] o.a.s.c.SolrCore [collection1] Registered new searcher Searcher@6284733a[collection1] main{ExitableDirectoryReader(UninvertingDirectoryReader())}
   [junit4]   2> 697585 INFO  (qtp1879144228-2475) [    x:collection1] o.a.s.c.S.Request [collection1]  webapp=/solr path=/replication params={qt=/replication&wt=javabin&version=2&command=indexversion} status=0 QTime=0
   [junit4]   2> 697586 INFO  (indexFetcher-778-thread-1) [    x:collection1] o.a.s.h.IndexFetcher Master's generation: 1
   [junit4]   2> 697586 INFO  (indexFetcher-778-thread-1) [    x:collection1] o.a.s.h.IndexFetcher Master's version: 0
   [junit4]   2> 697586 INFO  (indexFetcher-778-thread-1) [    x:collection1] o.a.s.h.IndexFetcher Slave's generation: 1
   [junit4]   2> 697586 INFO  (qtp1879144228-2476) [    x:collection1] o.a.s.c.S.Request [collection1]  webapp=/solr path=/select params={q=*:*&sort=id+desc&wt=javabin&version=2} hits=0 status=0 QTime=1
   [junit4]   2> 697586 INFO  (indexFetcher-778-thread-1) [    x:collection1] o.a.s.h.IndexFetcher Slave's version: 0
   [junit4]   2> 697586 INFO  (indexFetcher-778-thread-1) [    x:collection1] o.a.s.h.IndexFetcher New index in Master. Deleting mine...
   [junit4]   2> 697587 INFO  (indexFetcher-778-thread-1) [    x:collection1] o.a.s.u.DirectUpdateHandler2 start commit{,optimize=false,openSearcher=true,waitSearcher=true,expungeDeletes=false,softCommit=false,prepareCommit=false}
   [junit4]   2> 697587 INFO  (indexFetcher-778-thread-1) [    x:collection1] o.a.s.u.SolrIndexWriter Calling setCommitData with IW:org.apache.solr.update.SolrIndexWriter@2813fd24 commitCommandVersion:0
   [junit4]   2> 697589 INFO  (indexFetcher-778-thread-1) [    x:collection1] o.a.s.s.SolrIndexSearcher Opening [Searcher@6f4075c3[collection1] main]
   [junit4]   2> 697589 INFO  (indexFetcher-778-thread-1) [    x:collection1] o.a.s.u.DirectUpdateHandler2 end_commit_flush
   [junit4]   2> 697590 INFO  (searcherExecutor-774-thread-1-processing-x:collection1) [    x:collection1] o.a.s.c.SolrCore [collection1] Registered new searcher Searcher@6f4075c3[collection1] main{ExitableDirectoryReader(UninvertingDirectoryReader())}
   [junit4]   2> 697591 INFO  (qtp1879144228-2478) [    x:collection1] o.a.s.u.p.LogUpdateProcessorFactory [collection1]  webapp=/solr path=/update params={wt=javabin&version=2}{add=[0]} 0 3
   [junit4]   2> 697592 INFO  (qtp1879144228-2481) [    x:collection1] o.a.s.u.p.LogUpdateProcessorFactory [collection1]  webapp=/solr path=/update params={wt=javabin&version=2}{add=[1]} 0 0
   [junit4]   2> 697592 INFO  (qtp1879144228-2478) [    x:collection1] o.a.s.u.p.LogUpdateProcessorFactory [collection1]  webapp=/solr path=/update params={wt=javabin&version=2}{add=[2]} 0 0
   [junit4]   2> 697593 INFO  (qtp1879144228-2481) [    x:collection1] o.a.s.u.p.LogUpdateProcessorFactory [collection1]  webapp=/solr path=/update params={wt=javabin&version=2}{add=[3]} 0 0
   [junit4]   2> 697593 INFO  (qtp1879144228-2478) [    x:collection1] o.a.s.u.p.LogUpdateProcessorFactory [collection1]  webapp=/solr path=/update params={wt=javabin&version=2}{add=[4]} 0 0
   [junit4]   2> 697594 INFO  (qtp1879144228-2481) [    x:collection1] o.a.s.u.p.LogUpdateProcessorFactory [collection1]  webapp=/solr path=/update params={wt=javabin&version=2}{add=[5]} 0 0
   [junit4]   2> 697594 INFO  (qtp1879144228-2478) [    x:collection1] o.a.s.u.p.LogUpdateProcessorFactory [collection1]  webapp=/solr path=/update params={wt=javabin&version=2}{add=[6]} 0 0
   [junit4]   2> 697595 INFO  (qtp1879144228-2481) [    x:collection1] o.a.s.u.p.LogUpdateProcessorFactory [collection1]  webapp=/solr path=/update params={wt=javabin&version=2}{add=[7]} 0 0
   [junit4]   2> 697595 INFO  (qtp1879144228-2478) [    x:collection1] o.a.s.u.p.LogUpdateProcessorFactory [collection1]  webapp=/solr path=/update params={wt=javabin&version=2}{add=[8]} 0 0
   [junit4]   2> 697598 INFO  (qtp1879144228-2481) [    x:collection1] o.a.s.u.p.LogUpdateProcessorFactory [collection1]  webapp=/solr path=/update params={wt=javabin&version=2}{add=[9]} 0 0
   [junit4]   2> 697598 INFO  (qtp1879144228-2478) [    x:collection1] o.a.s.u.p.LogUpdateProcessorFactory [collection1]  webapp=/solr path=/update params={wt=javabin&version=2}{add=[10]} 0 0
   [junit4]   2> 697605 INFO  (qtp1879144228-2481) [    x:collection1] o.a.s.u.p.LogUpdateProcessorFactory [collection1]  webapp=/solr path=/update params={wt=javabin&version=2}{add=[11]} 0 0
   [junit4]   2> 697605 INFO  (qtp1879144228-2478) [    x:collection1] o.a.s.u.p.LogUpdateProcessorFactory [collection1]  webapp=/solr path=/update params={wt=javabin&version=2}{add=[12]} 0 0
   [junit4]   2> 697606 INFO  (qtp1879144228-2481) [    x:collection1] o.a.s.u.p.LogUpdateProcessorFactory [collection1]  webapp=/solr path=/update params={wt=javabin&version=2}{add=[13]} 0 0
   [junit4]   2> 697606 INFO  (qtp1879144228-2478) [    x:collection1] o.a.s.u.p.LogUpdateProcessorFactory [collection1]  webapp=/solr path=/update params={wt=javabin&version=2}{add=[14]} 0 0
   [junit4]   2> 697607 INFO  (qtp1879144228-2481) [    x:collection1] o.a.s.u.p.LogUpdateProcessorFactory [collection1]  webapp=/solr path=/update params={wt=javabin&version=2}{add=[15]} 0 0
   [junit4]   2> 697608 INFO  (qtp1879144228-2478) [    x:collection1] o.a.s.u.p.LogUpdateProcessorFactory [collection1]  webapp=/solr path=/update params={wt=javabin&version=2}{add=[16]} 0 0
   [junit4]   2> 697608 INFO  (qtp1879144228-2481) [    x:collection1] o.a.s.u.p.LogUpdateProcessorFactory [collection1]  webapp=/solr path=/update params={wt=javabin&version=2}{add=[17]} 0 0
   [junit4]   2> 697609 INFO  (qtp1879144228-2478) [    x:collection1] o.a.s.u.p.LogUpdateProcessorFactory [collection1]  webapp=/solr path=/update params={wt=javabin&version=2}{add=[18]} 0 0
   [junit4]   2> 697609 INFO  (qtp1879144228-2481) [    x:collection1] o.a.s.u.p.LogUpdateProcessorFactory [collection1]  webapp=/solr path=/update params={wt=javabin&version=2}{add=[19]} 0 0
   [junit4]   2> 697610 INFO  (qtp1879144228-2478) [    x:collection1] o.a.s.u.p.LogUpdateProcessorFactory [collection1]  webapp=/solr path=/update params={wt=javabin&version=2}{add=[20]} 0 0
   [junit4]   2> 697610 INFO  (qtp1879144228-2481) [    x:collection1] o.a.s.u.p.LogUpdateProcessorFactory [collection1]  webapp=/solr path=/update params={wt=javabin&version=2}{add=[21]} 0 0
   [junit4]   2> 697611 INFO  (qtp1879144228-2478) [    x:collection1] o.a.s.u.p.LogUpdateProcessorFactory [collection1]  webapp=/solr path=/update params={wt=javabin&version=2}{add=[22]} 0 0
   [junit4]   2> 697611 INFO  (qtp1879144228-2481) [    x:collection1] o.a.s.u.p.LogUpdateProcessorFactory [collection1]  webapp=/solr path=/update params={wt=javabin&version=2}{add=[23]} 0 0
   [junit4]   2> 697612 INFO  (qtp1879144228-2478) [    x:collection1] o.a.s.u.p.LogUpdateProcessorFactory [collection1]  webapp=/solr path=/update params={wt=javabin&version=2}{add=[24]} 0 0
   [junit4]   2> 697612 INFO  (qtp1879144228-2481) [    x:collection1] o.a.s.u.p.LogUpdateProcessorFactory [collection1]  webapp=/solr path=/update params={wt=javabin&version=2}{add=[25]} 0 0
   [junit4]   2> 697613 INFO  (qtp1879144228-2478) [    x:collection1] o.a.s.u.p.LogUpdateProcessorFactory [collection1]  webapp=/solr path=/update params={wt=javabin&version=2}{add=[26]} 0 0
   [junit4]   2> 697616 INFO  (qtp1879144228-2478) [    x:collection1] o.a.s.u.p.LogUpdateProcessorFactory [collection1]  webapp=/solr path=/update params={wt=javabin&version=2}{add=[27]} 0 0
   [junit4]   2> 697616 INFO  (qtp1879144228-2481) [    x:collection1] o.a.s.u.p.LogUpdateProcessorFactory [collection1]  webapp=/solr path=/update params={wt=javabin&version=2}{add=[28]} 0 0
   [junit4]   2> 697617 INFO  (qtp1879144228-2481) [    x:collection1] o.a.s.u.p.LogUpdateProcessorFactory [collection1]  webapp=/solr path=/update params={wt=javabin&version=2}{add=[29]} 0 0
   [junit4]   2> 697617 INFO  (qtp1879144228-2481) [    x:collection1] o.a.s.u.p.LogUpdateProcessorFactory [collection1]  webapp=/solr path=/update params={wt=javabin&version=2}{add=[30]} 0 0
   [junit4]   2> 697618 INFO  (qtp1879144228-2481) [    x:collection1] o.a.s.u.p.LogUpdateProcessorFactory [collection1]  webapp=/solr path=/update params={wt=javabin&version=2}{add=[31]} 0 0
   [junit4]   2> 697618 INFO  (qtp1879144228-2481) [    x:collection1] o.a.s.u.p.LogUpdateProcessorFactory [collection1]  webapp=/solr path=/update params={wt=javabin&version=2}{add=[32]} 0 0
   [junit4]   2> 697619 INFO  (qtp1879144228-2481) [    x:collection1] o.a.s.u.p.LogUpdateProcessorFactory [collection1]  webapp=/solr path=/update params={wt=javabin&version=2}{add=[33]} 0 0
   [junit4]   2> 697619 INFO  (qtp1879144228-2481) [    x:collection1] o.a.s.u.p.LogUpdateProcessorFactory [collection1]  webapp=/solr path=/update params={wt=javabin&version=2}{add=[34]} 0 0
   [junit4]   2> 697620 INFO  (qtp1879144228-2481) [    x:collection1] o.a.s.u.p.LogUpdateProcessorFactory [collection1]  webapp=/solr path=/update params={wt=javabin&version=2}{add=[35]} 0 0
   [junit4]   2> 697620 INFO  (qtp1879144228-2481) [    x:collection1] o.a.s.u.p.LogUpdateProcessorFactory [collection1]  webapp=/solr path=/update params={wt=javabin&version=2}{add=[36]} 0 0
   [junit4]   2> 697625 INFO  (qtp1879144228-2481) [    x:collection1] o.a.s.u.p.LogUpdateProcessorFactory [collection1]  webapp=/solr path=/update params={wt=javabin&version=2}{add=[37]} 0 0
   [junit4]   2> 697626 INFO  (qtp1879144228-2481) [    x:collection1] o.a.s.u.p.LogUpdateProcessorFactory [collection1]  webapp=/solr path=/update params={wt=javabin&version=2}{add=[38]} 0 0
   [junit4]   2> 697626 INFO  (qtp1879144228-2481) [    x:collection1] o.a.s.u.p.LogUpdateProcessorFactory [collection1]  webapp=/solr path=/update params={wt=javabin&version=2}{add=[39]} 0 0
   [junit4]   2> 697626 INFO  (qtp1879144228-2481) [    x:collection1] o.a.s.u.p.LogUpdateProcessorFactory [collection1]  webapp=/solr path=/update params={wt=javabin&version=2}{add=[40]} 0 0
   [junit4]   2> 697627 INFO  (qtp1879144228-2481) [    x:collection1] o.a.s.u.p.LogUpdateProcessorFactory [collection1]  webapp=/solr path=/update params={wt=javabin&version=2}{add=[41]} 0 0
   [junit4]   2> 697627 INFO  (qtp1879144228-2481) [    x:collection1] o.a.s.u.p.LogUpdateProcessorFactory [collection1]  webapp=/solr path=/update params={wt=javabin&version=2}{add=[42]} 0 0
   [junit4]   2> 697628 INFO  (qtp1879144228-2481) [    x:collection1] o.a.s.u.p.LogUpdateProcessorFactory [collection1]  webapp=/solr path=/update params={wt=javabin&version=2}{add=[43]} 0 0
   [junit4]   2> 697629 INFO  (qtp1879144228-2478) [    x:collection1] o.a.s.u.p.LogUpdateProcessorFactory [collection1]  webapp=/solr path=/update params={wt=javabin&version=2}{add=[44]} 0 0
   [junit4]   2> 697633 INFO  (qtp1879144228-2481) [    x:collection1] o.a.s.u.p.LogUpdateProcessorFactory [collection1]  webapp=/solr path=/update params={wt=javabin&version=2}{add=[45]} 0 0
   [junit4]   2> 697633 INFO  (qtp1879144228-2478) [    x:collection1] o.a.s.u.p.LogUpdateProcessorFactory [collection1]  webapp=/solr path=/update params={wt=javabin&version=2}{add=[46]} 0 0
   [junit4]   2> 697634 INFO  (qtp1879144228-2481) [    x:collection1] o.a.s.u.p.LogUpdateProcessorFactory [collection1]  webapp=/solr path=/update params={wt=javabin&version=2}{add=[47]} 0 0
   [junit4]   2> 697634 INFO  (qtp1879144228-2478) [    x:collection1] o.a.s.u.p.LogUpdateProcessorFactory [collection1]  webapp=/solr path=/update params={wt=javabin&version=2}{add=[48]} 0 0
   [junit4]   2> 697635 INFO  (qtp1879144228-2481) [    x:collection1] o.a.s.u.p.LogUpdateProcessorFactory [collection1]  webapp=/solr path=/update params={wt=javabin&version=2}{add=[49]} 0 0
   [junit4]   2> 697635 INFO  (qtp1879144228-2478) [    x:collection1] o.a.s.u.p.LogUpdateProcessorFactory [collection1]  webapp=/solr path=/update params={wt=javabin&version=2}{add=[50]} 0 0
   [junit4]   2> 697636 INFO  (qtp1879144228-2481) [    x:collection1] o.a.s.u.p.LogUpdateProcessorFactory [collection1]  webapp=/solr path=/update params={wt=javabin&version=2}{add=[51]} 0 0
   [junit4]   2> 697636 INFO  (qtp1879144228-2478) [    x:collection1] o.a.s.u.p.LogUpdateProcessorFactory [collection1]  webapp=/solr path=/update params={wt=javabin&version=2}{add=[52]} 0 0
   [junit4]   2> 697641 INFO  (qtp1879144228-2481) [    x:collection1] o.a.s.u.p.LogUpdateProcessorFactory [collection1]  webapp=/solr path=/update params={wt=javabin&version=2}{add=[53]} 0 0
   [junit4]   2> 697641 INFO  (qtp1879144228-2478) [    x:collection1] o.a.s.u.p.LogUpdateProcessorFactory [collection1]  webapp=/solr path=/update params={wt=javabin&version=2}{add=[54]} 0 0
   [junit4]   2> 697642 INFO  (qtp1879144228-2481) [    x:collection1] o.a.s.u.p.LogUpdateProcessorFactory [collection1]  webapp=/solr path=/update params={wt=javabin&version=2}{add=[55]} 0 0
   [junit4]   2> 697646 INFO  (qtp1879144228-2478) [    x:collection1] o.a.s.u.p.LogUpdateProcessorFactory [collection1]  webapp=/solr path=/update params={wt=javabin&version=2}{add=[56]} 0 0
   [junit4]   2> 697647 INFO  (qtp1879144228-2481) [    x:collection1] o.a.s.u.p.LogUpdateProcessorFactory [collection1]  webapp=/solr path=/update params={wt=javabin&version=2}{add=[57]} 0 0
   [junit4]   2> 697648 INFO  (qtp1879144228-2478) [    x:collection1] o.a.s.u.p.LogUpdateProcessorFactory [collection1]  webapp=/solr path=/update params={wt=javabin&version=2}{add=[58]} 0 0
   [junit4]   2> 697648 INFO  (qtp1879144228-2481) [    x:collection1] o.a.s.u.p.LogUpdateProcessorFactory [collection1]  webapp=/solr path=/update params={wt=javabin&version=2}{add=[59]} 0 0
   [junit4]   2> 697649 INFO  (qtp1879144228-2478) [    x:collection1] o.a.s.u.p.LogUpdateProcessorFactory [collection1]  webapp=/solr path=/update params={wt=javabin&version=2}{add=[60]} 0 0
   [junit4]   2> 697650 INFO  (qtp1879144228-2478) [    x:collection1] o.a.s.u.p.LogUpdateProcessorFactory [collection1]  webapp=/solr path=/update params={wt=javabin&version=2}{add=[61]} 0 0
   [junit4]   2> 697650 INFO  (qtp1879144228-2478) [    x:collection1] o.a.s.u.p.LogUpdateProcessorFactory [collection1]  webapp=/solr path=/update params={wt=javabin&version=2}{add=[62]} 0 0
   [junit4]   2> 697651 INFO  (qtp1879144228-2481) [    x:collection1] o.a.s.u.p.LogUpdateProcessorFactory [collection1]  webapp=/solr path=/update params={wt=javabin&version=2}{add=[63]} 0 0
   [junit4]   2> 697651 INFO  (qtp1879144228-2478) [    x:collection1] o.a.s.u.p.LogUpdateProcessorFactory [collection1]  webapp=/solr path=/update params={wt=javabin&version=2}{add=[64]} 0 0
   [junit4]   2> 697651 INFO  (qtp1879144228-2481) [    x:collection1] o.a.s.u.p.LogUpdateProcessorFactory [collection1]  webapp=/solr path=/update params={wt=javabin&version=2}{add=[65]} 0 0
   [junit4]   2> 697652 INFO  (qtp1879144228-2478) [    x:collection1] o.a.s.u.p.LogUpdateProcessorFactory [collection1]  webapp=/solr path=/update params={wt=javabin&version=2}{add=[66]} 0 0
   [junit4]   2> 697652 INFO  (qtp1879144228-2481) [    x:collection1] o.a.s.u.p.LogUpdateProcessorFactory [collection1]  webapp=/solr path=/update params={wt=javabin&version=2}{add=[67]} 0 0
   [junit4]   2> 697653 INFO  (qtp1879144228-2478) [    x:collection1] o.a.s.u.p.LogUpdateProcessorFactory [collection1]  webapp=/solr path=/update params={wt=javabin&version=2}{add=[68]} 0 0
   [junit4]   2> 697653 INFO  (qtp1879144228-2478) [    x:collection1] o.a.s.u.p.LogUpdateProcessorFactory [collection1]  webapp=/solr path=/update params={wt=javabin&version=2}{add=[69]} 0 0
   [junit4]   2> 697654 INFO  (qtp1879144228-2478) [    x:collection1] o.a.s.u.p.LogUpdateProcessorFactory [collection1]  webapp=/solr path=/update params={wt=javabin&version=2}{add=[70]} 0 0
   [junit4]   2> 697654 INFO  (qtp1879144228-2478) [    x:collection1] o.a.s.u.p.LogUpdateProcessorFactory [collection1]  webapp=/solr path=/update params={wt=javabin&version=2}{add=[71]} 0 0
   [junit4]   2> 697655 INFO  (qtp1879144228-2478) [    x:collection1] o.a.s.u.p.LogUpdateProcessorFactory [collection1]  webapp=/solr path=/update params={wt=javabin&version=2}{add=[72]} 0 0
   [junit4]   2> 697655 INFO  (qtp1879144228-2478) [    x:collection1] o.a.s.u.p.LogUpdateProcessorFactory [collection1]  webapp=/solr path=/update params={wt=javabin&version=2}{add=[73]} 0 0
   [junit4]   2> 697656 INFO  (qtp1879144228-2478) [    x:collection1] o.a.s.u.p.LogUpdateProcessorFactory [collection1]  webapp=/solr path=/update params={wt=javabin&version=2}{add=[74]} 0 0
   [junit4]   2> 697656 INFO  (qtp1879144228-2478) [    x:collection1] o.a.s.u.p.LogUpdateProcessorFactory [collection1]  webapp=/solr path=/update params={wt=javabin&version=2}{add=[75]} 0 0
   [junit4]   2> 697656 INFO  (qtp1879144228-2478) [    x:collection1] o.a.s.u.p.LogUpdateProcessorFactory [collection1]  webapp=/solr path=/update params={wt=javabin&version=2}{add=[76]} 0 0
   [junit4]   2> 697657 INFO  (qtp1879144228-2478) [    x:collection1] o.a.s.u.p.LogUpdateProcessorFactory [collection1]  webapp=/solr path=/update params={wt=javabin&version=2}{add=[77]} 0 0
   [junit4]   2> 697658 INFO  (qtp1879144228-2481) [    x:collection1] o.a.s.u.p.LogUpdateProcessorFactory [collection1]  webapp=/solr path=/update params={wt=javabin&version=2}{add=[78]} 0 0
   [junit4]   2> 697658 INFO  (qtp1879144228-2478) [    x:collection1] o.a.s.u.p.LogUpdateProcessorFactory [collection1]  webapp=/solr path=/update params={wt=javabin&version=2}{add=[79]} 0 0
   [junit4]   2> 697659 INFO  (qtp1879144228-2481) [    x:collection1] o.a.s.u.p.LogUpdateProcessorFactory [collection1]  webapp=/solr path=/update params={wt=javabin&version=2}{add=[80]} 0 0
   [junit4]   2> 697659 INFO  (qtp1879144228-2478) [    x:collection1] o.a.s.u.p.LogUpdateProcessorFactory [collection1]  webapp=/solr path=/update params={wt=javabin&version=2}{add=[81]} 0 0
   [junit4]   2> 697659 INFO  (qtp1879144228-2481) [    x:collection1] o.a.s.u.p.LogUpdateProcessorFactory [collection1]  webapp=/solr path=/update params={wt=javabin&version=2}{add=[82]} 0 0
   [junit4]   2> 697660 INFO  (qtp1879144228-2478) [    x:collection1] o.a.s.u.p.LogUpdateProcessorFactory [collection1]  webapp=/solr path=/update params={wt=javabin&version=2}{add=[83]} 0 0
   [junit4]   2> 697660 INFO  (qtp1879144228-2481) [    x:collection1] o.a.s.u.p.LogUpdateProcessorFactory [collection1]  webapp=/solr path=/update params={wt=javabin&version=2}{add=[84]} 0 0
   [junit4]   2> 697661 INFO  (qtp1879144228-2478) [    x:collection1] o.a.s.u.p.LogUpdateProcessorFactory [collection1]  webapp=/solr path=/update params={wt=javabin&version=2}{add=[85]} 0 0
   [junit4]   2> 697661 INFO  (qtp1879144228-2481) [    x:collection1] o.a.s.u.p.LogUpdateProcessorFactory [collection1]  webapp=/solr path=/update params={wt=javabin&version=2}{add=[86]} 0 0
   [junit4]   2> 697662 INFO  (qtp1879144228-2478) [    x:collection1] o.a.s.u.p.LogUpdateProcessorFactory [collection1]  webapp=/solr path=/update params={wt=javabin&version=2}{add=[87]} 0 0
   [junit4]   2> 697662 INFO  (qtp1879144228-2481) [    x:collection1] o.a.s.u.p.LogUpdateProcessorFactory [collection1]  webapp=/solr path=/update params={wt=javabin&version=2}{add=[88]} 0 0
   [junit4]   2> 697663 INFO  (qtp1879144228-2478) [    x:collection1] o.a.s.u.p.LogUpdateProcessorFactory [collection1]  webapp=/solr path=/update params={wt=javabin&version=2}{add=[89]} 0 0
   [junit4]   2> 697663 INFO  (qtp1879144228-2481) [    x:collection1] o.a.s.u.p.LogUpdateProcessorFactory [collection1]  webapp=/solr path=/update params={wt=javabin&version=2}{add=[90]} 0 0
   [junit4]   2> 697664 INFO  (qtp1879144228-2478) [    x:collection1] o.a.s.u.p.LogUpdateProcessorFactory [collection1]  webapp=/solr path=/update params={wt=javabin&version=2}{add=[91]} 0 0
   [junit4]   2> 697664 INFO  (qtp1879144228-2478) [    x:collection1] o.a.s.u.p.LogUpdateProcessorFactory [collection1]  webapp=/solr path=/update params={wt=javabin&version=2}{add=[92]} 0 0
   [junit4]   2> 697665 INFO  (qtp1879144228-2481) [    x:collection1] o.a.s.u.p.LogUpdateProcessorFactory [collection1]  webapp=/solr path=/update params={wt=javabin&version=2}{add=[93]} 0 0
   [junit4]   2> 697665 INFO  (qtp1879144228-2478) [    x:collection1] o.a.s.u.p.LogUpdateProcessorFactory [collection1]  webapp=/solr path=/update params={wt=javabin&version=2}{add=[94]} 0 0
   [junit4]   2> 697665 INFO  (qtp1879144228-2481) [    x:collection1] o.a.s.u.p.LogUpdateProcessorFactory [collection1]  webapp=/solr path=/update params={wt=javabin&version=2}{add=[95]} 0 0
   [junit4]   2> 697666 INFO  (qtp1879144228-2478) [    x:collection1] o.a.s.u.p.LogUpdateProcessorFactory [collection1]  webapp=/solr path=/update params={wt=javabin&version=2}{add=[96]} 0 0
   [junit4]   2> 697666 INFO  (qtp1879144228-2481) [    x:collection1] o.a.s.u.p.LogUpdateProcessorFactory [collection1]  webapp=/solr path=/update params={wt=javabin&version=2}{add=[97]} 0 0
   [junit4]   2> 697667 INFO  (qtp1879144228-2478) [    x:collection1] o.a.s.u.p.LogUpdateProcessorFactory [collection1]  webapp=/solr path=/update params={wt=javabin&version=2}{add=[98]} 0 0
   [junit4]   2> 697667 INFO  (qtp1879144228-2481) [    x:collection1] o.a.s.u.p.LogUpdateProcessorFactory [collection1]  webapp=/solr path=/update params={wt=javabin&version=2}{add=[99]} 0 0
   [junit4]   2> 697668 INFO  (qtp1879144228-2478) [    x:collection1] o.a.s.u.p.LogUpdateProcessorFactory [collection1]  webapp=/solr path=/update params={wt=javabin&version=2}{add=[100]} 0 0
   [junit4]   2> 697668 INFO  (qtp1879144228-2481) [    x:collection1] o.a.s.u.p.LogUpdateProcessorFactory [collection1]  webapp=/solr path=/update params={wt=javabin&version=2}{add=[101]} 0 0
   [junit4]   2> 697669 INFO  (qtp1879144228-2478) [    x:collection1] o.a.s.u.p.LogUpdateProcessorFactory [collection1]  webapp=/solr path=/update params={wt=javabin&version=2}{add=[102]} 0 0
   [junit4]   2> 697669 INFO  (qtp1879144228-2478) [    x:collection1] o.a.s.u.p.LogUpdateProcessorFactory [collection1]  webapp=/solr path=/update params={wt=javabin&version=2}{add=[103]} 0 0
   [junit4]   2> 697670 INFO  (qtp1879144228-2478) [    x:collection1] o.a.s.u.p.LogUpdateProcessorFactory [collection1]  webapp=/solr path=/update params={wt=javabin&version=2}{add=[104]} 0 0
   [junit4]   2> 697670 INFO  (qtp1879144228-2478) [    x:collection1] o.a.s.u.p.LogUpdateProcessorFactory [collection1]  webapp=/solr path=/update params={wt=javabin&version=2}{add=[105]} 0 0
   [junit4]   2> 697670 INFO  (qtp1879144228-2478) [    x:collection1] o.a.s.u.p.LogUpdateProcessorFactory [collection1]  webapp=/solr path=/update params={wt=javabin&version=2}{add=[106]} 0 0
   [junit4]   2> 697671 INFO  (qtp1879144228-2478) [    x:collection1] o.a.s.u.p.LogUpdateProcessorFactory [collection1]  webapp=/solr path=/update params={wt=javabin&version=2}{add=[107]} 0 0
   [junit4]   2> 697671 INFO  (qtp1879144228-2478) [    x:collection1] o.a.s.u.p.LogUpdateProcessorFactory [collection1]  webapp=/solr path=/update params={wt=javabin&version=2}{add=[108]} 0 0
   [junit4]   2> 697672 INFO  (qtp1879144228-2481) [    x:collection1] o.a.s.u.p.LogUpdateProcessorFactory [collection1]  webapp=/solr path=/update params={wt=javabin&version=2}{add=[109]} 0 0
   [junit4]   2> 697672 INFO  (qtp1879144228-2478) [    x:collection1] o.a.s.u.p.LogUpdateProcessorFactory [collection1]  webapp=/solr path=/update params={wt=javabin&version=2}{add=[110]} 0 0
   [junit4]   2> 697673 INFO  (qtp1879144228-2481) [    x:collection1] o.a.s.u.p.LogUpdateProcessorFactory [collection1]  webapp=/solr path=/update params={wt=javabin&version=2}{add=[111]} 0 0
   [junit4]   2> 697673 INFO  (qtp1879144228-2478) [    x:collection1] o.a.s.u.p.LogUpdateProcessorFactory [collection1]  webapp=/solr path=/update params={wt=javabin&version=2}{add=[112]} 0 0
   [junit4]   2> 697673 INFO  (qtp1879144228-2481) [    x:collection1] o.a.s.u.p.LogUpdateProcessorFactory [collection1]  webapp=/solr path=/update params={wt=javabin&version=2}{add=[113]} 0 0
   [junit4]   2> 697674 INFO  (qtp1879144228-2478) [    x:collection1] o.a.s.u.p.LogUpdateProcessorFactory [collection1]  webapp=/solr path=/update params={wt=javabin&version=2}{add=[114]} 0 0
   [junit4]   2> 697674 INFO  (qtp1879144228-2481) [    x:collection1] o.a.s.u.p.LogUpdateProcessorFactory [collection1]  webapp=/solr path=/update params={wt=javabin&version=2}{add=[115]} 0 0
   [junit4]   2> 697675 INFO  (qtp1879144228-2478) [    x:collection1] o.a.s.u.p.LogUpdateProcessorFactory [collection1]  webapp=/solr path=/update params={wt=javabin&version=2}{add=[116]} 0 0
   [junit4]   2> 697675 INFO  (qtp1879144228-2481) [    x:collection1] o.a.s.u.p.LogUpdateProcessorFactory [collection1]  webapp=/solr path=/update params={wt=javabin&version=2}{add=[117]} 0 0
   [junit4]   2> 697676 INFO  (qtp1879144228-2478) [    x:collection1] o.a.s.u.p.LogUpdateProcessorFactory [collection1]  webapp=/solr path=/update params={wt=javabin&version=2}{add=[118]} 0 0
   [junit4]   2> 697676 INFO  (qtp1879144228-2481) [    x:collection1] o.a.s.u.p.LogUpdateProcessorFactory [collection1]  webapp=/solr path=/update params={wt=javabin&version=2}{add=[119]} 0 0
   [junit4]   2> 697676 INFO  (qtp1879144228-2478) [    x:collection1] o.a.s.u.p.LogUpdateProcessorFactory [collection1]  webapp=/solr path=/update params={wt=javabin&version=2}{add=[120]} 0 0
   [junit4]   2> 697677 INFO  (qtp1879144228-2481) [    x:collection1] o.a.s.u.p.LogUpdateProcessorFactory [collection1]  webapp=/solr path=/update params={wt=javabin&version=2}{add=[121]} 0 0
   [junit4]   2> 697677 INFO  (qtp1879144228-2478) [    x:collection1] o.a.s.u.p.LogUpdateProcessorFactory [collection1]  webapp=/solr path=/update params={wt=javabin&version=2}{add=[122]} 0 0
   [junit4]   2> 697678 INFO  (qtp1879144228-2481) [    x:collection1] o.a.s.u.p.LogUpdateProcessorFactory [collection1]  webapp=/solr path=/update params={wt=javabin&version=2}{add=[123]} 0 0
   [junit4]   2> 697678 INFO  (qtp1879144228-2478) [    x:collection1] o.a.s.u.p.LogUpdateProcessorFactory [collection1]  webapp=/solr path=/update params={wt=javabin&version=2}{add=[124]} 0 0
   [junit4]   2> 697678 INFO  (qtp1879144228-2481) [    x:collection1] o.a.s.u.p.LogUpdateProcessorFactory [collection1]  webapp=/solr path=/update params={wt=javabin&version=2}{add=[125]} 0 0
   [junit4]   2> 697679 INFO  (qtp1879144228-2478) [    x:collection1] o.a.s.u.p.LogUpdateProcessorFactory [collection1]  webapp=/solr path=/update params={wt=javabin&version=2}{add=[126]} 0 0
   [junit4]   2> 697679 INFO  (qtp1879144228-2481) [    x:collection1] o.a.s.u.p.LogUpdateProcessorFactory [collection1]  webapp=/solr path=/update params={wt=javabin&version=2}{add=[127]} 0 0
   [junit4]   2> 697680 INFO  (qtp1879144228-2478) [    x:collection1] o.a.s.u.p.LogUpdateProcessorFactory [collection1]  webapp=/solr path=/update params={wt=javabin&version=2}{add=[128]} 0 0
   [junit4]   2> 697680 INFO  (qtp1879144228-2481) [    x:collection1] o.a.s.u.p.LogUpdateProcessorFactory [collection1]  webapp=/solr path=/update params={wt=javabin&version=2}{add=[129]} 0 0
   [junit4]   2> 697681 INFO  (qtp1879144228-2478) [    x:collection1] o.a.s.u.p.LogUpdateProcessorFactory [collection1]  webapp=/solr path=/update params={wt=javabin&version=2}{add=[130]} 0 0
   [junit4]   2> 697681 INFO  (qtp1879144228-2481) [    x:collection1] o.a.s.u.p.LogUpdateProcessorFactory [collection1]  webapp=/solr path=/update params={wt=javabin&version=2}{add=[131]} 0 0
   [junit4]   2> 697682 INFO  (qtp1879144228-2478) [    x:collection1] o.a.s.u.p.LogUpdateProcessorFactory [collection1]  webapp=/solr path=/update params={wt=javabin&version=2}{add=[132]} 0 0
   [junit4]   2> 697682 INFO  (qtp1879144228-2481) [    x:collection1] o.a.s.u.p.LogUpdateProcessorFactory [collection1]  webapp=/solr path=/update params={wt=javabin&version=2}{add=[133]} 0 0
   [junit4]   2> 697682 INFO  (qtp1879144228-2478) [    x:collection1] o.a.s.u.p.LogUpdateProcessorFactory [collection1]  webapp=/solr path=/update params={wt=javabin&version=2}{add=[134]} 0 0
   [junit4]   2> 697683 INFO  (qtp1879144228-2481) [    x:collection1] o.a.s.u.p.LogUpdateProcessorFactory [collection1]  webapp=/solr path=/update params={wt=javabin&version=2}{add=[135]} 0 0
   [junit4]   2> 697683 INFO  (qtp1879144228-2478) [    x:collection1] o.a.s.u.p.LogUpdateProcessorFactory [collection1]  webapp=/solr path=/update params={wt=javabin&version=2}{add=[136]} 0 0
   [junit4]   2> 697684 INFO  (qtp1879144228-2481) [    x:collection1] o.a.s.u.p.LogUpdateProcessorFactory [collection1]  webapp=/solr path=/update params={wt=javabin&version=2}{add=[137]} 0 0
   [junit4]   2> 697684 INFO  (qtp1879144228-2478) [    x:collection1] o.a.s.u.p.LogUpdateProcessorFactory [collection1]  webapp=/solr path=/update params={wt=javabin&version=2}{add=[138]} 0 0
   [junit4]   2> 697684 INFO  (qtp1879144228-2481) [    x:collection1] o.a.s.u.p.LogUpdateProcessorFactory [collection1]  webapp=/solr path=/update params={wt=javabin&version=2}{add=[139]} 0 0
   [junit4]   2> 697685 INFO  (qtp1879144228-2478) [    x:collection1] o.a.s.u.p.LogUpdateProcessorFactory [collection1]  webapp=/solr path=/update params={wt=javabin&version=2}{add=[140]} 0 0
   [junit4]   2> 697685 INFO  (qtp1879144228-2481) [    x:collection1] o.a.s.u.p.LogUpdateProcessorFactory [collection1]  webapp=/solr path=/update params={wt=javabin&version=2}{add=[141]} 0 0
   [junit4]   2> 697685 INFO  (qtp1879144228-2478) [    x:collection1] o.a.s.u.p.LogUpdateProcessorFactory [collection1]  webapp=/solr path=/update params={wt=javabin&version=2}{add=[142]} 0 0
   [junit4]   2> 697686 INFO  (qtp1879144228-2481) [    x:collection1] o.a.s.u.p.LogUpdateProcessorFactory [collection1]  webapp=/solr path=/update params={wt=javabin&version=2}{add=[143]} 0 0
   [junit4]   2> 697686 INFO  (qtp1879144228-2478) [    x:collection1] o.a.s.u.p.LogUpdateProcessorFactory [collection1]  webapp=/solr path=/update params={wt=javabin&version=2}{add=[144]} 0 0
   [junit4]   2> 697687 INFO  (qtp1879144228-2481) [    x:collection1] o.a.s.u.p.LogUpdateProcessorFactory [collection1]  webapp=/solr path=/update params={wt=javabin&version=2}{add=[145]} 0 0
   [junit4]   2> 697687 INFO  (qtp1879144228-2478) [    x:collection1] o.a.s.u.p.LogUpdateProcessorFactory [collection1]  webapp=/solr path=/update params={wt=javabin&version=2}{add=[146]} 0 0
   [junit4]   2> 697687 INFO  (qtp1879144228-2481) [    x:collection1] o.a.s.u.p.LogUpdateProcessorFactory [collection1]  webapp=/solr path=/update params={wt=javabin&version=2}{add=[147]} 0 0
   [junit4]   2> 697688 INFO  (qtp1879144228-2478) [    x:collection1] o.a.s.u.p.LogUpdateProcessorFactory [collection1]  webapp=/solr path=/update params={wt=javabin&version=2}{add=[148]} 0 0
   [junit4]   2> 697688 INFO  (qtp1879144228-2481) [    x:collection1] o.a.s.u.p.LogUpdateProcessorFactory [collection1]  webapp=/solr path=/update params={wt=javabin&version=2}{add=[149]} 0 0
   [junit4]   2> 697689 INFO  (qtp1879144228-2478) [    x:collection1] o.a.s.u.p.LogUpdateProcessorFactory [collection1]  webapp=/solr path=/update params={wt=javabin&version=2}{add=[150]} 0 0
   [junit4]   2> 697689 INFO  (qtp1879144228-2481) [    x:collection1] o.a.s.u.p.LogUpdateProcessorFactory [collection1]  webapp=/solr path=/update params={wt=javabin&version=2}{add=[151]} 0 0
   [junit4]   2> 697689 INFO  (qtp1879144228-2478) [    x:collection1] o.a.s.u.p.LogUpdateProcessorFactory [collection1]  webapp=/solr path=/update params={wt=javabin&version=2}{add=[152]} 0 0
   [junit4]   2> 697690 INFO  (qtp1879144228-2481) [    x:collection1] o.a.s.u.p.LogUpdateProcessorFactory [collection1]  webapp=/solr path=/update params={wt=javabin&version=2}{add=[153]} 0 0
   [junit4]   2> 697690 INFO  (qtp1879144228-2478) [    x:collection1] o.a.s.u.p.LogUpdateProcessorFactory [collection1]  webapp=/solr path=/update params={wt=javabin&version=2}{add=[154]} 0 0
   [junit4]   2> 697691 INFO  (qtp1879144228-2481) [    x:collection1] o.a.s.u.p.LogUpdateProcessorFactory [collection1]  webapp=/solr path=/update params={wt=javabin&version=2}{add=[155]} 0 0
   [junit4]   2> 697691 INFO  (qtp1879144228-2478) [    x:collection1] o.a.s.u.p.LogUpdateProcessorFactory [collection1]  webapp=/solr path=/update params={wt=javabin&version=2}{add=[156]} 0 0
   [junit4]   2> 697692 INFO  (qtp1879144228-2481) [    x:collection1] o.a.s.u.p.LogUpdateProcessorFactory [collection1]  webapp=/solr path=/update params={wt=javabin&version=2}{add=[157]} 0 0
   [junit4]   2> 697692 INFO  (qtp1879144228-2480) [    x:collection1] o.a.s.u.p.LogUpdateProcessorFactory [collection1]  webapp=/solr path=/update params={wt=javabin&version=2}{add=[158]} 0 0
   [junit4]   2> 697693 INFO  (qtp1879144228-2481) [    x:collection1] o.a.s.u.p.LogUpdateProcessorFactory [collection1]  webapp=/solr path=/update params={wt=javabin&version=2}{add=[159]} 0 0
   [junit4]   2> 697693 INFO  (qtp1879144228-2480) [    x:collection1] o.a.s.u.p.LogUpdateProcessorFactory [collection1]  webapp=/solr path=/update params={wt=javabin&version=2}{add=[160]} 0 0
   [junit4]   2> 697694 INFO  (qtp1879144228-2481) [    x:collection1] o.a.s.u.p.LogUpdateProcessorFactory [collection1]  webapp=/solr path=/update params={wt=javabin&version=2}{add=[161]} 0 0
   [junit4]   2> 697694 INFO  (qtp1879144228-2480) [    x:collection1] o.a.s.u.p.LogUpdateProcessorFactory [collection1]  webapp=/solr path=/update params={wt=javabin&version=2}{add=[162]} 0 0
   [junit4]   2> 697694 INFO  (qtp1879144228-2480) [    x:collection1] o.a.s.u.p.LogUpdateProcessorFactory [collection1]  webapp=/solr path=/update params={wt=javabin&version=2}{add=[163]} 0 0
   [junit4]   2> 697695 INFO  (qtp1879144228-2481) [    x:collection1] o.a.s.u.p.LogUpdateProcessorFactory [collection1]  webapp=/solr path=/update params={wt=javabin&version=2}{add=[164]} 0 0
   [junit4]   2> 697695 INFO  (qtp1879144228-2480) [    x:collection1] o.a.s.u.p.LogUpdateProcessorFactory [collection1]  webapp=/solr path=/update params={wt=javabin&version=2}{add=[165]} 0 0
   [junit4]   2> 697696 INFO  (qtp1879144228-2481) [    x:collection1] o.a.s.u.p.LogUpdateProcessorFactory [collection1]  webapp=/solr path=/update params={wt=javabin&version=2}{add=[166]} 0 0
   [junit4]   2> 697696 INFO  (qtp1879144228-2480) [    x:collection1] o.a.s.u.p.LogUpdateProcessorFactory [collection1]  webapp=/solr path=/update params={wt=javabin&version=2}{add=[167]} 0 0
   [junit4]   2> 697696 INFO  (qtp1879144228-2481) [    x:collection1] o.a.s.u.p.LogUpdateProcessorFactory [collection1]  webapp=/solr path=/update params={wt=javabin&version=2}{add=[168]} 0 0
   [junit4]   2> 697697 INFO  (qtp1879144228-2480) [    x:collection1] o.a.s.u.p.LogUpdateProcessorFactory [collection1]  webapp=/solr path=/update params={wt=javabin&version=2}{add=[169]} 0 0
   [junit4]   2> 697697 INFO  (qtp1879144228-2481) [    x:collection1] o.a.s.u.p.LogUpdateProcessorFactory [collection1]  webapp=/solr path=/update params={wt=javabin&version=2}{add=[170]} 0 0
   [junit4]   2> 697698 INFO  (qtp1879144228-2480) [    x:collection1] o.a.s.u.p.LogUpdateProcessorFactory [collection1]  webapp=/solr path=/update params={wt=javabin&version=2}{add=[171]} 0 0
   [junit4]   2> 697698 INFO  (qtp1879144228-2481) [    x:collection1] o.a.s.u.p.LogUpdateProcessorFactory [collection1]  webapp=/solr path=/update params={wt=javabin&version=2}{add=[172]} 0 0
   [junit4]   2> 697699 INFO  (qtp1879144228-2480) [    x:collection1] o.a.s.u.p.LogUpdateProcessorFactory [collection1]  webapp=/solr path=/update params={wt=javabin&version=2}{add=[173]} 0 0
   [junit4]   2> 697699 INFO  (qtp1879144228-2481) [    x:collection1] o.a.s.u.p.LogUpdateProcessorFactory [collection1]  webapp=/solr path=/update params={wt=javabin&version=2}{add=[174]} 0 0
   [junit4]   2> 697699 INFO  (qtp1879144228-2480) [    x:collection1] o.a.s.u.p.LogUpdateProcessorFactory [collection1]  webapp=/solr path=/update params={wt=javabin&version=2}{add=[175]} 0 0
   [junit4]   2> 697700 INFO  (qtp1879144228-2481) [    x:collection1] o.a.s.u.p.LogUpdateProcessorFactory [collection1]  webapp=/solr path=/update params={wt=javabin&version=2}{add=[176]} 0 0
   [junit4]   2> 697700 INFO  (qtp1879144228-2480) [    x:collection1] o.a.s.u.p.LogUpdateProcessorFactory [collection1]  webapp=/solr path=/update params={wt=javabin&version=2}{add=[177]} 0 0
   [junit4]   2> 697700 INFO  (qtp1879144228-2481) [    x:collection1] o.a.s.u.p.LogUpdateProcessorFactory [collection1]  webapp=/solr path=/update params={wt=javabin&version=2}{add=[178]} 0 0
   [junit4]   2> 697701 INFO  (qtp1879144228-2480) [    x:collection1] o.a.s.u.p.LogUpdateProcessorFactory [collection1]  webapp=/solr path=/update params={wt=javabin&version=2}{add=[179]} 0 0
   [junit4]   2> 697701 INFO  (qtp1879144228-2481) [    x:collection1] o.a.s.u.p.LogUpdateProcessorFactory [collection1]  webapp=/solr path=/update params={wt=javabin&version=2}{add=[180]} 0 0
   [junit4]   2> 697702 INFO  (qtp1879144228-2480) [    x:collection1] o.a.s.u.p.LogUpdateProcessorFactory [collection1]  webapp=/solr path=/update params={wt=javabin&version=2}{add=[181]} 0 0
   [junit4]   2> 697702 INFO  (qtp1879144228-2481) [    x:collection1] o.a.s.u.p.LogUpdateProcessorFactory [collection1]  webapp=/solr path=/update params={wt=javabin&version=2}{add=[182]} 0 0
   [junit4]   2> 697703 INFO  (qtp1879144228-2480) [    x:collection1] o.a.s.u.p.LogUpdateProcessorFactory [collection1]  webapp=/solr path=/update params={wt=javabin&version=2}{add=[183]} 0 0
   [junit4]   2> 697703 INFO  (qtp1879144228-2481) [    x:collection1] o.a.s.u.p.LogUpdateProcessorFactory [collection1]  webapp=/solr path=/update params={wt=javabin&version=2}{add=[184]} 0 0
   [junit4]   2> 697703 INFO  (qtp1879144228-2480) [    x:collection1] o.a.s.u.p.LogUpdateProcessorFactory [collection1]  webapp=/solr path=/update params={wt=javabin&version=2}{add=[185]} 0 0
   [junit4]   2> 697704 INFO  (qtp1879144228-2481) [    x:collection1] o.a.s.u.p.LogUpdateProcessorFactory [collection1]  webapp=/solr path=/update params={wt=javabin&version=2}{add=[186]} 0 0
   [junit4]   2> 697704 INFO  (qtp1879144228-2480) [    x:collection1] o.a.s.u.p.LogUpdateProcessorFactory [collection1]  webapp=/solr path=/update params={wt=javabin&version=2}{add=[187]} 0 0
   [junit4]   2> 697705 INFO  (qtp1879144228-2481) [    x:collection1] o.a.s.u.p.LogUpdateProcessorFactory [collection1]  webapp=/solr path=/update params={wt=javabin&version=2}{add=[188]} 0 0
   [junit4]   2> 697705 INFO  (qtp1879144228-2480) [    x:collection1] o.a.s.u.p.LogUpdateProcessorFactory [collection1]  webapp=/solr path=/update params={wt=javabin&version=2}{add=[189]} 0 0
   [junit4]   2> 697706 INFO  (qtp1879144228-2481) [    x:collection1] o.a.s.u.p.LogUpdateProcessorFactory [collection1]  webapp=/solr path=/update params={wt=javabin&version=2}{add=[190]} 0 0
   [junit4]   2> 697706 INFO  (qtp1879144228-2480) [    x:collection1] o.a.s.u.p.LogUpdateProcessorFactory [collection1]  webapp=/solr path=/update params={wt=javabin&version=2}{add=[191]} 0 0
   [junit4]   2> 697707 INFO  (qtp1879144228-2481) [    x:collection1] o.a.s.u.p.LogUpdateProcessorFactory [collection1]  webapp=/solr path=/update params={wt=javabin&version=2}{add=[192]} 0 0
   [junit4]   2> 697707 INFO  (qtp1879144228-2480) [    x:collection1] o.a.s.u.p.LogUpdateProcessorFactory [collection1]  webapp=/solr path=/update params={wt=javabin&version=2}{add=[193]} 0 0
   [junit4]   2> 697707 INFO  (qtp1879144228-2481) [    x:collection1] o.a.s.u.p.LogUpdateProcessorFactory [collection1]  webapp=/solr path=/update params={wt=javabin&version=2}{add=[194]} 0 0
   [junit4]   2> 697708 INFO  (qtp1879144228-2480) [    x:collection1] o.a.s.u.p.LogUpdateProcessorFactory [collection1]  webapp=/solr path=/update params={wt=javabin&version=2}{add=[195]} 0 0
   [junit4]   2> 697708 INFO  (qtp1879144228-2481) [    x:collection1] o.a.s.u.p.LogUpdateProcessorFactory [collection1]  webapp=/solr path=/update params={wt=javabin&version=2}{add=[196]} 0 0
   [junit4]   2> 697709 INFO  (qtp1879144228-2480) [    x:collection1] o.a.s.u.p.LogUpdateProcessorFactory [collection1]  webapp=/solr path=/update params={wt=javabin&version=2}{add=[197]} 0 0
   [junit4]   2> 697709 INFO  (qtp1879144228-2481) [    x:collection1] o.a.s.u.p.LogUpdateProcessorFactory [collection1]  webapp=/solr path=/update params={wt=javabin&version=2}{add=[198]} 0 0
   [junit4]   2> 697709 INFO  (qtp1879144228-2480) [    x:collection1] o.a.s.u.p.LogUpdateProcessorFactory [collection1]  webapp=/solr path=/update params={wt=javabin&version=2}{add=[199]} 0 0
   [junit4]   2> 697710 INFO  (qtp1879144228-2481) [    x:collection1] o.a.s.u.p.LogUpdateProcessorFactory [collection1]  webapp=/solr path=/update params={wt=javabin&version=2}{add=[200]} 0 0
   [junit4]   2> 697710 INFO  (qtp1879144228-2480) [    x:collection1] o.a.s.u.p.LogUpdateProcessorFactory [collection1]  webapp=/solr path=/update params={wt=javabin&version=2}{add=[201]} 0 0
   [junit4]   2> 697710 INFO  (qtp1879144228-2481) [    x:collection1] o.a.s.u.p.LogUpdateProcessorFactory [collection1]  webapp=/solr path=/update params={wt=javabin&version=2}{add=[202]} 0 0
   [junit4]   2> 697711 INFO  (qtp1879144228-2480) [    x:collection1] o.a.s.u.p.LogUpdateProcessorFactory [collection1]  webapp=/solr path=/update params={wt=javabin&version=2}{add=[203]} 0 0
   [junit4]   2> 697711 INFO  (qtp1879144228-2481) [    x:collection1] o.a.s.u.p.LogUpdateProcessorFactory [collection1]  webapp=/solr path=/update params={wt=javabin&version=2}{add=[204]} 0 0
   [junit4]   2> 697712 INFO  (qtp1879144228-2480) [    x:collection1] o.a.s.u.p.LogUpdateProcessorFactory [collection1]  webapp=/solr path=/update params={wt=javabin&version=2}{add=[205]} 0 0
   [junit4]   2> 697712 INFO  (qtp1879144228-2481) [    x:collection1] o.a.s.u.p.LogUpdateProcessorFactory [collection1]  webapp=/solr path=/update params={wt=javabin&version=2}{add=[206]} 0 0
   [junit4]   2> 697713 INFO  (qtp1879144228-2480) [    x:collection1] o.a.s.u.p.LogUpdateProcessorFactory [collection1]  webapp=/solr path=/update params={wt=javabin&version=2}{add=[207]} 0 0
   [junit4]   2> 697713 INFO  (qtp1879144228-2481) [    x:collection1] o.a.s.u.p.LogUpdateProcessorFactory [collection1]  webapp=/solr path=/update params={wt=javabin&version=2}{add=[208]} 0 0
   [junit4]   2> 697714 INFO  (qtp1879144228-2480) [    x:collection1] o.a.s.u.p.LogUpdateProcessorFactory [collection1]  webapp=/solr path=/update params={wt=javabin&version=2}{add=[209]} 0 0
   [junit4]   2> 697715 INFO  (qtp1879144228-2481) [    x:collection1] o.a.s.u.p.LogUpdateProcessorFactory [collection1]  webapp=/solr path=/update params={wt=javabin&version=2}{add=[210]} 0 0
   [junit4]   2> 697716 INFO  (qtp1879144228-2480) [    x:collection1] o.a.s.u.p.LogUpdateProcessorFactory [collection1]  webapp=/solr path=/update params={wt=javabin&version=2}{add=[211]} 0 0
   [junit4]   2> 697717 INFO  (qtp1879144228-2481) [    x:collection1] o.a.s.u.p.LogUpdateProcessorFactory [collection1]  webapp=/solr path=/update params={wt=javabin&version=2}{add=[212]} 0 0
   [junit4]   2> 697718 INFO  (qtp1879144228-2480) [    x:collection1] o.a.s.u.p.LogUpdateProcessorFactory [collection1]  webapp=/solr path=/update params={wt=javabin&version=2}{add=[213]} 0 0
   [junit4]   2> 697718 INFO  (qtp1879144228-2481) [    x:collection1] o.a.s.u.p.LogUpdateProcessorFactory [collection1]  webapp=/solr path=/update params={wt=javabin&version=2}{add=[214]} 0 0
   [junit4]   2> 697719 INFO  (qtp1879144228-2480) [    x:collection1] o.a.s.u.p.LogUpdateProcessorFactory [collection1]  webapp=/solr path=/update params={wt=javabin&version=2}{add=[215]} 0 0
   [junit4]   2> 697719 INFO  (qtp1879144228-2481) [    x:collection1] o.a.s.u.p.LogUpdateProcessorFactory [collection1]  webapp=/solr path=/update params={wt=javabin&version=2}{add=[216]} 0 0
   [junit4]   2> 697720 INFO  (qtp1879144228-2480) [    x:collection1] o.a.s.u.p.LogUpdateProcessorFactory [collection1]  webapp=/solr path=/update params={wt=javabin&version=2}{add=[217]} 0 0
   [junit4]   2> 697720 INFO  (qtp1879144228-2481) [    x:collection1] o.a.s.u.p.LogUpdateProcessorFactory [collection1]  webapp=/solr path=/update params={wt=javabin&version=2}{add=[218]} 0 0
   [junit4]   2> 697721 INFO  (qtp1879144228-2480) [    x:collection1] o.a.s.u.p.LogUpdateProcessorFactory [collection1]  webapp=/solr path=/update params={wt=javabin&version=2}{add=[219]} 0 0
   [junit4]   2> 697721 INFO  (qtp1879144228-2481) [    x:collection1] o.a.s.u.p.LogUpdateProcessorFactory [collection1]  webapp=/solr path=/update params={wt=javabin&version=2}{add=[220]} 0 0
   [junit4]   2> 697722 INFO  (qtp1879144228-2480) [    x:collection1] o.a.s.u.p.LogUpdateProcessorFactory [collection1]  webapp=/solr path=/update params={wt=javabin&version=2}{add=[221]} 0 0
   [junit4]   2> 697722 INFO  (qtp1879144228-2481) [    x:collection1] o.a.s.u.p.

[...truncated too long message...]

4]   2> 	at java.util.concurrent.Executors$RunnableAdapter.call(Executors.java:511)
   [junit4]   2> 	at java.util.concurrent.FutureTask.run(FutureTask.java:266)
   [junit4]   2> 	at org.apache.solr.common.util.ExecutorUtil$MDCAwareThreadPoolExecutor.lambda$execute$0(ExecutorUtil.java:188)
   [junit4]   2> 	at java.util.concurrent.ThreadPoolExecutor.runWorker(ThreadPoolExecutor.java:1149)
   [junit4]   2> 	at java.util.concurrent.ThreadPoolExecutor$Worker.run(ThreadPoolExecutor.java:624)
   [junit4]   2> 	at java.lang.Thread.run(Thread.java:748)
   [junit4]   2> 7103351 INFO  (jetty-closer-70929-thread-2) [    ] o.e.j.s.h.ContextHandler Stopped o.e.j.s.ServletContextHandler@c31fb1{/solr,null,UNAVAILABLE}
   [junit4]   2> 7103351 INFO  (jetty-closer-70929-thread-2) [    ] o.e.j.s.session Stopped scavenging
   [junit4]   2> 7103353 INFO  (zkCallback-70987-thread-1-processing-n:127.0.0.1:42745_solr) [n:127.0.0.1:42745_solr c:utilizenodecoll s:shard2 r:core_node10 x:utilizenodecoll_shard2_replica_n9] o.a.s.m.SolrMetricManager Closing metric reporters for registry=solr.collection.utilizenodecoll.shard2.leader, tag=3783412
   [junit4]   2> 7103354 INFO  (jetty-closer-70929-thread-5) [    ] o.e.j.s.h.ContextHandler Stopped o.e.j.s.ServletContextHandler@7f0f9162{/solr,null,UNAVAILABLE}
   [junit4]   2> 7103363 INFO  (jetty-closer-70929-thread-5) [    ] o.e.j.s.session Stopped scavenging
   [junit4]   2> 7103626 INFO  (jetty-closer-70929-thread-4) [    ] o.e.j.s.h.ContextHandler Stopped o.e.j.s.ServletContextHandler@463bc160{/solr,null,UNAVAILABLE}
   [junit4]   2> 7103627 INFO  (jetty-closer-70929-thread-4) [    ] o.e.j.s.session Stopped scavenging
   [junit4]   2> 7103643 ERROR (SUITE-TestUtilizeNode-seed#[49E30565A85D27F4]-worker) [    ] o.a.z.s.ZooKeeperServer ZKShutdownHandler is not registered, so ZooKeeper server won't take any action on ERROR or SHUTDOWN server state changes
   [junit4]   2> 7103651 INFO  (SUITE-TestUtilizeNode-seed#[49E30565A85D27F4]-worker) [    ] o.a.s.c.ZkTestServer connecting to 127.0.0.1:35825 35825
   [junit4]   2> 7103886 INFO  (Thread-59639) [    ] o.a.s.c.ZkTestServer connecting to 127.0.0.1:35825 35825
   [junit4]   2> 7103887 WARN  (Thread-59639) [    ] o.a.s.c.ZkTestServer Watch limit violations: 
   [junit4]   2> Maximum concurrent create/delete watches above limit:
   [junit4]   2> 
   [junit4]   2> 	18	/solr/collections/utilizenodecoll/terms/shard2
   [junit4]   2> 	8	/solr/aliases.json
   [junit4]   2> 	8	/solr/clusterprops.json
   [junit4]   2> 	6	/solr/security.json
   [junit4]   2> 	6	/solr/configs/conf1
   [junit4]   2> 	5	/solr/collections/utilizenodecoll/terms/shard1
   [junit4]   2> 
   [junit4]   2> Maximum concurrent data watches above limit:
   [junit4]   2> 
   [junit4]   2> 	78	/solr/collections/utilizenodecoll/state.json
   [junit4]   2> 	8	/solr/clusterstate.json
   [junit4]   2> 	2	/solr/overseer_elect/election/72166023191724044-127.0.0.1:39470_solr-n_0000000001
   [junit4]   2> 	2	/solr/overseer_elect/election/72166023191724036-127.0.0.1:37590_solr-n_0000000003
   [junit4]   2> 	2	/solr/collections/utilizenodecoll/leader_elect/shard2/election/72166023191724044-core_node8-n_0000000000
   [junit4]   2> 	2	/solr/overseer_elect/election/72166023191724040-127.0.0.1:36956_solr-n_0000000000
   [junit4]   2> 
   [junit4]   2> Maximum concurrent children watches above limit:
   [junit4]   2> 
   [junit4]   2> 	10	/solr/live_nodes
   [junit4]   2> 	9	/solr/collections
   [junit4]   2> 
   [junit4]   2> NOTE: leaving temporary files on disk at: /home/jenkins/jenkins-slave/workspace/Lucene-Solr-NightlyTests-master/checkout/solr/build/solr-core/test/J0/temp/solr.cloud.TestUtilizeNode_49E30565A85D27F4-001
   [junit4]   2> Feb 22, 2018 4:31:56 PM com.carrotsearch.randomizedtesting.ThreadLeakControl checkThreadLeaks
   [junit4]   2> WARNING: Will linger awaiting termination of 1 leaked thread(s).
   [junit4]   2> NOTE: test params are: codec=Asserting(Lucene70): {}, docValues:{}, maxPointsInLeafNode=542, maxMBSortInHeap=7.8362270141031605, sim=Asserting(org.apache.lucene.search.similarities.AssertingSimilarity@6c4f7fc), locale=und, timezone=Antarctica/McMurdo
   [junit4]   2> NOTE: Linux 4.4.0-112-generic amd64/Oracle Corporation 1.8.0_152 (64-bit)/cpus=4,threads=1,free=170757120,total=517996544
   [junit4]   2> NOTE: All tests run in this JVM: [MBeansHandlerTest, TestSQLHandlerNonCloud, ZkNodePropsTest, DistributedDebugComponentTest, DeleteShardTest, TestSchemaNameResource, RecoveryAfterSoftCommitTest, StatsReloadRaceTest, TestSolrFieldCacheBean, LargeFieldTest, SmileWriterTest, TestJavabinTupleStreamParser, ScheduledTriggerTest, InfixSuggestersTest, TestFileDictionaryLookup, PreAnalyzedUpdateProcessorTest, TestConfigSets, BinaryUpdateRequestHandlerTest, TestConfigsApi, RequestHandlersTest, TestLegacyTerms, ClassificationUpdateProcessorIntegrationTest, TestRuleBasedAuthorizationPlugin, TestInfoStreamLogging, BlockJoinFacetSimpleTest, TestMergePolicyConfig, TestSmileRequest, OverseerStatusTest, TestCSVLoader, TestPayloadScoreQParserPlugin, TestRemoteStreaming, TestClassicSimilarityFactory, MigrateRouteKeyTest, TestFieldSortValues, TestChildDocTransformer, DebugComponentTest, TestCSVResponseWriter, ShardSplitTest, UpdateParamsTest, SynonymTokenizerTest, TestDistributedStatsComponentCardinality, ZkShardTermsTest, OutputWriterTest, TestPolicyCloud, TestHighlightDedupGrouping, TestNodeLostTrigger, TestDistribIDF, HighlighterConfigTest, TestIBSimilarityFactory, TestOnReconnectListenerSupport, DistributedTermsComponentTest, TestDynamicFieldCollectionResource, TestLegacyFieldCache, TestStressLiveNodes, BasicDistributedZkTest, TestNestedDocsSort, SolrGangliaReporterTest, FullSolrCloudDistribCmdsTest, TestJoin, IndexBasedSpellCheckerTest, AssignBackwardCompatibilityTest, ExecutePlanActionTest, TestTrieFacet, CdcrUpdateLogTest, CdcrRequestHandlerTest, TestManagedSchemaAPI, UUIDUpdateProcessorFallbackTest, TestFieldCache, OverseerCollectionConfigSetProcessorTest, TestLeaderInitiatedRecoveryThread, TestCollationFieldDocValues, TestMaxScoreQueryParser, SolrIndexMetricsTest, TestConfig, TestSolrCLIRunExample, DeleteLastCustomShardedReplicaTest, CdcrBootstrapTest, MetricUtilsTest, TestCrossCoreJoin, TestSystemCollAutoCreate, TestManagedStopFilterFactory, TestClusterProperties, TestCollectionsAPIViaSolrCloudCluster, DefaultValueUpdateProcessorTest, TestSegmentSorting, TestExtendedDismaxParser, OpenExchangeRatesOrgProviderTest, UninvertDocValuesMergePolicyTest, TestMaxTokenLenTokenizer, DistributedFacetSimpleRefinementLongTailTest, DistributedFacetPivotLargeTest, HdfsThreadLeakTest, TestCollationField, BitVectorTest, TestDistributedSearch, TestPseudoReturnFields, TestConfigOverlay, ConcurrentCreateRoutedAliasTest, CursorPagingTest, PluginInfoTest, TestLMDirichletSimilarityFactory, AutoAddReplicasPlanActionTest, TestReqParamsAPI, BJQParserTest, TestLRUStatsCache, TestExportWriter, DirectUpdateHandlerTest, AnalyticsQueryTest, SchemaApiFailureTest, ReplaceNodeTest, TestEmbeddedSolrServerSchemaAPI, TestIndexingPerformance, SharedFSAutoReplicaFailoverTest, PropertiesRequestHandlerTest, DocExpirationUpdateProcessorFactoryTest, TestSkipOverseerOperations, TestQuerySenderNoQuery, TestRandomFaceting, TestHdfsUpdateLog, TestReloadDeadlock, TestStressLucene, SortSpecParsingTest, TestSolrQueryParser, TestCoreBackup, TriLevelCompositeIdRoutingTest, SimpleFacetsTest, LeaderInitiatedRecoveryOnShardRestartTest, LegacyCloudClusterPropTest, MissingSegmentRecoveryTest, MoveReplicaHDFSTest, PeerSyncReplicationTest, RollingRestartTest, TestTolerantUpdateProcessorRandomCloud, TestUtilizeNode]
   [junit4] Completed [578/779 (4!)] on J0 in 20.65s, 1 test, 1 failure <<< FAILURES!

[...truncated 25596 lines...]
-check-forbidden-all:
[forbidden-apis] Reading bundled API signatures: jdk-unsafe-1.8
[forbidden-apis] Reading bundled API signatures: jdk-deprecated-1.8
[forbidden-apis] Reading bundled API signatures: jdk-non-portable
[forbidden-apis] Reading bundled API signatures: jdk-reflection
[forbidden-apis] Reading bundled API signatures: commons-io-unsafe-2.5
[forbidden-apis] Reading API signatures: /home/jenkins/jenkins-slave/workspace/Lucene-Solr-NightlyTests-master/checkout/lucene/tools/forbiddenApis/base.txt
[forbidden-apis] Reading API signatures: /home/jenkins/jenkins-slave/workspace/Lucene-Solr-NightlyTests-master/checkout/lucene/tools/forbiddenApis/servlet-api.txt
[forbidden-apis] Reading API signatures: /home/jenkins/jenkins-slave/workspace/Lucene-Solr-NightlyTests-master/checkout/lucene/tools/forbiddenApis/solr.txt
[forbidden-apis] Loading classes to check...
[forbidden-apis] Scanning classes for violations...
[forbidden-apis] Forbidden method invocation: java.lang.System#currentTimeMillis() [Use RTimer/TimeOut/System.nanoTime for time comparisons, and `new Date()` output/debugging/stats of timestamps. If for some miscellaneous reason, you absolutely need to use this, use a SuppressForbidden.]
[forbidden-apis]   in org.apache.solr.cloud.autoscaling.ScheduledTriggerTest (ScheduledTriggerTest.java:80)
[forbidden-apis] Scanned 3977 class file(s) for forbidden API invocations (in 10.80s), 1 error(s).

BUILD FAILED
/home/jenkins/jenkins-slave/workspace/Lucene-Solr-NightlyTests-master/checkout/build.xml:626: The following error occurred while executing this line:
/home/jenkins/jenkins-slave/workspace/Lucene-Solr-NightlyTests-master/checkout/build.xml:117: The following error occurred while executing this line:
/home/jenkins/jenkins-slave/workspace/Lucene-Solr-NightlyTests-master/checkout/solr/build.xml:376: The following error occurred while executing this line:
/home/jenkins/jenkins-slave/workspace/Lucene-Solr-NightlyTests-master/checkout/solr/common-build.xml:535: Check for forbidden API calls failed, see log.

Total time: 607 minutes 36 seconds
Build step 'Invoke Ant' marked build as failure
Archiving artifacts
Recording test results
Email was triggered for: Failure - Any
Sending email for trigger: Failure - Any

Mime
View raw message