lucene-dev mailing list archives

Site index · List index
Message view « Date » · « Thread »
Top « Date » · « Thread »
From Policeman Jenkins Server <jenk...@thetaphi.de>
Subject [JENKINS] Lucene-Solr-master-Windows (64bit/jdk-9.0.1) - Build # 7148 - Still Unstable!
Date Thu, 01 Feb 2018 06:11:54 GMT
Build: https://jenkins.thetaphi.de/job/Lucene-Solr-master-Windows/7148/
Java: 64bit/jdk-9.0.1 -XX:+UseCompressedOops -XX:+UseParallelGC

10 tests failed.
FAILED:  junit.framework.TestSuite.org.apache.lucene.index.TestLongPostings

Error Message:
Could not remove the following files (in the order of attempts):    C:\Users\jenkins\workspace\Lucene-Solr-master-Windows\lucene\build\core\test\J0\temp\lucene.index.TestLongPostings_98258A9110904AF7-001\longpostings.1603048714465031682-001: java.nio.file.AccessDeniedException: C:\Users\jenkins\workspace\Lucene-Solr-master-Windows\lucene\build\core\test\J0\temp\lucene.index.TestLongPostings_98258A9110904AF7-001\longpostings.1603048714465031682-001    C:\Users\jenkins\workspace\Lucene-Solr-master-Windows\lucene\build\core\test\J0\temp\lucene.index.TestLongPostings_98258A9110904AF7-001: java.nio.file.DirectoryNotEmptyException: C:\Users\jenkins\workspace\Lucene-Solr-master-Windows\lucene\build\core\test\J0\temp\lucene.index.TestLongPostings_98258A9110904AF7-001 

Stack Trace:
java.io.IOException: Could not remove the following files (in the order of attempts):
   C:\Users\jenkins\workspace\Lucene-Solr-master-Windows\lucene\build\core\test\J0\temp\lucene.index.TestLongPostings_98258A9110904AF7-001\longpostings.1603048714465031682-001: java.nio.file.AccessDeniedException: C:\Users\jenkins\workspace\Lucene-Solr-master-Windows\lucene\build\core\test\J0\temp\lucene.index.TestLongPostings_98258A9110904AF7-001\longpostings.1603048714465031682-001
   C:\Users\jenkins\workspace\Lucene-Solr-master-Windows\lucene\build\core\test\J0\temp\lucene.index.TestLongPostings_98258A9110904AF7-001: java.nio.file.DirectoryNotEmptyException: C:\Users\jenkins\workspace\Lucene-Solr-master-Windows\lucene\build\core\test\J0\temp\lucene.index.TestLongPostings_98258A9110904AF7-001

	at __randomizedtesting.SeedInfo.seed([98258A9110904AF7]:0)
	at org.apache.lucene.util.IOUtils.rm(IOUtils.java:329)
	at org.apache.lucene.util.TestRuleTemporaryFilesCleanup.afterAlways(TestRuleTemporaryFilesCleanup.java:216)
	at com.carrotsearch.randomizedtesting.rules.TestRuleAdapter$1.afterAlways(TestRuleAdapter.java:31)
	at com.carrotsearch.randomizedtesting.rules.StatementAdapter.evaluate(StatementAdapter.java:43)
	at com.carrotsearch.randomizedtesting.rules.StatementAdapter.evaluate(StatementAdapter.java:36)
	at org.apache.lucene.util.TestRuleAssertionsRequired$1.evaluate(TestRuleAssertionsRequired.java:53)
	at org.apache.lucene.util.TestRuleMarkFailure$1.evaluate(TestRuleMarkFailure.java:47)
	at org.apache.lucene.util.TestRuleIgnoreAfterMaxFailures$1.evaluate(TestRuleIgnoreAfterMaxFailures.java:64)
	at org.apache.lucene.util.TestRuleIgnoreTestSuites$1.evaluate(TestRuleIgnoreTestSuites.java:54)
	at com.carrotsearch.randomizedtesting.rules.StatementAdapter.evaluate(StatementAdapter.java:36)
	at com.carrotsearch.randomizedtesting.ThreadLeakControl$StatementRunner.run(ThreadLeakControl.java:368)
	at java.base/java.lang.Thread.run(Thread.java:844)


FAILED:  junit.framework.TestSuite.org.apache.lucene.store.TestMmapDirectory

Error Message:
Could not remove the following files (in the order of attempts):    C:\Users\jenkins\workspace\Lucene-Solr-master-Windows\lucene\build\core\test\J1\temp\lucene.store.TestMmapDirectory_98258A9110904AF7-001\tempDir-003: java.nio.file.AccessDeniedException: C:\Users\jenkins\workspace\Lucene-Solr-master-Windows\lucene\build\core\test\J1\temp\lucene.store.TestMmapDirectory_98258A9110904AF7-001\tempDir-003    C:\Users\jenkins\workspace\Lucene-Solr-master-Windows\lucene\build\core\test\J1\temp\lucene.store.TestMmapDirectory_98258A9110904AF7-001: java.nio.file.DirectoryNotEmptyException: C:\Users\jenkins\workspace\Lucene-Solr-master-Windows\lucene\build\core\test\J1\temp\lucene.store.TestMmapDirectory_98258A9110904AF7-001 

Stack Trace:
java.io.IOException: Could not remove the following files (in the order of attempts):
   C:\Users\jenkins\workspace\Lucene-Solr-master-Windows\lucene\build\core\test\J1\temp\lucene.store.TestMmapDirectory_98258A9110904AF7-001\tempDir-003: java.nio.file.AccessDeniedException: C:\Users\jenkins\workspace\Lucene-Solr-master-Windows\lucene\build\core\test\J1\temp\lucene.store.TestMmapDirectory_98258A9110904AF7-001\tempDir-003
   C:\Users\jenkins\workspace\Lucene-Solr-master-Windows\lucene\build\core\test\J1\temp\lucene.store.TestMmapDirectory_98258A9110904AF7-001: java.nio.file.DirectoryNotEmptyException: C:\Users\jenkins\workspace\Lucene-Solr-master-Windows\lucene\build\core\test\J1\temp\lucene.store.TestMmapDirectory_98258A9110904AF7-001

	at __randomizedtesting.SeedInfo.seed([98258A9110904AF7]:0)
	at org.apache.lucene.util.IOUtils.rm(IOUtils.java:329)
	at org.apache.lucene.util.TestRuleTemporaryFilesCleanup.afterAlways(TestRuleTemporaryFilesCleanup.java:216)
	at com.carrotsearch.randomizedtesting.rules.TestRuleAdapter$1.afterAlways(TestRuleAdapter.java:31)
	at com.carrotsearch.randomizedtesting.rules.StatementAdapter.evaluate(StatementAdapter.java:43)
	at com.carrotsearch.randomizedtesting.rules.StatementAdapter.evaluate(StatementAdapter.java:36)
	at org.apache.lucene.util.TestRuleAssertionsRequired$1.evaluate(TestRuleAssertionsRequired.java:53)
	at org.apache.lucene.util.TestRuleMarkFailure$1.evaluate(TestRuleMarkFailure.java:47)
	at org.apache.lucene.util.TestRuleIgnoreAfterMaxFailures$1.evaluate(TestRuleIgnoreAfterMaxFailures.java:64)
	at org.apache.lucene.util.TestRuleIgnoreTestSuites$1.evaluate(TestRuleIgnoreTestSuites.java:54)
	at com.carrotsearch.randomizedtesting.rules.StatementAdapter.evaluate(StatementAdapter.java:36)
	at com.carrotsearch.randomizedtesting.ThreadLeakControl$StatementRunner.run(ThreadLeakControl.java:368)
	at java.base/java.lang.Thread.run(Thread.java:844)


FAILED:  junit.framework.TestSuite.org.apache.lucene.store.TestHardLinkCopyDirectoryWrapper

Error Message:
Could not remove the following files (in the order of attempts):    C:\Users\jenkins\workspace\Lucene-Solr-master-Windows\lucene\build\misc\test\J1\temp\lucene.store.TestHardLinkCopyDirectoryWrapper_C6B7DB4D748E83DC-001\testThreadSafety-001: java.nio.file.AccessDeniedException: C:\Users\jenkins\workspace\Lucene-Solr-master-Windows\lucene\build\misc\test\J1\temp\lucene.store.TestHardLinkCopyDirectoryWrapper_C6B7DB4D748E83DC-001\testThreadSafety-001    C:\Users\jenkins\workspace\Lucene-Solr-master-Windows\lucene\build\misc\test\J1\temp\lucene.store.TestHardLinkCopyDirectoryWrapper_C6B7DB4D748E83DC-001: java.nio.file.DirectoryNotEmptyException: C:\Users\jenkins\workspace\Lucene-Solr-master-Windows\lucene\build\misc\test\J1\temp\lucene.store.TestHardLinkCopyDirectoryWrapper_C6B7DB4D748E83DC-001 

Stack Trace:
java.io.IOException: Could not remove the following files (in the order of attempts):
   C:\Users\jenkins\workspace\Lucene-Solr-master-Windows\lucene\build\misc\test\J1\temp\lucene.store.TestHardLinkCopyDirectoryWrapper_C6B7DB4D748E83DC-001\testThreadSafety-001: java.nio.file.AccessDeniedException: C:\Users\jenkins\workspace\Lucene-Solr-master-Windows\lucene\build\misc\test\J1\temp\lucene.store.TestHardLinkCopyDirectoryWrapper_C6B7DB4D748E83DC-001\testThreadSafety-001
   C:\Users\jenkins\workspace\Lucene-Solr-master-Windows\lucene\build\misc\test\J1\temp\lucene.store.TestHardLinkCopyDirectoryWrapper_C6B7DB4D748E83DC-001: java.nio.file.DirectoryNotEmptyException: C:\Users\jenkins\workspace\Lucene-Solr-master-Windows\lucene\build\misc\test\J1\temp\lucene.store.TestHardLinkCopyDirectoryWrapper_C6B7DB4D748E83DC-001

	at __randomizedtesting.SeedInfo.seed([C6B7DB4D748E83DC]:0)
	at org.apache.lucene.util.IOUtils.rm(IOUtils.java:329)
	at org.apache.lucene.util.TestRuleTemporaryFilesCleanup.afterAlways(TestRuleTemporaryFilesCleanup.java:216)
	at com.carrotsearch.randomizedtesting.rules.TestRuleAdapter$1.afterAlways(TestRuleAdapter.java:31)
	at com.carrotsearch.randomizedtesting.rules.StatementAdapter.evaluate(StatementAdapter.java:43)
	at com.carrotsearch.randomizedtesting.rules.StatementAdapter.evaluate(StatementAdapter.java:36)
	at org.apache.lucene.util.TestRuleAssertionsRequired$1.evaluate(TestRuleAssertionsRequired.java:53)
	at org.apache.lucene.util.TestRuleMarkFailure$1.evaluate(TestRuleMarkFailure.java:47)
	at org.apache.lucene.util.TestRuleIgnoreAfterMaxFailures$1.evaluate(TestRuleIgnoreAfterMaxFailures.java:64)
	at org.apache.lucene.util.TestRuleIgnoreTestSuites$1.evaluate(TestRuleIgnoreTestSuites.java:54)
	at com.carrotsearch.randomizedtesting.rules.StatementAdapter.evaluate(StatementAdapter.java:36)
	at com.carrotsearch.randomizedtesting.ThreadLeakControl$StatementRunner.run(ThreadLeakControl.java:368)
	at java.base/java.lang.Thread.run(Thread.java:844)


FAILED:  org.apache.solr.cloud.FullSolrCloudDistribCmdsTest.test

Error Message:
Could not find collection:collection2

Stack Trace:
java.lang.AssertionError: Could not find collection:collection2
	at __randomizedtesting.SeedInfo.seed([B6B0142CA4C8D361:3EE42BF60A34BE99]:0)
	at org.junit.Assert.fail(Assert.java:93)
	at org.junit.Assert.assertTrue(Assert.java:43)
	at org.junit.Assert.assertNotNull(Assert.java:526)
	at org.apache.solr.cloud.AbstractDistribZkTestBase.waitForRecoveriesToFinish(AbstractDistribZkTestBase.java:155)
	at org.apache.solr.cloud.AbstractDistribZkTestBase.waitForRecoveriesToFinish(AbstractDistribZkTestBase.java:140)
	at org.apache.solr.cloud.AbstractDistribZkTestBase.waitForRecoveriesToFinish(AbstractDistribZkTestBase.java:135)
	at org.apache.solr.cloud.AbstractFullDistribZkTestBase.waitForRecoveriesToFinish(AbstractFullDistribZkTestBase.java:915)
	at org.apache.solr.cloud.FullSolrCloudDistribCmdsTest.testIndexingBatchPerRequestWithHttpSolrClient(FullSolrCloudDistribCmdsTest.java:612)
	at org.apache.solr.cloud.FullSolrCloudDistribCmdsTest.test(FullSolrCloudDistribCmdsTest.java:152)
	at java.base/jdk.internal.reflect.NativeMethodAccessorImpl.invoke0(Native Method)
	at java.base/jdk.internal.reflect.NativeMethodAccessorImpl.invoke(NativeMethodAccessorImpl.java:62)
	at java.base/jdk.internal.reflect.DelegatingMethodAccessorImpl.invoke(DelegatingMethodAccessorImpl.java:43)
	at java.base/java.lang.reflect.Method.invoke(Method.java:564)
	at com.carrotsearch.randomizedtesting.RandomizedRunner.invoke(RandomizedRunner.java:1737)
	at com.carrotsearch.randomizedtesting.RandomizedRunner$8.evaluate(RandomizedRunner.java:934)
	at com.carrotsearch.randomizedtesting.RandomizedRunner$9.evaluate(RandomizedRunner.java:970)
	at com.carrotsearch.randomizedtesting.RandomizedRunner$10.evaluate(RandomizedRunner.java:984)
	at org.apache.solr.BaseDistributedSearchTestCase$ShardsRepeatRule$ShardsFixedStatement.callStatement(BaseDistributedSearchTestCase.java:993)
	at org.apache.solr.BaseDistributedSearchTestCase$ShardsRepeatRule$ShardsStatement.evaluate(BaseDistributedSearchTestCase.java:968)
	at com.carrotsearch.randomizedtesting.rules.SystemPropertiesRestoreRule$1.evaluate(SystemPropertiesRestoreRule.java:57)
	at org.apache.lucene.util.TestRuleSetupTeardownChained$1.evaluate(TestRuleSetupTeardownChained.java:49)
	at org.apache.lucene.util.AbstractBeforeAfterRule$1.evaluate(AbstractBeforeAfterRule.java:45)
	at org.apache.lucene.util.TestRuleThreadAndTestName$1.evaluate(TestRuleThreadAndTestName.java:48)
	at org.apache.lucene.util.TestRuleIgnoreAfterMaxFailures$1.evaluate(TestRuleIgnoreAfterMaxFailures.java:64)
	at org.apache.lucene.util.TestRuleMarkFailure$1.evaluate(TestRuleMarkFailure.java:47)
	at com.carrotsearch.randomizedtesting.rules.StatementAdapter.evaluate(StatementAdapter.java:36)
	at com.carrotsearch.randomizedtesting.ThreadLeakControl$StatementRunner.run(ThreadLeakControl.java:368)
	at com.carrotsearch.randomizedtesting.ThreadLeakControl.forkTimeoutingTask(ThreadLeakControl.java:817)
	at com.carrotsearch.randomizedtesting.ThreadLeakControl$3.evaluate(ThreadLeakControl.java:468)
	at com.carrotsearch.randomizedtesting.RandomizedRunner.runSingleTest(RandomizedRunner.java:943)
	at com.carrotsearch.randomizedtesting.RandomizedRunner$5.evaluate(RandomizedRunner.java:829)
	at com.carrotsearch.randomizedtesting.RandomizedRunner$6.evaluate(RandomizedRunner.java:879)
	at com.carrotsearch.randomizedtesting.RandomizedRunner$7.evaluate(RandomizedRunner.java:890)
	at com.carrotsearch.randomizedtesting.rules.StatementAdapter.evaluate(StatementAdapter.java:36)
	at com.carrotsearch.randomizedtesting.rules.SystemPropertiesRestoreRule$1.evaluate(SystemPropertiesRestoreRule.java:57)
	at org.apache.lucene.util.AbstractBeforeAfterRule$1.evaluate(AbstractBeforeAfterRule.java:45)
	at com.carrotsearch.randomizedtesting.rules.StatementAdapter.evaluate(StatementAdapter.java:36)
	at org.apache.lucene.util.TestRuleStoreClassName$1.evaluate(TestRuleStoreClassName.java:41)
	at com.carrotsearch.randomizedtesting.rules.NoShadowingOrOverridesOnMethodsRule$1.evaluate(NoShadowingOrOverridesOnMethodsRule.java:40)
	at com.carrotsearch.randomizedtesting.rules.NoShadowingOrOverridesOnMethodsRule$1.evaluate(NoShadowingOrOverridesOnMethodsRule.java:40)
	at com.carrotsearch.randomizedtesting.rules.StatementAdapter.evaluate(StatementAdapter.java:36)
	at com.carrotsearch.randomizedtesting.rules.StatementAdapter.evaluate(StatementAdapter.java:36)
	at org.apache.lucene.util.TestRuleAssertionsRequired$1.evaluate(TestRuleAssertionsRequired.java:53)
	at org.apache.lucene.util.TestRuleMarkFailure$1.evaluate(TestRuleMarkFailure.java:47)
	at org.apache.lucene.util.TestRuleIgnoreAfterMaxFailures$1.evaluate(TestRuleIgnoreAfterMaxFailures.java:64)
	at org.apache.lucene.util.TestRuleIgnoreTestSuites$1.evaluate(TestRuleIgnoreTestSuites.java:54)
	at com.carrotsearch.randomizedtesting.rules.StatementAdapter.evaluate(StatementAdapter.java:36)
	at com.carrotsearch.randomizedtesting.ThreadLeakControl$StatementRunner.run(ThreadLeakControl.java:368)
	at java.base/java.lang.Thread.run(Thread.java:844)


FAILED:  org.apache.solr.handler.admin.AutoscalingHistoryHandlerTest.testHistory

Error Message:
expected:<5> but was:<0>

Stack Trace:
java.lang.AssertionError: expected:<5> but was:<0>
	at __randomizedtesting.SeedInfo.seed([B6B0142CA4C8D361:DB4CB0D11E802C66]:0)
	at org.junit.Assert.fail(Assert.java:93)
	at org.junit.Assert.failNotEquals(Assert.java:647)
	at org.junit.Assert.assertEquals(Assert.java:128)
	at org.junit.Assert.assertEquals(Assert.java:472)
	at org.junit.Assert.assertEquals(Assert.java:456)
	at org.apache.solr.handler.admin.AutoscalingHistoryHandlerTest.testHistory(AutoscalingHistoryHandlerTest.java:244)
	at java.base/jdk.internal.reflect.NativeMethodAccessorImpl.invoke0(Native Method)
	at java.base/jdk.internal.reflect.NativeMethodAccessorImpl.invoke(NativeMethodAccessorImpl.java:62)
	at java.base/jdk.internal.reflect.DelegatingMethodAccessorImpl.invoke(DelegatingMethodAccessorImpl.java:43)
	at java.base/java.lang.reflect.Method.invoke(Method.java:564)
	at com.carrotsearch.randomizedtesting.RandomizedRunner.invoke(RandomizedRunner.java:1737)
	at com.carrotsearch.randomizedtesting.RandomizedRunner$8.evaluate(RandomizedRunner.java:934)
	at com.carrotsearch.randomizedtesting.RandomizedRunner$9.evaluate(RandomizedRunner.java:970)
	at com.carrotsearch.randomizedtesting.RandomizedRunner$10.evaluate(RandomizedRunner.java:984)
	at com.carrotsearch.randomizedtesting.rules.SystemPropertiesRestoreRule$1.evaluate(SystemPropertiesRestoreRule.java:57)
	at org.apache.lucene.util.TestRuleSetupTeardownChained$1.evaluate(TestRuleSetupTeardownChained.java:49)
	at org.apache.lucene.util.AbstractBeforeAfterRule$1.evaluate(AbstractBeforeAfterRule.java:45)
	at org.apache.lucene.util.TestRuleThreadAndTestName$1.evaluate(TestRuleThreadAndTestName.java:48)
	at org.apache.lucene.util.TestRuleIgnoreAfterMaxFailures$1.evaluate(TestRuleIgnoreAfterMaxFailures.java:64)
	at org.apache.lucene.util.TestRuleMarkFailure$1.evaluate(TestRuleMarkFailure.java:47)
	at com.carrotsearch.randomizedtesting.rules.StatementAdapter.evaluate(StatementAdapter.java:36)
	at com.carrotsearch.randomizedtesting.ThreadLeakControl$StatementRunner.run(ThreadLeakControl.java:368)
	at com.carrotsearch.randomizedtesting.ThreadLeakControl.forkTimeoutingTask(ThreadLeakControl.java:817)
	at com.carrotsearch.randomizedtesting.ThreadLeakControl$3.evaluate(ThreadLeakControl.java:468)
	at com.carrotsearch.randomizedtesting.RandomizedRunner.runSingleTest(RandomizedRunner.java:943)
	at com.carrotsearch.randomizedtesting.RandomizedRunner$5.evaluate(RandomizedRunner.java:829)
	at com.carrotsearch.randomizedtesting.RandomizedRunner$6.evaluate(RandomizedRunner.java:879)
	at com.carrotsearch.randomizedtesting.RandomizedRunner$7.evaluate(RandomizedRunner.java:890)
	at com.carrotsearch.randomizedtesting.rules.StatementAdapter.evaluate(StatementAdapter.java:36)
	at com.carrotsearch.randomizedtesting.rules.SystemPropertiesRestoreRule$1.evaluate(SystemPropertiesRestoreRule.java:57)
	at org.apache.lucene.util.AbstractBeforeAfterRule$1.evaluate(AbstractBeforeAfterRule.java:45)
	at com.carrotsearch.randomizedtesting.rules.StatementAdapter.evaluate(StatementAdapter.java:36)
	at org.apache.lucene.util.TestRuleStoreClassName$1.evaluate(TestRuleStoreClassName.java:41)
	at com.carrotsearch.randomizedtesting.rules.NoShadowingOrOverridesOnMethodsRule$1.evaluate(NoShadowingOrOverridesOnMethodsRule.java:40)
	at com.carrotsearch.randomizedtesting.rules.NoShadowingOrOverridesOnMethodsRule$1.evaluate(NoShadowingOrOverridesOnMethodsRule.java:40)
	at com.carrotsearch.randomizedtesting.rules.StatementAdapter.evaluate(StatementAdapter.java:36)
	at com.carrotsearch.randomizedtesting.rules.StatementAdapter.evaluate(StatementAdapter.java:36)
	at org.apache.lucene.util.TestRuleAssertionsRequired$1.evaluate(TestRuleAssertionsRequired.java:53)
	at org.apache.lucene.util.TestRuleMarkFailure$1.evaluate(TestRuleMarkFailure.java:47)
	at org.apache.lucene.util.TestRuleIgnoreAfterMaxFailures$1.evaluate(TestRuleIgnoreAfterMaxFailures.java:64)
	at org.apache.lucene.util.TestRuleIgnoreTestSuites$1.evaluate(TestRuleIgnoreTestSuites.java:54)
	at com.carrotsearch.randomizedtesting.rules.StatementAdapter.evaluate(StatementAdapter.java:36)
	at com.carrotsearch.randomizedtesting.ThreadLeakControl$StatementRunner.run(ThreadLeakControl.java:368)
	at java.base/java.lang.Thread.run(Thread.java:844)


FAILED:  junit.framework.TestSuite.org.apache.solr.handler.admin.InfoHandlerTest

Error Message:
Could not remove the following files (in the order of attempts):    C:\Users\jenkins\workspace\Lucene-Solr-master-Windows\solr\build\solr-core\test\J0\temp\solr.handler.admin.InfoHandlerTest_B6B0142CA4C8D361-001\init-core-data-001\spellcheckerFreq: java.nio.file.DirectoryNotEmptyException: C:\Users\jenkins\workspace\Lucene-Solr-master-Windows\solr\build\solr-core\test\J0\temp\solr.handler.admin.InfoHandlerTest_B6B0142CA4C8D361-001\init-core-data-001\spellcheckerFreq    C:\Users\jenkins\workspace\Lucene-Solr-master-Windows\solr\build\solr-core\test\J0\temp\solr.handler.admin.InfoHandlerTest_B6B0142CA4C8D361-001\init-core-data-001: java.nio.file.DirectoryNotEmptyException: C:\Users\jenkins\workspace\Lucene-Solr-master-Windows\solr\build\solr-core\test\J0\temp\solr.handler.admin.InfoHandlerTest_B6B0142CA4C8D361-001\init-core-data-001    C:\Users\jenkins\workspace\Lucene-Solr-master-Windows\solr\build\solr-core\test\J0\temp\solr.handler.admin.InfoHandlerTest_B6B0142CA4C8D361-001\init-core-data-001\spellcheckerFreq\segments_1: java.nio.file.AccessDeniedException: C:\Users\jenkins\workspace\Lucene-Solr-master-Windows\solr\build\solr-core\test\J0\temp\solr.handler.admin.InfoHandlerTest_B6B0142CA4C8D361-001\init-core-data-001\spellcheckerFreq\segments_1    C:\Users\jenkins\workspace\Lucene-Solr-master-Windows\solr\build\solr-core\test\J0\temp\solr.handler.admin.InfoHandlerTest_B6B0142CA4C8D361-001: java.nio.file.DirectoryNotEmptyException: C:\Users\jenkins\workspace\Lucene-Solr-master-Windows\solr\build\solr-core\test\J0\temp\solr.handler.admin.InfoHandlerTest_B6B0142CA4C8D361-001 

Stack Trace:
java.io.IOException: Could not remove the following files (in the order of attempts):
   C:\Users\jenkins\workspace\Lucene-Solr-master-Windows\solr\build\solr-core\test\J0\temp\solr.handler.admin.InfoHandlerTest_B6B0142CA4C8D361-001\init-core-data-001\spellcheckerFreq: java.nio.file.DirectoryNotEmptyException: C:\Users\jenkins\workspace\Lucene-Solr-master-Windows\solr\build\solr-core\test\J0\temp\solr.handler.admin.InfoHandlerTest_B6B0142CA4C8D361-001\init-core-data-001\spellcheckerFreq
   C:\Users\jenkins\workspace\Lucene-Solr-master-Windows\solr\build\solr-core\test\J0\temp\solr.handler.admin.InfoHandlerTest_B6B0142CA4C8D361-001\init-core-data-001: java.nio.file.DirectoryNotEmptyException: C:\Users\jenkins\workspace\Lucene-Solr-master-Windows\solr\build\solr-core\test\J0\temp\solr.handler.admin.InfoHandlerTest_B6B0142CA4C8D361-001\init-core-data-001
   C:\Users\jenkins\workspace\Lucene-Solr-master-Windows\solr\build\solr-core\test\J0\temp\solr.handler.admin.InfoHandlerTest_B6B0142CA4C8D361-001\init-core-data-001\spellcheckerFreq\segments_1: java.nio.file.AccessDeniedException: C:\Users\jenkins\workspace\Lucene-Solr-master-Windows\solr\build\solr-core\test\J0\temp\solr.handler.admin.InfoHandlerTest_B6B0142CA4C8D361-001\init-core-data-001\spellcheckerFreq\segments_1
   C:\Users\jenkins\workspace\Lucene-Solr-master-Windows\solr\build\solr-core\test\J0\temp\solr.handler.admin.InfoHandlerTest_B6B0142CA4C8D361-001: java.nio.file.DirectoryNotEmptyException: C:\Users\jenkins\workspace\Lucene-Solr-master-Windows\solr\build\solr-core\test\J0\temp\solr.handler.admin.InfoHandlerTest_B6B0142CA4C8D361-001

	at __randomizedtesting.SeedInfo.seed([B6B0142CA4C8D361]:0)
	at org.apache.lucene.util.IOUtils.rm(IOUtils.java:329)
	at org.apache.lucene.util.TestRuleTemporaryFilesCleanup.afterAlways(TestRuleTemporaryFilesCleanup.java:216)
	at com.carrotsearch.randomizedtesting.rules.TestRuleAdapter$1.afterAlways(TestRuleAdapter.java:31)
	at com.carrotsearch.randomizedtesting.rules.StatementAdapter.evaluate(StatementAdapter.java:43)
	at com.carrotsearch.randomizedtesting.rules.StatementAdapter.evaluate(StatementAdapter.java:36)
	at org.apache.lucene.util.TestRuleAssertionsRequired$1.evaluate(TestRuleAssertionsRequired.java:53)
	at org.apache.lucene.util.TestRuleMarkFailure$1.evaluate(TestRuleMarkFailure.java:47)
	at org.apache.lucene.util.TestRuleIgnoreAfterMaxFailures$1.evaluate(TestRuleIgnoreAfterMaxFailures.java:64)
	at org.apache.lucene.util.TestRuleIgnoreTestSuites$1.evaluate(TestRuleIgnoreTestSuites.java:54)
	at com.carrotsearch.randomizedtesting.rules.StatementAdapter.evaluate(StatementAdapter.java:36)
	at com.carrotsearch.randomizedtesting.ThreadLeakControl$StatementRunner.run(ThreadLeakControl.java:368)
	at java.base/java.lang.Thread.run(Thread.java:844)


FAILED:  junit.framework.TestSuite.org.apache.solr.spelling.suggest.TestHighFrequencyDictionaryFactory

Error Message:
Could not remove the following files (in the order of attempts):    C:\Users\jenkins\workspace\Lucene-Solr-master-Windows\solr\build\solr-core\test\J1\temp\solr.spelling.suggest.TestHighFrequencyDictionaryFactory_B6B0142CA4C8D361-001\init-core-data-001: java.nio.file.DirectoryNotEmptyException: C:\Users\jenkins\workspace\Lucene-Solr-master-Windows\solr\build\solr-core\test\J1\temp\solr.spelling.suggest.TestHighFrequencyDictionaryFactory_B6B0142CA4C8D361-001\init-core-data-001    C:\Users\jenkins\workspace\Lucene-Solr-master-Windows\solr\build\solr-core\test\J1\temp\solr.spelling.suggest.TestHighFrequencyDictionaryFactory_B6B0142CA4C8D361-001\init-core-data-001\analyzing_infix_suggest_not_all_terms_required: java.nio.file.AccessDeniedException: C:\Users\jenkins\workspace\Lucene-Solr-master-Windows\solr\build\solr-core\test\J1\temp\solr.spelling.suggest.TestHighFrequencyDictionaryFactory_B6B0142CA4C8D361-001\init-core-data-001\analyzing_infix_suggest_not_all_terms_required    C:\Users\jenkins\workspace\Lucene-Solr-master-Windows\solr\build\solr-core\test\J1\temp\solr.spelling.suggest.TestHighFrequencyDictionaryFactory_B6B0142CA4C8D361-001: java.nio.file.DirectoryNotEmptyException: C:\Users\jenkins\workspace\Lucene-Solr-master-Windows\solr\build\solr-core\test\J1\temp\solr.spelling.suggest.TestHighFrequencyDictionaryFactory_B6B0142CA4C8D361-001 

Stack Trace:
java.io.IOException: Could not remove the following files (in the order of attempts):
   C:\Users\jenkins\workspace\Lucene-Solr-master-Windows\solr\build\solr-core\test\J1\temp\solr.spelling.suggest.TestHighFrequencyDictionaryFactory_B6B0142CA4C8D361-001\init-core-data-001: java.nio.file.DirectoryNotEmptyException: C:\Users\jenkins\workspace\Lucene-Solr-master-Windows\solr\build\solr-core\test\J1\temp\solr.spelling.suggest.TestHighFrequencyDictionaryFactory_B6B0142CA4C8D361-001\init-core-data-001
   C:\Users\jenkins\workspace\Lucene-Solr-master-Windows\solr\build\solr-core\test\J1\temp\solr.spelling.suggest.TestHighFrequencyDictionaryFactory_B6B0142CA4C8D361-001\init-core-data-001\analyzing_infix_suggest_not_all_terms_required: java.nio.file.AccessDeniedException: C:\Users\jenkins\workspace\Lucene-Solr-master-Windows\solr\build\solr-core\test\J1\temp\solr.spelling.suggest.TestHighFrequencyDictionaryFactory_B6B0142CA4C8D361-001\init-core-data-001\analyzing_infix_suggest_not_all_terms_required
   C:\Users\jenkins\workspace\Lucene-Solr-master-Windows\solr\build\solr-core\test\J1\temp\solr.spelling.suggest.TestHighFrequencyDictionaryFactory_B6B0142CA4C8D361-001: java.nio.file.DirectoryNotEmptyException: C:\Users\jenkins\workspace\Lucene-Solr-master-Windows\solr\build\solr-core\test\J1\temp\solr.spelling.suggest.TestHighFrequencyDictionaryFactory_B6B0142CA4C8D361-001

	at __randomizedtesting.SeedInfo.seed([B6B0142CA4C8D361]:0)
	at org.apache.lucene.util.IOUtils.rm(IOUtils.java:329)
	at org.apache.lucene.util.TestRuleTemporaryFilesCleanup.afterAlways(TestRuleTemporaryFilesCleanup.java:216)
	at com.carrotsearch.randomizedtesting.rules.TestRuleAdapter$1.afterAlways(TestRuleAdapter.java:31)
	at com.carrotsearch.randomizedtesting.rules.StatementAdapter.evaluate(StatementAdapter.java:43)
	at com.carrotsearch.randomizedtesting.rules.StatementAdapter.evaluate(StatementAdapter.java:36)
	at org.apache.lucene.util.TestRuleAssertionsRequired$1.evaluate(TestRuleAssertionsRequired.java:53)
	at org.apache.lucene.util.TestRuleMarkFailure$1.evaluate(TestRuleMarkFailure.java:47)
	at org.apache.lucene.util.TestRuleIgnoreAfterMaxFailures$1.evaluate(TestRuleIgnoreAfterMaxFailures.java:64)
	at org.apache.lucene.util.TestRuleIgnoreTestSuites$1.evaluate(TestRuleIgnoreTestSuites.java:54)
	at com.carrotsearch.randomizedtesting.rules.StatementAdapter.evaluate(StatementAdapter.java:36)
	at com.carrotsearch.randomizedtesting.ThreadLeakControl$StatementRunner.run(ThreadLeakControl.java:368)
	at java.base/java.lang.Thread.run(Thread.java:844)


FAILED:  junit.framework.TestSuite.org.apache.solr.client.solrj.impl.HttpSolrClientConPoolTest

Error Message:
Could not remove the following files (in the order of attempts):    C:\Users\jenkins\workspace\Lucene-Solr-master-Windows\solr\build\solr-solrj\test\J1\temp\solr.client.solrj.impl.HttpSolrClientConPoolTest_EF3A06AE9D3DE6CB-001\tempDir-003\collection1\conf\clustering: java.nio.file.DirectoryNotEmptyException: C:\Users\jenkins\workspace\Lucene-Solr-master-Windows\solr\build\solr-solrj\test\J1\temp\solr.client.solrj.impl.HttpSolrClientConPoolTest_EF3A06AE9D3DE6CB-001\tempDir-003\collection1\conf\clustering    C:\Users\jenkins\workspace\Lucene-Solr-master-Windows\solr\build\solr-solrj\test\J1\temp\solr.client.solrj.impl.HttpSolrClientConPoolTest_EF3A06AE9D3DE6CB-001\tempDir-003\collection1\conf: java.nio.file.DirectoryNotEmptyException: C:\Users\jenkins\workspace\Lucene-Solr-master-Windows\solr\build\solr-solrj\test\J1\temp\solr.client.solrj.impl.HttpSolrClientConPoolTest_EF3A06AE9D3DE6CB-001\tempDir-003\collection1\conf    C:\Users\jenkins\workspace\Lucene-Solr-master-Windows\solr\build\solr-solrj\test\J1\temp\solr.client.solrj.impl.HttpSolrClientConPoolTest_EF3A06AE9D3DE6CB-001\tempDir-003\collection1: java.nio.file.DirectoryNotEmptyException: C:\Users\jenkins\workspace\Lucene-Solr-master-Windows\solr\build\solr-solrj\test\J1\temp\solr.client.solrj.impl.HttpSolrClientConPoolTest_EF3A06AE9D3DE6CB-001\tempDir-003\collection1    C:\Users\jenkins\workspace\Lucene-Solr-master-Windows\solr\build\solr-solrj\test\J1\temp\solr.client.solrj.impl.HttpSolrClientConPoolTest_EF3A06AE9D3DE6CB-001\tempDir-003: java.nio.file.DirectoryNotEmptyException: C:\Users\jenkins\workspace\Lucene-Solr-master-Windows\solr\build\solr-solrj\test\J1\temp\solr.client.solrj.impl.HttpSolrClientConPoolTest_EF3A06AE9D3DE6CB-001\tempDir-003    C:\Users\jenkins\workspace\Lucene-Solr-master-Windows\solr\build\solr-solrj\test\J1\temp\solr.client.solrj.impl.HttpSolrClientConPoolTest_EF3A06AE9D3DE6CB-001\tempDir-003\collection1\conf\clustering\carrot2: java.nio.file.NoSuchFileException: C:\Users\jenkins\workspace\Lucene-Solr-master-Windows\solr\build\solr-solrj\test\J1\temp\solr.client.solrj.impl.HttpSolrClientConPoolTest_EF3A06AE9D3DE6CB-001\tempDir-003\collection1\conf\clustering\carrot2 

Stack Trace:
java.io.IOException: Could not remove the following files (in the order of attempts):
   C:\Users\jenkins\workspace\Lucene-Solr-master-Windows\solr\build\solr-solrj\test\J1\temp\solr.client.solrj.impl.HttpSolrClientConPoolTest_EF3A06AE9D3DE6CB-001\tempDir-003\collection1\conf\clustering: java.nio.file.DirectoryNotEmptyException: C:\Users\jenkins\workspace\Lucene-Solr-master-Windows\solr\build\solr-solrj\test\J1\temp\solr.client.solrj.impl.HttpSolrClientConPoolTest_EF3A06AE9D3DE6CB-001\tempDir-003\collection1\conf\clustering
   C:\Users\jenkins\workspace\Lucene-Solr-master-Windows\solr\build\solr-solrj\test\J1\temp\solr.client.solrj.impl.HttpSolrClientConPoolTest_EF3A06AE9D3DE6CB-001\tempDir-003\collection1\conf: java.nio.file.DirectoryNotEmptyException: C:\Users\jenkins\workspace\Lucene-Solr-master-Windows\solr\build\solr-solrj\test\J1\temp\solr.client.solrj.impl.HttpSolrClientConPoolTest_EF3A06AE9D3DE6CB-001\tempDir-003\collection1\conf
   C:\Users\jenkins\workspace\Lucene-Solr-master-Windows\solr\build\solr-solrj\test\J1\temp\solr.client.solrj.impl.HttpSolrClientConPoolTest_EF3A06AE9D3DE6CB-001\tempDir-003\collection1: java.nio.file.DirectoryNotEmptyException: C:\Users\jenkins\workspace\Lucene-Solr-master-Windows\solr\build\solr-solrj\test\J1\temp\solr.client.solrj.impl.HttpSolrClientConPoolTest_EF3A06AE9D3DE6CB-001\tempDir-003\collection1
   C:\Users\jenkins\workspace\Lucene-Solr-master-Windows\solr\build\solr-solrj\test\J1\temp\solr.client.solrj.impl.HttpSolrClientConPoolTest_EF3A06AE9D3DE6CB-001\tempDir-003: java.nio.file.DirectoryNotEmptyException: C:\Users\jenkins\workspace\Lucene-Solr-master-Windows\solr\build\solr-solrj\test\J1\temp\solr.client.solrj.impl.HttpSolrClientConPoolTest_EF3A06AE9D3DE6CB-001\tempDir-003
   C:\Users\jenkins\workspace\Lucene-Solr-master-Windows\solr\build\solr-solrj\test\J1\temp\solr.client.solrj.impl.HttpSolrClientConPoolTest_EF3A06AE9D3DE6CB-001\tempDir-003\collection1\conf\clustering\carrot2: java.nio.file.NoSuchFileException: C:\Users\jenkins\workspace\Lucene-Solr-master-Windows\solr\build\solr-solrj\test\J1\temp\solr.client.solrj.impl.HttpSolrClientConPoolTest_EF3A06AE9D3DE6CB-001\tempDir-003\collection1\conf\clustering\carrot2

	at __randomizedtesting.SeedInfo.seed([EF3A06AE9D3DE6CB]:0)
	at org.apache.lucene.util.IOUtils.rm(IOUtils.java:329)
	at org.apache.lucene.util.TestRuleTemporaryFilesCleanup.afterAlways(TestRuleTemporaryFilesCleanup.java:216)
	at com.carrotsearch.randomizedtesting.rules.TestRuleAdapter$1.afterAlways(TestRuleAdapter.java:31)
	at com.carrotsearch.randomizedtesting.rules.StatementAdapter.evaluate(StatementAdapter.java:43)
	at com.carrotsearch.randomizedtesting.rules.StatementAdapter.evaluate(StatementAdapter.java:36)
	at org.apache.lucene.util.TestRuleAssertionsRequired$1.evaluate(TestRuleAssertionsRequired.java:53)
	at org.apache.lucene.util.TestRuleMarkFailure$1.evaluate(TestRuleMarkFailure.java:47)
	at org.apache.lucene.util.TestRuleIgnoreAfterMaxFailures$1.evaluate(TestRuleIgnoreAfterMaxFailures.java:64)
	at org.apache.lucene.util.TestRuleIgnoreTestSuites$1.evaluate(TestRuleIgnoreTestSuites.java:54)
	at com.carrotsearch.randomizedtesting.rules.StatementAdapter.evaluate(StatementAdapter.java:36)
	at com.carrotsearch.randomizedtesting.ThreadLeakControl$StatementRunner.run(ThreadLeakControl.java:368)
	at java.base/java.lang.Thread.run(Thread.java:844)


FAILED:  org.apache.solr.cloud.autoscaling.sim.TestTriggerIntegration.testCooldown

Error Message:


Stack Trace:
java.lang.NullPointerException
	at __randomizedtesting.SeedInfo.seed([B6B0142CA4C8D361:870E79C8DA62A693]:0)
	at org.apache.solr.cloud.autoscaling.sim.TestTriggerIntegration.testCooldown(TestTriggerIntegration.java:1102)
	at java.base/jdk.internal.reflect.NativeMethodAccessorImpl.invoke0(Native Method)
	at java.base/jdk.internal.reflect.NativeMethodAccessorImpl.invoke(NativeMethodAccessorImpl.java:62)
	at java.base/jdk.internal.reflect.DelegatingMethodAccessorImpl.invoke(DelegatingMethodAccessorImpl.java:43)
	at java.base/java.lang.reflect.Method.invoke(Method.java:564)
	at com.carrotsearch.randomizedtesting.RandomizedRunner.invoke(RandomizedRunner.java:1737)
	at com.carrotsearch.randomizedtesting.RandomizedRunner$8.evaluate(RandomizedRunner.java:934)
	at com.carrotsearch.randomizedtesting.RandomizedRunner$9.evaluate(RandomizedRunner.java:970)
	at com.carrotsearch.randomizedtesting.RandomizedRunner$10.evaluate(RandomizedRunner.java:984)
	at com.carrotsearch.randomizedtesting.rules.SystemPropertiesRestoreRule$1.evaluate(SystemPropertiesRestoreRule.java:57)
	at org.apache.lucene.util.TestRuleSetupTeardownChained$1.evaluate(TestRuleSetupTeardownChained.java:49)
	at org.apache.lucene.util.AbstractBeforeAfterRule$1.evaluate(AbstractBeforeAfterRule.java:45)
	at org.apache.lucene.util.TestRuleThreadAndTestName$1.evaluate(TestRuleThreadAndTestName.java:48)
	at org.apache.lucene.util.TestRuleIgnoreAfterMaxFailures$1.evaluate(TestRuleIgnoreAfterMaxFailures.java:64)
	at org.apache.lucene.util.TestRuleMarkFailure$1.evaluate(TestRuleMarkFailure.java:47)
	at com.carrotsearch.randomizedtesting.rules.StatementAdapter.evaluate(StatementAdapter.java:36)
	at com.carrotsearch.randomizedtesting.ThreadLeakControl$StatementRunner.run(ThreadLeakControl.java:368)
	at com.carrotsearch.randomizedtesting.ThreadLeakControl.forkTimeoutingTask(ThreadLeakControl.java:817)
	at com.carrotsearch.randomizedtesting.ThreadLeakControl$3.evaluate(ThreadLeakControl.java:468)
	at com.carrotsearch.randomizedtesting.RandomizedRunner.runSingleTest(RandomizedRunner.java:943)
	at com.carrotsearch.randomizedtesting.RandomizedRunner$5.evaluate(RandomizedRunner.java:829)
	at com.carrotsearch.randomizedtesting.RandomizedRunner$6.evaluate(RandomizedRunner.java:879)
	at com.carrotsearch.randomizedtesting.RandomizedRunner$7.evaluate(RandomizedRunner.java:890)
	at com.carrotsearch.randomizedtesting.rules.StatementAdapter.evaluate(StatementAdapter.java:36)
	at com.carrotsearch.randomizedtesting.rules.SystemPropertiesRestoreRule$1.evaluate(SystemPropertiesRestoreRule.java:57)
	at org.apache.lucene.util.AbstractBeforeAfterRule$1.evaluate(AbstractBeforeAfterRule.java:45)
	at com.carrotsearch.randomizedtesting.rules.StatementAdapter.evaluate(StatementAdapter.java:36)
	at org.apache.lucene.util.TestRuleStoreClassName$1.evaluate(TestRuleStoreClassName.java:41)
	at com.carrotsearch.randomizedtesting.rules.NoShadowingOrOverridesOnMethodsRule$1.evaluate(NoShadowingOrOverridesOnMethodsRule.java:40)
	at com.carrotsearch.randomizedtesting.rules.NoShadowingOrOverridesOnMethodsRule$1.evaluate(NoShadowingOrOverridesOnMethodsRule.java:40)
	at com.carrotsearch.randomizedtesting.rules.StatementAdapter.evaluate(StatementAdapter.java:36)
	at com.carrotsearch.randomizedtesting.rules.StatementAdapter.evaluate(StatementAdapter.java:36)
	at org.apache.lucene.util.TestRuleAssertionsRequired$1.evaluate(TestRuleAssertionsRequired.java:53)
	at org.apache.lucene.util.TestRuleMarkFailure$1.evaluate(TestRuleMarkFailure.java:47)
	at org.apache.lucene.util.TestRuleIgnoreAfterMaxFailures$1.evaluate(TestRuleIgnoreAfterMaxFailures.java:64)
	at org.apache.lucene.util.TestRuleIgnoreTestSuites$1.evaluate(TestRuleIgnoreTestSuites.java:54)
	at com.carrotsearch.randomizedtesting.rules.StatementAdapter.evaluate(StatementAdapter.java:36)
	at com.carrotsearch.randomizedtesting.ThreadLeakControl$StatementRunner.run(ThreadLeakControl.java:368)
	at java.base/java.lang.Thread.run(Thread.java:844)


FAILED:  junit.framework.TestSuite.org.apache.solr.update.processor.TestOpenNLPExtractNamedEntitiesUpdateProcessorFactory

Error Message:
Could not remove the following files (in the order of attempts):    C:\Users\jenkins\workspace\Lucene-Solr-master-Windows\solr\build\contrib\solr-analysis-extras\test\J1\temp\solr.update.processor.TestOpenNLPExtractNamedEntitiesUpdateProcessorFactory_B1244A25F0CDAD25-001\tempDir-001\collection1\conf: java.nio.file.DirectoryNotEmptyException: C:\Users\jenkins\workspace\Lucene-Solr-master-Windows\solr\build\contrib\solr-analysis-extras\test\J1\temp\solr.update.processor.TestOpenNLPExtractNamedEntitiesUpdateProcessorFactory_B1244A25F0CDAD25-001\tempDir-001\collection1\conf    C:\Users\jenkins\workspace\Lucene-Solr-master-Windows\solr\build\contrib\solr-analysis-extras\test\J1\temp\solr.update.processor.TestOpenNLPExtractNamedEntitiesUpdateProcessorFactory_B1244A25F0CDAD25-001\tempDir-001\collection1: java.nio.file.DirectoryNotEmptyException: C:\Users\jenkins\workspace\Lucene-Solr-master-Windows\solr\build\contrib\solr-analysis-extras\test\J1\temp\solr.update.processor.TestOpenNLPExtractNamedEntitiesUpdateProcessorFactory_B1244A25F0CDAD25-001\tempDir-001\collection1    C:\Users\jenkins\workspace\Lucene-Solr-master-Windows\solr\build\contrib\solr-analysis-extras\test\J1\temp\solr.update.processor.TestOpenNLPExtractNamedEntitiesUpdateProcessorFactory_B1244A25F0CDAD25-001\tempDir-001: java.nio.file.DirectoryNotEmptyException: C:\Users\jenkins\workspace\Lucene-Solr-master-Windows\solr\build\contrib\solr-analysis-extras\test\J1\temp\solr.update.processor.TestOpenNLPExtractNamedEntitiesUpdateProcessorFactory_B1244A25F0CDAD25-001\tempDir-001    C:\Users\jenkins\workspace\Lucene-Solr-master-Windows\solr\build\contrib\solr-analysis-extras\test\J1\temp\solr.update.processor.TestOpenNLPExtractNamedEntitiesUpdateProcessorFactory_B1244A25F0CDAD25-001\tempDir-001\collection1\conf\en-test-tokenizer.bin: java.nio.file.AccessDeniedException: C:\Users\jenkins\workspace\Lucene-Solr-master-Windows\solr\build\contrib\solr-analysis-extras\test\J1\temp\solr.update.processor.TestOpenNLPExtractNamedEntitiesUpdateProcessorFactory_B1244A25F0CDAD25-001\tempDir-001\collection1\conf\en-test-tokenizer.bin    C:\Users\jenkins\workspace\Lucene-Solr-master-Windows\solr\build\contrib\solr-analysis-extras\test\J1\temp\solr.update.processor.TestOpenNLPExtractNamedEntitiesUpdateProcessorFactory_B1244A25F0CDAD25-001\tempDir-001\collection1\conf\en-test-ner-person.bin: java.nio.file.AccessDeniedException: C:\Users\jenkins\workspace\Lucene-Solr-master-Windows\solr\build\contrib\solr-analysis-extras\test\J1\temp\solr.update.processor.TestOpenNLPExtractNamedEntitiesUpdateProcessorFactory_B1244A25F0CDAD25-001\tempDir-001\collection1\conf\en-test-ner-person.bin    C:\Users\jenkins\workspace\Lucene-Solr-master-Windows\solr\build\contrib\solr-analysis-extras\test\J1\temp\solr.update.processor.TestOpenNLPExtractNamedEntitiesUpdateProcessorFactory_B1244A25F0CDAD25-001\tempDir-001\collection1\conf\en-test-sent.bin: java.nio.file.AccessDeniedException: C:\Users\jenkins\workspace\Lucene-Solr-master-Windows\solr\build\contrib\solr-analysis-extras\test\J1\temp\solr.update.processor.TestOpenNLPExtractNamedEntitiesUpdateProcessorFactory_B1244A25F0CDAD25-001\tempDir-001\collection1\conf\en-test-sent.bin    C:\Users\jenkins\workspace\Lucene-Solr-master-Windows\solr\build\contrib\solr-analysis-extras\test\J1\temp\solr.update.processor.TestOpenNLPExtractNamedEntitiesUpdateProcessorFactory_B1244A25F0CDAD25-001: java.nio.file.DirectoryNotEmptyException: C:\Users\jenkins\workspace\Lucene-Solr-master-Windows\solr\build\contrib\solr-analysis-extras\test\J1\temp\solr.update.processor.TestOpenNLPExtractNamedEntitiesUpdateProcessorFactory_B1244A25F0CDAD25-001 

Stack Trace:
java.io.IOException: Could not remove the following files (in the order of attempts):
   C:\Users\jenkins\workspace\Lucene-Solr-master-Windows\solr\build\contrib\solr-analysis-extras\test\J1\temp\solr.update.processor.TestOpenNLPExtractNamedEntitiesUpdateProcessorFactory_B1244A25F0CDAD25-001\tempDir-001\collection1\conf: java.nio.file.DirectoryNotEmptyException: C:\Users\jenkins\workspace\Lucene-Solr-master-Windows\solr\build\contrib\solr-analysis-extras\test\J1\temp\solr.update.processor.TestOpenNLPExtractNamedEntitiesUpdateProcessorFactory_B1244A25F0CDAD25-001\tempDir-001\collection1\conf
   C:\Users\jenkins\workspace\Lucene-Solr-master-Windows\solr\build\contrib\solr-analysis-extras\test\J1\temp\solr.update.processor.TestOpenNLPExtractNamedEntitiesUpdateProcessorFactory_B1244A25F0CDAD25-001\tempDir-001\collection1: java.nio.file.DirectoryNotEmptyException: C:\Users\jenkins\workspace\Lucene-Solr-master-Windows\solr\build\contrib\solr-analysis-extras\test\J1\temp\solr.update.processor.TestOpenNLPExtractNamedEntitiesUpdateProcessorFactory_B1244A25F0CDAD25-001\tempDir-001\collection1
   C:\Users\jenkins\workspace\Lucene-Solr-master-Windows\solr\build\contrib\solr-analysis-extras\test\J1\temp\solr.update.processor.TestOpenNLPExtractNamedEntitiesUpdateProcessorFactory_B1244A25F0CDAD25-001\tempDir-001: java.nio.file.DirectoryNotEmptyException: C:\Users\jenkins\workspace\Lucene-Solr-master-Windows\solr\build\contrib\solr-analysis-extras\test\J1\temp\solr.update.processor.TestOpenNLPExtractNamedEntitiesUpdateProcessorFactory_B1244A25F0CDAD25-001\tempDir-001
   C:\Users\jenkins\workspace\Lucene-Solr-master-Windows\solr\build\contrib\solr-analysis-extras\test\J1\temp\solr.update.processor.TestOpenNLPExtractNamedEntitiesUpdateProcessorFactory_B1244A25F0CDAD25-001\tempDir-001\collection1\conf\en-test-tokenizer.bin: java.nio.file.AccessDeniedException: C:\Users\jenkins\workspace\Lucene-Solr-master-Windows\solr\build\contrib\solr-analysis-extras\test\J1\temp\solr.update.processor.TestOpenNLPExtractNamedEntitiesUpdateProcessorFactory_B1244A25F0CDAD25-001\tempDir-001\collection1\conf\en-test-tokenizer.bin
   C:\Users\jenkins\workspace\Lucene-Solr-master-Windows\solr\build\contrib\solr-analysis-extras\test\J1\temp\solr.update.processor.TestOpenNLPExtractNamedEntitiesUpdateProcessorFactory_B1244A25F0CDAD25-001\tempDir-001\collection1\conf\en-test-ner-person.bin: java.nio.file.AccessDeniedException: C:\Users\jenkins\workspace\Lucene-Solr-master-Windows\solr\build\contrib\solr-analysis-extras\test\J1\temp\solr.update.processor.TestOpenNLPExtractNamedEntitiesUpdateProcessorFactory_B1244A25F0CDAD25-001\tempDir-001\collection1\conf\en-test-ner-person.bin
   C:\Users\jenkins\workspace\Lucene-Solr-master-Windows\solr\build\contrib\solr-analysis-extras\test\J1\temp\solr.update.processor.TestOpenNLPExtractNamedEntitiesUpdateProcessorFactory_B1244A25F0CDAD25-001\tempDir-001\collection1\conf\en-test-sent.bin: java.nio.file.AccessDeniedException: C:\Users\jenkins\workspace\Lucene-Solr-master-Windows\solr\build\contrib\solr-analysis-extras\test\J1\temp\solr.update.processor.TestOpenNLPExtractNamedEntitiesUpdateProcessorFactory_B1244A25F0CDAD25-001\tempDir-001\collection1\conf\en-test-sent.bin
   C:\Users\jenkins\workspace\Lucene-Solr-master-Windows\solr\build\contrib\solr-analysis-extras\test\J1\temp\solr.update.processor.TestOpenNLPExtractNamedEntitiesUpdateProcessorFactory_B1244A25F0CDAD25-001: java.nio.file.DirectoryNotEmptyException: C:\Users\jenkins\workspace\Lucene-Solr-master-Windows\solr\build\contrib\solr-analysis-extras\test\J1\temp\solr.update.processor.TestOpenNLPExtractNamedEntitiesUpdateProcessorFactory_B1244A25F0CDAD25-001

	at __randomizedtesting.SeedInfo.seed([B1244A25F0CDAD25]:0)
	at org.apache.lucene.util.IOUtils.rm(IOUtils.java:329)
	at org.apache.lucene.util.TestRuleTemporaryFilesCleanup.afterAlways(TestRuleTemporaryFilesCleanup.java:216)
	at com.carrotsearch.randomizedtesting.rules.TestRuleAdapter$1.afterAlways(TestRuleAdapter.java:31)
	at com.carrotsearch.randomizedtesting.rules.StatementAdapter.evaluate(StatementAdapter.java:43)
	at com.carrotsearch.randomizedtesting.rules.StatementAdapter.evaluate(StatementAdapter.java:36)
	at org.apache.lucene.util.TestRuleAssertionsRequired$1.evaluate(TestRuleAssertionsRequired.java:53)
	at org.apache.lucene.util.TestRuleMarkFailure$1.evaluate(TestRuleMarkFailure.java:47)
	at org.apache.lucene.util.TestRuleIgnoreAfterMaxFailures$1.evaluate(TestRuleIgnoreAfterMaxFailures.java:64)
	at org.apache.lucene.util.TestRuleIgnoreTestSuites$1.evaluate(TestRuleIgnoreTestSuites.java:54)
	at com.carrotsearch.randomizedtesting.rules.StatementAdapter.evaluate(StatementAdapter.java:36)
	at com.carrotsearch.randomizedtesting.ThreadLeakControl$StatementRunner.run(ThreadLeakControl.java:368)
	at java.base/java.lang.Thread.run(Thread.java:844)




Build Log:
[...truncated 860 lines...]
   [junit4] Suite: org.apache.lucene.store.TestMmapDirectory
   [junit4]   2> NOTE: test params are: codec=Asserting(Lucene70): {}, docValues:{}, maxPointsInLeafNode=1827, maxMBSortInHeap=7.728744359667261, sim=Asserting(org.apache.lucene.search.similarities.AssertingSimilarity@1c6b7b4a), locale=ha-NE, timezone=MST7MDT
   [junit4]   2> NOTE: Windows 10 10.0 amd64/Oracle Corporation 9.0.1 (64-bit)/cpus=3,threads=1,free=178432992,total=248512512
   [junit4]   2> NOTE: All tests run in this JVM: [TestEarlyTermination, TestSearch, FiniteStringsIteratorTest, TestIntroSorter, TestLucene50TermVectorsFormat, TestBooleanRewrites, TestBytesStore, TestVirtualMethod, TestFieldMaskingSpanQuery, TestVersion, TestDirectPacked, TestSortRescorer, TestConcurrentMergeScheduler, TestAxiomaticF1LOG, TestMutableValues, TestLucene50StoredFieldsFormat, TestMinShouldMatch2, TestCharArraySet, TestPhrasePrefixQuery, TestCharTermAttributeImpl, TestRamUsageEstimator, TestIntRangeFieldQueries, TestMixedDocValuesUpdates, TestFlex, TestDoubleRangeFieldQueries, TestSameTokenSamePosition, TermInSetQueryTest, TestFuzzyQuery, TestSortRandom, TestIndexWriterOnVMError, Test2BPostings, TestCustomSearcherSort, TestSimpleExplanations, TestMultiFields, TestMaxTermFrequency, TestRecyclingByteBlockAllocator, TestBasicModelIne, TestSwappedIndexFiles, Test2BSortedDocValuesOrds, TestBytesRef, TestStressIndexing2, TestPagedBytes, TestCharsRefBuilder, TestConjunctionDISI, TestIndexWriterCommit, TestSimpleFSDirectory, TestIndependenceSaturated, TestBoolean2, TestPrefixInBooleanQuery, TestCharFilter, TestPolygon, TestLongRangeFieldQueries, TestBKD, TestRegExp, TestIndexWriterReader, TestIsCurrent, TestTransactions, TestSortedSetDocValues, TestNRTReaderCleanup, TestWeakIdentityMap, TestLucene70SegmentInfoFormat, TestPhraseQuery, TestDocumentsWriterStallControl, TestBlockPostingsFormat2, TestConstantScoreQuery, TestShardSearching, TestSegmentCacheables, TestExceedMaxTermLength, TestParallelTermEnum, TestTermsEnum, Test2BDocs, TestDocInverterPerFieldErrorInfo, TestSearchAfter, TestFieldInvertState, TestDelegatingAnalyzerWrapper, TestFrequencyTrackingRingBuffer, TestInfoStream, TestManyFields, TestIndexManyDocuments, TestMergeSchedulerExternal, Test2BTerms, TestSpanCollection, TestTermRangeQuery, TestByteSlices, TestGraphTokenizers, TestMmapDirectory]
   [junit4]   2> NOTE: reproduce with: ant test  -Dtestcase=TestMmapDirectory -Dtests.seed=98258A9110904AF7 -Dtests.slow=true -Dtests.locale=ha-NE -Dtests.timezone=MST7MDT -Dtests.asserts=true -Dtests.file.encoding=US-ASCII
   [junit4] ERROR   0.00s J1 | TestMmapDirectory (suite) <<<
   [junit4]    > Throwable #1: java.io.IOException: Could not remove the following files (in the order of attempts):
   [junit4]    >    C:\Users\jenkins\workspace\Lucene-Solr-master-Windows\lucene\build\core\test\J1\temp\lucene.store.TestMmapDirectory_98258A9110904AF7-001\tempDir-003: java.nio.file.AccessDeniedException: C:\Users\jenkins\workspace\Lucene-Solr-master-Windows\lucene\build\core\test\J1\temp\lucene.store.TestMmapDirectory_98258A9110904AF7-001\tempDir-003
   [junit4]    >    C:\Users\jenkins\workspace\Lucene-Solr-master-Windows\lucene\build\core\test\J1\temp\lucene.store.TestMmapDirectory_98258A9110904AF7-001: java.nio.file.DirectoryNotEmptyException: C:\Users\jenkins\workspace\Lucene-Solr-master-Windows\lucene\build\core\test\J1\temp\lucene.store.TestMmapDirectory_98258A9110904AF7-001
   [junit4]    > 	at __randomizedtesting.SeedInfo.seed([98258A9110904AF7]:0)
   [junit4]    > 	at org.apache.lucene.util.IOUtils.rm(IOUtils.java:329)
   [junit4]    > 	at java.base/java.lang.Thread.run(Thread.java:844)
   [junit4] Completed [193/478 (1!)] on J1 in 1.45s, 43 tests, 1 error, 1 skipped <<< FAILURES!

[...truncated 218 lines...]
   [junit4] Suite: org.apache.lucene.index.TestLongPostings
   [junit4]   2> NOTE: test params are: codec=Asserting(Lucene70): {field=Lucene50(blocksize=128)}, docValues:{}, maxPointsInLeafNode=2033, maxMBSortInHeap=7.037069792418686, sim=Asserting(org.apache.lucene.search.similarities.AssertingSimilarity@3873b386), locale=lg, timezone=Pacific/Easter
   [junit4]   2> NOTE: Windows 10 10.0 amd64/Oracle Corporation 9.0.1 (64-bit)/cpus=3,threads=1,free=170937240,total=256901120
   [junit4]   2> NOTE: All tests run in this JVM: [TestSimpleExplanationsOfNonMatches, TestMultiMMap, TestAllFilesHaveChecksumFooter, TestIndexInput, TestWordlistLoader, TestNGramPhraseQuery, TestBooleanMinShouldMatch, TestByteArrayDataInput, TestBooleanOr, TestPolygon2D, TestLucene60FieldInfoFormat, TestIndexCommit, TestComplexExplanations, TestTotalHitCountCollector, Test2BSortedDocValuesFixedSorted, TestIntroSelector, TestOmitTf, TestFixedLengthBytesRefArray, TestToken, TestStandardAnalyzer, TestInPlaceMergeSorter, TestLiveFieldValues, TestArrayUtil, TestFSTs, TestMinimize, TestUnicodeUtil, TestLogMergePolicy, TestRAMDirectory, TestSortedNumericSortField, TestIndependenceStandardized, TestIndexedDISI, TestDocument, TestTerms, TestTieredMergePolicy, TestConsistentFieldNumbers, TestDocValuesIndexing, TestSloppyPhraseQuery, TestAddIndexes, TestGraphTokenStreamFiniteStrings, TestLucene50CompoundFormat, TestExitableDirectoryReader, TestSegmentInfos, TestNoMergeScheduler, TestAllFilesHaveCodecHeader, TestCrashCausesCorruptIndex, TestMaxScoreSumPropagator, TestSpanNotQuery, TestBooleanSimilarity, TestLongValuesSource, TestScorerPerf, TestLRUQueryCache, TestBufferedIndexInput, TestIOUtils, TestSpanMultiTermQueryWrapper, TestNumericDocValuesUpdates, TestGrowableByteArrayDataOutput, Test2BBinaryDocValues, TestSort, TestParallelLeafReader, TestReqOptSumScorer, TestReusableStringReader, TestGeoUtils, TestDoc, TestUTF32ToUTF8, TestSloppyMath, TestExternalCodecs, TestTryDelete, TestSnapshotDeletionPolicy, TestIndexWriterUnicode, TestBagOfPositions, TestCustomNorms, TestElevationComparator, TestDocsAndPositions, TestLockFactory, TestFieldCacheRewriteMethod, TestRoaringDocIdSet, TestLucene50StoredFieldsFormatHighCompression, TestMergedIterator, TestParallelCompositeReader, TestDistributionLL, TestPrefixRandom, TestCustomTermFreq, TestDeterminizeLexicon, TestDocIdSetBuilder, TestTermQuery, TestSegmentTermEnum, TestMaxPosition, TestBooleanQuery, TestIndexSearcher, TestField, TestSegmentReader, TestBlockPostingsFormat3, TestMultiTermQueryRewrites, TestStressDeletes, TestAxiomaticF2EXP, TestStringMSBRadixSorter, TestAllFilesCheckIndexHeader, TestSpanExplanations, TestOmitPositions, TestIndexWriterMergePolicy, TestDocCount, LimitedFiniteStringsIteratorTest, TestCachingTokenFilter, TestIndexWriterOnJRECrash, TestFloatRangeFieldQueries, TestSpanSearchEquivalence, TestReadOnlyIndex, TestSortedSetSortField, TestMergeRateLimiter, TestFieldsReader, TestSimpleFSLockFactory, TestDemo, TestMultiTermsEnum, TestNIOFSDirectory, TestMixedCodecs, TestFieldReuse, TestRegexpRandom2, TestQueryBuilder, TestBoolean2ScorerSupplier, TestIndexWriter, TestIndexWriterMerging, TestPackedInts, TestIndexWriterWithThreads, TestIndexWriterExceptions, TestDeletionPolicy, TestBasics, TestFlushByRamOrCountsPolicy, TestIndexWriterDelete, TestNRTThreads, TestDuelingCodecs, TestAtomicUpdate, TestTimeLimitingCollector, TestTopDocsMerge, TestLongPostings]
   [junit4]   2> NOTE: reproduce with: ant test  -Dtestcase=TestLongPostings -Dtests.seed=98258A9110904AF7 -Dtests.slow=true -Dtests.locale=lg -Dtests.timezone=Pacific/Easter -Dtests.asserts=true -Dtests.file.encoding=US-ASCII
   [junit4] ERROR   0.00s J0 | TestLongPostings (suite) <<<
   [junit4]    > Throwable #1: java.io.IOException: Could not remove the following files (in the order of attempts):
   [junit4]    >    C:\Users\jenkins\workspace\Lucene-Solr-master-Windows\lucene\build\core\test\J0\temp\lucene.index.TestLongPostings_98258A9110904AF7-001\longpostings.1603048714465031682-001: java.nio.file.AccessDeniedException: C:\Users\jenkins\workspace\Lucene-Solr-master-Windows\lucene\build\core\test\J0\temp\lucene.index.TestLongPostings_98258A9110904AF7-001\longpostings.1603048714465031682-001
   [junit4]    >    C:\Users\jenkins\workspace\Lucene-Solr-master-Windows\lucene\build\core\test\J0\temp\lucene.index.TestLongPostings_98258A9110904AF7-001: java.nio.file.DirectoryNotEmptyException: C:\Users\jenkins\workspace\Lucene-Solr-master-Windows\lucene\build\core\test\J0\temp\lucene.index.TestLongPostings_98258A9110904AF7-001
   [junit4]    > 	at __randomizedtesting.SeedInfo.seed([98258A9110904AF7]:0)
   [junit4]    > 	at org.apache.lucene.util.IOUtils.rm(IOUtils.java:329)
   [junit4]    > 	at java.base/java.lang.Thread.run(Thread.java:844)
   [junit4] Completed [260/478 (2!)] on J0 in 1.21s, 2 tests, 1 error <<< FAILURES!

[...truncated 7053 lines...]
   [junit4] Suite: org.apache.lucene.store.TestHardLinkCopyDirectoryWrapper
   [junit4] IGNOR/A 0.02s J1 | TestHardLinkCopyDirectoryWrapper.testPendingDeletions
   [junit4]    > Assumption #1: we can only install VirusCheckingFS on an FSDirectory
   [junit4] IGNOR/A 0.01s J1 | TestHardLinkCopyDirectoryWrapper.testFsyncDoesntCreateNewFiles
   [junit4]    > Assumption #1: test only works for FSDirectory subclasses
   [junit4] IGNOR/A 0.03s J1 | TestHardLinkCopyDirectoryWrapper.testCopyHardLinks
   [junit4]    > Assumption #1: hardlinks are not supported
   [junit4]   2> NOTE: test params are: codec=Asserting(Lucene70): {}, docValues:{}, maxPointsInLeafNode=1547, maxMBSortInHeap=7.600876916821825, sim=Asserting(org.apache.lucene.search.similarities.AssertingSimilarity@522147e6), locale=lrc, timezone=Asia/Khandyga
   [junit4]   2> NOTE: Windows 10 10.0 amd64/Oracle Corporation 9.0.1 (64-bit)/cpus=3,threads=1,free=69777352,total=218628096
   [junit4]   2> NOTE: All tests run in this JVM: [TestDocValuesStatsCollector, TestHardLinkCopyDirectoryWrapper]
   [junit4]   2> NOTE: reproduce with: ant test  -Dtestcase=TestHardLinkCopyDirectoryWrapper -Dtests.seed=C6B7DB4D748E83DC -Dtests.slow=true -Dtests.locale=lrc -Dtests.timezone=Asia/Khandyga -Dtests.asserts=true -Dtests.file.encoding=ISO-8859-1
   [junit4] ERROR   0.00s J1 | TestHardLinkCopyDirectoryWrapper (suite) <<<
   [junit4]    > Throwable #1: java.io.IOException: Could not remove the following files (in the order of attempts):
   [junit4]    >    C:\Users\jenkins\workspace\Lucene-Solr-master-Windows\lucene\build\misc\test\J1\temp\lucene.store.TestHardLinkCopyDirectoryWrapper_C6B7DB4D748E83DC-001\testThreadSafety-001: java.nio.file.AccessDeniedException: C:\Users\jenkins\workspace\Lucene-Solr-master-Windows\lucene\build\misc\test\J1\temp\lucene.store.TestHardLinkCopyDirectoryWrapper_C6B7DB4D748E83DC-001\testThreadSafety-001
   [junit4]    >    C:\Users\jenkins\workspace\Lucene-Solr-master-Windows\lucene\build\misc\test\J1\temp\lucene.store.TestHardLinkCopyDirectoryWrapper_C6B7DB4D748E83DC-001: java.nio.file.DirectoryNotEmptyException: C:\Users\jenkins\workspace\Lucene-Solr-master-Windows\lucene\build\misc\test\J1\temp\lucene.store.TestHardLinkCopyDirectoryWrapper_C6B7DB4D748E83DC-001
   [junit4]    > 	at __randomizedtesting.SeedInfo.seed([C6B7DB4D748E83DC]:0)
   [junit4]    > 	at org.apache.lucene.util.IOUtils.rm(IOUtils.java:329)
   [junit4]    > 	at java.base/java.lang.Thread.run(Thread.java:844)
   [junit4] Completed [5/13 (1!)] on J1 in 9.78s, 43 tests, 1 error, 3 skipped <<< FAILURES!

[...truncated 3588 lines...]
   [junit4] Suite: org.apache.solr.cloud.autoscaling.sim.TestTriggerIntegration
   [junit4]   2> Creating dataDir: C:\Users\jenkins\workspace\Lucene-Solr-master-Windows\solr\build\solr-core\test\J0\temp\solr.cloud.autoscaling.sim.TestTriggerIntegration_B6B0142CA4C8D361-001\init-core-data-001
   [junit4]   2> 276638 WARN  (SUITE-TestTriggerIntegration-seed#[B6B0142CA4C8D361]-worker) [    ] o.a.s.SolrTestCaseJ4 startTrackingSearchers: numOpens=10 numCloses=10
   [junit4]   2> 276639 INFO  (SUITE-TestTriggerIntegration-seed#[B6B0142CA4C8D361]-worker) [    ] o.a.s.SolrTestCaseJ4 Using PointFields (NUMERIC_POINTS_SYSPROP=true) w/NUMERIC_DOCVALUES_SYSPROP=false
   [junit4]   2> 276639 INFO  (SUITE-TestTriggerIntegration-seed#[B6B0142CA4C8D361]-worker) [    ] o.a.s.SolrTestCaseJ4 Randomized ssl (false) and clientAuth (false) via: @org.apache.solr.util.RandomizeSSL(reason="", value=0.0/0.0, ssl=0.0/0.0, clientAuth=0.0/0.0)
   [junit4]   2> 276639 INFO  (SUITE-TestTriggerIntegration-seed#[B6B0142CA4C8D361]-worker) [    ] o.a.s.SolrTestCaseJ4 SecureRandom sanity checks: test.solr.allowed.securerandom=null & java.security.egd=file:/dev/./urandom
   [junit4]   2> 276652 INFO  (TEST-TestTriggerIntegration.testTriggerThrottling-seed#[B6B0142CA4C8D361]) [    ] o.a.s.SolrTestCaseJ4 ###Starting testTriggerThrottling
   [junit4]   2> 276652 DEBUG (Simulated OverseerAutoScalingTriggerThread) [    ] o.a.s.c.a.OverseerTriggerThread Adding .autoAddReplicas trigger
   [junit4]   2> 276652 DEBUG (Simulated OverseerAutoScalingTriggerThread) [    ] o.a.s.c.a.OverseerTriggerThread Refreshing /autoscaling.json with znode version 1
   [junit4]   2> 276652 DEBUG (Simulated OverseerAutoScalingTriggerThread) [    ] o.a.s.c.a.NodeLostTrigger Initial livenodes: [127.0.0.1:10001_solr, 127.0.0.1:10000_solr]
   [junit4]   2> 276652 DEBUG (Simulated OverseerAutoScalingTriggerThread) [    ] o.a.s.c.a.OverseerTriggerThread Current znodeVersion 1, lastZnodeVersion -1
   [junit4]   2> 276652 DEBUG (Simulated OverseerAutoScalingTriggerThread) [    ] o.a.s.c.a.OverseerTriggerThread Processed trigger updates upto znodeVersion 1
   [junit4]   2> 276653 INFO  (TEST-TestTriggerIntegration.testTriggerThrottling-seed#[B6B0142CA4C8D361]) [    ] o.a.s.c.a.s.SimCloudManager === Restarting OverseerTriggerThread and clearing object cache...
   [junit4]   2> 276655 DEBUG (Simulated OverseerAutoScalingTriggerThread) [    ] o.a.s.c.a.OverseerTriggerThread -- clean old nodeAdded markers
   [junit4]   2> 276655 WARN  (Simulated OverseerAutoScalingTriggerThread) [    ] o.a.s.c.a.OverseerTriggerThread Interrupted
   [junit4]   2> java.lang.InterruptedException
   [junit4]   2> 	at java.base/java.util.concurrent.locks.AbstractQueuedSynchronizer.acquireInterruptibly(AbstractQueuedSynchronizer.java:1247)
   [junit4]   2> 	at java.base/java.util.concurrent.locks.ReentrantLock.lockInterruptibly(ReentrantLock.java:317)
   [junit4]   2> 	at org.apache.solr.cloud.autoscaling.OverseerTriggerThread.run(OverseerTriggerThread.java:154)
   [junit4]   2> 	at java.base/java.lang.Thread.run(Thread.java:844)
   [junit4]   2> 276655 DEBUG (TEST-TestTriggerIntegration.testTriggerThrottling-seed#[B6B0142CA4C8D361]) [    ] o.a.s.c.a.OverseerTriggerThread OverseerTriggerThread has been closed explicitly
   [junit4]   2> 276656 DEBUG (Simulated OverseerAutoScalingTriggerThread) [    ] o.a.s.c.a.OverseerTriggerThread Refreshing /autoscaling.json with znode version 1
   [junit4]   2> 276656 DEBUG (Simulated OverseerAutoScalingTriggerThread) [    ] o.a.s.c.a.NodeLostTrigger Initial livenodes: [127.0.0.1:10001_solr, 127.0.0.1:10000_solr]
   [junit4]   2> 276656 DEBUG (Simulated OverseerAutoScalingTriggerThread) [    ] o.a.s.c.a.OverseerTriggerThread Current znodeVersion 1, lastZnodeVersion -1
   [junit4]   2> 276656 DEBUG (Simulated OverseerAutoScalingTriggerThread) [    ] o.a.s.c.a.OverseerTriggerThread Processed trigger updates upto znodeVersion 1
   [junit4]   2> 276657 DEBUG (Simulated OverseerAutoScalingTriggerThread) [    ] o.a.s.c.a.OverseerTriggerThread -- clean old nodeAdded markers
   [junit4]   2> 276657 DEBUG (Simulated OverseerAutoScalingTriggerThread) [    ] o.a.s.c.a.OverseerTriggerThread Current znodeVersion 1, lastZnodeVersion 1
   [junit4]   2> 276657 DEBUG (ScheduledTrigger-622-thread-1) [    ] o.a.s.c.a.NodeLostTrigger Running NodeLostTrigger: .auto_add_replicas with currently live nodes: 2
   [junit4]   2> 276678 DEBUG (ScheduledTrigger-622-thread-1) [    ] o.a.s.c.a.NodeLostTrigger Running NodeLostTrigger: .auto_add_replicas with currently live nodes: 2
   [junit4]   2> 276699 DEBUG (ScheduledTrigger-622-thread-2) [    ] o.a.s.c.a.NodeLostTrigger Running NodeLostTrigger: .auto_add_replicas with currently live nodes: 2
   [junit4]   2> 276720 DEBUG (ScheduledTrigger-622-thread-1) [    ] o.a.s.c.a.NodeLostTrigger Running NodeLostTrigger: .auto_add_replicas with currently live nodes: 2
   [junit4]   2> 276741 DEBUG (ScheduledTrigger-622-thread-1) [    ] o.a.s.c.a.NodeLostTrigger Running NodeLostTrigger: .auto_add_replicas with currently live nodes: 2
   [junit4]   2> 276763 DEBUG (ScheduledTrigger-622-thread-1) [    ] o.a.s.c.a.NodeLostTrigger Running NodeLostTrigger: .auto_add_replicas with currently live nodes: 2
   [junit4]   2> 276766 DEBUG (simCloudManagerPool-621-thread-1) [    ] o.a.s.c.a.AutoScalingHandler Verified autoscaling configuration
   [junit4]   2> 276766 DEBUG (simCloudManagerPool-621-thread-1) [    ] o.a.s.c.a.OverseerTriggerThread Refreshing /autoscaling.json with znode version 2
   [junit4]   2> 276767 DEBUG (simCloudManagerPool-621-thread-1) [    ] o.a.s.c.a.NodeLostTrigger Initial livenodes: [127.0.0.1:10001_solr, 127.0.0.1:10000_solr]
   [junit4]   2> 276768 DEBUG (simCloudManagerPool-621-thread-1) [    ] o.a.s.c.a.NodeAddedTrigger Initial livenodes: [127.0.0.1:10001_solr, 127.0.0.1:10000_solr]
   [junit4]   2> 276768 DEBUG (simCloudManagerPool-621-thread-1) [    ] o.a.s.c.a.NodeAddedTrigger NodeAddedTrigger node_added_trigger1 instantiated with properties: {event=nodeAdded, waitFor=0, actions=[{name=test, class=org.apache.solr.cloud.autoscaling.sim.TestTriggerIntegration$ThrottlingTesterAction}], enabled=true}
   [junit4]   2> 276768 DEBUG (Simulated OverseerAutoScalingTriggerThread) [    ] o.a.s.c.a.OverseerTriggerThread Processed trigger updates upto znodeVersion 2
   [junit4]   2> 276768 INFO  (Simulated OverseerAutoScalingTriggerThread) [    ] o.a.s.c.a.s.TestTriggerIntegration TestTriggerAction init
   [junit4]   2> 276768 DEBUG (Simulated OverseerAutoScalingTriggerThread) [    ] o.a.s.c.a.OverseerTriggerThread Current znodeVersion 2, lastZnodeVersion 2
   [junit4]   2> 276768 DEBUG (ScheduledTrigger-622-thread-3) [    ] o.a.s.c.a.NodeAddedTrigger Running NodeAddedTrigger node_added_trigger1
   [junit4]   2> 276768 DEBUG (ScheduledTrigger-622-thread-3) [    ] o.a.s.c.a.NodeAddedTrigger Found livenodes: 2
   [junit4]   2> 276768 DEBUG (simCloudManagerPool-621-thread-2) [    ] o.a.s.c.a.AutoScalingHandler Verified autoscaling configuration
   [junit4]   2> 276768 DEBUG (simCloudManagerPool-621-thread-2) [    ] o.a.s.c.a.OverseerTriggerThread Refreshing /autoscaling.json with znode version 3
   [junit4]   2> 276768 DEBUG (simCloudManagerPool-621-thread-2) [    ] o.a.s.c.a.NodeAddedTrigger Initial livenodes: [127.0.0.1:10001_solr, 127.0.0.1:10000_solr]
   [junit4]   2> 276768 DEBUG (simCloudManagerPool-621-thread-2) [    ] o.a.s.c.a.NodeAddedTrigger NodeAddedTrigger node_added_trigger2 instantiated with properties: {event=nodeAdded, waitFor=0, actions=[{name=test, class=org.apache.solr.cloud.autoscaling.sim.TestTriggerIntegration$ThrottlingTesterAction}], enabled=true}
   [junit4]   2> 276768 DEBUG (simCloudManagerPool-621-thread-2) [    ] o.a.s.c.a.NodeLostTrigger Initial livenodes: [127.0.0.1:10001_solr, 127.0.0.1:10000_solr]
   [junit4]   2> 276768 DEBUG (simCloudManagerPool-621-thread-2) [    ] o.a.s.c.a.NodeAddedTrigger Initial livenodes: [127.0.0.1:10001_solr, 127.0.0.1:10000_solr]
   [junit4]   2> 276768 DEBUG (simCloudManagerPool-621-thread-2) [    ] o.a.s.c.a.NodeAddedTrigger NodeAddedTrigger node_added_trigger1 instantiated with properties: {event=nodeAdded, waitFor=0, actions=[{name=test, class=org.apache.solr.cloud.autoscaling.sim.TestTriggerIntegration$ThrottlingTesterAction}], enabled=true}
   [junit4]   2> 276768 DEBUG (Simulated OverseerAutoScalingTriggerThread) [    ] o.a.s.c.a.OverseerTriggerThread Processed trigger updates upto znodeVersion 3
   [junit4]   2> 276768 INFO  (Simulated OverseerAutoScalingTriggerThread) [    ] o.a.s.c.a.s.TestTriggerIntegration TestTriggerAction init
   [junit4]   2> 276768 DEBUG (Simulated OverseerAutoScalingTriggerThread) [    ] o.a.s.c.a.OverseerTriggerThread Current znodeVersion 3, lastZnodeVersion 3
   [junit4]   2> 276768 DEBUG (ScheduledTrigger-622-thread-1) [    ] o.a.s.c.a.NodeAddedTrigger Running NodeAddedTrigger node_added_trigger2
   [junit4]   2> 276768 DEBUG (ScheduledTrigger-622-thread-1) [    ] o.a.s.c.a.NodeAddedTrigger Found livenodes: 3
   [junit4]   2> 276768 DEBUG (ScheduledTrigger-622-thread-1) [    ] o.a.s.c.a.NodeAddedTrigger Tracking new node: 127.0.0.1:10002_solr at time 969810704971236
   [junit4]   2> 276768 DEBUG (ScheduledTrigger-622-thread-1) [    ] o.a.s.c.a.NodeAddedTrigger NodeAddedTrigger node_added_trigger2 firing registered processor for nodes: [127.0.0.1:10002_solr] added at times [969810704971236], now=969810708043236
   [junit4]   2> 276768 DEBUG (ScheduledTrigger-622-thread-1) [    ] o.a.s.c.a.ScheduledTriggers ++++++++ Cooldown inactive - processing event: {
   [junit4]   2>   "id":"37209a691b5e4T5gg6k5tw6jr00nbhbt292e4s6",
   [junit4]   2>   "source":"node_added_trigger2",
   [junit4]   2>   "eventTime":969810704971236,
   [junit4]   2>   "eventType":"NODEADDED",
   [junit4]   2>   "properties":{
   [junit4]   2>     "eventTimes":[969810704971236],
   [junit4]   2>     "nodeNames":["127.0.0.1:10002_solr"]}}
   [junit4]   2> 276768 DEBUG (ScheduledTrigger-622-thread-1) [    ] o.a.s.c.a.ScheduledTriggers Pausing all triggers: [.auto_add_replicas, node_added_trigger2, node_added_trigger1]
   [junit4]   2> 276773 DEBUG (AutoscalingActionExecutor-623-thread-1) [    ] o.a.s.c.a.ScheduledTriggers -- processing actions for {
   [junit4]   2>   "id":"37209a691b5e4T5gg6k5tw6jr00nbhbt292e4s6",
   [junit4]   2>   "source":"node_added_trigger2",
   [junit4]   2>   "eventTime":969810704971236,
   [junit4]   2>   "eventType":"NODEADDED",
   [junit4]   2>   "properties":{
   [junit4]   2>     "eventTimes":[969810704971236],
   [junit4]   2>     "_enqueue_time_":969810744451886,
   [junit4]   2>     "nodeNames":["127.0.0.1:10002_solr"]}}
   [junit4]   2> 276773 INFO  (AutoscalingActionExecutor-623-thread-1) [    ] o.a.s.c.a.s.TestTriggerIntegration action executed from node_added_trigger2
   [junit4]   2> 276774 DEBUG (AutoscalingActionExecutor-623-thread-1) [    ] o.a.s.c.a.ScheduledTriggers Resuming trigger: .auto_add_replicas after 100ms
   [junit4]   2> 276774 DEBUG (AutoscalingActionExecutor-623-thread-1) [    ] o.a.s.c.a.ScheduledTriggers Resuming trigger: node_added_trigger2 after 100ms
   [junit4]   2> 276774 DEBUG (AutoscalingActionExecutor-623-thread-1) [    ] o.a.s.c.a.ScheduledTriggers Resuming trigger: node_added_trigger1 after 100ms
   [junit4]   2> 276774 DEBUG (AutoscalingActionExecutor-623-thread-1) [    ] o.a.s.c.a.ScheduledTriggers -- processing took 39 ms for event id=37209a691b5e4T5gg6k5tw6jr00nbhbt292e4s6
   [junit4]   2> 276874 DEBUG (ScheduledTrigger-622-thread-2) [    ] o.a.s.c.a.NodeLostTrigger Running NodeLostTrigger: .auto_add_replicas with currently live nodes: 3
   [junit4]   2> 276874 DEBUG (ScheduledTrigger-622-thread-3) [    ] o.a.s.c.a.NodeAddedTrigger Running NodeAddedTrigger node_added_trigger2
   [junit4]   2> 276874 DEBUG (ScheduledTrigger-622-thread-3) [    ] o.a.s.c.a.NodeAddedTrigger Found livenodes: 3
   [junit4]   2> 276875 DEBUG (ScheduledTrigger-622-thread-1) [    ] o.a.s.c.a.NodeAddedTrigger Running NodeAddedTrigger node_added_trigger1
   [junit4]   2> 276875 DEBUG (ScheduledTrigger-622-thread-1) [    ] o.a.s.c.a.NodeAddedTrigger Found livenodes: 3
   [junit4]   2> 276875 DEBUG (ScheduledTrigger-622-thread-1) [    ] o.a.s.c.a.NodeAddedTrigger Tracking new node: 127.0.0.1:10002_solr at time 969815927694136
   [junit4]   2> 276875 DEBUG (ScheduledTrigger-622-thread-1) [    ] o.a.s.c.a.NodeAddedTrigger NodeAddedTrigger node_added_trigger1 firing registered processor for nodes: [127.0.0.1:10002_solr] added at times [969815927694136], now=969815928575886
   [junit4]   2> 276875 DEBUG (ScheduledTrigger-622-thread-1) [    ] o.a.s.c.a.ScheduledTriggers ++++++++ Cooldown inactive - processing event: {
   [junit4]   2>   "id":"3720addde2338T5gg6k5tw6jr00nbhbt292e4s9",
   [junit4]   2>   "source":"node_added_trigger1",
   [junit4]   2>   "eventTime":969815927694136,
   [junit4]   2>   "eventType":"NODEADDED",
   [junit4]   2>   "properties":{
   [junit4]   2>     "eventTimes":[969815927694136],
   [junit4]   2>     "nodeNames":["127.0.0.1:10002_solr"]}}
   [junit4]   2> 276875 DEBUG (ScheduledTrigger-622-thread-1) [    ] o.a.s.c.a.ScheduledTriggers Pausing all triggers: [.auto_add_replicas, node_added_trigger2, node_added_trigger1]
   [junit4]   2> 276876 DEBUG (AutoscalingActionExecutor-623-thread-1) [    ] o.a.s.c.a.ScheduledTriggers -- processing actions for {
   [junit4]   2>   "id":"3720addde2338T5gg6k5tw6jr00nbhbt292e4s9",
   [junit4]   2>   "source":"node_added_trigger1",
   [junit4]   2>   "eventTime":969815927694136,
   [junit4]   2>   "eventType":"NODEADDED",
   [junit4]   2>   "properties":{
   [junit4]   2>     "eventTimes":[969815927694136],
   [junit4]   2>     "_enqueue_time_":969815939029186,
   [junit4]   2>     "nodeNames":["127.0.0.1:10002_solr"]}}
   [junit4]   2> 276876 INFO  (AutoscalingActionExecutor-623-thread-1) [    ] o.a.s.c.a.s.TestTriggerIntegration last action at 969810831761586 time = 969815974527636
   [junit4]   2> 276876 INFO  (AutoscalingActionExecutor-623-thread-1) [    ] o.a.s.c.a.s.TestTriggerIntegration action executed from node_added_trigger1
   [junit4]   2> 276877 DEBUG (AutoscalingActionExecutor-623-thread-1) [    ] o.a.s.c.a.ScheduledTriggers Resuming trigger: .auto_add_replicas after 100ms
   [junit4]   2> 276877 DEBUG (AutoscalingActionExecutor-623-thread-1) [    ] o.a.s.c.a.ScheduledTriggers Resuming trigger: node_added_trigger2 after 100ms
   [junit4]   2> 276877 DEBUG (AutoscalingActionExecutor-623-thread-1) [    ] o.a.s.c.a.ScheduledTriggers Resuming trigger: node_added_trigger1 after 100ms
   [junit4]   2> 276877 DEBUG (AutoscalingActionExecutor-623-thread-1) [    ] o.a.s.c.a.ScheduledTriggers -- processing took 39 ms for event id=3720addde2338T5gg6k5tw6jr00nbhbt292e4s9
   [junit4]   2> 276877 DEBUG (simCloudManagerPool-621-thread-6) [    ] o.a.s.c.a.AutoScalingHandler Verified autoscaling configuration
   [junit4]   2> 276877 DEBUG (simCloudManagerPool-621-thread-6) [    ] o.a.s.c.a.OverseerTriggerThread Refreshing /autoscaling.json with znode version 4
   [junit4]   2> 276877 DEBUG (simCloudManagerPool-621-thread-6) [    ] o.a.s.c.a.NodeAddedTrigger Initial livenodes: [127.0.0.1:10001_solr, 127.0.0.1:10000_solr, 127.0.0.1:10002_solr]
   [junit4]   2> 276877 DEBUG (simCloudManagerPool-621-thread-6) [    ] o.a.s.c.a.NodeAddedTrigger NodeAddedTrigger node_added_trigger2 instantiated with properties: {event=nodeAdded, waitFor=0, actions=[{name=test, class=org.apache.solr.cloud.autoscaling.sim.TestTriggerIntegration$ThrottlingTesterAction}], enabled=true}
   [junit4]   2> 276877 DEBUG (simCloudManagerPool-621-thread-6) [    ] o.a.s.c.a.NodeLostTrigger Initial livenodes: [127.0.0.1:10001_solr, 127.0.0.1:10000_solr, 127.0.0.1:10002_solr]
   [junit4]   2> 276878 DEBUG (simCloudManagerPool-621-thread-6) [    ] o.a.s.c.a.NodeAddedTrigger Initial livenodes: [127.0.0.1:10001_solr, 127.0.0.1:10000_solr, 127.0.0.1:10002_solr]
   [junit4]   2> 276878 DEBUG (simCloudManagerPool-621-thread-6) [    ] o.a.s.c.a.NodeAddedTrigger NodeAddedTrigger node_added_trigger1 instantiated with properties: {event=nodeAdded, waitFor=0, actions=[{name=test, class=org.apache.solr.cloud.autoscaling.sim.TestTriggerIntegration$ThrottlingTesterAction}], enabled=true}
   [junit4]   2> 276878 DEBUG (simCloudManagerPool-621-thread-6) [    ] o.a.s.c.a.NodeLostTrigger Initial livenodes: [127.0.0.1:10001_solr, 127.0.0.1:10000_solr, 127.0.0.1:10002_solr]
   [junit4]   2> 276878 DEBUG (Simulated OverseerAutoScalingTriggerThread) [    ] o.a.s.c.a.OverseerTriggerThread Processed trigger updates upto znodeVersion 4
   [junit4]   2> 276878 INFO  (Simulated OverseerAutoScalingTriggerThread) [    ] o.a.s.c.a.s.TestTriggerIntegration TestTriggerAction init
   [junit4]   2> 276878 DEBUG (Simulated OverseerAutoScalingTriggerThread) [    ] o.a.s.c.a.OverseerTriggerThread Current znodeVersion 4, lastZnodeVersion 4
   [junit4]   2> 276878 DEBUG (ScheduledTrigger-622-thread-3) [    ] o.a.s.c.a.NodeLostTrigger Running NodeLostTrigger: node_lost_trigger1 with currently live nodes: 3
   [junit4]   2> 276878 DEBUG (simCloudManagerPool-621-thread-8) [    ] o.a.s.c.a.AutoScalingHandler Verified autoscaling configuration
   [junit4]   2> 276878 DEBUG (simCloudManagerPool-621-thread-8) [    ] o.a.s.c.a.OverseerTriggerThread Refreshing /autoscaling.json with znode version 5
   [junit4]   2> 276879 DEBUG (simCloudManagerPool-621-thread-8) [    ] o.a.s.c.a.NodeAddedTrigger Initial livenodes: [127.0.0.1:10001_solr, 127.0.0.1:10000_solr, 127.0.0.1:10002_solr]
   [junit4]   2> 276879 DEBUG (simCloudManagerPool-621-thread-8) [    ] o.a.s.c.a.NodeAddedTrigger NodeAddedTrigger node_added_trigger2 instantiated with properties: {event=nodeAdded, waitFor=0, actions=[{name=test, class=org.apache.solr.cloud.autoscaling.sim.TestTriggerIntegration$ThrottlingTesterAction}], enabled=true}
   [junit4]   2> 276879 DEBUG (simCloudManagerPool-621-thread-8) [    ] o.a.s.c.a.NodeLostTrigger Initial livenodes: [127.0.0.1:10001_solr, 127.0.0.1:10000_solr, 127.0.0.1:10002_solr]
   [junit4]   2> 276879 DEBUG (simCloudManagerPool-621-thread-8) [    ] o.a.s.c.a.NodeAddedTrigger Initial livenodes: [127.0.0.1:10001_solr, 127.0.0.1:10000_solr, 127.0.0.1:10002_solr]
   [junit4]   2> 276879 DEBUG (simCloudManagerPool-621-thread-8) [    ] o.a.s.c.a.NodeAddedTrigger NodeAddedTrigger node_added_trigger1 instantiated with properties: {event=nodeAdded, waitFor=0, actions=[{name=test, class=org.apache.solr.cloud.autoscaling.sim.TestTriggerIntegration$ThrottlingTesterAction}], enabled=true}
   [junit4]   2> 276879 DEBUG (simCloudManagerPool-621-thread-8) [    ] o.a.s.c.a.NodeLostTrigger Initial livenodes: [127.0.0.1:10001_solr, 127.0.0.1:10000_solr, 127.0.0.1:10002_solr]
   [junit4]   2> 276879 DEBUG (simCloudManagerPool-621-thread-8) [    ] o.a.s.c.a.NodeLostTrigger Initial livenodes: [127.0.0.1:10001_solr, 127.0.0.1:10000_solr, 127.0.0.1:10002_solr]
   [junit4]   2> 276879 DEBUG (Simulated OverseerAutoScalingTriggerThread) [    ] o.a.s.c.a.OverseerTriggerThread Processed trigger updates upto znodeVersion 5
   [junit4]   2> 276879 INFO  (Simulated OverseerAutoScalingTriggerThread) [    ] o.a.s.c.a.s.TestTriggerIntegration TestTriggerAction init
   [junit4]   2> 276879 DEBUG (Simulated OverseerAutoScalingTriggerThread) [    ] o.a.s.c.a.OverseerTriggerThread Current znodeVersion 5, lastZnodeVersion 5
   [junit4]   2> 276879 DEBUG (ScheduledTrigger-622-thread-2) [    ] o.a.s.c.a.NodeLostTrigger Running NodeLostTrigger: node_lost_trigger2 with currently live nodes: 3
   [junit4]   2> 276899 DEBUG (ScheduledTrigger-622-thread-2) [    ] o.a.s.c.a.NodeLostTrigger Running NodeLostTrigger: node_lost_trigger1 with currently live nodes: 2
   [junit4]   2> 276899 DEBUG (ScheduledTrigger-622-thread-2) [    ] o.a.s.c.a.NodeLostTrigger Tracking lost node: 127.0.0.1:10002_solr
   [junit4]   2> 276899 DEBUG (ScheduledTrigger-622-thread-2) [    ] o.a.s.c.a.NodeLostTrigger NodeLostTrigger firing registered processor for lost nodes: [127.0.0.1:10002_solr]
   [junit4]   2> 276899 DEBUG (ScheduledTrigger-622-thread-2) [    ] o.a.s.c.a.ScheduledTriggers ++++++++ Cooldown inactive - processing event: {
   [junit4]   2>   "id":"3720b250b290eT5gg6k5tw6jr00nbhbt292e4sc",
   [junit4]   2>   "source":"node_lost_trigger1",
   [junit4]   2>   "eventTime":969817121827086,
   [junit4]   2>   "eventType":"NODELOST",
   [junit4]   2>   "properties":{
   [junit4]   2>     "eventTimes":[969817121827086],
   [junit4]   2>     "nodeNames":["127.0.0.1:10002_solr"]}}
   [junit4]   2> 276899 DEBUG (ScheduledTrigger-622-thread-2) [    ] o.a.s.c.a.ScheduledTriggers Pausing all triggers: [node_lost_trigger2, .auto_add_replicas, node_added_trigger2, node_lost_trigger1, node_added_trigger1]
   [junit4]   2> 276900 DEBUG (AutoscalingActionExecutor-623-thread-1) [    ] o.a.s.c.a.ScheduledTriggers -- processing actions for {
   [junit4]   2>   "id":"3720b250b290eT5gg6k5tw6jr00nbhbt292e4sc",
   [junit4]   2>   "source":"node_lost_trigger1",
   [junit4]   2>   "eventTime":969817121827086,
   [junit4]   2>   "eventType":"NODELOST",
   [junit4]   2>   "properties":{
   [junit4]   2>     "eventTimes":[969817121827086],
   [junit4]   2>     "_enqueue_time_":969817129734586,
   [junit4]   2>     "nodeNames":["127.0.0.1:10002_solr"]}}
   [junit4]   2> 276900 INFO  (AutoscalingActionExecutor-623-thread-1) [    ] o.a.s.c.a.s.TestTriggerIntegration action executed from node_lost_trigger1
   [junit4]   2> 276901 DEBUG (AutoscalingActionExecutor-623-thread-1) [    ] o.a.s.c.a.ScheduledTriggers Resuming trigger: node_lost_trigger2 after 100ms
   [junit4]   2> 276901 DEBUG (AutoscalingActionExecutor-623-thread-1) [    ] o.a.s.c.a.ScheduledTriggers Resuming trigger: .auto_add_replicas after 100ms
   [junit4]   2> 276901 DEBUG (AutoscalingActionExecutor-623-thread-1) [    ] o.a.s.c.a.ScheduledTriggers Resuming trigger: node_added_trigger2 after 100ms
   [junit4]   2> 276901 DEBUG (AutoscalingActionExecutor-623-thread-1) [    ] o.a.s.c.a.ScheduledTriggers Resuming trigger: node_lost_trigger1 after 100ms
   [junit4]   2> 276901 DEBUG (AutoscalingActionExecutor-623-thread-1) [    ] o.a.s.c.a.ScheduledTriggers Resuming trigger: node_added_trigger1 after 100ms
   [junit4]   2> 276901 DEBUG (AutoscalingActionExecutor-623-thread-1) [    ] o.a.s.c.a.ScheduledTriggers -- processing took 40 ms for event id=3720b250b290eT5gg6k5tw6jr00nbhbt292e4sc
   [junit4]   2> 277002 DEBUG (ScheduledTrigger-622-thread-4) [    ] o.a.s.c.a.NodeLostTrigger Running NodeLostTrigger: .auto_add_replicas with currently live nodes: 2
   [junit4]   2> 277003 DEBUG (ScheduledTrigger-622-thread-1) [    ] o.a.s.c.a.NodeLostTrigger Running NodeLostTrigger: node_lost_trigger2 with currently live nodes: 2
   [junit4]   2> 277003 DEBUG (ScheduledTrigger-622-thread-4) [    ] o.a.s.c.a.NodeLostTrigger Tracking lost node: 127.0.0.1:10002_solr
   [junit4]   2> 277003 DEBUG (ScheduledTrigger-622-thread-3) [    ] o.a.s.c.a.NodeAddedTrigger Running NodeAddedTrigger node_added_trigger2
   [junit4]   2> 277003 DEBUG (ScheduledTrigger-622-thread-3) [    ] o.a.s.c.a.NodeAddedTrigger Found livenodes: 2
   [junit4]   2> 277003 DEBUG (ScheduledTrigger-622-thread-4) [    ] o.a.s.c.a.NodeAddedTrigger Running NodeAddedTrigger node_added_trigger1
   [junit4]   2> 277003 DEBUG (ScheduledTrigger-622-thread-4) [    ] o.a.s.c.a.NodeAddedTrigger Found livenodes: 2
   [junit4]   2> 277002 DEBUG (ScheduledTrigger-622-thread-2) [    ] o.a.s.c.a.NodeLostTrigger Running NodeLostTrigger: node_lost_trigger1 with currently live nodes: 2
   [junit4]   2> 277003 DEBUG (ScheduledTrigger-622-thread-1) [    ] o.a.s.c.a.NodeLostTrigger Tracking lost node: 127.0.0.1:10002_solr
   [junit4]   2> 277003 DEBUG (ScheduledTrigger-622-thread-1) [    ] o.a.s.c.a.NodeLostTrigger NodeLostTrigger firing registered processor for lost nodes: [127.0.0.1:10002_solr]
   [junit4]   2> 277003 DEBUG (ScheduledTrigger-622-thread-1) [    ] o.a.s.c.a.ScheduledTriggers ++++++++ Cooldown inactive - processing event: {
   [junit4]   2>   "id":"3720c5b26e6c6T5gg6k5tw6jr00nbhbt292e4sf",
   [junit4]   2>   "source":"node_lost_trigger2",
   [junit4]   2>   "eventTime":969822324582086,
   [junit4]   2>   "eventType":"NODELOST",
   [junit4]   2>   "properties":{
   [junit4]   2>     "eventTimes":[969822324582086],
   [junit4]   2>     "nodeNames":["127.0.0.1:10002_solr"]}}
   [junit4]   2> 277003 DEBUG (ScheduledTrigger-622-thread-1) [    ] o.a.s.c.a.ScheduledTriggers Pausing all triggers: [node_lost_trigger2, .auto_add_replicas, node_added_trigger2, node_lost_trigger1, node_added_trigger1]
   [junit4]   2> 277004 DEBUG (AutoscalingActionExecutor-623-thread-1) [    ] o.a.s.c.a.ScheduledTriggers -- processing actions for {
   [junit4]   2>   "id":"3720c5b26e6c6T5gg6k5tw6jr00nbhbt292e4sf",
   [junit4]   2>   "source":"node_lost_trigger2",
   [junit4]   2>   "eventTime":969822324582086,
   [junit4]   2>   "eventType":"NODELOST",
   [junit4]   2>   "properties":{
   [junit4]   2>     "eventTimes":[969822324582086],
   [junit4]   2>     "_enqueue_time_":969822336358036,
   [junit4]   2>     "nodeNames":["127.0.0.1:10002_solr"]}}
   [junit4]   2> 277004 INFO  (AutoscalingActionExecutor-623-thread-1) [    ] o.a.s.c.a.s.TestTriggerIntegration last action at 969817170950336 time = 969822373221786
   [junit4]   2> 277004 INFO  (AutoscalingActionExecutor-623-thread-1) [    ] o.a.s.c.a.s.TestTriggerIntegration action executed from node_lost_trigger2
   [junit4]   2> 277004 INFO  (TEST-TestTriggerIntegration.testTriggerThrottling-seed#[B6B0142CA4C8D361]) [    ] o.a.s.SolrTestCaseJ4 ###Ending testTriggerThrottling
   [junit4]   2> 277004 INFO  (TEST-TestTriggerIntegration.testTriggerThrottling-seed#[B6B0142CA4C8D361]) [    ] o.a.s.c.a.s.SimSolrCloudTestCase 
   [junit4]   2> 
   [junit4]   2> 277004 INFO  (TEST-TestTriggerIntegration.testTriggerThrottling-seed#[B6B0142CA4C8D361]) [    ] o.a.s.c.a.s.SimSolrCloudTestCase #############################################
   [junit4]   2> 277004 INFO  (TEST-TestTriggerIntegration.testTriggerThrottling-seed#[B6B0142CA4C8D361]) [    ] o.a.s.c.a.s.SimSolrCloudTestCase ############ FINAL CLUSTER STATS ############
   [junit4]   2> 277004 INFO  (TEST-TestTriggerIntegration.testTriggerThrottling-seed#[B6B0142CA4C8D361]) [    ] o.a.s.c.a.s.SimSolrCloudTestCase #############################################
   [junit4]   2> 
   [junit4]   2> 277004 INFO  (TEST-TestTriggerIntegration.testTriggerThrottling-seed#[B6B0142CA4C8D361]) [    ] o.a.s.c.a.s.SimSolrCloudTestCase ## Live nodes:		2
   [junit4]   2> 277004 INFO  (TEST-TestTriggerIntegration.testTriggerThrottling-seed#[B6B0142CA4C8D361]) [    ] o.a.s.c.a.s.SimSolrCloudTestCase ## Empty nodes:	2
   [junit4]   2> 277004 DEBUG (AutoscalingActionExecutor-623-thread-1) [    ] o.a.s.c.a.ScheduledTriggers Resuming trigger: node_lost_trigger2 after 100ms
   [junit4]   2> 277004 INFO  (TEST-TestTriggerIntegration.testTriggerThrottling-seed#[B6B0142CA4C8D361]) [    ] o.a.s.c.a.s.SimSolrCloudTestCase ## Dead nodes:		1
   [junit4]   2> 277004 DEBUG (AutoscalingActionExecutor-623-thread-1) [    ] o.a.s.c.a.ScheduledTriggers Resuming trigger: .auto_add_replicas after 100ms
   [junit4]   2> 277004 DEBUG (AutoscalingActionExecutor-623-thread-1) [    ] o.a.s.c.a.ScheduledTriggers Resuming trigger: node_added_trigger2 after 100ms
   [junit4]   2> 277004 DEBUG (AutoscalingActionExecutor-623-thread-1) [    ] o.a.s.c.a.ScheduledTriggers Resuming trigger: node_lost_trigger1 after 100ms
   [junit4]   2> 277004 DEBUG (AutoscalingActionExecutor-623-thread-1) [    ] o.a.s.c.a.ScheduledTriggers Resuming trigger: node_added_trigger1 after 100ms
   [junit4]   2> 277004 DEBUG (AutoscalingActionExecutor-623-thread-1) [    ] o.a.s.c.a.ScheduledTriggers -- processing took 26 ms for event id=3720c5b26e6c6T5gg6k5tw6jr00nbhbt292e4sf
   [junit4]   2> 277005 INFO  (TEST-TestTriggerIntegration.testTriggerThrottling-seed#[B6B0142CA4C8D361]) [    ] o.a.s.c.a.s.SimSolrCloudTestCase ##		127.0.0.1:10002_solr
   [junit4]   2> 277005 INFO  (TEST-TestTriggerIntegration.testTriggerThrottling-seed#[B6B0142CA4C8D361]) [    ] o.a.s.c.a.s.SimSolrCloudTestCase ## Collections:	[]
   [junit4]   2> 277005 INFO  (TEST-TestTriggerIntegration.testTriggerThrottling-seed#[B6B0142CA4C8D361]) [    ] o.a.s.c.a.s.SimSolrCloudTestCase ## Max replicas per node:	0
   [junit4]   2> 277005 INFO  (TEST-TestTriggerIntegration.testTriggerThrottling-seed#[B6B0142CA4C8D361]) [    ] o.a.s.c.a.s.SimSolrCloudTestCase ## Min replicas per node:	0
   [junit4]   2> 277005 INFO  (TEST-TestTriggerIntegration.testTriggerThrottling-seed#[B6B0142CA4C8D361]) [    ] o.a.s.c.a.s.SimSolrCloudTestCase ## Total replicas:		0
   [junit4]   2> 277006 INFO  (TEST-TestTriggerIntegration.testTriggerThrottling-seed#[B6B0142CA4C8D361]) [    ] o.a.s.c.a.s.SimSolrCloudTestCase ######### Final Solr op counts ##########
   [junit4]   2> 277006 INFO  (TEST-TestTriggerIntegration.testTriggerThrottling-seed#[B6B0142CA4C8D361]) [    ] o.a.s.c.a.s.SimSolrCloudTestCase ##		- autoscaling        4
   [junit4]   2> 277006 INFO  (TEST-TestTriggerIntegration.testTriggerThrottling-seed#[B6B0142CA4C8D361]) [    ] o.a.s.c.a.s.SimSolrCloudTestCase ##		- update             8
   [junit4]   2> 277006 INFO  (TEST-TestTriggerIntegration.testTriggerThrottling-seed#[B6B0142CA4C8D361]) [    ] o.a.s.c.a.s.SimSolrCloudTestCase ######### Autoscaling event counts ###########
   [junit4]   2> 277006 INFO  (TEST-TestTriggerIntegration.testTriggerThrottling-seed#[B6B0142CA4C8D361]) [    ] o.a.s.c.a.s.SimSolrCloudTestCase ## * Trigger: node_added_trigger1
   [junit4]   2> 277006 INFO  (TEST-TestTriggerIntegration.testTriggerThrottling-seed#[B6B0142CA4C8D361]) [    ] o.a.s.c.a.s.SimSolrCloudTestCase ##		- STARTED         1
   [junit4]   2> 277007 INFO  (TEST-TestTriggerIntegration.testTriggerThrottling-seed#[B6B0142CA4C8D361]) [    ] o.a.s.c.a.s.SimSolrCloudTestCase ##		- SUCCEEDED       1
   [junit4]   2> 277007 INFO  (TEST-TestTriggerIntegration.testTriggerThrottling-seed#[B6B0142CA4C8D361]) [    ] o.a.s.c.a.s.SimSolrCloudTestCase ## * Trigger: node_added_trigger2
   [junit4]   2> 277007 INFO  (TEST-TestTriggerIntegration.testTriggerThrottling-seed#[B6B0142CA4C8D361]) [    ] o.a.s.c.a.s.SimSolrCloudTestCase ##		- STARTED         1
   [junit4]   2> 277007 INFO  (TEST-TestTriggerIntegration.testTriggerThrottling-seed#[B6B0142CA4C8D361]) [    ] o.a.s.c.a.s.SimSolrCloudTestCase ##		- SUCCEEDED       1
   [junit4]   2> 277007 INFO  (TEST-TestTriggerIntegration.testTriggerThrottling-seed#[B6B0142CA4C8D361]) [    ] o.a.s.c.a.s.SimSolrCloudTestCase ## * Trigger: node_lost_trigger1
   [junit4]   2> 277007 INFO  (TEST-TestTriggerIntegration.testTriggerThrottling-seed#[B6B0142CA4C8D361]) [    ] o.a.s.c.a.s.SimSolrCloudTestCase ##		- STARTED         1
   [junit4]   2> 277007 INFO  (TEST-TestTriggerIntegration.testTriggerThrottling-seed#[B6B0142CA4C8D361]) [    ] o.a.s.c.a.s.SimSolrCloudTestCase ##		- SUCCEEDED       1
   [junit4]   2> 277007 INFO  (TEST-TestTriggerIntegration.testTriggerThrottling-seed#[B6B0142CA4C8D361]) [    ] o.a.s.c.a.s.SimSolrCloudTestCase ## * Trigger: node_lost_trigger2
   [junit4]   2> 277007 INFO  (TEST-TestTriggerIntegration.testTriggerThrottling-seed#[B6B0142CA4C8D361]) [    ] o.a.s.c.a.s.SimSolrCloudTestCase ##		- STARTED         1
   [junit4]   2> 277007 INFO  (TEST-TestTriggerIntegration.testTriggerThrottling-seed#[B6B0142CA4C8D361]) [    ] o.a.s.c.a.s.SimSolrCloudTestCase ##		- SUCCEEDED       1
   [junit4]   2> 277010 INFO  (TEST-TestTriggerIntegration.testNodeMarkersRegistration-seed#[B6B0142CA4C8D361]) [    ] o.a.s.SolrTestCaseJ4 ###Starting testNodeMarkersRegistration
   [junit4]   2> 277010 DEBUG (TEST-TestTriggerIntegration.testNodeMarkersRegistration-seed#[B6B0142CA4C8D361]) [    ] o.a.s.c.a.OverseerTriggerThread Refreshing /autoscaling.json with znode version 6
   [junit4]   2> 277011 DEBUG (Simulated OverseerAutoScalingTriggerThread) [    ] o.a.s.c.a.OverseerTriggerThread Processed trigger updates upto znodeVersion 6
   [junit4]   2> 277011 DEBUG (TEST-TestTriggerIntegration.testNodeMarkersRegistration-seed#[B6B0142CA4C8D361]) [    ] o.a.s.c.a.s.SimNodeStateProvider - removing dead node values: 127.0.0.1:10002_solr
   [junit4]   2> 277011 INFO  (TEST-TestTriggerIntegration.testNodeMarkersRegistration-seed#[B6B0142CA4C8D361]) [    ] o.a.s.c.a.s.SimCloudManager === Restarting OverseerTriggerThread and clearing object cache...
   [junit4]   2> 277011 DEBUG (Simulated OverseerAutoScalingTriggerThread) [    ] o.a.s.c.a.OverseerTriggerThread -- clean old nodeLost markers
   [junit4]   2> 277011 DEBUG (TEST-TestTriggerIntegration.testNodeMarkersRegistration-seed#[B6B0142CA4C8D361]) [    ] o.a.s.c.a.OverseerTriggerThread OverseerTriggerThread has been closed explicitly
   [junit4]   2> 277011 DEBUG (Simulated OverseerAutoScalingTriggerThread) [    ] o.a.s.c.a.OverseerTriggerThread -- clean old nodeAdded markers
   [junit4]   2> 277011 WARN  (Simulated OverseerAutoScalingTriggerThread) [    ] o.a.s.c.a.OverseerTriggerThread Interrupted
   [junit4]   2> java.lang.InterruptedException
   [junit4]   2> 	at java.base/java.util.concurrent.locks.AbstractQueuedSynchronizer.acquir

[...truncated too long message...]

it = false]
   [junit4]   2> 33977 INFO  (coreCloseExecutor-171-thread-1) [    x:collection1] o.a.s.u.LoggingInfoStream [IFD][coreCloseExecutor-171-thread-1]: 0 msec to checkpoint
   [junit4]   2> 33980 INFO  (SUITE-HttpSolrClientConPoolTest-seed#[EF3A06AE9D3DE6CB]-worker) [    ] o.e.j.s.h.ContextHandler Stopped o.e.j.s.ServletContextHandler@6d435729{/solr,null,UNAVAILABLE}
   [junit4]   2> 33980 INFO  (SUITE-HttpSolrClientConPoolTest-seed#[EF3A06AE9D3DE6CB]-worker) [    ] o.e.j.s.session Stopped scavenging
   [junit4]   2> 33981 INFO  (SUITE-HttpSolrClientConPoolTest-seed#[EF3A06AE9D3DE6CB]-worker) [    ] o.a.s.SolrTestCaseJ4 ------------------------------------------------------- Done waiting for tracked resources to be released
   [junit4]   2> NOTE: test params are: codec=Asserting(Lucene70): {}, docValues:{}, maxPointsInLeafNode=1025, maxMBSortInHeap=5.114366523401209, sim=Asserting(org.apache.lucene.search.similarities.AssertingSimilarity@dfe576b), locale=sw-KE, timezone=Africa/Kigali
   [junit4]   2> NOTE: Windows 10 10.0 amd64/Oracle Corporation 9.0.1 (64-bit)/cpus=3,threads=1,free=153770464,total=257949696
   [junit4]   2> NOTE: All tests run in this JVM: [JDBCStreamTest, JdbcDriverTest, AnlysisResponseBaseTest, ClientUtilsTest, TestV2Request, TestSuggesterResponse, TestZkConfigManager, HttpSolrClientConPoolTest]
   [junit4]   2> NOTE: reproduce with: ant test  -Dtestcase=HttpSolrClientConPoolTest -Dtests.seed=EF3A06AE9D3DE6CB -Dtests.slow=true -Dtests.locale=sw-KE -Dtests.timezone=Africa/Kigali -Dtests.asserts=true -Dtests.file.encoding=UTF-8
   [junit4] ERROR   0.00s J1 | HttpSolrClientConPoolTest (suite) <<<
   [junit4]    > Throwable #1: java.io.IOException: Could not remove the following files (in the order of attempts):
   [junit4]    >    C:\Users\jenkins\workspace\Lucene-Solr-master-Windows\solr\build\solr-solrj\test\J1\temp\solr.client.solrj.impl.HttpSolrClientConPoolTest_EF3A06AE9D3DE6CB-001\tempDir-003\collection1\conf\clustering: java.nio.file.DirectoryNotEmptyException: C:\Users\jenkins\workspace\Lucene-Solr-master-Windows\solr\build\solr-solrj\test\J1\temp\solr.client.solrj.impl.HttpSolrClientConPoolTest_EF3A06AE9D3DE6CB-001\tempDir-003\collection1\conf\clustering
   [junit4]    >    C:\Users\jenkins\workspace\Lucene-Solr-master-Windows\solr\build\solr-solrj\test\J1\temp\solr.client.solrj.impl.HttpSolrClientConPoolTest_EF3A06AE9D3DE6CB-001\tempDir-003\collection1\conf: java.nio.file.DirectoryNotEmptyException: C:\Users\jenkins\workspace\Lucene-Solr-master-Windows\solr\build\solr-solrj\test\J1\temp\solr.client.solrj.impl.HttpSolrClientConPoolTest_EF3A06AE9D3DE6CB-001\tempDir-003\collection1\conf
   [junit4]    >    C:\Users\jenkins\workspace\Lucene-Solr-master-Windows\solr\build\solr-solrj\test\J1\temp\solr.client.solrj.impl.HttpSolrClientConPoolTest_EF3A06AE9D3DE6CB-001\tempDir-003\collection1: java.nio.file.DirectoryNotEmptyException: C:\Users\jenkins\workspace\Lucene-Solr-master-Windows\solr\build\solr-solrj\test\J1\temp\solr.client.solrj.impl.HttpSolrClientConPoolTest_EF3A06AE9D3DE6CB-001\tempDir-003\collection1
   [junit4]    >    C:\Users\jenkins\workspace\Lucene-Solr-master-Windows\solr\build\solr-solrj\test\J1\temp\solr.client.solrj.impl.HttpSolrClientConPoolTest_EF3A06AE9D3DE6CB-001\tempDir-003: java.nio.file.DirectoryNotEmptyException: C:\Users\jenkins\workspace\Lucene-Solr-master-Windows\solr\build\solr-solrj\test\J1\temp\solr.client.solrj.impl.HttpSolrClientConPoolTest_EF3A06AE9D3DE6CB-001\tempDir-003
   [junit4]    >    C:\Users\jenkins\workspace\Lucene-Solr-master-Windows\solr\build\solr-solrj\test\J1\temp\solr.client.solrj.impl.HttpSolrClientConPoolTest_EF3A06AE9D3DE6CB-001\tempDir-003\collection1\conf\clustering\carrot2: java.nio.file.NoSuchFileException: C:\Users\jenkins\workspace\Lucene-Solr-master-Windows\solr\build\solr-solrj\test\J1\temp\solr.client.solrj.impl.HttpSolrClientConPoolTest_EF3A06AE9D3DE6CB-001\tempDir-003\collection1\conf\clustering\carrot2
   [junit4]    > 	at __randomizedtesting.SeedInfo.seed([EF3A06AE9D3DE6CB]:0)
   [junit4]    > 	at org.apache.lucene.util.IOUtils.rm(IOUtils.java:329)
   [junit4]    > 	at java.base/java.lang.Thread.run(Thread.java:844)
   [junit4] Completed [27/146 (1!)] on J1 in 1.99s, 2 tests, 1 error <<< FAILURES!

[...truncated 1830 lines...]
   [junit4] Suite: org.apache.solr.update.processor.TestOpenNLPExtractNamedEntitiesUpdateProcessorFactory
   [junit4]   2> log4j:WARN No appenders could be found for logger (org.apache.solr.SolrTestCaseJ4).
   [junit4]   2> log4j:WARN Please initialize the log4j system properly.
   [junit4]   2> log4j:WARN See http://logging.apache.org/log4j/1.2/faq.html#noconfig for more info.
   [junit4]   2> Creating dataDir: C:\Users\jenkins\workspace\Lucene-Solr-master-Windows\solr\build\contrib\solr-analysis-extras\test\J1\temp\solr.update.processor.TestOpenNLPExtractNamedEntitiesUpdateProcessorFactory_B1244A25F0CDAD25-001\init-core-data-001
   [junit4]   2> NOTE: test params are: codec=Asserting(Lucene70): {}, docValues:{}, maxPointsInLeafNode=524, maxMBSortInHeap=5.498706101538739, sim=Asserting(org.apache.lucene.search.similarities.AssertingSimilarity@ea29050), locale=fr-LU, timezone=Africa/Maseru
   [junit4]   2> NOTE: Windows 10 10.0 amd64/Oracle Corporation 9.0.1 (64-bit)/cpus=3,threads=1,free=97317424,total=123731968
   [junit4]   2> NOTE: All tests run in this JVM: [TestOpenNLPExtractNamedEntitiesUpdateProcessorFactory]
   [junit4]   2> NOTE: reproduce with: ant test  -Dtestcase=TestOpenNLPExtractNamedEntitiesUpdateProcessorFactory -Dtests.seed=B1244A25F0CDAD25 -Dtests.slow=true -Dtests.locale=fr-LU -Dtests.timezone=Africa/Maseru -Dtests.asserts=true -Dtests.file.encoding=ISO-8859-1
   [junit4] ERROR   0.00s J1 | TestOpenNLPExtractNamedEntitiesUpdateProcessorFactory (suite) <<<
   [junit4]    > Throwable #1: java.io.IOException: Could not remove the following files (in the order of attempts):
   [junit4]    >    C:\Users\jenkins\workspace\Lucene-Solr-master-Windows\solr\build\contrib\solr-analysis-extras\test\J1\temp\solr.update.processor.TestOpenNLPExtractNamedEntitiesUpdateProcessorFactory_B1244A25F0CDAD25-001\tempDir-001\collection1\conf: java.nio.file.DirectoryNotEmptyException: C:\Users\jenkins\workspace\Lucene-Solr-master-Windows\solr\build\contrib\solr-analysis-extras\test\J1\temp\solr.update.processor.TestOpenNLPExtractNamedEntitiesUpdateProcessorFactory_B1244A25F0CDAD25-001\tempDir-001\collection1\conf
   [junit4]    >    C:\Users\jenkins\workspace\Lucene-Solr-master-Windows\solr\build\contrib\solr-analysis-extras\test\J1\temp\solr.update.processor.TestOpenNLPExtractNamedEntitiesUpdateProcessorFactory_B1244A25F0CDAD25-001\tempDir-001\collection1: java.nio.file.DirectoryNotEmptyException: C:\Users\jenkins\workspace\Lucene-Solr-master-Windows\solr\build\contrib\solr-analysis-extras\test\J1\temp\solr.update.processor.TestOpenNLPExtractNamedEntitiesUpdateProcessorFactory_B1244A25F0CDAD25-001\tempDir-001\collection1
   [junit4]    >    C:\Users\jenkins\workspace\Lucene-Solr-master-Windows\solr\build\contrib\solr-analysis-extras\test\J1\temp\solr.update.processor.TestOpenNLPExtractNamedEntitiesUpdateProcessorFactory_B1244A25F0CDAD25-001\tempDir-001: java.nio.file.DirectoryNotEmptyException: C:\Users\jenkins\workspace\Lucene-Solr-master-Windows\solr\build\contrib\solr-analysis-extras\test\J1\temp\solr.update.processor.TestOpenNLPExtractNamedEntitiesUpdateProcessorFactory_B1244A25F0CDAD25-001\tempDir-001
   [junit4]    >    C:\Users\jenkins\workspace\Lucene-Solr-master-Windows\solr\build\contrib\solr-analysis-extras\test\J1\temp\solr.update.processor.TestOpenNLPExtractNamedEntitiesUpdateProcessorFactory_B1244A25F0CDAD25-001\tempDir-001\collection1\conf\en-test-tokenizer.bin: java.nio.file.AccessDeniedException: C:\Users\jenkins\workspace\Lucene-Solr-master-Windows\solr\build\contrib\solr-analysis-extras\test\J1\temp\solr.update.processor.TestOpenNLPExtractNamedEntitiesUpdateProcessorFactory_B1244A25F0CDAD25-001\tempDir-001\collection1\conf\en-test-tokenizer.bin
   [junit4]    >    C:\Users\jenkins\workspace\Lucene-Solr-master-Windows\solr\build\contrib\solr-analysis-extras\test\J1\temp\solr.update.processor.TestOpenNLPExtractNamedEntitiesUpdateProcessorFactory_B1244A25F0CDAD25-001\tempDir-001\collection1\conf\en-test-ner-person.bin: java.nio.file.AccessDeniedException: C:\Users\jenkins\workspace\Lucene-Solr-master-Windows\solr\build\contrib\solr-analysis-extras\test\J1\temp\solr.update.processor.TestOpenNLPExtractNamedEntitiesUpdateProcessorFactory_B1244A25F0CDAD25-001\tempDir-001\collection1\conf\en-test-ner-person.bin
   [junit4]    >    C:\Users\jenkins\workspace\Lucene-Solr-master-Windows\solr\build\contrib\solr-analysis-extras\test\J1\temp\solr.update.processor.TestOpenNLPExtractNamedEntitiesUpdateProcessorFactory_B1244A25F0CDAD25-001\tempDir-001\collection1\conf\en-test-sent.bin: java.nio.file.AccessDeniedException: C:\Users\jenkins\workspace\Lucene-Solr-master-Windows\solr\build\contrib\solr-analysis-extras\test\J1\temp\solr.update.processor.TestOpenNLPExtractNamedEntitiesUpdateProcessorFactory_B1244A25F0CDAD25-001\tempDir-001\collection1\conf\en-test-sent.bin
   [junit4]    >    C:\Users\jenkins\workspace\Lucene-Solr-master-Windows\solr\build\contrib\solr-analysis-extras\test\J1\temp\solr.update.processor.TestOpenNLPExtractNamedEntitiesUpdateProcessorFactory_B1244A25F0CDAD25-001: java.nio.file.DirectoryNotEmptyException: C:\Users\jenkins\workspace\Lucene-Solr-master-Windows\solr\build\contrib\solr-analysis-extras\test\J1\temp\solr.update.processor.TestOpenNLPExtractNamedEntitiesUpdateProcessorFactory_B1244A25F0CDAD25-001
   [junit4]    > 	at __randomizedtesting.SeedInfo.seed([B1244A25F0CDAD25]:0)
   [junit4]    > 	at org.apache.lucene.util.IOUtils.rm(IOUtils.java:329)
   [junit4]    > 	at java.base/java.lang.Thread.run(Thread.java:844)
   [junit4] Completed [1/5 (1!)] on J1 in 12.01s, 8 tests, 1 error <<< FAILURES!

[...truncated 38491 lines...]

Mime
View raw message