lucene-dev mailing list archives

Site index · List index
Message view « Date » · « Thread »
Top « Date » · « Thread »
From Apache Jenkins Server <jenk...@builds.apache.org>
Subject [JENKINS] Lucene-Solr-Tests-master - Build # 2358 - Still Failing
Date Thu, 22 Feb 2018 14:06:16 GMT
Build: https://builds.apache.org/job/Lucene-Solr-Tests-master/2358/

1 tests failed.
FAILED:  org.apache.solr.cloud.autoscaling.TriggerIntegrationTest.testScheduledTrigger

Error Message:
expected:<2> but was:<1>

Stack Trace:
java.lang.AssertionError: expected:<2> but was:<1>
	at __randomizedtesting.SeedInfo.seed([E8165FBDA1B87F0A:7B0D17CFFF45243E]:0)
	at org.junit.Assert.fail(Assert.java:93)
	at org.junit.Assert.failNotEquals(Assert.java:647)
	at org.junit.Assert.assertEquals(Assert.java:128)
	at org.junit.Assert.assertEquals(Assert.java:472)
	at org.junit.Assert.assertEquals(Assert.java:456)
	at org.apache.solr.cloud.autoscaling.TriggerIntegrationTest.testScheduledTrigger(TriggerIntegrationTest.java:1679)
	at sun.reflect.NativeMethodAccessorImpl.invoke0(Native Method)
	at sun.reflect.NativeMethodAccessorImpl.invoke(NativeMethodAccessorImpl.java:62)
	at sun.reflect.DelegatingMethodAccessorImpl.invoke(DelegatingMethodAccessorImpl.java:43)
	at java.lang.reflect.Method.invoke(Method.java:498)
	at com.carrotsearch.randomizedtesting.RandomizedRunner.invoke(RandomizedRunner.java:1737)
	at com.carrotsearch.randomizedtesting.RandomizedRunner$8.evaluate(RandomizedRunner.java:934)
	at com.carrotsearch.randomizedtesting.RandomizedRunner$9.evaluate(RandomizedRunner.java:970)
	at com.carrotsearch.randomizedtesting.RandomizedRunner$10.evaluate(RandomizedRunner.java:984)
	at com.carrotsearch.randomizedtesting.rules.SystemPropertiesRestoreRule$1.evaluate(SystemPropertiesRestoreRule.java:57)
	at org.apache.lucene.util.TestRuleSetupTeardownChained$1.evaluate(TestRuleSetupTeardownChained.java:49)
	at org.apache.lucene.util.AbstractBeforeAfterRule$1.evaluate(AbstractBeforeAfterRule.java:45)
	at org.apache.lucene.util.TestRuleThreadAndTestName$1.evaluate(TestRuleThreadAndTestName.java:48)
	at org.apache.lucene.util.TestRuleIgnoreAfterMaxFailures$1.evaluate(TestRuleIgnoreAfterMaxFailures.java:64)
	at org.apache.lucene.util.TestRuleMarkFailure$1.evaluate(TestRuleMarkFailure.java:47)
	at com.carrotsearch.randomizedtesting.rules.StatementAdapter.evaluate(StatementAdapter.java:36)
	at com.carrotsearch.randomizedtesting.ThreadLeakControl$StatementRunner.run(ThreadLeakControl.java:368)
	at com.carrotsearch.randomizedtesting.ThreadLeakControl.forkTimeoutingTask(ThreadLeakControl.java:817)
	at com.carrotsearch.randomizedtesting.ThreadLeakControl$3.evaluate(ThreadLeakControl.java:468)
	at com.carrotsearch.randomizedtesting.RandomizedRunner.runSingleTest(RandomizedRunner.java:943)
	at com.carrotsearch.randomizedtesting.RandomizedRunner$5.evaluate(RandomizedRunner.java:829)
	at com.carrotsearch.randomizedtesting.RandomizedRunner$6.evaluate(RandomizedRunner.java:879)
	at com.carrotsearch.randomizedtesting.RandomizedRunner$7.evaluate(RandomizedRunner.java:890)
	at com.carrotsearch.randomizedtesting.rules.StatementAdapter.evaluate(StatementAdapter.java:36)
	at com.carrotsearch.randomizedtesting.rules.SystemPropertiesRestoreRule$1.evaluate(SystemPropertiesRestoreRule.java:57)
	at org.apache.lucene.util.AbstractBeforeAfterRule$1.evaluate(AbstractBeforeAfterRule.java:45)
	at com.carrotsearch.randomizedtesting.rules.StatementAdapter.evaluate(StatementAdapter.java:36)
	at org.apache.lucene.util.TestRuleStoreClassName$1.evaluate(TestRuleStoreClassName.java:41)
	at com.carrotsearch.randomizedtesting.rules.NoShadowingOrOverridesOnMethodsRule$1.evaluate(NoShadowingOrOverridesOnMethodsRule.java:40)
	at com.carrotsearch.randomizedtesting.rules.NoShadowingOrOverridesOnMethodsRule$1.evaluate(NoShadowingOrOverridesOnMethodsRule.java:40)
	at com.carrotsearch.randomizedtesting.rules.StatementAdapter.evaluate(StatementAdapter.java:36)
	at com.carrotsearch.randomizedtesting.rules.StatementAdapter.evaluate(StatementAdapter.java:36)
	at com.carrotsearch.randomizedtesting.rules.StatementAdapter.evaluate(StatementAdapter.java:36)
	at org.apache.lucene.util.TestRuleAssertionsRequired$1.evaluate(TestRuleAssertionsRequired.java:53)
	at org.apache.lucene.util.TestRuleMarkFailure$1.evaluate(TestRuleMarkFailure.java:47)
	at org.apache.lucene.util.TestRuleIgnoreAfterMaxFailures$1.evaluate(TestRuleIgnoreAfterMaxFailures.java:64)
	at org.apache.lucene.util.TestRuleIgnoreTestSuites$1.evaluate(TestRuleIgnoreTestSuites.java:54)
	at com.carrotsearch.randomizedtesting.rules.StatementAdapter.evaluate(StatementAdapter.java:36)
	at com.carrotsearch.randomizedtesting.ThreadLeakControl$StatementRunner.run(ThreadLeakControl.java:368)
	at java.lang.Thread.run(Thread.java:748)




Build Log:
[...truncated 14256 lines...]
   [junit4] Suite: org.apache.solr.cloud.autoscaling.TriggerIntegrationTest
   [junit4]   2> 2367037 INFO  (SUITE-TriggerIntegrationTest-seed#[E8165FBDA1B87F0A]-worker) [    ] o.a.s.SolrTestCaseJ4 SecureRandom sanity checks: test.solr.allowed.securerandom=null & java.security.egd=file:/dev/./urandom
   [junit4]   2> Creating dataDir: /x1/jenkins/jenkins-slave/workspace/Lucene-Solr-Tests-master/solr/build/solr-core/test/J0/temp/solr.cloud.autoscaling.TriggerIntegrationTest_E8165FBDA1B87F0A-001/init-core-data-001
   [junit4]   2> 2367038 WARN  (SUITE-TriggerIntegrationTest-seed#[E8165FBDA1B87F0A]-worker) [    ] o.a.s.SolrTestCaseJ4 startTrackingSearchers: numOpens=25 numCloses=25
   [junit4]   2> 2367038 INFO  (SUITE-TriggerIntegrationTest-seed#[E8165FBDA1B87F0A]-worker) [    ] o.a.s.SolrTestCaseJ4 Using PointFields (NUMERIC_POINTS_SYSPROP=true) w/NUMERIC_DOCVALUES_SYSPROP=false
   [junit4]   2> 2367039 INFO  (SUITE-TriggerIntegrationTest-seed#[E8165FBDA1B87F0A]-worker) [    ] o.a.s.SolrTestCaseJ4 Randomized ssl (false) and clientAuth (false) via: @org.apache.solr.util.RandomizeSSL(reason=, ssl=NaN, value=NaN, clientAuth=NaN)
   [junit4]   2> 2367040 INFO  (SUITE-TriggerIntegrationTest-seed#[E8165FBDA1B87F0A]-worker) [    ] o.a.s.c.MiniSolrCloudCluster Starting cluster of 2 servers in /x1/jenkins/jenkins-slave/workspace/Lucene-Solr-Tests-master/solr/build/solr-core/test/J0/temp/solr.cloud.autoscaling.TriggerIntegrationTest_E8165FBDA1B87F0A-001/tempDir-001
   [junit4]   2> 2367040 INFO  (SUITE-TriggerIntegrationTest-seed#[E8165FBDA1B87F0A]-worker) [    ] o.a.s.c.ZkTestServer STARTING ZK TEST SERVER
   [junit4]   2> 2367040 INFO  (Thread-3337) [    ] o.a.s.c.ZkTestServer client port:0.0.0.0/0.0.0.0:0
   [junit4]   2> 2367040 INFO  (Thread-3337) [    ] o.a.s.c.ZkTestServer Starting server
   [junit4]   2> 2367046 ERROR (Thread-3337) [    ] o.a.z.s.ZooKeeperServer ZKShutdownHandler is not registered, so ZooKeeper server won't take any action on ERROR or SHUTDOWN server state changes
   [junit4]   2> 2367140 INFO  (SUITE-TriggerIntegrationTest-seed#[E8165FBDA1B87F0A]-worker) [    ] o.a.s.c.ZkTestServer start zk server on port:46604
   [junit4]   2> 2367149 INFO  (zkConnectionManagerCallback-6137-thread-1) [    ] o.a.s.c.c.ConnectionManager zkClient has connected
   [junit4]   2> 2367159 INFO  (jetty-launcher-6134-thread-2) [    ] o.e.j.s.Server jetty-9.4.8.v20171121, build timestamp: 2017-11-21T13:27:37-08:00, git hash: 82b8fb23f757335bb3329d540ce37a2a2615f0a8
   [junit4]   2> 2367159 INFO  (jetty-launcher-6134-thread-1) [    ] o.e.j.s.Server jetty-9.4.8.v20171121, build timestamp: 2017-11-21T13:27:37-08:00, git hash: 82b8fb23f757335bb3329d540ce37a2a2615f0a8
   [junit4]   2> 2367161 INFO  (jetty-launcher-6134-thread-1) [    ] o.e.j.s.session DefaultSessionIdManager workerName=node0
   [junit4]   2> 2367161 INFO  (jetty-launcher-6134-thread-1) [    ] o.e.j.s.session No SessionScavenger set, using defaults
   [junit4]   2> 2367161 INFO  (jetty-launcher-6134-thread-2) [    ] o.e.j.s.session DefaultSessionIdManager workerName=node0
   [junit4]   2> 2367161 INFO  (jetty-launcher-6134-thread-1) [    ] o.e.j.s.session Scavenging every 600000ms
   [junit4]   2> 2367161 INFO  (jetty-launcher-6134-thread-2) [    ] o.e.j.s.session No SessionScavenger set, using defaults
   [junit4]   2> 2367161 INFO  (jetty-launcher-6134-thread-2) [    ] o.e.j.s.session Scavenging every 600000ms
   [junit4]   2> 2367161 INFO  (jetty-launcher-6134-thread-1) [    ] o.e.j.s.h.ContextHandler Started o.e.j.s.ServletContextHandler@21dc8120{/solr,null,AVAILABLE}
   [junit4]   2> 2367161 INFO  (jetty-launcher-6134-thread-2) [    ] o.e.j.s.h.ContextHandler Started o.e.j.s.ServletContextHandler@431acaeb{/solr,null,AVAILABLE}
   [junit4]   2> 2367161 INFO  (jetty-launcher-6134-thread-1) [    ] o.e.j.s.AbstractConnector Started ServerConnector@49e1603a{HTTP/1.1,[http/1.1]}{127.0.0.1:33725}
   [junit4]   2> 2367162 INFO  (jetty-launcher-6134-thread-1) [    ] o.e.j.s.Server Started @2369500ms
   [junit4]   2> 2367162 INFO  (jetty-launcher-6134-thread-1) [    ] o.a.s.c.s.e.JettySolrRunner Jetty properties: {hostContext=/solr, hostPort=33725}
   [junit4]   2> 2367162 INFO  (jetty-launcher-6134-thread-2) [    ] o.e.j.s.AbstractConnector Started ServerConnector@25dcdded{HTTP/1.1,[http/1.1]}{127.0.0.1:57572}
   [junit4]   2> 2367162 ERROR (jetty-launcher-6134-thread-1) [    ] o.a.s.u.StartupLoggingUtils Missing Java Option solr.log.dir. Logging may be missing or incomplete.
   [junit4]   2> 2367162 INFO  (jetty-launcher-6134-thread-2) [    ] o.e.j.s.Server Started @2369501ms
   [junit4]   2> 2367162 INFO  (jetty-launcher-6134-thread-1) [    ] o.a.s.s.SolrDispatchFilter  ___      _       Welcome to Apache Solr™ version 8.0.0
   [junit4]   2> 2367162 INFO  (jetty-launcher-6134-thread-2) [    ] o.a.s.c.s.e.JettySolrRunner Jetty properties: {hostContext=/solr, hostPort=57572}
   [junit4]   2> 2367162 INFO  (jetty-launcher-6134-thread-1) [    ] o.a.s.s.SolrDispatchFilter / __| ___| |_ _   Starting in cloud mode on port null
   [junit4]   2> 2367162 INFO  (jetty-launcher-6134-thread-1) [    ] o.a.s.s.SolrDispatchFilter \__ \/ _ \ | '_|  Install dir: null
   [junit4]   2> 2367162 INFO  (jetty-launcher-6134-thread-1) [    ] o.a.s.s.SolrDispatchFilter |___/\___/_|_|    Start time: 2018-02-22T13:48:20.200Z
   [junit4]   2> 2367163 ERROR (jetty-launcher-6134-thread-2) [    ] o.a.s.u.StartupLoggingUtils Missing Java Option solr.log.dir. Logging may be missing or incomplete.
   [junit4]   2> 2367163 INFO  (jetty-launcher-6134-thread-2) [    ] o.a.s.s.SolrDispatchFilter  ___      _       Welcome to Apache Solr™ version 8.0.0
   [junit4]   2> 2367163 INFO  (jetty-launcher-6134-thread-2) [    ] o.a.s.s.SolrDispatchFilter / __| ___| |_ _   Starting in cloud mode on port null
   [junit4]   2> 2367163 INFO  (jetty-launcher-6134-thread-2) [    ] o.a.s.s.SolrDispatchFilter \__ \/ _ \ | '_|  Install dir: null
   [junit4]   2> 2367163 INFO  (jetty-launcher-6134-thread-2) [    ] o.a.s.s.SolrDispatchFilter |___/\___/_|_|    Start time: 2018-02-22T13:48:20.201Z
   [junit4]   2> 2367165 INFO  (zkConnectionManagerCallback-6139-thread-1) [    ] o.a.s.c.c.ConnectionManager zkClient has connected
   [junit4]   2> 2367165 INFO  (zkConnectionManagerCallback-6141-thread-1) [    ] o.a.s.c.c.ConnectionManager zkClient has connected
   [junit4]   2> 2367165 INFO  (jetty-launcher-6134-thread-1) [    ] o.a.s.s.SolrDispatchFilter solr.xml found in ZooKeeper. Loading...
   [junit4]   2> 2367167 INFO  (jetty-launcher-6134-thread-2) [    ] o.a.s.s.SolrDispatchFilter solr.xml found in ZooKeeper. Loading...
   [junit4]   2> 2367179 INFO  (jetty-launcher-6134-thread-2) [    ] o.a.s.c.ZkContainer Zookeeper client=127.0.0.1:46604/solr
   [junit4]   2> 2367179 INFO  (jetty-launcher-6134-thread-1) [    ] o.a.s.c.ZkContainer Zookeeper client=127.0.0.1:46604/solr
   [junit4]   2> 2367183 INFO  (zkConnectionManagerCallback-6147-thread-1) [    ] o.a.s.c.c.ConnectionManager zkClient has connected
   [junit4]   2> 2367183 INFO  (zkConnectionManagerCallback-6149-thread-1) [    ] o.a.s.c.c.ConnectionManager zkClient has connected
   [junit4]   2> 2367189 INFO  (zkConnectionManagerCallback-6151-thread-1-processing-n:127.0.0.1:33725_solr) [n:127.0.0.1:33725_solr    ] o.a.s.c.c.ConnectionManager zkClient has connected
   [junit4]   2> 2367189 INFO  (zkConnectionManagerCallback-6153-thread-1-processing-n:127.0.0.1:57572_solr) [n:127.0.0.1:57572_solr    ] o.a.s.c.c.ConnectionManager zkClient has connected
   [junit4]   2> 2367273 INFO  (jetty-launcher-6134-thread-2) [n:127.0.0.1:57572_solr    ] o.a.s.c.Overseer Overseer (id=null) closing
   [junit4]   2> 2367273 INFO  (jetty-launcher-6134-thread-2) [n:127.0.0.1:57572_solr    ] o.a.s.c.OverseerElectionContext I am going to be the leader 127.0.0.1:57572_solr
   [junit4]   2> 2367274 INFO  (jetty-launcher-6134-thread-2) [n:127.0.0.1:57572_solr    ] o.a.s.c.Overseer Overseer (id=73339426247540742-127.0.0.1:57572_solr-n_0000000000) starting
   [junit4]   2> 2367281 INFO  (jetty-launcher-6134-thread-1) [n:127.0.0.1:33725_solr    ] o.a.s.c.Overseer Overseer (id=null) closing
   [junit4]   2> 2367282 INFO  (jetty-launcher-6134-thread-2) [n:127.0.0.1:57572_solr    ] o.a.s.c.ZkController Register node as live in ZooKeeper:/live_nodes/127.0.0.1:57572_solr
   [junit4]   2> 2367282 DEBUG (OverseerAutoScalingTriggerThread-73339426247540742-127.0.0.1:57572_solr-n_0000000000) [n:127.0.0.1:57572_solr    ] o.a.s.c.a.OverseerTriggerThread Adding .autoAddReplicas trigger
   [junit4]   2> 2367286 INFO  (zkCallback-6152-thread-1-processing-n:127.0.0.1:57572_solr) [n:127.0.0.1:57572_solr    ] o.a.s.c.c.ZkStateReader Updated live nodes from ZooKeeper... (0) -> (1)
   [junit4]   2> 2367286 INFO  (zkCallback-6150-thread-1-processing-n:127.0.0.1:33725_solr) [n:127.0.0.1:33725_solr    ] o.a.s.c.c.ZkStateReader Updated live nodes from ZooKeeper... (0) -> (1)
   [junit4]   2> 2367288 INFO  (jetty-launcher-6134-thread-1) [n:127.0.0.1:33725_solr    ] o.a.s.c.ZkController Register node as live in ZooKeeper:/live_nodes/127.0.0.1:33725_solr
   [junit4]   2> 2367288 DEBUG (OverseerAutoScalingTriggerThread-73339426247540742-127.0.0.1:57572_solr-n_0000000000) [n:127.0.0.1:57572_solr    ] o.a.s.c.a.OverseerTriggerThread Refreshing /autoscaling.json with znode version 1
   [junit4]   2> 2367289 INFO  (zkCallback-6152-thread-1-processing-n:127.0.0.1:57572_solr) [n:127.0.0.1:57572_solr    ] o.a.s.c.c.ZkStateReader Updated live nodes from ZooKeeper... (1) -> (2)
   [junit4]   2> 2367289 INFO  (zkCallback-6150-thread-1-processing-n:127.0.0.1:33725_solr) [n:127.0.0.1:33725_solr    ] o.a.s.c.c.ZkStateReader Updated live nodes from ZooKeeper... (1) -> (2)
   [junit4]   2> 2367294 DEBUG (OverseerAutoScalingTriggerThread-73339426247540742-127.0.0.1:57572_solr-n_0000000000) [n:127.0.0.1:57572_solr    ] o.a.s.c.a.NodeLostTrigger Initial livenodes: [127.0.0.1:33725_solr, 127.0.0.1:57572_solr]
   [junit4]   2> 2367294 DEBUG (OverseerAutoScalingTriggerThread-73339426247540742-127.0.0.1:57572_solr-n_0000000000) [n:127.0.0.1:57572_solr    ] o.a.s.c.a.OverseerTriggerThread Current znodeVersion 1, lastZnodeVersion -1
   [junit4]   2> 2367294 DEBUG (OverseerAutoScalingTriggerThread-73339426247540742-127.0.0.1:57572_solr-n_0000000000) [n:127.0.0.1:57572_solr    ] o.a.s.c.a.OverseerTriggerThread Processed trigger updates upto znodeVersion 1
   [junit4]   2> 2367296 DEBUG (OverseerAutoScalingTriggerThread-73339426247540742-127.0.0.1:57572_solr-n_0000000000) [n:127.0.0.1:57572_solr    ] o.a.s.c.a.OverseerTriggerThread -- clean old nodeAdded markers
   [junit4]   2> 2367296 DEBUG (OverseerAutoScalingTriggerThread-73339426247540742-127.0.0.1:57572_solr-n_0000000000) [n:127.0.0.1:57572_solr    ] o.a.s.c.a.OverseerTriggerThread Current znodeVersion 1, lastZnodeVersion 1
   [junit4]   2> 2367296 DEBUG (ScheduledTrigger-6305-thread-1) [n:127.0.0.1:57572_solr    ] o.a.s.c.a.NodeLostTrigger Running NodeLostTrigger: .auto_add_replicas with currently live nodes: 2
   [junit4]   2> 2367376 INFO  (jetty-launcher-6134-thread-1) [n:127.0.0.1:33725_solr    ] o.a.s.m.r.SolrJmxReporter JMX monitoring for 'solr_33725.solr.node' (registry 'solr.node') enabled at server: com.sun.jmx.mbeanserver.JmxMBeanServer@7b3284b7
   [junit4]   2> 2367405 INFO  (jetty-launcher-6134-thread-2) [n:127.0.0.1:57572_solr    ] o.a.s.m.r.SolrJmxReporter JMX monitoring for 'solr_57572.solr.node' (registry 'solr.node') enabled at server: com.sun.jmx.mbeanserver.JmxMBeanServer@7b3284b7
   [junit4]   2> 2367409 INFO  (jetty-launcher-6134-thread-1) [n:127.0.0.1:33725_solr    ] o.a.s.m.r.SolrJmxReporter JMX monitoring for 'solr_33725.solr.jvm' (registry 'solr.jvm') enabled at server: com.sun.jmx.mbeanserver.JmxMBeanServer@7b3284b7
   [junit4]   2> 2367409 INFO  (jetty-launcher-6134-thread-1) [n:127.0.0.1:33725_solr    ] o.a.s.m.r.SolrJmxReporter JMX monitoring for 'solr_33725.solr.jetty' (registry 'solr.jetty') enabled at server: com.sun.jmx.mbeanserver.JmxMBeanServer@7b3284b7
   [junit4]   2> 2367410 INFO  (jetty-launcher-6134-thread-1) [n:127.0.0.1:33725_solr    ] o.a.s.c.CorePropertiesLocator Found 0 core definitions underneath /x1/jenkins/jenkins-slave/workspace/Lucene-Solr-Tests-master/solr/build/solr-core/test/J0/temp/solr.cloud.autoscaling.TriggerIntegrationTest_E8165FBDA1B87F0A-001/tempDir-001/node1/.
   [junit4]   2> 2367414 INFO  (jetty-launcher-6134-thread-2) [n:127.0.0.1:57572_solr    ] o.a.s.m.r.SolrJmxReporter JMX monitoring for 'solr_57572.solr.jvm' (registry 'solr.jvm') enabled at server: com.sun.jmx.mbeanserver.JmxMBeanServer@7b3284b7
   [junit4]   2> 2367414 INFO  (jetty-launcher-6134-thread-2) [n:127.0.0.1:57572_solr    ] o.a.s.m.r.SolrJmxReporter JMX monitoring for 'solr_57572.solr.jetty' (registry 'solr.jetty') enabled at server: com.sun.jmx.mbeanserver.JmxMBeanServer@7b3284b7
   [junit4]   2> 2367415 INFO  (jetty-launcher-6134-thread-2) [n:127.0.0.1:57572_solr    ] o.a.s.c.CorePropertiesLocator Found 0 core definitions underneath /x1/jenkins/jenkins-slave/workspace/Lucene-Solr-Tests-master/solr/build/solr-core/test/J0/temp/solr.cloud.autoscaling.TriggerIntegrationTest_E8165FBDA1B87F0A-001/tempDir-001/node2/.
   [junit4]   2> 2367456 INFO  (zkConnectionManagerCallback-6159-thread-1) [    ] o.a.s.c.c.ConnectionManager zkClient has connected
   [junit4]   2> 2367462 INFO  (zkConnectionManagerCallback-6163-thread-1) [    ] o.a.s.c.c.ConnectionManager zkClient has connected
   [junit4]   2> 2367463 INFO  (SUITE-TriggerIntegrationTest-seed#[E8165FBDA1B87F0A]-worker) [    ] o.a.s.c.c.ZkStateReader Updated live nodes from ZooKeeper... (0) -> (2)
   [junit4]   2> 2367464 INFO  (SUITE-TriggerIntegrationTest-seed#[E8165FBDA1B87F0A]-worker) [    ] o.a.s.c.s.i.ZkClientClusterStateProvider Cluster at 127.0.0.1:46604/solr ready
   [junit4]   2> 2367545 INFO  (TEST-TriggerIntegrationTest.testNodeAddedTriggerRestoreState-seed#[E8165FBDA1B87F0A]) [    ] o.a.s.SolrTestCaseJ4 ###Starting testNodeAddedTriggerRestoreState
   [junit4]   2> 2367546 INFO  (qtp1984073611-25289) [n:127.0.0.1:33725_solr    ] o.a.s.h.a.CollectionsHandler Invoked Collection Action :overseerstatus with params action=OVERSEERSTATUS&wt=javabin&version=2 and sendToOCPQueue=true
   [junit4]   2> 2367554 INFO  (qtp1984073611-25289) [n:127.0.0.1:33725_solr    ] o.a.s.s.HttpSolrCall [admin] webapp=null path=/admin/collections params={action=OVERSEERSTATUS&wt=javabin&version=2} status=0 QTime=7
   [junit4]   2> 2367558 INFO  (TEST-TriggerIntegrationTest.testNodeAddedTriggerRestoreState-seed#[E8165FBDA1B87F0A]) [    ] o.a.s.c.a.ScheduledTriggers -- removing trigger: .auto_add_replicas
   [junit4]   2> 2367562 INFO  (TEST-TriggerIntegrationTest.testNodeAddedTriggerRestoreState-seed#[E8165FBDA1B87F0A]) [    ] o.a.s.c.a.TriggerIntegrationTest /autoscaling.json reset, new znode version 2
   [junit4]   2> 2367562 DEBUG (zkCallback-6152-thread-1-processing-n:127.0.0.1:57572_solr) [n:127.0.0.1:57572_solr    ] o.a.s.c.a.OverseerTriggerThread Refreshing /autoscaling.json with znode version 2
   [junit4]   2> 2367562 DEBUG (OverseerAutoScalingTriggerThread-73339426247540742-127.0.0.1:57572_solr-n_0000000000) [n:127.0.0.1:57572_solr    ] o.a.s.c.a.OverseerTriggerThread Processed trigger updates upto znodeVersion 2
   [junit4]   2> 2367562 DEBUG (OverseerAutoScalingTriggerThread-73339426247540742-127.0.0.1:57572_solr-n_0000000000) [n:127.0.0.1:57572_solr    ] o.a.s.c.a.OverseerTriggerThread -- clean old nodeLost markers
   [junit4]   2> 2367562 DEBUG (OverseerAutoScalingTriggerThread-73339426247540742-127.0.0.1:57572_solr-n_0000000000) [n:127.0.0.1:57572_solr    ] o.a.s.c.a.OverseerTriggerThread -- clean old nodeAdded markers
   [junit4]   2> 2367563 DEBUG (OverseerAutoScalingTriggerThread-73339426247540742-127.0.0.1:57572_solr-n_0000000000) [n:127.0.0.1:57572_solr    ] o.a.s.c.a.OverseerTriggerThread Current znodeVersion 2, lastZnodeVersion 2
   [junit4]   2> 2367563 INFO  (TEST-TriggerIntegrationTest.testNodeAddedTriggerRestoreState-seed#[E8165FBDA1B87F0A]) [    ] o.a.s.c.c.ZkStateReader Updated live nodes from ZooKeeper... (0) -> (2)
   [junit4]   2> 2367564 INFO  (TEST-TriggerIntegrationTest.testNodeAddedTriggerRestoreState-seed#[E8165FBDA1B87F0A]) [    ] o.e.j.s.AbstractConnector Stopped ServerConnector@25dcdded{HTTP/1.1,[http/1.1]}{127.0.0.1:0}
   [junit4]   2> 2367567 INFO  (TEST-TriggerIntegrationTest.testNodeAddedTriggerRestoreState-seed#[E8165FBDA1B87F0A]) [    ] o.a.s.c.CoreContainer Shutting down CoreContainer instance=514267840
   [junit4]   2> 2367567 INFO  (TEST-TriggerIntegrationTest.testNodeAddedTriggerRestoreState-seed#[E8165FBDA1B87F0A]) [    ] o.a.s.m.SolrMetricManager Closing metric reporters for registry=solr.node, tag=null
   [junit4]   2> 2367567 INFO  (TEST-TriggerIntegrationTest.testNodeAddedTriggerRestoreState-seed#[E8165FBDA1B87F0A]) [    ] o.a.s.m.r.SolrJmxReporter Closing reporter [org.apache.solr.metrics.reporters.SolrJmxReporter@59354d7d: rootName = solr_57572, domain = solr.node, service url = null, agent id = null] for registry solr.node / com.codahale.metrics.MetricRegistry@31337274
   [junit4]   2> 2367575 INFO  (TEST-TriggerIntegrationTest.testNodeAddedTriggerRestoreState-seed#[E8165FBDA1B87F0A]) [    ] o.a.s.m.SolrMetricManager Closing metric reporters for registry=solr.jvm, tag=null
   [junit4]   2> 2367575 INFO  (TEST-TriggerIntegrationTest.testNodeAddedTriggerRestoreState-seed#[E8165FBDA1B87F0A]) [    ] o.a.s.m.r.SolrJmxReporter Closing reporter [org.apache.solr.metrics.reporters.SolrJmxReporter@275a6279: rootName = solr_57572, domain = solr.jvm, service url = null, agent id = null] for registry solr.jvm / com.codahale.metrics.MetricRegistry@5121bc1f
   [junit4]   2> 2367580 INFO  (TEST-TriggerIntegrationTest.testNodeAddedTriggerRestoreState-seed#[E8165FBDA1B87F0A]) [    ] o.a.s.m.SolrMetricManager Closing metric reporters for registry=solr.jetty, tag=null
   [junit4]   2> 2367580 INFO  (TEST-TriggerIntegrationTest.testNodeAddedTriggerRestoreState-seed#[E8165FBDA1B87F0A]) [    ] o.a.s.m.r.SolrJmxReporter Closing reporter [org.apache.solr.metrics.reporters.SolrJmxReporter@772bd76b: rootName = solr_57572, domain = solr.jetty, service url = null, agent id = null] for registry solr.jetty / com.codahale.metrics.MetricRegistry@581757e9
   [junit4]   2> 2367583 INFO  (TEST-TriggerIntegrationTest.testNodeAddedTriggerRestoreState-seed#[E8165FBDA1B87F0A]) [    ] o.a.s.c.ZkController Remove node as live in ZooKeeper:/live_nodes/127.0.0.1:57572_solr
   [junit4]   2> 2367584 INFO  (zkCallback-6150-thread-1-processing-n:127.0.0.1:33725_solr) [n:127.0.0.1:33725_solr    ] o.a.s.c.c.ZkStateReader Updated live nodes from ZooKeeper... (2) -> (1)
   [junit4]   2> 2367584 INFO  (zkCallback-6152-thread-1-processing-n:127.0.0.1:57572_solr) [n:127.0.0.1:57572_solr    ] o.a.s.c.c.ZkStateReader Updated live nodes from ZooKeeper... (2) -> (1)
   [junit4]   2> 2367585 INFO  (TEST-TriggerIntegrationTest.testNodeAddedTriggerRestoreState-seed#[E8165FBDA1B87F0A]) [    ] o.a.s.m.SolrMetricManager Closing metric reporters for registry=solr.cluster, tag=null
   [junit4]   2> 2367585 INFO  (TEST-TriggerIntegrationTest.testNodeAddedTriggerRestoreState-seed#[E8165FBDA1B87F0A]) [    ] o.a.s.c.TransientSolrCoreCacheDefault Allocating transient cache for 2147483647 transient cores
   [junit4]   2> 2367585 INFO  (TEST-TriggerIntegrationTest.testNodeAddedTriggerRestoreState-seed#[E8165FBDA1B87F0A]) [    ] o.a.s.c.Overseer Overseer (id=73339426247540742-127.0.0.1:57572_solr-n_0000000000) closing
   [junit4]   2> 2367585 INFO  (OverseerStateUpdate-73339426247540742-127.0.0.1:57572_solr-n_0000000000) [n:127.0.0.1:57572_solr    ] o.a.s.c.Overseer Overseer Loop exiting : 127.0.0.1:57572_solr
   [junit4]   2> 2367592 DEBUG (TEST-TriggerIntegrationTest.testNodeAddedTriggerRestoreState-seed#[E8165FBDA1B87F0A]) [    ] o.a.s.c.a.OverseerTriggerThread OverseerTriggerThread has been closed explicitly
   [junit4]   2> 2367586 WARN  (OverseerAutoScalingTriggerThread-73339426247540742-127.0.0.1:57572_solr-n_0000000000) [n:127.0.0.1:57572_solr    ] o.a.s.c.a.OverseerTriggerThread OverseerTriggerThread woken up but we are closed, exiting.
   [junit4]   2> 2367593 INFO  (zkCallback-6162-thread-1) [    ] o.a.s.c.c.ZkStateReader Updated live nodes from ZooKeeper... (2) -> (1)
   [junit4]   2> 2367593 INFO  (zkCallback-6162-thread-2) [    ] o.a.s.c.c.ZkStateReader Updated live nodes from ZooKeeper... (2) -> (1)
   [junit4]   2> 2367593 INFO  (zkCallback-6150-thread-1-processing-n:127.0.0.1:33725_solr) [n:127.0.0.1:33725_solr    ] o.a.s.c.OverseerElectionContext I am going to be the leader 127.0.0.1:33725_solr
   [junit4]   2> 2367594 INFO  (TEST-TriggerIntegrationTest.testNodeAddedTriggerRestoreState-seed#[E8165FBDA1B87F0A]) [    ] o.e.j.s.h.ContextHandler Stopped o.e.j.s.ServletContextHandler@431acaeb{/solr,null,UNAVAILABLE}
   [junit4]   2> 2367595 INFO  (TEST-TriggerIntegrationTest.testNodeAddedTriggerRestoreState-seed#[E8165FBDA1B87F0A]) [    ] o.e.j.s.session Stopped scavenging
   [junit4]   2> 2367596 INFO  (zkCallback-6150-thread-1-processing-n:127.0.0.1:33725_solr) [n:127.0.0.1:33725_solr    ] o.a.s.c.Overseer Overseer (id=73339426247540741-127.0.0.1:33725_solr-n_0000000001) starting
   [junit4]   2> 2367601 DEBUG (OverseerAutoScalingTriggerThread-73339426247540741-127.0.0.1:33725_solr-n_0000000001) [n:127.0.0.1:33725_solr    ] o.a.s.c.a.OverseerTriggerThread Adding .autoAddReplicas trigger
   [junit4]   2> 2367602 DEBUG (OverseerAutoScalingTriggerThread-73339426247540741-127.0.0.1:33725_solr-n_0000000001) [n:127.0.0.1:33725_solr    ] o.a.s.c.a.OverseerTriggerThread Refreshing /autoscaling.json with znode version 3
   [junit4]   2> 2367602 DEBUG (OverseerAutoScalingTriggerThread-73339426247540741-127.0.0.1:33725_solr-n_0000000001) [n:127.0.0.1:33725_solr    ] o.a.s.c.a.NodeLostTrigger Initial livenodes: [127.0.0.1:33725_solr]
   [junit4]   2> 2367603 DEBUG (OverseerAutoScalingTriggerThread-73339426247540741-127.0.0.1:33725_solr-n_0000000001) [n:127.0.0.1:33725_solr    ] o.a.s.c.a.OverseerTriggerThread Current znodeVersion 3, lastZnodeVersion -1
   [junit4]   2> 2367603 DEBUG (OverseerAutoScalingTriggerThread-73339426247540741-127.0.0.1:33725_solr-n_0000000001) [n:127.0.0.1:33725_solr    ] o.a.s.c.a.OverseerTriggerThread Processed trigger updates upto znodeVersion 3
   [junit4]   2> 2367604 DEBUG (OverseerAutoScalingTriggerThread-73339426247540741-127.0.0.1:33725_solr-n_0000000001) [n:127.0.0.1:33725_solr    ] o.a.s.c.a.OverseerTriggerThread -- clean old nodeAdded markers
   [junit4]   2> 2367605 DEBUG (OverseerAutoScalingTriggerThread-73339426247540741-127.0.0.1:33725_solr-n_0000000001) [n:127.0.0.1:33725_solr    ] o.a.s.c.a.OverseerTriggerThread Current znodeVersion 3, lastZnodeVersion 3
   [junit4]   2> 2367605 DEBUG (ScheduledTrigger-6314-thread-1) [n:127.0.0.1:33725_solr    ] o.a.s.c.a.NodeLostTrigger Running NodeLostTrigger: .auto_add_replicas with currently live nodes: 1
   [junit4]   2> 2368606 DEBUG (ScheduledTrigger-6314-thread-1) [n:127.0.0.1:33725_solr    ] o.a.s.c.a.NodeLostTrigger Running NodeLostTrigger: .auto_add_replicas with currently live nodes: 1
   [junit4]   2> 2369611 DEBUG (ScheduledTrigger-6314-thread-2) [n:127.0.0.1:33725_solr    ] o.a.s.c.a.NodeLostTrigger Running NodeLostTrigger: .auto_add_replicas with currently live nodes: 1
   [junit4]   2> 2370611 DEBUG (ScheduledTrigger-6314-thread-1) [n:127.0.0.1:33725_solr    ] o.a.s.c.a.NodeLostTrigger Running NodeLostTrigger: .auto_add_replicas with currently live nodes: 1
   [junit4]   2> 2371611 DEBUG (ScheduledTrigger-6314-thread-1) [n:127.0.0.1:33725_solr    ] o.a.s.c.a.NodeLostTrigger Running NodeLostTrigger: .auto_add_replicas with currently live nodes: 1
   [junit4]   2> 2372596 INFO  (TEST-TriggerIntegrationTest.testNodeAddedTriggerRestoreState-seed#[E8165FBDA1B87F0A]) [    ] o.e.j.s.Server jetty-9.4.8.v20171121, build timestamp: 2017-11-21T13:27:37-08:00, git hash: 82b8fb23f757335bb3329d540ce37a2a2615f0a8
   [junit4]   2> 2372602 INFO  (TEST-TriggerIntegrationTest.testNodeAddedTriggerRestoreState-seed#[E8165FBDA1B87F0A]) [    ] o.e.j.s.session DefaultSessionIdManager workerName=node0
   [junit4]   2> 2372602 INFO  (TEST-TriggerIntegrationTest.testNodeAddedTriggerRestoreState-seed#[E8165FBDA1B87F0A]) [    ] o.e.j.s.session No SessionScavenger set, using defaults
   [junit4]   2> 2372602 INFO  (TEST-TriggerIntegrationTest.testNodeAddedTriggerRestoreState-seed#[E8165FBDA1B87F0A]) [    ] o.e.j.s.session Scavenging every 660000ms
   [junit4]   2> 2372602 INFO  (TEST-TriggerIntegrationTest.testNodeAddedTriggerRestoreState-seed#[E8165FBDA1B87F0A]) [    ] o.e.j.s.h.ContextHandler Started o.e.j.s.ServletContextHandler@421311dd{/solr,null,AVAILABLE}
   [junit4]   2> 2372603 INFO  (TEST-TriggerIntegrationTest.testNodeAddedTriggerRestoreState-seed#[E8165FBDA1B87F0A]) [    ] o.e.j.s.AbstractConnector Started ServerConnector@5fe1c4fb{HTTP/1.1,[http/1.1]}{127.0.0.1:55720}
   [junit4]   2> 2372603 INFO  (TEST-TriggerIntegrationTest.testNodeAddedTriggerRestoreState-seed#[E8165FBDA1B87F0A]) [    ] o.e.j.s.Server Started @2374942ms
   [junit4]   2> 2372603 INFO  (TEST-TriggerIntegrationTest.testNodeAddedTriggerRestoreState-seed#[E8165FBDA1B87F0A]) [    ] o.a.s.c.s.e.JettySolrRunner Jetty properties: {hostContext=/solr, hostPort=55720}
   [junit4]   2> 2372603 ERROR (TEST-TriggerIntegrationTest.testNodeAddedTriggerRestoreState-seed#[E8165FBDA1B87F0A]) [    ] o.a.s.u.StartupLoggingUtils Missing Java Option solr.log.dir. Logging may be missing or incomplete.
   [junit4]   2> 2372603 INFO  (TEST-TriggerIntegrationTest.testNodeAddedTriggerRestoreState-seed#[E8165FBDA1B87F0A]) [    ] o.a.s.s.SolrDispatchFilter  ___      _       Welcome to Apache Solr™ version 8.0.0
   [junit4]   2> 2372603 INFO  (TEST-TriggerIntegrationTest.testNodeAddedTriggerRestoreState-seed#[E8165FBDA1B87F0A]) [    ] o.a.s.s.SolrDispatchFilter / __| ___| |_ _   Starting in cloud mode on port null
   [junit4]   2> 2372603 INFO  (TEST-TriggerIntegrationTest.testNodeAddedTriggerRestoreState-seed#[E8165FBDA1B87F0A]) [    ] o.a.s.s.SolrDispatchFilter \__ \/ _ \ | '_|  Install dir: null
   [junit4]   2> 2372604 INFO  (TEST-TriggerIntegrationTest.testNodeAddedTriggerRestoreState-seed#[E8165FBDA1B87F0A]) [    ] o.a.s.s.SolrDispatchFilter |___/\___/_|_|    Start time: 2018-02-22T13:48:25.642Z
   [junit4]   2> 2372612 DEBUG (ScheduledTrigger-6314-thread-1) [n:127.0.0.1:33725_solr    ] o.a.s.c.a.NodeLostTrigger Running NodeLostTrigger: .auto_add_replicas with currently live nodes: 1
   [junit4]   2> 2372618 INFO  (zkConnectionManagerCallback-6166-thread-1) [    ] o.a.s.c.c.ConnectionManager zkClient has connected
   [junit4]   2> 2372619 INFO  (TEST-TriggerIntegrationTest.testNodeAddedTriggerRestoreState-seed#[E8165FBDA1B87F0A]) [    ] o.a.s.s.SolrDispatchFilter solr.xml found in ZooKeeper. Loading...
   [junit4]   2> 2372631 INFO  (TEST-TriggerIntegrationTest.testNodeAddedTriggerRestoreState-seed#[E8165FBDA1B87F0A]) [    ] o.a.s.c.ZkContainer Zookeeper client=127.0.0.1:46604/solr
   [junit4]   2> 2372635 INFO  (zkConnectionManagerCallback-6170-thread-1) [    ] o.a.s.c.c.ConnectionManager zkClient has connected
   [junit4]   2> 2372642 INFO  (zkConnectionManagerCallback-6172-thread-1-processing-n:127.0.0.1:55720_solr) [n:127.0.0.1:55720_solr    ] o.a.s.c.c.ConnectionManager zkClient has connected
   [junit4]   2> 2372647 INFO  (TEST-TriggerIntegrationTest.testNodeAddedTriggerRestoreState-seed#[E8165FBDA1B87F0A]) [n:127.0.0.1:55720_solr    ] o.a.s.c.c.ZkStateReader Updated live nodes from ZooKeeper... (0) -> (1)
   [junit4]   2> 2372649 INFO  (TEST-TriggerIntegrationTest.testNodeAddedTriggerRestoreState-seed#[E8165FBDA1B87F0A]) [n:127.0.0.1:55720_solr    ] o.a.s.c.Overseer Overseer (id=null) closing
   [junit4]   2> 2372651 INFO  (TEST-TriggerIntegrationTest.testNodeAddedTriggerRestoreState-seed#[E8165FBDA1B87F0A]) [n:127.0.0.1:55720_solr    ] o.a.s.c.ZkController Register node as live in ZooKeeper:/live_nodes/127.0.0.1:55720_solr
   [junit4]   2> 2372652 INFO  (zkCallback-6150-thread-1-processing-n:127.0.0.1:33725_solr) [n:127.0.0.1:33725_solr    ] o.a.s.c.c.ZkStateReader Updated live nodes from ZooKeeper... (1) -> (2)
   [junit4]   2> 2372652 INFO  (zkCallback-6162-thread-1) [    ] o.a.s.c.c.ZkStateReader Updated live nodes from ZooKeeper... (1) -> (2)
   [junit4]   2> 2372652 INFO  (zkCallback-6162-thread-2) [    ] o.a.s.c.c.ZkStateReader Updated live nodes from ZooKeeper... (1) -> (2)
   [junit4]   2> 2372658 INFO  (zkCallback-6171-thread-1-processing-n:127.0.0.1:55720_solr) [n:127.0.0.1:55720_solr    ] o.a.s.c.c.ZkStateReader Updated live nodes from ZooKeeper... (1) -> (2)
   [junit4]   2> 2372709 INFO  (TEST-TriggerIntegrationTest.testNodeAddedTriggerRestoreState-seed#[E8165FBDA1B87F0A]) [n:127.0.0.1:55720_solr    ] o.a.s.m.r.SolrJmxReporter JMX monitoring for 'solr_55720.solr.node' (registry 'solr.node') enabled at server: com.sun.jmx.mbeanserver.JmxMBeanServer@7b3284b7
   [junit4]   2> 2372719 INFO  (TEST-TriggerIntegrationTest.testNodeAddedTriggerRestoreState-seed#[E8165FBDA1B87F0A]) [n:127.0.0.1:55720_solr    ] o.a.s.m.r.SolrJmxReporter JMX monitoring for 'solr_55720.solr.jvm' (registry 'solr.jvm') enabled at server: com.sun.jmx.mbeanserver.JmxMBeanServer@7b3284b7
   [junit4]   2> 2372719 INFO  (TEST-TriggerIntegrationTest.testNodeAddedTriggerRestoreState-seed#[E8165FBDA1B87F0A]) [n:127.0.0.1:55720_solr    ] o.a.s.m.r.SolrJmxReporter JMX monitoring for 'solr_55720.solr.jetty' (registry 'solr.jetty') enabled at server: com.sun.jmx.mbeanserver.JmxMBeanServer@7b3284b7
   [junit4]   2> 2372720 INFO  (TEST-TriggerIntegrationTest.testNodeAddedTriggerRestoreState-seed#[E8165FBDA1B87F0A]) [n:127.0.0.1:55720_solr    ] o.a.s.c.CorePropertiesLocator Found 0 core definitions underneath /x1/jenkins/jenkins-slave/workspace/Lucene-Solr-Tests-master/solr/build/solr-core/test/J0/temp/solr.cloud.autoscaling.TriggerIntegrationTest_E8165FBDA1B87F0A-001/tempDir-001/node3/.
   [junit4]   2> 2372752 INFO  (qtp1984073611-25298) [n:127.0.0.1:33725_solr    ] o.a.s.s.HttpSolrCall [admin] webapp=null path=/admin/metrics params={prefix=CONTAINER.fs.usableSpace,CORE.coreName&wt=javabin&version=2&group=solr.node,solr.core} status=0 QTime=0
   [junit4]   2> 2372754 INFO  (qtp1095183666-25360) [n:127.0.0.1:55720_solr    ] o.a.s.s.HttpSolrCall [admin] webapp=null path=/admin/metrics params={prefix=CONTAINER.fs.usableSpace,CORE.coreName&wt=javabin&version=2&group=solr.node,solr.core} status=0 QTime=0
   [junit4]   2> 2372754 DEBUG (qtp1984073611-25293) [n:127.0.0.1:33725_solr    ] o.a.s.c.a.AutoScalingHandler Verified autoscaling configuration
   [junit4]   2> 2372755 INFO  (qtp1984073611-25293) [n:127.0.0.1:33725_solr    ] o.a.s.s.HttpSolrCall [admin] webapp=null path=/admin/autoscaling params={wt=javabin&version=2} status=0 QTime=4
   [junit4]   2> 2372755 DEBUG (zkCallback-6150-thread-1-processing-n:127.0.0.1:33725_solr) [n:127.0.0.1:33725_solr    ] o.a.s.c.a.OverseerTriggerThread Refreshing /autoscaling.json with znode version 4
   [junit4]   2> 2372758 INFO  (TEST-TriggerIntegrationTest.testNodeAddedTriggerRestoreState-seed#[E8165FBDA1B87F0A]) [    ] o.e.j.s.Server jetty-9.4.8.v20171121, build timestamp: 2017-11-21T13:27:37-08:00, git hash: 82b8fb23f757335bb3329d540ce37a2a2615f0a8
   [junit4]   2> 2372758 DEBUG (zkCallback-6150-thread-1-processing-n:127.0.0.1:33725_solr) [n:127.0.0.1:33725_solr    ] o.a.s.c.a.NodeAddedTrigger Initial livenodes: [127.0.0.1:33725_solr, 127.0.0.1:55720_solr]
   [junit4]   2> 2372758 DEBUG (zkCallback-6150-thread-1-processing-n:127.0.0.1:33725_solr) [n:127.0.0.1:33725_solr    ] o.a.s.c.a.NodeAddedTrigger NodeAddedTrigger node_added_restore_trigger instantiated with properties: {event=nodeAdded, waitFor=5, actions=[{name=test, class=org.apache.solr.cloud.autoscaling.TriggerIntegrationTest$TestTriggerAction}], enabled=true}
   [junit4]   2> 2372758 DEBUG (zkCallback-6150-thread-1-processing-n:127.0.0.1:33725_solr) [n:127.0.0.1:33725_solr    ] o.a.s.c.a.NodeLostTrigger Initial livenodes: [127.0.0.1:33725_solr, 127.0.0.1:55720_solr]
   [junit4]   2> 2372758 DEBUG (OverseerAutoScalingTriggerThread-73339426247540741-127.0.0.1:33725_solr-n_0000000001) [n:127.0.0.1:33725_solr    ] o.a.s.c.a.OverseerTriggerThread Processed trigger updates upto znodeVersion 4
   [junit4]   2> 2372759 INFO  (TEST-TriggerIntegrationTest.testNodeAddedTriggerRestoreState-seed#[E8165FBDA1B87F0A]) [    ] o.e.j.s.session DefaultSessionIdManager workerName=node0
   [junit4]   2> 2372760 INFO  (TEST-TriggerIntegrationTest.testNodeAddedTriggerRestoreState-seed#[E8165FBDA1B87F0A]) [    ] o.e.j.s.session No SessionScavenger set, using defaults
   [junit4]   2> 2372760 INFO  (TEST-TriggerIntegrationTest.testNodeAddedTriggerRestoreState-seed#[E8165FBDA1B87F0A]) [    ] o.e.j.s.session Scavenging every 660000ms
   [junit4]   2> 2372760 INFO  (OverseerAutoScalingTriggerThread-73339426247540741-127.0.0.1:33725_solr-n_0000000001) [n:127.0.0.1:33725_solr    ] o.a.s.c.a.TriggerIntegrationTest TestTriggerAction init
   [junit4]   2> 2372760 INFO  (TEST-TriggerIntegrationTest.testNodeAddedTriggerRestoreState-seed#[E8165FBDA1B87F0A]) [    ] o.e.j.s.h.ContextHandler Started o.e.j.s.ServletContextHandler@4a813b61{/solr,null,AVAILABLE}
   [junit4]   2> 2372760 INFO  (TEST-TriggerIntegrationTest.testNodeAddedTriggerRestoreState-seed#[E8165FBDA1B87F0A]) [    ] o.e.j.s.AbstractConnector Started ServerConnector@6d33aaad{HTTP/1.1,[http/1.1]}{127.0.0.1:44638}
   [junit4]   2> 2372760 INFO  (TEST-TriggerIntegrationTest.testNodeAddedTriggerRestoreState-seed#[E8165FBDA1B87F0A]) [    ] o.e.j.s.Server Started @2375099ms
   [junit4]   2> 2372760 INFO  (TEST-TriggerIntegrationTest.testNodeAddedTriggerRestoreState-seed#[E8165FBDA1B87F0A]) [    ] o.a.s.c.s.e.JettySolrRunner Jetty properties: {hostContext=/solr, hostPort=44638}
   [junit4]   2> 2372760 ERROR (TEST-TriggerIntegrationTest.testNodeAddedTriggerRestoreState-seed#[E8165FBDA1B87F0A]) [    ] o.a.s.u.StartupLoggingUtils Missing Java Option solr.log.dir. Logging may be missing or incomplete.
   [junit4]   2> 2372761 DEBUG (ScheduledTrigger-6314-thread-3) [n:127.0.0.1:33725_solr    ] o.a.s.c.a.NodeAddedTrigger Running NodeAddedTrigger node_added_restore_trigger
   [junit4]   2> 2372761 INFO  (TEST-TriggerIntegrationTest.testNodeAddedTriggerRestoreState-seed#[E8165FBDA1B87F0A]) [    ] o.a.s.s.SolrDispatchFilter  ___      _       Welcome to Apache Solr™ version 8.0.0
   [junit4]   2> 2372761 DEBUG (ScheduledTrigger-6314-thread-3) [n:127.0.0.1:33725_solr    ] o.a.s.c.a.NodeAddedTrigger Found livenodes: 2
   [junit4]   2> 2372761 INFO  (TEST-TriggerIntegrationTest.testNodeAddedTriggerRestoreState-seed#[E8165FBDA1B87F0A]) [    ] o.a.s.s.SolrDispatchFilter / __| ___| |_ _   Starting in cloud mode on port null
   [junit4]   2> 2372761 INFO  (TEST-TriggerIntegrationTest.testNodeAddedTriggerRestoreState-seed#[E8165FBDA1B87F0A]) [    ] o.a.s.s.SolrDispatchFilter \__ \/ _ \ | '_|  Install dir: null
   [junit4]   2> 2372761 INFO  (TEST-TriggerIntegrationTest.testNodeAddedTriggerRestoreState-seed#[E8165FBDA1B87F0A]) [    ] o.a.s.s.SolrDispatchFilter |___/\___/_|_|    Start time: 2018-02-22T13:48:25.799Z
   [junit4]   2> 2372762 DEBUG (OverseerAutoScalingTriggerThread-73339426247540741-127.0.0.1:33725_solr-n_0000000001) [n:127.0.0.1:33725_solr    ] o.a.s.c.a.OverseerTriggerThread Current znodeVersion 4, lastZnodeVersion 4
   [junit4]   2> 2372763 INFO  (zkConnectionManagerCallback-6176-thread-1) [    ] o.a.s.c.c.ConnectionManager zkClient has connected
   [junit4]   2> 2372763 INFO  (TEST-TriggerIntegrationTest.testNodeAddedTriggerRestoreState-seed#[E8165FBDA1B87F0A]) [    ] o.a.s.s.SolrDispatchFilter solr.xml found in ZooKeeper. Loading...
   [junit4]   2> 2372774 INFO  (TEST-TriggerIntegrationTest.testNodeAddedTriggerRestoreState-seed#[E8165FBDA1B87F0A]) [    ] o.a.s.c.ZkContainer Zookeeper client=127.0.0.1:46604/solr
   [junit4]   2> 2372778 INFO  (zkConnectionManagerCallback-6180-thread-1) [    ] o.a.s.c.c.ConnectionManager zkClient has connected
   [junit4]   2> 2372785 INFO  (zkConnectionManagerCallback-6182-thread-1-processing-n:127.0.0.1:44638_solr) [n:127.0.0.1:44638_solr    ] o.a.s.c.c.ConnectionManager zkClient has connected
   [junit4]   2> 2372792 INFO  (TEST-TriggerIntegrationTest.testNodeAddedTriggerRestoreState-seed#[E8165FBDA1B87F0A]) [n:127.0.0.1:44638_solr    ] o.a.s.c.c.ZkStateReader Updated live nodes from ZooKeeper... (0) -> (2)
   [junit4]   2> 2372794 INFO  (TEST-TriggerIntegrationTest.testNodeAddedTriggerRestoreState-seed#[E8165FBDA1B87F0A]) [n:127.0.0.1:44638_solr    ] o.a.s.c.Overseer Overseer (id=null) closing
   [junit4]   2> 2372795 INFO  (TEST-TriggerIntegrationTest.testNodeAddedTriggerRestoreState-seed#[E8165FBDA1B87F0A]) [n:127.0.0.1:44638_solr    ] o.a.s.c.ZkController Register node as live in ZooKeeper:/live_nodes/127.0.0.1:44638_solr
   [junit4]   2> 2372796 INFO  (zkCallback-6171-thread-1-processing-n:127.0.0.1:55720_solr) [n:127.0.0.1:55720_solr    ] o.a.s.c.c.ZkStateReader Updated live nodes from ZooKeeper... (2) -> (3)
   [junit4]   2> 2372796 INFO  (zkCallback-6162-thread-2) [    ] o.a.s.c.c.ZkStateReader Updated live nodes from ZooKeeper... (2) -> (3)
   [junit4]   2> 2372796 INFO  (zkCallback-6162-thread-1) [    ] o.a.s.c.c.ZkStateReader Updated live nodes from ZooKeeper... (2) -> (3)
   [junit4]   2> 2372797 INFO  (zkCallback-6150-thread-1-processing-n:127.0.0.1:33725_solr) [n:127.0.0.1:33725_solr    ] o.a.s.c.c.ZkStateReader Updated live nodes from ZooKeeper... (2) -> (3)
   [junit4]   2> 2372797 INFO  (zkCallback-6181-thread-1-processing-n:127.0.0.1:44638_solr) [n:127.0.0.1:44638_solr    ] o.a.s.c.c.ZkStateReader Updated live nodes from ZooKeeper... (2) -> (3)
   [junit4]   2> 2372907 INFO  (TEST-TriggerIntegrationTest.testNodeAddedTriggerRestoreState-seed#[E8165FBDA1B87F0A]) [n:127.0.0.1:44638_solr    ] o.a.s.m.r.SolrJmxReporter JMX monitoring for 'solr_44638.solr.node' (registry 'solr.node') enabled at server: com.sun.jmx.mbeanserver.JmxMBeanServer@7b3284b7
   [junit4]   2> 2372917 INFO  (TEST-TriggerIntegrationTest.testNodeAddedTriggerRestoreState-seed#[E8165FBDA1B87F0A]) [n:127.0.0.1:44638_solr    ] o.a.s.m.r.SolrJmxReporter JMX monitoring for 'solr_44638.solr.jvm' (registry 'solr.jvm') enabled at server: com.sun.jmx.mbeanserver.JmxMBeanServer@7b3284b7
   [junit4]   2> 2372918 INFO  (TEST-TriggerIntegrationTest.testNodeAddedTriggerRestoreState-seed#[E8165FBDA1B87F0A]) [n:127.0.0.1:44638_solr    ] o.a.s.m.r.SolrJmxReporter JMX monitoring for 'solr_44638.solr.jetty' (registry 'solr.jetty') enabled at server: com.sun.jmx.mbeanserver.JmxMBeanServer@7b3284b7
   [junit4]   2> 2372919 INFO  (TEST-TriggerIntegrationTest.testNodeAddedTriggerRestoreState-seed#[E8165FBDA1B87F0A]) [n:127.0.0.1:44638_solr    ] o.a.s.c.CorePropertiesLocator Found 0 core definitions underneath /x1/jenkins/jenkins-slave/workspace/Lucene-Solr-Tests-master/solr/build/solr-core/test/J0/temp/solr.cloud.autoscaling.TriggerIntegrationTest_E8165FBDA1B87F0A-001/tempDir-001/node4/.
   [junit4]   2> 2373612 DEBUG (ScheduledTrigger-6314-thread-2) [n:127.0.0.1:33725_solr    ] o.a.s.c.a.NodeLostTrigger Running NodeLostTrigger: .auto_add_replicas with currently live nodes: 3
   [junit4]   2> 2373765 DEBUG (ScheduledTrigger-6314-thread-1) [n:127.0.0.1:33725_solr    ] o.a.s.c.a.NodeAddedTrigger Running NodeAddedTrigger node_added_restore_trigger
   [junit4]   2> 2373765 DEBUG (ScheduledTrigger-6314-thread-1) [n:127.0.0.1:33725_solr    ] o.a.s.c.a.NodeAddedTrigger Found livenodes: 3
   [junit4]   2> 2373765 DEBUG (ScheduledTrigger-6314-thread-1) [n:127.0.0.1:33725_solr    ] o.a.s.c.a.NodeAddedTrigger Tracking new node: 127.0.0.1:44638_solr at time 19559214023352613
   [junit4]   2> 2374474 INFO  (qtp1984073611-25293) [n:127.0.0.1:33725_solr    ] o.a.s.s.HttpSolrCall [admin] webapp=null path=/admin/metrics params={prefix=CONTAINER.fs.usableSpace,CORE.coreName&wt=javabin&version=2&group=solr.node,solr.core} status=0 QTime=0
   [junit4]   2> 2374475 INFO  (qtp581229017-25389) [n:127.0.0.1:44638_solr    ] o.a.s.s.HttpSolrCall [admin] webapp=null path=/admin/metrics params={prefix=CONTAINER.fs.usableSpace,CORE.coreName&wt=javabin&version=2&group=solr.node,solr.core} status=0 QTime=0
   [junit4]   2> 2374477 INFO  (qtp1095183666-25364) [n:127.0.0.1:55720_solr    ] o.a.s.s.HttpSolrCall [admin] webapp=null path=/admin/metrics params={prefix=CONTAINER.fs.usableSpace,CORE.coreName&wt=javabin&version=2&group=solr.node,solr.core} status=0 QTime=0
   [junit4]   2> 2374477 DEBUG (qtp581229017-25386) [n:127.0.0.1:44638_solr    ] o.a.s.c.a.AutoScalingHandler Verified autoscaling configuration
   [junit4]   2> 2374478 INFO  (qtp581229017-25386) [n:127.0.0.1:44638_solr    ] o.a.s.s.HttpSolrCall [admin] webapp=null path=/cluster/autoscaling params={wt=javabin&version=2} status=0 QTime=5
   [junit4]   2> 2374478 DEBUG (zkCallback-6150-thread-1-processing-n:127.0.0.1:33725_solr) [n:127.0.0.1:33725_solr    ] o.a.s.c.a.OverseerTriggerThread Refreshing /autoscaling.json with znode version 5
   [junit4]   2> 2374479 DEBUG (zkCallback-6150-thread-1-processing-n:127.0.0.1:33725_solr) [n:127.0.0.1:33725_solr    ] o.a.s.c.a.NodeAddedTrigger Initial livenodes: [127.0.0.1:33725_solr, 127.0.0.1:55720_solr, 127.0.0.1:44638_solr]
   [junit4]   2> 2374479 DEBUG (zkCallback-6150-thread-1-processing-n:127.0.0.1:33725_solr) [n:127.0.0.1:33725_solr    ] o.a.s.c.a.NodeAddedTrigger NodeAddedTrigger node_added_restore_trigger instantiated with properties: {event=nodeAdded, waitFor=0, actions=[{name=test, class=org.apache.solr.cloud.autoscaling.TriggerIntegrationTest$TestTriggerAction}], enabled=true}
   [junit4]   2> 2374479 DEBUG (zkCallback-6150-thread-1-processing-n:127.0.0.1:33725_solr) [n:127.0.0.1:33725_solr    ] o.a.s.c.a.NodeLostTrigger Initial livenodes: [127.0.0.1:33725_solr, 127.0.0.1:55720_solr, 127.0.0.1:44638_solr]
   [junit4]   2> 2374479 DEBUG (OverseerAutoScalingTriggerThread-73339426247540741-127.0.0.1:33725_solr-n_0000000001) [n:127.0.0.1:33725_solr    ] o.a.s.c.a.OverseerTriggerThread Processed trigger updates upto znodeVersion 5
   [junit4]   2> 2374480 INFO  (OverseerAutoScalingTriggerThread-73339426247540741-127.0.0.1:33725_solr-n_0000000001) [n:127.0.0.1:33725_solr    ] o.a.s.c.a.TriggerIntegrationTest TestTriggerAction init
   [junit4]   2> 2374480 DEBUG (OverseerAutoScalingTriggerThread-73339426247540741-127.0.0.1:33725_solr-n_0000000001) [n:127.0.0.1:33725_solr    ] o.a.s.c.a.NodeAddedTrigger Adding node from marker path: 127.0.0.1:44638_solr
   [junit4]   2> 2374481 DEBUG (ScheduledTrigger-6314-thread-3) [n:127.0.0.1:33725_solr    ] o.a.s.c.a.NodeAddedTrigger Running NodeAddedTrigger node_added_restore_trigger
   [junit4]   2> 2374481 DEBUG (ScheduledTrigger-6314-thread-3) [n:127.0.0.1:33725_solr    ] o.a.s.c.a.NodeAddedTrigger Found livenodes: 3
   [junit4]   2> 2374481 DEBUG (ScheduledTrigger-6314-thread-3) [n:127.0.0.1:33725_solr    ] o.a.s.c.a.NodeAddedTrigger NodeAddedTrigger node_added_restore_trigger firing registered processor for nodes: [127.0.0.1:44638_solr] added at times [19559214738422965], now=19559214739189866
   [junit4]   2> 2374481 DEBUG (ScheduledTrigger-6314-thread-3) [n:127.0.0.1:33725_solr    ] o.a.s.c.a.ScheduledTriggers ++++++++ Cooldown inactive - processing event: {
   [junit4]   2>   "id":"457d008e91bcb5T9o7ewqbvr79nc97ac8rntpb7l",
   [junit4]   2>   "source":"node_added_restore_trigger",
   [junit4]   2>   "eventTime":19559214738422965,
   [junit4]   2>   "eventType":"NODEADDED",
   [junit4]   2>   "properties":{
   [junit4]   2>     "eventTimes":[19559214738422965],
   [junit4]   2>     "nodeNames":["127.0.0.1:44638_solr"]}}
   [junit4]   2> 2374484 DEBUG (OverseerAutoScalingTriggerThread-73339426247540741-127.0.0.1:33725_solr-n_0000000001) [n:127.0.0.1:33725_solr    ] o.a.s.c.a.OverseerTriggerThread Current znodeVersion 5, lastZnodeVersion 5
   [junit4]   2> 2374484 DEBUG (ScheduledTrigger-6314-thread-3) [n:127.0.0.1:33725_solr    ] o.a.s.c.a.ScheduledTriggers Pausing all triggers: [.auto_add_replicas, node_added_restore_trigger]
   [junit4]   2> 2374484 INFO  (ScheduledTrigger-6314-thread-3) [n:127.0.0.1:33725_solr    ] o.a.s.c.a.SystemLogListener Collection .system does not exist, disabling logging.
   [junit4]   2> 2374485 DEBUG (AutoscalingActionExecutor-6315-thread-1-processing-n:127.0.0.1:33725_solr) [n:127.0.0.1:33725_solr    ] o.a.s.c.a.ScheduledTriggers -- processing actions for {
   [junit4]   2>   "id":"457d008e91bcb5T9o7ewqbvr79nc97ac8rntpb7l",
   [junit4]   2>   "source":"node_added_restore_trigger",
   [junit4]   2>   "eventTime":19559214738422965,
   [junit4]   2>   "eventType":"NODEADDED",
   [junit4]   2>   "properties":{
   [junit4]   2>     "eventTimes":[19559214738422965],
   [junit4]   2>     "_enqueue_time_":19559214742052832,
   [junit4]   2>     "nodeNames":["127.0.0.1:44638_solr"]}}
   [junit4]   2> 2374485 INFO  (TEST-TriggerIntegrationTest.testNodeAddedTriggerRestoreState-seed#[E8165FBDA1B87F0A]) [    ] o.a.s.SolrTestCaseJ4 ###Ending testNodeAddedTriggerRestoreState
   [junit4]   2> 2374525 DEBUG (AutoscalingActionExecutor-6315-thread-1-processing-n:127.0.0.1:33725_solr) [n:127.0.0.1:33725_solr    ] o.a.s.c.a.ScheduledTriggers Resuming trigger: .auto_add_replicas after 5000ms
   [junit4]   2> 2374527 DEBUG (AutoscalingActionExecutor-6315-thread-1-processing-n:127.0.0.1:33725_solr) [n:127.0.0.1:33725_solr    ] o.a.s.c.a.ScheduledTriggers Resuming trigger: node_added_restore_trigger after 5000ms
   [junit4]   2> 2374528 DEBUG (AutoscalingActionExecutor-6315-thread-1-processing-n:127.0.0.1:33725_solr) [n:127.0.0.1:33725_solr    ] o.a.s.c.a.ScheduledTriggers -- processing took 43 ms for event id=457d008e91bcb5T9o7ewqbvr79nc97ac8rntpb7l
   [junit4]   2> 2374582 INFO  (TEST-TriggerIntegrationTest.testEventFromRestoredState-seed#[E8165FBDA1B87F0A]) [    ] o.a.s.SolrTestCaseJ4 ###Starting testEventFromRestoredState
   [junit4]   2> 2374582 INFO  (qtp1984073611-25297) [n:127.0.0.1:33725_solr    ] o.a.s.h.a.CollectionsHandler Invoked Collection Action :overseerstatus with params action=OVERSEERSTATUS&wt=javabin&version=2 and sendToOCPQueue=true
   [junit4]   2> 2374586 INFO  (qtp1984073611-25297) [n:127.0.0.1:33725_solr    ] o.a.s.s.HttpSolrCall [admin] webapp=null path=/admin/collections params={action=OVERSEERSTATUS&wt=javabin&version=2} status=0 QTime=3
   [junit4]   2> 2374586 INFO  (TEST-TriggerIntegrationTest.testEventFromRestoredState-seed#[E8165FBDA1B87F0A]) [    ] o.a.s.c.a.ScheduledTriggers -- removing trigger: .auto_add_replicas
   [junit4]   2> 2374587 INFO  (TEST-TriggerIntegrationTest.testEventFromRestoredState-seed#[E8165FBDA1B87F0A]) [    ] o.a.s.c.a.ScheduledTriggers -- removing trigger: node_added_restore_trigger
   [junit4]   2> 2374599 INFO  (TEST-TriggerIntegrationTest.testEventFromRestoredState-seed#[E8165FBDA1B87F0A]) [    ] o.a.s.c.a.TriggerIntegrationTest /autoscaling.json reset, new znode version 6
   [junit4]   2> 2374599 DEBUG (zkCallback-6150-thread-1-processing-n:127.0.0.1:33725_solr) [n:127.0.0.1:33725_solr    ] o.a.s.c.a.OverseerTriggerThread Refreshing /autoscaling.json with znode version 6
   [junit4]   2> 2374599 DEBUG (OverseerAutoScalingTriggerThread-73339426247540741-127.0.0.1:33725_solr-n_0000000001) [n:127.0.0.1:33725_solr    ] o.a.s.c.a.OverseerTriggerThread Processed trigger updates upto znodeVersion 6
   [junit4]   2> 2374600 DEBUG (OverseerAutoScalingTriggerThread-73339426247540741-127.0.0.1:33725_solr-n_0000000001) [n:127.0.0.1:33725_solr    ] o.a.s.c.a.OverseerTriggerThread -- clean old nodeLost markers
   [junit4]   2> 2374600 DEBUG (OverseerAutoScalingTriggerThread-73339426247540741-127.0.0.1:33725_solr-n_0000000001) [n:127.0.0.1:33725_solr    ] o.a.s.c.a.OverseerTriggerThread -- clean old nodeAdded markers
   [junit4]   2> 2374600 DEBUG (OverseerAutoScalingTriggerThread-73339426247540741-127.0.0.1:33725_solr-n_0000000001) [n:127.0.0.1:33725_solr    ] o.a.s.c.a.OverseerTriggerThread Current znodeVersion 6, lastZnodeVersion 6
   [junit4]   2> 2374601 INFO  (TEST-TriggerIntegrationTest.testEventFromRestoredState-seed#[E8165FBDA1B87F0A]) [    ] o.a.s.c.c.ZkStateReader Updated live nodes from ZooKeeper... (0) -> (3)
   [junit4]   2> 2374603 INFO  (TEST-TriggerIntegrationTest.testEventFromRestoredState-seed#[E8165FBDA1B87F0A]) [    ] o.e.j.s.AbstractConnector Stopped ServerConnector@49e1603a{HTTP/1.1,[http/1.1]}{127.0.0.1:0}
   [junit4]   2> 2374605 INFO  (TEST-TriggerIntegrationTest.testEventFromRestoredState-seed#[E8165FBDA1B87F0A]) [    ] o.a.s.c.CoreContainer Shutting down CoreContainer instance=1865012556
   [junit4]   2> 2374605 INFO  (TEST-TriggerIntegrationTest.testEventFromRestoredState-seed#[E8165FBDA1B87F0A]) [    ] o.a.s.m.SolrMetricManager Closing metric reporters for registry=solr.node, tag=null
   [junit4]   2> 2374605 INFO  (TEST-TriggerIntegrationTest.testEventFromRestoredState-seed#[E8165FBDA1B87F0A]) [    ] o.a.s.m.r.SolrJmxReporter Closing reporter [org.apache.solr.metrics.reporters.SolrJmxReporter@685011b: rootName = solr_33725, domain = solr.node, service url = null, agent id = null] for registry solr.node / com.codahale.metrics.MetricRegistry@731919ce
   [junit4]   2> 2374613 INFO  (TEST-TriggerIntegrationTest.testEventFromRestoredState-seed#[E8165FBDA1B87F0A]) [    ] o.a.s.m.SolrMetricManager Closing metric reporters for registry=solr.jvm, tag=null
   [junit4]   2> 2374613 INFO  (TEST-TriggerIntegrationTest.testEventFromRestoredState-seed#[E8165FBDA1B87F0A]) [    ] o.a.s.m.r.SolrJmxReporter Closing reporter [org.apache.solr.metrics.reporters.SolrJmxReporter@1011fe42: rootName = solr_33725, domain = solr.jvm, service url = null, agent id = null] for registry solr.jvm / com.codahale.metrics.MetricRegistry@5121bc1f
   [junit4]   2> 2374618 INFO  (TEST-TriggerIntegrationTest.testEventFromRestoredState-seed#[E8165FBDA1B87F0A]) [    ] o.a.s.m.SolrMetricManager Closing metric reporters for registry=solr.jetty, tag=null
   [junit4]   2> 2374618 INFO  (TEST-TriggerIntegrationTest.testEventFromRestoredState-seed#[E8165FBDA1B87F0A]) [    ] o.a.s.m.r.SolrJmxReporter Closing reporter [org.apache.solr.metrics.reporters.SolrJmxReporter@1a7bd329: rootName = solr_33725, domain = solr.jetty, service url = null, agent id = null] for registry solr.jetty / com.codahale.metrics.MetricRegistry@581757e9
   [junit4]   2> 2374619 INFO  (TEST-TriggerIntegrationTest.testEventFromRestoredState-seed#[E8165FBDA1B87F0A]) [    ] o.a.s.c.ZkController Remove node as live in ZooKeeper:/live_nodes/127.0.0.1:33725_solr
   [junit4]   2> 2374620 INFO  (zkCallback-6181-thread-1-processing-n:127.0.0.1:44638_solr) [n:127.0.0.1:44638_solr    ] o.a.s.c.c.ZkStateReader Updated live nodes from ZooKeeper... (3) -> (2)
   [junit4]   2> 2374620 INFO  (zkCallback-6162-thread-2) [    ] o.a.s.c.c.ZkStateReader Updated live nodes from ZooKeeper... (3) -> (2)
   [junit4]   2> 2374620 INFO  (zkCallback-6171-thread-1-processing-n:127.0.0.1:55720_solr) [n:127.0.0.1:55720_solr    ] o.a.s.c.c.ZkStateReader Updated live nodes from ZooKeeper... (3) -> (2)
   [junit4]   2> 2374620 INFO  (zkCallback-6162-thread-1) [    ] o.a.s.c.c.ZkStateReader Updated live nodes from ZooKeeper... (3) -> (2)
   [junit4]   2> 2374621 INFO  (TEST-TriggerIntegrationTest.testEventFromRestoredState-seed#[E8165FBDA1B87F0A]) [    ] o.a.s.m.SolrMetricManager Closing metric reporters for registry=solr.cluster, tag=null
   [junit4]   2> 2374621 INFO  (TEST-TriggerIntegrationTest.testEventFromRestoredState-seed#[E8165FBDA1B87F0A]) [    ] o.a.s.c.TransientSolrCoreCacheDefault Allocating transient cache for 2147483647 transient cores
   [junit4]   2> 2374625 INFO  (zkCallback-6162-thread-3) [    ] o.a.s.c.c.ZkStateReader Updated live nodes from ZooKeeper... (3) -> (2)
   [junit4]   2> 2374626 INFO  (TEST-TriggerIntegrationTest.testEventFromRestoredState-seed#[E8165FBDA1B87F0A]) [    ] o.a.s.c.Overseer Overseer (id=73339426247540741-127.0.0.1:33725_solr-n_0000000001) closing
   [junit4]   2> 2374626 INFO  (OverseerStateUpdate-73339426247540741-127.0.0.1:33725_solr-n_0000000001) [n:127.0.0.1:33725_solr    ] o.a.s.c.Overseer Overseer Loop exiting : 127.0.0.1:33725_solr
   [junit4]   2> 2374626 INFO  (zkCallback-6150-thread-2-processing-n:127.0.0.1:33725_solr) [n:127.0.0.1:33725_solr    ] o.a.s.c.c.ZkStateReader Updated live nodes from ZooKeeper... (3) -> (2)
   [junit4]   2> 2374626 WARN  (OverseerAutoScalingTriggerThread-73339426247540741-127.0.0.1:33725_solr-n_0000000001) [n:127.0.0.1:33725_solr    ] o.a.s.c.a.OverseerTriggerThread OverseerTriggerThread woken up but we are closed, exiting.
   [junit4]   2> 2374626 DEBUG (TEST-TriggerIntegrationTest.testEventFromRestoredState-seed#[E8165FBDA1B87F0A]) [    ] o.a.s.c.a.OverseerTriggerThread OverseerTriggerThread has been closed explicitly
   [junit4]   2> 2374627 INFO  (zkCallback-6171-thread-1-processing-n:127.0.0.1:55720_solr) [n:127.0.0.1:55720_solr    ] o.a.s.c.OverseerElectionContext I am going to be the leader 127.0.0.1:55720_solr
   [junit4]   2> 2374628 INFO  (TEST-TriggerIntegrationTest.testEventFromRestoredState-seed#[E8165FBDA1B87F0A]) [    ] o.e.j.s.h.ContextHandler Stopped o.e.j.s.ServletContextHandler@21dc8120{/solr,null,UNAVAILABLE}
   [junit4]   2> 2374630 INFO  (TEST-TriggerIntegrationTest.testEventFromRestoredState-seed#[E8165FBDA1B87F0A]) [    ] o.e.j.s.session Stopped scavenging
   [junit4]   2> 2374630 INFO  (zkCallback-6171-thread-1-processing-n:127.0.0.1:55720_solr) [n:127.0.0.1:55720_solr    ] o.a.s.c.Overseer Overseer (id=73339426247540747-127.0.0.1:55720_solr-n_0000000002) starting
   [junit4]   2> 2374637 DEBUG (OverseerAutoScalingTriggerThread-73339426247540747-127.0.0.1:55720_solr-n_0000000002) [n:127.0.0.1:55720_solr    ] o.a.s.c.a.OverseerTriggerThread Adding .autoAddReplicas trigger
   [junit4]   2> 2374638 DEBUG (OverseerAutoScalingTriggerThread-73339426247540747-127.0.0.1:55720_solr-n_0000000002) [n:127.0.0.1:55720_solr    ] o.a.s.c.a.OverseerTriggerThread Refreshing /autoscaling.json with znode version 7
   [junit4]   2> 2374638 DEBUG (OverseerAutoScalingTriggerThread-73339426247540747-127.0.0.1:55720_solr-n_0000000002) [n:127.0.0.1:55720_solr    ] o.a.s.c.a.NodeLostTrigger Initial livenodes: [127.0.0.1:55720_solr, 127.0.0.1:44638_solr]
   [junit4]   2> 2374638 DEBUG (OverseerAutoScalingTriggerThread-73339426247540747-127.0.0.1:55720_solr-n_0000000002) [n:127.0.0.1:55720_solr    ] o.a.s.c.a.OverseerTriggerThread Current znodeVersion 7, lastZnodeVersion -1
   [junit4]   2> 2374638 DEBUG (OverseerAutoScalingTriggerThread-73339426247540747-127.0.0.1:55720_solr-n_0000000002) [n:127.0.0.1:55720_solr    ] o.a.s.c.a.OverseerTriggerThread Processed trigger updates upto znodeVersion 7
   [junit4]   2> 2374640 DEBUG (OverseerAutoScalingTriggerThread-73339426247540747-127.0.0.1:55720_solr-n_0000000002) [n:127.0.0.1:55720_solr    ] o.a.s.c.a.OverseerTriggerThread -- clean old nodeAdded markers
   [junit4]   2> 2374640 DEBUG (OverseerAutoScalingTriggerThread-73339426247540747-127.0.0.1:55720_solr-n_0000000002) [n:127.0.0.1:55720_solr    ] o.a.s.c.a.OverseerTriggerThread Current znodeVersion 7, lastZnodeVersion 7
   [junit4]   2> 2374640 DEBUG (ScheduledTrigger-6331-thread-1) [n:127.0.0.1:55720_solr    ] o.a.s.c.a.NodeLostTrigger Running NodeLostTrigger: .auto_add_replicas with currently live nodes: 2
   [junit4]   2> 2375641 DEBUG (ScheduledTrigger-6331-thread-1) [n:127.0.0.1:55720_solr    ] o.a.s.c.a.NodeLostTrigger Running NodeLostTrigger: .auto_add_replicas with currently live nodes: 2
   [junit4]   2> 2376646 DEBUG (ScheduledTrigger-6331-thread-2) [n:127.0.0.1:55720_solr    ] o.a.s.c.a.NodeLostTrigger Running NodeLostTrigger: .auto_add_replicas with currently live nodes: 2
   [junit4]   2> 2377646 DEBUG (ScheduledTrigger-6331-thread-1) [n:127.0.0.1:55720_solr    ] o.a.s.c.a.NodeLostTrigger Running NodeLostTrigger: .auto_add_replicas with currently live nodes: 2
   [junit4]   2> 2378646 DEBUG (ScheduledTrigger-6331-thread-1) [n:127.0.0.1:55720_solr    ] o.a.s.c.a.NodeLostTrigger Running NodeLostTrigger: .auto_add_replicas with currently live nodes: 2
   [junit4]   2> 2379643 INFO  (qtp581229017-25390) [n:127.0.0.1:44638_solr    ] o.a.s.s.HttpSolrCall [admin] webapp=null path=/admin/metrics params={prefix=CONTAINER.fs.usableSpace,CORE.coreName&wt=javabin&version=2&group=solr.node,solr.core} status=0 QTime=0
   [junit4]   2> 2379645 INFO  (qtp1095183666-25359) [n:127.0.0.1:55720_solr    ] o.a.s.s.HttpSolrCall [admin] webapp=null path=/admin/metrics params={prefix=CONTAINER.fs.usableSpace,CORE.coreName&wt=javabin&version=2&group=solr.node,solr.core} status=0 QTime=0
   [junit4]   2> 2379646 DEBUG (qtp581229017-25385) [n:127.0.0.1:44638_solr    ] o.a.s.c.a.AutoScalingHandler Verified autoscaling configuration
   [junit4]   2> 2379646 INFO  (qtp581229017-25385) [n:127.0.0.1:44638_solr    ] o.a.s.s.HttpSolrCall [admin] webapp=null path=/admin/autoscaling params={wt=javabin&version=2} status=0 QTime=9
   [junit4]   2> 2379647 DEBUG (zkCallback-6171-thread-1-processing-n:127.0.0.1:55720_solr) [n:127.0.0.1:55720_solr    ] o.a.s.c.a.OverseerTriggerThread Refreshing /autoscaling.json with znode version 8
   [junit4]   2> 2379647 DEBUG (ScheduledTrigger-6331-thread-1) [n:127.0.0.1:55720_solr    ] o.a.s.c.a.NodeLostTrigger Running NodeLostTrigger: .auto_add_replicas with currently live nodes: 2
   [junit4]   2> 2379649 DEBUG (zkCallback-6171-thread-1-processing-n:127.0.0.1:55720_solr) [n:127.0.0.1:55720_solr    ] o.a.s.c.a.NodeAddedTrigger Initial livenodes: [127.0.0.1:55720_solr, 127.0.0.1:44638_solr]
   [junit4]   2> 2379649 DEBUG (zkCallback-6171-thread-1-processing-n:127.0.0.1:55720_solr) [n:127.0.0.1:55720_solr    ] o.a.s.c.a.NodeAddedTrigger NodeAddedTrigger node_added_triggerEFRS instantiated with properties: {event=nodeAdded, waitFor=10, actions=[{name=test, class=org.apache.solr.cloud.autoscaling.TriggerIntegrationTest$TestTriggerAction}], enabled=true}
   [junit4]   2> 2379650 DEBUG (zkCallback-6171-thread-1-processing-n:127.0.0.1:55720_solr) [n:127.0.0.1:55720_solr    ] o.a.s.c.a.NodeLostTrigger Initial livenodes: [127.0.0.1:55720_solr, 127.0.0.1:44638_solr]
   [junit4]   2> 2379650 DEBUG (OverseerAutoScalingTriggerThread-73339426247540747-127.0.0.1:55720_solr-n_0000000002) [n:127.0.0.1:55720_solr    ] o.a.s.c.a.OverseerTriggerThread Processed trigger updates upto znodeVersion 8
   [junit4]   2> 2379652 INFO  (OverseerAutoScalingTriggerThread-73339426247540747-127.0.0.1:55720_solr-n_0000000002) [n:127.0.0.1:55720_solr    ] o.a.s.c.a.TriggerIntegrationTest TestTriggerAction init
   [junit4]   2> 2379652 INFO  (qtp581229017-25391) [n:127.0.0.1:44638_solr    ] o.a.s.h.a.CollectionsHandler Invoked Collection Action :overseerstatus with params action=OVERSEERSTATUS&wt=javabin&version=2 and sendToOCPQueue=true
   [junit4]   2> 2379653 DEBUG (ScheduledTrigger-6331-thread-3) [n:127.0.0.1:55720_solr    ] o.a.s.c.a.NodeAddedTrigger Running NodeAddedTrigger node_added_triggerEFRS
   [junit4]   2> 2379654 DEBUG (ScheduledTrigger-6331-thread-3) [n:127.0.0.1:55720_solr    ] o.a.s.c.a.NodeAddedTrigger Found livenodes: 2
   [junit4]   2> 2379655 DEBUG (OverseerAutoScalingTriggerThread-73339426247540747-127.0.0.1:55720_solr-n_0000000002) [n:127.0.0.1:55720_solr    ] o.a.s.c.a.OverseerTriggerThread Current znodeVersion 8, lastZnodeVersion 8
   [junit4]   2> 2379658 INFO  (qtp581229017-25391) [n:127.0.0.1:44638_solr    ] o.a.s.s.HttpSolrCall [admin] webapp=null path=/admin/collections params={action=OVERSEERSTATUS&wt=javabin&version=2} status=0 QTime=5
   [junit4]   2> 2379659 INFO  (TEST-TriggerIntegrationTest.testEventFromRestoredState-seed#[E8165FBDA1B87F0A]) [    ] o.e.j.s.Server jetty-9.4.8.v20171121, build timestamp: 2017-11-21T13:27:37-08:00, git hash: 82b8fb23f757335bb3329d540ce37a2a2615f0a8
   [junit4]   2> 2379660 INFO  (TEST-TriggerIntegrationTest.testEventFromRestoredState-seed#[E8165FBDA1B87F0A]) [    ] o.e.j.s.session DefaultSessionIdManager workerName=node0
   [junit4]   2> 2379660 INFO  (TEST-TriggerIntegrationTest.testEventFromRestoredState-seed#[E8165FBDA1B87F0A]) [    ] o.e.j.s.session No SessionScavenger set, using defaults
   [junit4]   2> 2379660 INFO  (TEST-TriggerIntegrationTest.testEventFromRestoredState-seed#[E8165FBDA1B87F0A]) [    ] o.e.j.s.session Scavenging every 660000ms
   [junit4]   2> 2379661 INFO  (TEST-TriggerIntegrationTest.testEventFromRestoredState-seed#[E8165FBDA1B87F0A]) [    ] o.e.j.s.h.ContextHandler Started o.e.j.s.ServletContextHandler@320fde3f{/solr,null,AVAILABLE}
   [junit4]   2> 2379662 INFO  (TEST-TriggerIntegrationTest.testEventFromRestoredState-seed#[E8165FBDA1B87F0A]) [    ] o.e.j.s.AbstractConnector Started ServerConnector@235118e7{HTTP/1.1,[http/1.1]}{127.0.0.1:46369}
   [junit4]   2> 2379662 INFO  (TEST-TriggerIntegrationTest.testEventFromRestoredState-seed#[E8165FBDA1B87F0A]) [    ] o.e.j.s.Server Started @2382001ms
   [junit4]   2> 2379662 INFO  (TEST-TriggerIntegrationTest.testEventFromRestoredState-seed#[E8165FBDA1B87F0A]) [    ] o.a.s.c.s.e.JettySolrRunner Jetty properties: {hostContext=/solr, hostPort=46369}
   [junit4]   2> 2379662 ERROR (TEST-TriggerIntegrationTest.testEventFromRestoredState-seed#[E8165FBDA1B87F0A]) [    ] o.a.s.u.StartupLoggingUtils Missing Java Option solr.log.dir. Logging may be missing or incomplete.
   [junit4]   2> 2379662 INFO  (TEST-TriggerIntegrationTest.testEventFromRestoredState-seed#[E8165FBDA1B87F0A]) [    ] o.a.s.s.SolrDispatchFilter  ___      _       Welcome to Apache Solr™ version 8.0.0
   [junit4]   2> 2379663 INFO  (TEST-TriggerIntegrationTest.testEventFromRestoredState-seed#[E8165FBDA1B87F0A]) [    ] o.a.s.s.SolrDispatchFilter / __| ___| |_ _   Starting in cloud mode on port null
   [junit4]   2> 2379663 INFO  (TEST-TriggerIntegrationTest.testEventFromRestoredState-seed#[E8165FBDA1B87F0A]) [    ] o.a.s.s.SolrDispatchFilter \__ \/ _ \ | '_|  Install dir: null
   [junit4]   2> 2379663 INFO  (TEST-TriggerIntegrationTest.testEventFromRestoredState-seed#[E8165FBDA1B87F0A]) [    ] o.a.s.s.SolrDispatchFilter |___/\___/_|_|    Start time: 2018-02-22T13:48:32.701Z
   [junit4]   2> 2379665 INFO  (zkConnectionManagerCallback-6187-thread-1) [    ] o.a.s.c.c.ConnectionManager zkClient has connected
   [junit4]   2> 2379665 INFO  (TEST-TriggerIntegrationTest.testEventFromRestoredState-seed#[E8165FBDA1B87F0A]) [    ] o.a.s.s.SolrDispatchFilter solr.xml found in ZooKeeper. Loading...
   [junit4]   2> 2379676 INFO  (TEST-TriggerIntegrationTest.testEventFromRestoredState-seed#[E8165FBDA1B87F0A]) [    ] o.a.s.c.ZkContainer Zookeeper client=127.0.0.1:46604/solr
   [junit4]   2> 2379677 INFO  (zkConnectionManagerCallback-6191-thread-1) [    ] o.a.s.c.c.ConnectionManager zkClient has connected
   [junit4]   2> 2379683 INFO  (zkConnectionManagerCallback-6193-thread-1-processing-n:127.0.0.1:46369_solr) [n:127.0.0.1:46369_solr    ] o.a.s.c.c.ConnectionManager zkClient has connected
   [junit4]   2> 2379692 INFO  (TEST-TriggerIntegrationTest.testEventFromRestoredState-seed#[E8165FBDA1B87F0A]) [n:127.0.0.1:46369_solr    ] o.a.s.c.c.ZkStateReader Updated live nodes from ZooKeeper... (0) -> (2)
   [junit4]   2> 2379694 INFO  (TEST-TriggerIntegrationTest.testEventFromRestoredState-seed#[E8165FBDA1B87F0A]) [n:127.0.0.1:46369_solr    ] o.a.s.c.Overseer Overseer (id=null) closing
   [junit4]   2> 2379696 INFO  (TEST-TriggerIntegrationTest.testEventFromRestoredState-seed#[E8165FBDA1B87F0A]) [n:127.0.0.1:46369_solr    ] o.a.s.c.ZkController Register node as live in ZooKeeper:/live_nodes/127.0.0.1:46369_solr
   [junit4]   2> 2379697 INFO  (zkCallback-6162-thread-2) [    ] o.a.s.c.c.ZkStateReader Updated live nodes from ZooKeeper... (2) -> (3)
   [junit4]   2> 2379697 INFO  (zkCallback-6162-thread-3) [    ] o.a.s.c.c.ZkStateReader Updated live nodes from ZooKeeper... (2) -> (3)
   [junit4]   2> 2379697 INFO  (zkCallback-6162-thread-1) [    ] o.a.s.c.c.ZkStateReader Updated live nodes from ZooKeeper... (2) -> (3)
   [junit4]   2> 2379697 INFO  (zkCallback-6181-thread-1-processing-n:127.0.0.1:44638_solr) [n:127.0.0.1:44638_solr    ] o.a.s.c.c.ZkStateReader Updated live nodes from ZooKeeper... (2) -> (3)
   [junit4]   2> 2379697 INFO  (zkCallback-6171-thread-1-processing-n:127.0.0.1:55720_solr) [n:127.0.0.1:55720_solr    ] o.a.s.c.c.ZkStateReader Updated live nodes from ZooKeeper... (2) -> (3)
   [junit4]   2> 2379698 INFO  (zkCallback-6192-thread-1-processing-n:127.0.0.1:46369_solr) [n:127.0.0.1:46369_solr    ] o.a.s.c.c.ZkStateReader Updated live nodes from ZooKeeper... (2) -> (3)
   [junit4]   2> 2379804 INFO  (TEST-TriggerIntegrationTest.testEventFromRestoredState-seed#[E8165FBDA1B87F0A]) [n:127.0.0.1:46369_solr    ] o.a.s.m.r.SolrJmxReporter JMX monitoring for 'solr_46369.solr.node' (registry 'solr.node') enabled at server: com.sun.jmx.mbeanserver.JmxMBeanServer@7b3284b7
   [junit4]   2> 2379815 INFO  (TEST-TriggerIntegrationTest.testEventFromRestoredState-seed#[E8165FBDA1B87F0A]) [n:127.0.0.1:46369_solr    ] o.a.s.m.r.SolrJmxReporter JMX monitoring for 'solr_46369.solr.jvm' (registry 'solr.jvm') enabled at server: com.sun.jmx.mbeanserver.JmxMBeanServer@7b3284b7
   [junit4]   2> 2379816 INFO  (TEST-TriggerIntegrationTest.testEventFromRestoredState-seed#[E8165FBDA1B87F0A]) [n:127.0.0.1:46369_solr    ] o.a.s.m.r.SolrJmxReporter JMX monitoring for 'solr_46369.solr.jetty' (registry 'solr.jetty') enabled at server: com.sun.jmx.mbeanserver.JmxMBeanServer@7b3284b7
   [junit4]   2> 2379817 INFO  (TEST-TriggerIntegrationTest.testEventFromRestoredState-seed#[E8165FBDA1B87F0A]) [n:127.0.0.1:46369_solr    ] o.a.s.c.CorePropertiesLocator Found 0 core definitions underneath /x1/jenkins/jenkins-slave/workspace/Lucene-Solr-Tests-master/solr/build/solr-core/test/J0/temp/solr.cloud.autoscaling.TriggerIntegrationTest_E8165FBDA1B87F0A-001/tempDir-001/node5/.
   [junit4]   2> 2380649 DEBUG (ScheduledTrigger-6331-thread-2) [n:127.0.0.1:55720_solr    ] o.a.s.c.a.NodeLostTrigger Running NodeLostTrigger: .auto_add_replicas with currently live nodes: 3
   [junit4]   2> 2380659 DEBUG (ScheduledTrigger-6331-thread-1) [n:127.0.0.1:55720_solr    ] o.a.s.c.a.NodeAddedTrigger Running NodeAddedTrigger node_added_triggerEFRS
   [junit4]   2> 2380660 DEBUG (ScheduledTrigger-6331-thread-1) [n:127.0.0.1:55720_solr    ] o.a.s.c.a.NodeAddedTrigger Found livenodes: 3
   [junit4]   2> 2380660 DEBUG (ScheduledTrigger-6331-thread-1) [n:127.0.0.1:55720_solr    ] o.a.s.c.a.NodeAddedTrigger Tracking new node: 127.0.0.1:46369_solr at time 19559220917900022
   [junit4]   2> 2381650 DEBUG (ScheduledTrigger-6331-thread-4) [n:127.0.0.1:55720_solr    ] o.a.s.c.a.NodeLostTrigger Running NodeLostTrigger: .auto_add_replicas with currently live nodes: 3
   [junit4]   2> 2381656 INFO  (OverseerCollectionConfigSetProcessor-73339426247540747-127.0.0.1:55720_solr-n_0000000002) [n:127.0.0.1:55720_solr    ] o.a.s.c.OverseerTaskQueue Response ZK path: /overseer/collection-queue-work/qnr-0000000004 doesn't exist.  Requestor may have disconnected from ZooKeeper
   [junit4]   2> 2381661 DEBUG (ScheduledTrigger-6331-thread-4) [n:127.0.0.1:55720_solr    ] o.a.s.c.a.NodeAddedTrigger Running NodeAddedTrigger node_added_triggerEFRS
   [junit4]   2> 2381661 DEBUG (ScheduledTrigger-6331-thread-4) [n:127.0.0.1:55720_solr    ] o.a.s.c.a.NodeAddedTrigger Found livenodes: 3
   [junit4]   2> 2382651 DEBUG (ScheduledTrigger-6331-thread-2) [n:127.0.0.1:55720_solr    ] o.a.s.c.a.NodeLostTrigger Running NodeLostTrigger: .auto_add_replicas with currently live nodes: 3
   [junit4]   2> 2382661 DEBUG (ScheduledTrigger-6331-thread-1) [n:127.0.0.1:55720_solr    ] o.a.s.c.a.NodeAddedTrigger Running NodeAddedTrigger node_added_triggerEFRS
   [junit4]   2> 2382662 DEBUG (ScheduledTrigger-6331-thread-1) [n:127.0.0.1:55720_solr    ] o.a.s.c.a.NodeAddedTrigger Found livenodes: 3
   [junit4]   2> 2383651 DEBUG (ScheduledTrigger-6331-thread-3) [n:127.0.0.1:55720_solr    ] o.a.s.c.a.NodeLostTrigger Running NodeLostTrigger: .auto_add_replicas with currently live nodes: 3
   [junit4]   2> 2383662 DEBUG (ScheduledTrigger-6331-thread-4) [n:127.0.0.1:55720_solr    ] o.a.s.c.a.NodeAddedTrigger Running NodeAddedTrigger node_added_triggerEFRS
   [junit4]   2> 2383662 DEBUG (ScheduledTrigger-6331-thread-4) [n:127.0.0.1:55720_solr    ] o.a.s.c.a.NodeAddedTrigger Found livenodes: 3
   [junit4]   2> 2384651 DEBUG (ScheduledTrigger-6331-thread-2) [n:127.0.0.1:55720_solr    ] o.a.s.c.a.NodeLostTrigger Running NodeLostTrigger: .auto_add_replicas with currently live nodes: 3
   [junit4]   2> 2384662 DEBUG (ScheduledTrigger-6331-thread-1) [n:127.0.0.1:55720_solr    ] o.a.s.c.a.NodeAddedTrigger Running NodeAddedTrigger node_added_triggerEFRS
   [junit4]   2> 2384662 DEBUG (ScheduledTrigger-6331-thread-1) [n:127.0.0.1:55720_solr    ] o.a.s.c.a.NodeAddedTrigger Found livenodes: 3
   [junit4]   2> 2385652 DEBUG (ScheduledTrigger-6331-thread-3) [n:127.0.0.1:55720_solr    ] o.a.s.c.a.NodeLostTrigger Running NodeLostTrigger: .auto_add_replicas with currently live nodes: 3
   [junit4]   2> 2385663 DEBUG (ScheduledTrigger-6331-thread-4) [n:127.0.0.1:55720_solr    ] o.a.s.c.a.NodeAddedTrigger Running NodeAddedTrigger node_added_triggerEFRS
   [junit4]   2> 2385663 DEBUG (ScheduledTrigger-6331-thread-4) [n:127.0.0.1:55720_solr    ] o.a.s.c.a.NodeAddedTrigger Found livenodes: 3
   [junit4]   2> 2386652 DEBUG (ScheduledTrigger-6331-thread-2) [n:127.0.0.1:55720_solr    ] o.a.s.c.a.NodeLostTrigger Running NodeLostTrigger: .auto_add_replicas with currently live nodes: 3
   [junit4]   2> 2386663 DEBUG (ScheduledTrigger-6331-thread-1) [n:127.0.0.1:55720_solr    ] o.a.s.c.a.NodeAddedTrigger Running NodeAddedTrigger node_added_triggerEFRS
   [junit4]   2> 2386663 DEBUG (ScheduledTrigger-6331-thread-1) [n:127.0.0.1:55720_solr    ] o.a.s.c.a.NodeAddedTrigger Found livenodes: 3
   [junit4]   2> 2387652 DEBUG (ScheduledTrigger-6331-thread-3) [n:127.0.0.1:55720_solr    ] o.a.s.c.a.NodeLostTrigger Running NodeLostTrigger: .auto_add_replicas with currently live nodes: 3
   [junit4]   2> 2387663 DEBUG (ScheduledTrigger-6331-thread-4) [n:127.0.0.1:55720_solr    ] o.a.s.c.a.NodeAddedTrigger Running NodeAddedTrigger node_added_triggerEFRS
   [junit4]   2> 2387663 DEBUG (ScheduledTrigger-6331-thread-4) [n:127.0.0.1:55720_solr    ] o.a.s.c.a.NodeAddedTrigger Found livenodes: 3
   [junit4]   2> 2388653 DEBUG (ScheduledTrigger-6331-thread-2) [n:127.0.0.1:55720_solr    ] o.a.s.c.a.NodeLostTrigger Running NodeLostTrigger: .auto_add_replicas with currently live nodes: 3
   [junit4]   2> 2388664 DEBUG (ScheduledTrigger-6331-thread-1) [n:127.0.0.1:55720_solr    ] o.a.s.c.a.NodeAddedTrigger Running NodeAddedTrigger node_added_triggerEFRS
   [junit4]   2> 2388664 DEBUG (ScheduledTrigger-6331-thread-1) [n:127.0.0.1:55720_solr    ] o.a.s.c.a.NodeAddedTrigger Found livenodes: 3
   [junit4]   2> 2389653 DEBUG (ScheduledTrigger-6331-thread-3) [n:127.0.0.1:55720_solr    ] o.a.s.c.a.NodeLostTrigger Running NodeLostTrigger: .auto_add_replicas with currently live nodes: 3
   [junit4]   2> 2389664 DEBUG (ScheduledTrigger-6331-thread-4) [n:127.0.0.1:55720_solr    ] o.a.s.c.a.NodeAddedTrigger Running NodeAddedTrigger node_added_triggerEFRS
   [junit4]   2> 2389664 DEBUG (ScheduledTrigger-6331-thread-4) [n:127.0.0.1:55720_solr    ] o.a.s.c.a.NodeAddedTrigger Found livenodes: 3
   [junit4]   2> 2390653 DEBUG (ScheduledTrigger-6331-thread-4) [n:127.0.0.1:55720_solr    ] o.a.s.c.a.NodeLostTrigger Running NodeLostTrigger: .auto_add_replicas with currently live nodes: 3
   [junit4]   2> 2390664 DEBUG (ScheduledTrigger-6331-thread-1) [n:127.0.0.1:55720_solr    ] o.a.s.c.a.NodeAddedTrigger Running NodeAddedTrigger node_added_triggerEFRS
   [junit4]   2> 2390665 DEBUG (ScheduledTrigger-6331-thread-1) [n:127.0.0.1:55720_solr    ] o.a.s.c.a.NodeAddedTrigger Found livenodes: 3
   [junit4]   2> 2390665 DEBUG (ScheduledTrigger-6331-thread-1) [n:127.0.0.1:55720_solr    ] o.a.s.c.a.NodeAddedTrigger NodeAddedTrigger node_added_triggerEFRS firing registered processor for nodes: [127.0.0.1:46369_solr] added at times [19559220917900022], now=19559230922905383
   [junit4]   2> 2390665 DEBUG (ScheduledTrigger-6331-thread-1) [n:127.0.0.1:55720_solr    ] o.a.s.c.a.ScheduledTriggers ++++++++ Cooldown inactive - processing event: {
   [junit4]   2>   "id":"457d01fee512f6T9o7ewqbvr79nc97ac8rntpb7n",
   [junit4]   2>   "source":"node_added_triggerEFRS",
   [junit4]   2>   "eventTime":19559220917900022,
   [junit4]   2>   "eventType":"NODEADDED",
   [junit4]   2>   "properties":{
   [junit4]   2>     "eventTimes":[19559220917900022],
   [junit4]   2>     "nodeNames":["127.0.0.1:46369_solr"]}}
   [junit4]   2> 2390669 DEBUG (ScheduledTrigger-6331-thread-1) [n:127.0.0.1:55720_solr    ] o.a.s.c.a.ScheduledTriggers Pausing all triggers: [.auto_add_replicas, node_added_triggerEFRS]
   [junit4]   2> 2390671 INFO  (ScheduledTrigger-6331-thread-1) [n:127.0.0.1:55720_solr    ] o.a.s.c.a.SystemLogListener Collection .system does not exist, disabling logging.
   [junit4]   2> 2390672 DEBUG (AutoscalingActionExecutor-6332-thread-1-processing-n:127.0.0.1:55720_solr) [n:127.0.0.1:55720_solr    ] o.a.s.c.a.ScheduledTriggers -- processing actions for {
   [junit4]   2>   "id":"457d01fee512f6T9o7ewqbvr79nc97ac8rntpb7n",
   [junit4]   2>   "source":"node_added_triggerEFRS",
   [junit4]   2>   "eventTime":19559220917900022,
   [junit4]   2>   "eventType":"NODEADDED",
   [junit4]   2>   "properties":{
   [junit4]   2>     "eventTimes":[19559220917900022],
   [junit4]   2>     "_enqueue_time_":19559230927268227,
   [junit4]   2>     "nodeNames":["127.0.0.1:46369_solr"]}}
   [junit4]   2> 2390677 INFO  (TEST-TriggerIntegrationTest.testEventFromRestoredState-seed#[E8165FBDA1B87F0A]) [    ] o.e.j.s.Server jetty-9.4.8.v20171121, build timestamp: 2017-11-21T13:27:37-08:00, git hash: 82b8fb23f757335bb3329d540ce37a2a2615f0a8
   [junit4]   2> 2390678 INFO  (TEST-TriggerIntegrationTest.testEventFromRestoredState-seed#[E8165FBDA1B87F0A]) [    ] o.e.j.s.session DefaultSessionIdManager workerName=node0
   [junit4]   2> 2390678 INFO  (TEST-TriggerIntegrationTest.testEventFromRestoredState-seed#[E8165FBDA1B87F0A]) [    ] o.e.j.s.session No SessionScavenger set, using defaults
   [junit4]   2> 2390678 INFO  (TEST-TriggerIntegrationTest.testEventFromRestoredState-seed#[E8165FBDA1B87F0A]) [    ] o.e.j.s.session Scavenging every 660000ms
   [junit4]   2> 2390679 INFO  (TEST-TriggerIntegrationTest.testEventFromRestoredState-seed#[E8165FBDA1B87F0A]) [    ] o.e.j.s.h.ContextHandler Started o.e.j.s.ServletContextHandler@22a68bb{/solr,null,AVAILABLE}
   [junit4]   2> 2390679 DEBUG (AutoscalingActionExecutor-6332-thread-1-processing-n:127.0.0.1:55720_solr) [n:127.0.0.1:55720_solr    ] o.a.s.c.a.ScheduledTriggers Resuming trigger: .auto_add_replicas after 5000ms
   [junit4]   2> 2390679 DEBUG (AutoscalingActionExecutor-6332-thread-1-processing-n:127.0.0.1:55720_solr) [n:127.0.0.1:55720_solr    ] o.a.s.c.a.ScheduledTriggers Resuming trigger: node_added_triggerEFRS after 5000ms
   [junit4]   2> 2390679 INFO  (TEST-TriggerIntegrationTest.testEventFromRestoredState-seed#[E8165FBDA1B87F0A]) [    ] o.e.j.s.AbstractConnector Started ServerConnector@7a8e518{HTTP/1.1,[http/1.1]}{127.0.0.1:39500}
   [junit4]   2> 2390680 DEBUG (AutoscalingActionExecutor-6332-thread-1-processing-n:127.0.0.1:55720_solr) [n:127.0.0.1:55720_solr    ] o.a.s.c.a.ScheduledTriggers -- processing took 7 ms for event id=457d01fee512f6T9o7ewqbvr79nc97ac8rntpb7n
   [junit4]   2> 2390680 INFO  (TEST-TriggerIntegrationTest.testEventFromRestoredState-seed#[E8165FBDA1B87F0A]) [    ] o.e.j.s.Server Started @2393019ms
   [junit4]   2> 2390680 INFO  (TEST-TriggerIntegrationTest.testEventFromRestoredState-seed#[E8165FBDA1B87F0A]) [    ] o.a.s.c.s.e.JettySolrRunner Jetty properties: {hostContext=/solr, hostPort=39500}
   [junit4]   2> 2390681 ERROR (TEST-TriggerIntegrationTest.testEventFromRestoredState-seed#[E8165FBDA1B87F0A]) [    ] o.a.s.u.StartupLoggingUtils Missing Java Option solr.log.dir. Logging may be missing or incomplete.
   [junit4]   2> 2390681 INFO  (TEST-TriggerIntegrationTest.testEventFromRestoredState-seed#[E8165FBDA1B87F0A]) [    ] o.a.s.s.SolrDispatchFilter  ___      _       Welcome to Apache Solr™ version 8.0.0
   [junit4]   2> 2390681 INFO  (TEST-TriggerIntegrationTest.testEventFromRestoredState-seed#[E8165FBDA1B87F0A]) [    ] o.a.s.s.SolrDispatchFilter / __| ___| |_ _   Starting in cloud mode on port null
   [junit4]   2> 2390681 INFO  (TEST-TriggerIntegrationTest.testEventFromRestoredState-seed#[E8165FBDA1B87F0A]) [    ] o.a.s.s.SolrDispatchFilter \__ \/ _ \ | '_|  Install dir: null
   [junit4]   2> 2390681 INFO  (TEST-TriggerIntegrationTest.testEventFromRestoredState-seed#[E8165FBDA1B87F0A]) [    ] o.a.s.s.SolrDispatchFilter |___/\___/_|_|    Start time: 2018-02-22T13:48:43.719Z
   [junit4]   2> 2390684 INFO  (zkConnectionManagerCallback-6197-thread-1) [    ] o.a.s.c.c.ConnectionManager zkClient has connected
   [junit4]   2> 2390684 INFO  (TEST-TriggerIntegrationTest.testEventFromRestoredState-seed#[E8165FBDA1B87F0A]) [    ] o.a.s.s.SolrDispatchFilter solr.xml found in ZooKeeper. Loading...
   [junit4]   2> 2390696 INFO  (TEST-TriggerIntegrationTest.testEventFromRestoredState-seed#[E8165FBDA1B87F0A]) [    ] o.a.s.c.ZkContainer Zookeeper client=127.0.0.1:46604/solr
   [junit4]   2> 2390697 INFO  (zkConnectionManagerCallback-6201-thread-1) [    ] o.a.s.c.c.ConnectionManager zkClient has connected
   [junit4]   2> 2390704 INFO  (zkConnectionManagerCallback-6203-thread-1-processing-n:127.0.0.1:39500_solr) [n:127.0.0.1:39500_solr    ] o.a.s.c.c.ConnectionManager zkClient has connected
   [junit4]   2> 2390714 INFO  (TEST-TriggerIntegrationTest.testEventFromRestoredState-seed#[E8165FBDA1B87F0A]) [n:127.0.0.1:39500_solr    ] o.a.s.c.c.ZkStateReader Updated live nodes from ZooKeeper... (0) -> (3)
   [junit4]   2> 2390717 INFO  (TEST-TriggerIntegrationTest.testEventFromRestoredState-seed#[E8165FBDA1B87F0A]) [n:127.0.0.1:39500_solr    ] o.a.s.c.Overseer Overseer (id=null) closing
   [junit4]   2> 2390719 INFO  (TEST-TriggerIntegrationTest.testEventFromRestoredState-seed#[E8165FBDA1B87F0A]) [n:127.0.0.1:39500_solr    ] o.a.s.c.ZkController Register node as live in ZooKeeper:/live_nodes/127.0.0.1:39500_solr
   [junit4]   2> 2390722 INFO  (zkCallback-6192-thread-1-processing-n:127.0.0.1:46369_solr) [n:127.0.0.1:46369_solr    ] o.a.s.c.c.ZkStateReader Updated live nodes from ZooKeeper... (3) -> (4)
   [junit4]   2> 2390722 INFO  (zkCallback-6162-thread-1) [    ] o.a.s.c.c.ZkStateReader Updated live nodes from ZooKeeper... (3) -> (4)
   [junit4]   2> 2390722 INFO  (zkCallback-6162-thread-2) [    ] o.a.s.c.c.ZkStateReader Updated live nodes from ZooKeeper... (3) -> (4)
   [junit4]   2> 2390723 INFO  (zkCallback-6202-thread-1-processing-n:127.0.0.1:39500_solr) [n:127.0.0.1:39500_solr    ] o.a.s.c.c.ZkStateReader Updated live nodes from ZooKeeper... (3) -> (4)
   [junit4]   2> 2390726 INFO  (zkCallback-6162-thread-3) [    ] o.a.s.c.c.ZkStateReader Updated live nodes from ZooKeeper... (3) -> (4)
   [junit4]   2> 2390726 INFO  (zkCallback-6181-thread-1-processing-n:127.0.0.1:44638_solr) [n:127.0.0.1:44638_solr    ] o.a.s.c.c.ZkStateReader Updated live nodes from ZooKeeper... (3) -> (4)
   [junit4]   2> 2390727 INFO  (zkCallback-6171-thread-1-processing-n:127.0.0.1:55720_solr) [n:127.0.0.1:55720_solr    ] o.a.s.c.c.ZkStateReader Updated live nodes from ZooKeeper... (3) -> (4)
   [junit4]   2> 2390802 INFO  (TEST-TriggerIntegrationTest.testEventFromRestoredState-seed#[E8165FBDA1B87F0A]) [n:127.0.0.1:39500_solr    ] o.a.s.m.r.SolrJmxReporter JMX monitoring for 'solr_39500.solr.node' (registry 'solr.node') enabled at server: com.sun.jmx.mbeanserver.JmxMBeanServer@7b3284b7
   [junit4]   2> 2390813 INFO  (TEST-TriggerIntegrationTest.testEventFromRestoredState-seed#[E8165FBDA1B87F0A]) [n:127.0.0.1:39500_solr    ] o.a.s.m.r.SolrJmxReporter JMX monitoring for 'solr_39500.solr.jvm' (registry 'solr.jvm') enabled at server: com.sun.jmx.mbeanserver.JmxMBeanServer@7b3284b7
   [junit4]   2> 2390813 INFO  (TEST-TriggerIntegrationTest.testEventFromRestoredState-seed#[E8165FBDA1B87F0A]) [n:127.0.0.1:39500_solr    ] o.a.s.m.r.SolrJmxReporter JMX monitoring for 'solr_39500.solr.jetty' (registry 'solr.jetty') enabled at server: com.sun.jmx.mbeanserver.JmxMBeanServer@7b3284b7
   [junit4]   2> 2390814 INFO  (TEST-TriggerIntegrationTest.testEventFromRestoredState-seed#[E8165FBDA1B87F0A]) [n:127.0.0.1:39500_solr    ] o.a.s.c.CorePropertiesLocator Found 0 core definitions underneath /x1/jenkins/jenkins-slave/workspace/Lucene-Solr-Tests-master/solr/build/solr-core/test/J0/temp/solr.cloud.autoscaling.TriggerIntegrationTest_E8165FBDA1B87F0A-001/tempDir-001/node6/.
   [junit4]   2> 2395679 DEBUG (ScheduledTrigger-6331-thread-2) [n:127.0.0.1:55720_solr    ] o.a.s.c.a.NodeLostTrigger Running NodeLostTrigger: .auto_add_replicas with currently live nodes: 4
   [junit4]   2> 2395680 DEBUG (ScheduledTrigger-6331-thread-4) [n:127.0.0.1:55720_solr    ] o.a.s.c.a.NodeAddedTrigger Running NodeAddedTrigger node_added_triggerEFRS
   [junit4]   2> 2395680 DEBUG (ScheduledTrigger-6331-thread-4) [n:127.0.0.1:55720_solr    ] o.a.s.c.a.NodeAddedTrigger Found livenodes: 4
   [junit4]   2> 2395680 DEBUG (ScheduledTrigger-6331-thread-4) [n:127.0.0.1:55720_solr    ] o.a.s.c.a.NodeAddedTrigger Tracking new node: 127.0.0.1:39500_solr at time 19559235938115686
   [junit4]   2> 2396681 DEBUG (ScheduledTrigger-6331-thread-2) [n:127.0.0.1:55720_solr    ] o.a.s.c.a.NodeLostTrigger Running NodeLostTrigger: .auto_add_replicas with currently live nodes: 4
   [junit4]   2> 2396681 DEBUG (ScheduledTrigger-6331-thread-3) [n:127.0.0.1:55720_solr    ] o.a.s.c.a.NodeAddedTrigger Running NodeAddedTrigger node_added_triggerEFRS
   [junit4]   2> 2396681 DEBUG (ScheduledTrigger-6331-thread-3) [n:127.0.0.1:55720_solr    ] o.a.s.c.a.NodeAddedTrigger Found livenodes: 4
   [junit4]   2> 2397681 DEBUG (ScheduledTrigger-6331-thread-2) [n:127.0.0.1:55720_solr    ] o.a.s.c.a.NodeLostTrigger Running NodeLostTrigger: .auto_add_replicas with currently live nodes: 4
   [junit4]   2> 2397681 DEBUG (ScheduledTrigger-6331-thread-4) [n:127.0.0.1:55720_solr    ] o.a.s.c.a.NodeAddedTrigger Running NodeAddedTrigger node_added_triggerEFRS
   [junit4]   2> 2397681 DEBUG (ScheduledTrigger-6331-thread-4) [n:127.0.0.1:55720_solr    ] o.a.s.c.a.NodeAddedTrigger Found livenodes: 4
   [junit4]   2> 2398681 DEBUG (ScheduledTrigger-6331-thread-2) [n:127.0.0.1:55720_solr    ] o.a.s.c.a.NodeLostTrigger Running NodeLostTrigger: .auto_add_replicas with currently live nodes: 4
   [junit4]   2> 2398682 DEBUG (ScheduledTrigger-6331-thread-3) [n:127.0.0.1:55720_solr    ] o.a.s.c.a.NodeAddedTrigger Running NodeAddedTrigger node_added_triggerEFRS
   [junit4]   2> 2398682 DEBUG (ScheduledTrigger-6331-thread-3) [n:127.0.0.1:55720_solr    ] o.a.s.c.a.NodeAddedTrigger Found livenodes: 4
   [junit4]   2> 2399682 DEBUG (ScheduledTrigger-6331-thread-2) [n:127.0.0.1:55720_solr    ] o.a.s.c.a.NodeLostTrigger Running NodeLostTrigger: .auto_add_replicas with currently live nodes: 4
   [junit4]   2> 2399682 DEBUG (ScheduledTrigger-6331-thread-4) [n:127.0.0.1:55720_solr    ] o.a.s.c.a.NodeAddedTrigger Running NodeAddedTrigger node_added_triggerEFRS
   [junit4]   2> 2399682 DEBUG (ScheduledTrigger-6331-thread-4) [n:127.0.0.1:55720_solr    ] o.a.s.c.a.NodeAddedTrigger Found livenodes: 4
   [junit4]   2> 2400682 DEBUG (ScheduledTrigger-6331-thread-1) [n:127.0.0.1:55720_solr    ] o.a.s.c.a.NodeLostTrigger Running NodeLostTrigger: .auto_add_replicas with currently live nodes: 4
   [junit4]   2> 2400682 DEBUG (ScheduledTrigger-6331-thread-3) [n:127.0.0.1:55720_solr    ] o.a.s.c.a.NodeAddedTrigger Running NodeAddedTrigger node_added_triggerEFRS
   [junit4]   2> 2400682 DEBUG (ScheduledTrigger-6331-thread-3) [n:127.0.0.1:55720_solr    ] o.a.s.c.a.NodeAddedTrigger Found livenodes: 4
   [junit4]   2> 2400875 INFO  (TEST-TriggerIntegrationTest.testEventFromRestoredState-seed#[E8165FBDA1B87F0A]) [    ] o.e.j.s.AbstractConnector Stopped ServerConnector@5fe1c4fb{HTTP/1.1,[http/1.1]}{127.0.0.1:0}
   [junit4]   2> 2400876 INFO  (TEST-TriggerIntegrationTest.testEventFromRestoredState-seed#[E8165FBDA1B87F0A]) [    ] o.a.s.c.CoreContainer Shutting down CoreContainer instance=36431399
   [junit4]   2> 2400876 INFO  (TEST-TriggerIntegrationTest.testEventFromRestoredState-seed#[E8165FBDA1B87F0A]) [    ] o.a.s.m.SolrMetricManager Closing metric reporters for registry=solr.node, tag=null
   [junit4]   2> 2400876 INFO  (TEST-TriggerIntegrationTest.testEventFromRestoredState-seed#[E8165FBDA1B87F0A]) [    ] o.a.s.m.r.SolrJmxReporter Closing reporter [org.apache.solr.metrics.reporters.SolrJmxReporter@15d21c79: rootName = solr_55720, domain = solr.node, service url = null, agent id = null] for registry solr.node / com.codahale.metrics.MetricRegistry@49a9c998
   [junit4]   2> 2400884 INFO  (TEST-TriggerIntegrationTest.testEventFromRestoredState-seed#[E8165FBDA1B87F0A]) [    ] o.a.s.m.SolrMetricManager Closing metric reporters for registry=solr.jvm, tag=null
   [junit4]   2> 2400884 INFO  (TEST-TriggerIntegrationTest.testEventFromRestoredState-seed#[E8165FBDA1B87F0A]) [    ] o.a.s.m.r.SolrJmxReporter Closing reporter [org.apache.solr.metrics.reporters.SolrJmxReporter@7ac573c7: rootName = solr_55720, domain = solr.jvm, service url = null, agent id = 

[...truncated too long message...]

or.runWorker(ThreadPoolExecutor.java:1149)
   [junit4]   2> 	at java.util.concurrent.ThreadPoolExecutor$Worker.run(ThreadPoolExecutor.java:624)
   [junit4]   2> 	at java.lang.Thread.run(Thread.java:748)
   [junit4]   2> 2661711 INFO  (jetty-closer-6135-thread-3) [    ] o.e.j.s.h.ContextHandler Stopped o.e.j.s.ServletContextHandler@65a8b459{/solr,null,UNAVAILABLE}
   [junit4]   2> 2661712 INFO  (jetty-closer-6135-thread-3) [    ] o.e.j.s.session Stopped scavenging
   [junit4]   2> 2661713 ERROR (SUITE-TriggerIntegrationTest-seed#[E8165FBDA1B87F0A]-worker) [    ] o.a.z.s.ZooKeeperServer ZKShutdownHandler is not registered, so ZooKeeper server won't take any action on ERROR or SHUTDOWN server state changes
   [junit4]   2> 2661714 INFO  (SUITE-TriggerIntegrationTest-seed#[E8165FBDA1B87F0A]-worker) [    ] o.a.s.c.ZkTestServer connecting to 127.0.0.1:46604 46604
   [junit4]   2> 2661817 INFO  (Thread-3337) [    ] o.a.s.c.ZkTestServer connecting to 127.0.0.1:46604 46604
   [junit4]   2> 2661822 WARN  (Thread-3337) [    ] o.a.s.c.ZkTestServer Watch limit violations: 
   [junit4]   2> Maximum concurrent create/delete watches above limit:
   [junit4]   2> 
   [junit4]   2> 	43	/solr/aliases.json
   [junit4]   2> 	43	/solr/clusterprops.json
   [junit4]   2> 	38	/solr/collections/collection1/terms/shard1
   [junit4]   2> 	27	/solr/security.json
   [junit4]   2> 	21	/solr/collections/testScheduledTrigger/terms/shard2
   [junit4]   2> 	15	/solr/collections/testScheduledTrigger/terms/shard1
   [junit4]   2> 	11	/solr/collections/testMetricTrigger/terms/shard1
   [junit4]   2> 	9	/solr/configs/conf
   [junit4]   2> 	7	/solr/configs/testScheduledTrigger.AUTOCREATED/managed-schema
   [junit4]   2> 	6	/solr/configs/testScheduledTrigger.AUTOCREATED
   [junit4]   2> 	3	/solr/collections/testMetricTrigger/terms/shard2
   [junit4]   2> 
   [junit4]   2> Maximum concurrent data watches above limit:
   [junit4]   2> 
   [junit4]   2> 	65	/solr/collections/testScheduledTrigger/state.json
   [junit4]   2> 	54	/solr/collections/collection1/state.json
   [junit4]   2> 	43	/solr/clusterstate.json
   [junit4]   2> 	34	/solr/collections/testMetricTrigger/state.json
   [junit4]   2> 	21	/solr/autoscaling.json
   [junit4]   2> 	2	/solr/collections/collection1/leader_elect/shard1/election/73339426247540799-core_node4-n_0000000000
   [junit4]   2> 	2	/solr/collections/testScheduledTrigger/leader_elect/shard2/election/73339426247540783-core_node11-n_0000000001
   [junit4]   2> 	2	/solr/overseer_elect/election/73339426247540805-127.0.0.1:41348_solr-n_0000000021
   [junit4]   2> 	2	/solr/overseer_elect/election/73339426247540814-127.0.0.1:36629_solr-n_0000000024
   [junit4]   2> 	2	/solr/collections/testScheduledTrigger/leader_elect/shard1/election/73339426247540774-core_node5-n_0000000000
   [junit4]   2> 
   [junit4]   2> Maximum concurrent children watches above limit:
   [junit4]   2> 
   [junit4]   2> 	423	/solr/live_nodes
   [junit4]   2> 	110	/solr/collections
   [junit4]   2> 	21	/solr/overseer/queue-work
   [junit4]   2> 	21	/solr/autoscaling/events/.auto_add_replicas
   [junit4]   2> 	21	/solr/overseer/collection-queue-work
   [junit4]   2> 	20	/solr/overseer/queue
   [junit4]   2> 	2	/solr/autoscaling/events/node_lost_triggerMR
   [junit4]   2> 	2	/solr/autoscaling/events/node_added_triggerCTOOR
   [junit4]   2> 
   [junit4]   2> NOTE: leaving temporary files on disk at: /x1/jenkins/jenkins-slave/workspace/Lucene-Solr-Tests-master/solr/build/solr-core/test/J0/temp/solr.cloud.autoscaling.TriggerIntegrationTest_E8165FBDA1B87F0A-001
   [junit4]   2> NOTE: test params are: codec=Asserting(Lucene70): {id=Lucene50(blocksize=128), x_s=PostingsFormat(name=Memory)}, docValues:{}, maxPointsInLeafNode=671, maxMBSortInHeap=6.581489445821132, sim=Asserting(org.apache.lucene.search.similarities.AssertingSimilarity@37a332ea), locale=en, timezone=Africa/Dakar
   [junit4]   2> NOTE: Linux 3.13.0-88-generic amd64/Oracle Corporation 1.8.0_144 (64-bit)/cpus=4,threads=1,free=170494544,total=517472256
   [junit4]   2> NOTE: All tests run in this JVM: [UUIDUpdateProcessorFallbackTest, TestSystemCollAutoCreate, DeleteShardTest, TestGroupingSearch, TestPerFieldSimilarityWithDefaultOverride, CursorPagingTest, TestCollationField, ExecutePlanActionTest, TestTrieFacet, RAMDirectoryFactoryTest, TestLegacyTerms, TestInfoStreamLogging, HdfsDirectoryFactoryTest, TestConfigSets, TestMacroExpander, SolrCoreCheckLockOnStartupTest, SpellCheckCollatorWithCollapseTest, TestImpersonationWithHadoopAuth, TestCSVLoader, TestQuerySenderNoQuery, BadCopyFieldTest, TestStressLiveNodes, BasicDistributedZkTest, HLLSerializationTest, TestFieldCacheSortRandom, TestExclusionRuleCollectionAccess, LeaderFailureAfterFreshStartTest, TestSolrCloudWithSecureImpersonation, DistributedQueryComponentOptimizationTest, HdfsChaosMonkeySafeLeaderTest, OpenCloseCoreStressTest, TestPHPSerializedResponseWriter, ZkStateReaderTest, RollingRestartTest, MetricTriggerTest, EnumFieldTest, ChaosMonkeySafeLeaderWithPullReplicasTest, RequestHandlersTest, TestSolrCoreSnapshots, AutoAddReplicasPlanActionTest, DocumentAnalysisRequestHandlerTest, TestSmileRequest, TestDistributedSearch, TestFieldSortValues, FieldAnalysisRequestHandlerTest, PluginInfoTest, TestNodeLostTrigger, HealthCheckHandlerTest, TestLuceneMatchVersion, AtomicUpdateProcessorFactoryTest, OpenExchangeRatesOrgProviderTest, TestSkipOverseerOperations, TestLRUStatsCache, UpdateLogTest, TestHighlightDedupGrouping, RuleEngineTest, TestIndexingPerformance, DirectUpdateHandlerTest, TestFileDictionaryLookup, TestHashQParserPlugin, IndexBasedSpellCheckerTest, MetricUtilsTest, TestCollationFieldDocValues, TestSQLHandlerNonCloud, SolrMetricManagerTest, StatsReloadRaceTest, CoreMergeIndexesAdminHandlerTest, TestSolrCLIRunExample, TestCoreBackup, AssignBackwardCompatibilityTest, TestNestedDocsSort, TestLegacyField, ConcurrentCreateRoutedAliasTest, EchoParamsTest, UninvertDocValuesMergePolicyTest, SchemaApiFailureTest, OverseerStatusTest, TriLevelCompositeIdRoutingTest, LargeFieldTest, TestMaxTokenLenTokenizer, TestDocumentBuilder, TestMinMaxOnMultiValuedField, ZkSolrClientTest, TestFieldResource, TestCrossCoreJoin, TestCSVResponseWriter, ConcurrentDeleteAndCreateCollectionTest, DistributedFacetPivotLargeTest, TestFieldCache, HdfsWriteToMultipleCollectionsTest, TestGenericDistributedQueue, TestSort, TestRemoteStreaming, CurrencyFieldTypeTest, TestClassicSimilarityFactory, TestConfig, DistribDocExpirationUpdateProcessorTest, HdfsDirectoryTest, CdcrRequestHandlerTest, TestRawTransformer, InfixSuggestersTest, TestJsonRequest, CdcrBootstrapTest, TestDynamicFieldCollectionResource, TestPullReplicaErrorHandling, TestSubQueryTransformerDistrib, TestJoin, TestCloudPseudoReturnFields, ZkNodePropsTest, TestBinaryField, TestPolicyCloud, TestComplexPhraseLeadingWildcard, TestLegacyFieldCache, FullSolrCloudDistribCmdsTest, SharedFSAutoReplicaFailoverTest, NodeMutatorTest, SolrRequestParserTest, DistributedTermsComponentTest, SpellCheckCollatorTest, TestComponentsName, AnalyticsQueryTest, TestNoOpRegenerator, TestOmitPositions, ZkCLITest, TestSchemaManager, TestRandomFaceting, TestCollectionsAPIViaSolrCloudCluster, LIRRollingUpdatesTest, OutOfBoxZkACLAndCredentialsProvidersTest, OverriddenZkACLAndCredentialsProvidersTest, OverseerCollectionConfigSetProcessorTest, OverseerModifyCollectionTest, OverseerRolesTest, PeerSyncReplicationTest, ReplaceNodeTest, TestCloudInspectUtil, TestCloudRecovery, TestLeaderElectionWithEmptyReplica, TestRebalanceLeaders, TestShortCircuitedRequests, TestTolerantUpdateProcessorRandomCloud, AssignTest, CollectionsAPIDistributedZkTest, AutoScalingHandlerTest, HttpTriggerListenerTest, ScheduledTriggerTest, SystemLogListenerTest, TriggerIntegrationTest]
   [junit4] Completed [653/779 (1!)] on J0 in 294.91s, 15 tests, 1 failure <<< FAILURES!

[...truncated 25896 lines...]
-check-forbidden-all:
[forbidden-apis] Reading bundled API signatures: jdk-unsafe-1.8
[forbidden-apis] Reading bundled API signatures: jdk-deprecated-1.8
[forbidden-apis] Reading bundled API signatures: jdk-non-portable
[forbidden-apis] Reading bundled API signatures: jdk-reflection
[forbidden-apis] Reading bundled API signatures: commons-io-unsafe-2.5
[forbidden-apis] Reading API signatures: /x1/jenkins/jenkins-slave/workspace/Lucene-Solr-Tests-master/lucene/tools/forbiddenApis/base.txt
[forbidden-apis] Reading API signatures: /x1/jenkins/jenkins-slave/workspace/Lucene-Solr-Tests-master/lucene/tools/forbiddenApis/servlet-api.txt
[forbidden-apis] Reading API signatures: /x1/jenkins/jenkins-slave/workspace/Lucene-Solr-Tests-master/lucene/tools/forbiddenApis/solr.txt
[forbidden-apis] Loading classes to check...
[forbidden-apis] Scanning classes for violations...
[forbidden-apis] Forbidden method invocation: java.lang.System#currentTimeMillis() [Use RTimer/TimeOut/System.nanoTime for time comparisons, and `new Date()` output/debugging/stats of timestamps. If for some miscellaneous reason, you absolutely need to use this, use a SuppressForbidden.]
[forbidden-apis]   in org.apache.solr.cloud.autoscaling.ScheduledTriggerTest (ScheduledTriggerTest.java:80)
[forbidden-apis] Scanned 3978 class file(s) for forbidden API invocations (in 3.42s), 1 error(s).

BUILD FAILED
/x1/jenkins/jenkins-slave/workspace/Lucene-Solr-Tests-master/build.xml:618: The following error occurred while executing this line:
/x1/jenkins/jenkins-slave/workspace/Lucene-Solr-Tests-master/build.xml:117: The following error occurred while executing this line:
/x1/jenkins/jenkins-slave/workspace/Lucene-Solr-Tests-master/solr/build.xml:376: The following error occurred while executing this line:
/x1/jenkins/jenkins-slave/workspace/Lucene-Solr-Tests-master/solr/common-build.xml:535: Check for forbidden API calls failed, see log.

Total time: 83 minutes 7 seconds
Build step 'Invoke Ant' marked build as failure
Archiving artifacts
Recording test results
Email was triggered for: Failure - Any
Sending email for trigger: Failure - Any

Mime
View raw message