lucene-dev mailing list archives

Site index · List index
Message view « Date » · « Thread »
Top « Date » · « Thread »
From Apache Jenkins Server <jenk...@builds.apache.org>
Subject [JENKINS] Lucene-Solr-Tests-7.x - Build # 379 - Still Unstable
Date Mon, 12 Feb 2018 16:03:01 GMT
Build: https://builds.apache.org/job/Lucene-Solr-Tests-7.x/379/

1 tests failed.
FAILED:  org.apache.solr.cloud.autoscaling.TriggerIntegrationTest.testNodeLostTrigger

Error Message:


Stack Trace:
java.lang.AssertionError
	at __randomizedtesting.SeedInfo.seed([265F98BEBC3430CA:22A131AC86FEB250]:0)
	at org.junit.Assert.fail(Assert.java:92)
	at org.junit.Assert.assertTrue(Assert.java:43)
	at org.junit.Assert.assertTrue(Assert.java:54)
	at org.apache.solr.cloud.autoscaling.TriggerIntegrationTest.testNodeLostTrigger(TriggerIntegrationTest.java:521)
	at sun.reflect.NativeMethodAccessorImpl.invoke0(Native Method)
	at sun.reflect.NativeMethodAccessorImpl.invoke(NativeMethodAccessorImpl.java:62)
	at sun.reflect.DelegatingMethodAccessorImpl.invoke(DelegatingMethodAccessorImpl.java:43)
	at java.lang.reflect.Method.invoke(Method.java:498)
	at com.carrotsearch.randomizedtesting.RandomizedRunner.invoke(RandomizedRunner.java:1737)
	at com.carrotsearch.randomizedtesting.RandomizedRunner$8.evaluate(RandomizedRunner.java:934)
	at com.carrotsearch.randomizedtesting.RandomizedRunner$9.evaluate(RandomizedRunner.java:970)
	at com.carrotsearch.randomizedtesting.RandomizedRunner$10.evaluate(RandomizedRunner.java:984)
	at com.carrotsearch.randomizedtesting.rules.SystemPropertiesRestoreRule$1.evaluate(SystemPropertiesRestoreRule.java:57)
	at org.apache.lucene.util.TestRuleSetupTeardownChained$1.evaluate(TestRuleSetupTeardownChained.java:49)
	at org.apache.lucene.util.AbstractBeforeAfterRule$1.evaluate(AbstractBeforeAfterRule.java:45)
	at org.apache.lucene.util.TestRuleThreadAndTestName$1.evaluate(TestRuleThreadAndTestName.java:48)
	at org.apache.lucene.util.TestRuleIgnoreAfterMaxFailures$1.evaluate(TestRuleIgnoreAfterMaxFailures.java:64)
	at org.apache.lucene.util.TestRuleMarkFailure$1.evaluate(TestRuleMarkFailure.java:47)
	at com.carrotsearch.randomizedtesting.rules.StatementAdapter.evaluate(StatementAdapter.java:36)
	at com.carrotsearch.randomizedtesting.ThreadLeakControl$StatementRunner.run(ThreadLeakControl.java:368)
	at com.carrotsearch.randomizedtesting.ThreadLeakControl.forkTimeoutingTask(ThreadLeakControl.java:817)
	at com.carrotsearch.randomizedtesting.ThreadLeakControl$3.evaluate(ThreadLeakControl.java:468)
	at com.carrotsearch.randomizedtesting.RandomizedRunner.runSingleTest(RandomizedRunner.java:943)
	at com.carrotsearch.randomizedtesting.RandomizedRunner$5.evaluate(RandomizedRunner.java:829)
	at com.carrotsearch.randomizedtesting.RandomizedRunner$6.evaluate(RandomizedRunner.java:879)
	at com.carrotsearch.randomizedtesting.RandomizedRunner$7.evaluate(RandomizedRunner.java:890)
	at com.carrotsearch.randomizedtesting.rules.StatementAdapter.evaluate(StatementAdapter.java:36)
	at com.carrotsearch.randomizedtesting.rules.SystemPropertiesRestoreRule$1.evaluate(SystemPropertiesRestoreRule.java:57)
	at org.apache.lucene.util.AbstractBeforeAfterRule$1.evaluate(AbstractBeforeAfterRule.java:45)
	at com.carrotsearch.randomizedtesting.rules.StatementAdapter.evaluate(StatementAdapter.java:36)
	at org.apache.lucene.util.TestRuleStoreClassName$1.evaluate(TestRuleStoreClassName.java:41)
	at com.carrotsearch.randomizedtesting.rules.NoShadowingOrOverridesOnMethodsRule$1.evaluate(NoShadowingOrOverridesOnMethodsRule.java:40)
	at com.carrotsearch.randomizedtesting.rules.NoShadowingOrOverridesOnMethodsRule$1.evaluate(NoShadowingOrOverridesOnMethodsRule.java:40)
	at com.carrotsearch.randomizedtesting.rules.StatementAdapter.evaluate(StatementAdapter.java:36)
	at com.carrotsearch.randomizedtesting.rules.StatementAdapter.evaluate(StatementAdapter.java:36)
	at com.carrotsearch.randomizedtesting.rules.StatementAdapter.evaluate(StatementAdapter.java:36)
	at org.apache.lucene.util.TestRuleAssertionsRequired$1.evaluate(TestRuleAssertionsRequired.java:53)
	at org.apache.lucene.util.TestRuleMarkFailure$1.evaluate(TestRuleMarkFailure.java:47)
	at org.apache.lucene.util.TestRuleIgnoreAfterMaxFailures$1.evaluate(TestRuleIgnoreAfterMaxFailures.java:64)
	at org.apache.lucene.util.TestRuleIgnoreTestSuites$1.evaluate(TestRuleIgnoreTestSuites.java:54)
	at com.carrotsearch.randomizedtesting.rules.StatementAdapter.evaluate(StatementAdapter.java:36)
	at com.carrotsearch.randomizedtesting.ThreadLeakControl$StatementRunner.run(ThreadLeakControl.java:368)
	at java.lang.Thread.run(Thread.java:748)




Build Log:
[...truncated 12583 lines...]
   [junit4] Suite: org.apache.solr.cloud.autoscaling.TriggerIntegrationTest
   [junit4]   2> Creating dataDir: /x1/jenkins/jenkins-slave/workspace/Lucene-Solr-Tests-7.x/solr/build/solr-core/test/J1/temp/solr.cloud.autoscaling.TriggerIntegrationTest_265F98BEBC3430CA-001/init-core-data-001
   [junit4]   2> 455673 WARN  (SUITE-TriggerIntegrationTest-seed#[265F98BEBC3430CA]-worker) [    ] o.a.s.SolrTestCaseJ4 startTrackingSearchers: numOpens=769 numCloses=769
   [junit4]   2> 455673 INFO  (SUITE-TriggerIntegrationTest-seed#[265F98BEBC3430CA]-worker) [    ] o.a.s.SolrTestCaseJ4 Using TrieFields (NUMERIC_POINTS_SYSPROP=false) w/NUMERIC_DOCVALUES_SYSPROP=true
   [junit4]   2> 455674 INFO  (SUITE-TriggerIntegrationTest-seed#[265F98BEBC3430CA]-worker) [    ] o.a.s.SolrTestCaseJ4 Randomized ssl (true) and clientAuth (true) via: @org.apache.solr.util.RandomizeSSL(reason=, ssl=NaN, value=NaN, clientAuth=NaN)
   [junit4]   2> 455676 INFO  (SUITE-TriggerIntegrationTest-seed#[265F98BEBC3430CA]-worker) [    ] o.a.s.SolrTestCaseJ4 SecureRandom sanity checks: test.solr.allowed.securerandom=null & java.security.egd=file:/dev/./urandom
   [junit4]   2> 455676 INFO  (SUITE-TriggerIntegrationTest-seed#[265F98BEBC3430CA]-worker) [    ] o.a.s.c.MiniSolrCloudCluster Starting cluster of 2 servers in /x1/jenkins/jenkins-slave/workspace/Lucene-Solr-Tests-7.x/solr/build/solr-core/test/J1/temp/solr.cloud.autoscaling.TriggerIntegrationTest_265F98BEBC3430CA-001/tempDir-001
   [junit4]   2> 455676 INFO  (SUITE-TriggerIntegrationTest-seed#[265F98BEBC3430CA]-worker) [    ] o.a.s.c.ZkTestServer STARTING ZK TEST SERVER
   [junit4]   2> 455677 INFO  (Thread-805) [    ] o.a.s.c.ZkTestServer client port:0.0.0.0/0.0.0.0:0
   [junit4]   2> 455677 INFO  (Thread-805) [    ] o.a.s.c.ZkTestServer Starting server
   [junit4]   2> 455678 ERROR (Thread-805) [    ] o.a.z.s.ZooKeeperServer ZKShutdownHandler is not registered, so ZooKeeper server won't take any action on ERROR or SHUTDOWN server state changes
   [junit4]   2> 455777 INFO  (SUITE-TriggerIntegrationTest-seed#[265F98BEBC3430CA]-worker) [    ] o.a.s.c.ZkTestServer start zk server on port:55242
   [junit4]   2> 455785 INFO  (zkConnectionManagerCallback-968-thread-1) [    ] o.a.s.c.c.ConnectionManager zkClient has connected
   [junit4]   2> 455792 INFO  (jetty-launcher-965-thread-2) [    ] o.e.j.s.Server jetty-9.4.8.v20171121, build timestamp: 2017-11-21T23:27:37+02:00, git hash: 82b8fb23f757335bb3329d540ce37a2a2615f0a8
   [junit4]   2> 455793 INFO  (jetty-launcher-965-thread-1) [    ] o.e.j.s.Server jetty-9.4.8.v20171121, build timestamp: 2017-11-21T23:27:37+02:00, git hash: 82b8fb23f757335bb3329d540ce37a2a2615f0a8
   [junit4]   2> 455798 INFO  (jetty-launcher-965-thread-2) [    ] o.e.j.s.session DefaultSessionIdManager workerName=node0
   [junit4]   2> 455798 INFO  (jetty-launcher-965-thread-2) [    ] o.e.j.s.session No SessionScavenger set, using defaults
   [junit4]   2> 455798 INFO  (jetty-launcher-965-thread-2) [    ] o.e.j.s.session Scavenging every 660000ms
   [junit4]   2> 455799 INFO  (jetty-launcher-965-thread-2) [    ] o.e.j.s.h.ContextHandler Started o.e.j.s.ServletContextHandler@68168ed8{/solr,null,AVAILABLE}
   [junit4]   2> 455799 INFO  (jetty-launcher-965-thread-2) [    ] o.e.j.s.AbstractConnector Started ServerConnector@f8a7e02{SSL,[ssl, http/1.1]}{127.0.0.1:55310}
   [junit4]   2> 455799 INFO  (jetty-launcher-965-thread-2) [    ] o.e.j.s.Server Started @457970ms
   [junit4]   2> 455799 INFO  (jetty-launcher-965-thread-2) [    ] o.a.s.c.s.e.JettySolrRunner Jetty properties: {hostContext=/solr, hostPort=55310}
   [junit4]   2> 455799 ERROR (jetty-launcher-965-thread-2) [    ] o.a.s.u.StartupLoggingUtils Missing Java Option solr.log.dir. Logging may be missing or incomplete.
   [junit4]   2> 455800 INFO  (jetty-launcher-965-thread-2) [    ] o.a.s.s.SolrDispatchFilter  ___      _       Welcome to Apache Solr™ version 7.3.0
   [junit4]   2> 455800 INFO  (jetty-launcher-965-thread-2) [    ] o.a.s.s.SolrDispatchFilter / __| ___| |_ _   Starting in cloud mode on port null
   [junit4]   2> 455800 INFO  (jetty-launcher-965-thread-2) [    ] o.a.s.s.SolrDispatchFilter \__ \/ _ \ | '_|  Install dir: null
   [junit4]   2> 455800 INFO  (jetty-launcher-965-thread-2) [    ] o.a.s.s.SolrDispatchFilter |___/\___/_|_|    Start time: 2018-02-12T15:00:39.902Z
   [junit4]   2> 455801 INFO  (jetty-launcher-965-thread-1) [    ] o.e.j.s.session DefaultSessionIdManager workerName=node0
   [junit4]   2> 455801 INFO  (jetty-launcher-965-thread-1) [    ] o.e.j.s.session No SessionScavenger set, using defaults
   [junit4]   2> 455801 INFO  (jetty-launcher-965-thread-1) [    ] o.e.j.s.session Scavenging every 600000ms
   [junit4]   2> 455802 INFO  (jetty-launcher-965-thread-1) [    ] o.e.j.s.h.ContextHandler Started o.e.j.s.ServletContextHandler@59520536{/solr,null,AVAILABLE}
   [junit4]   2> 455803 INFO  (zkConnectionManagerCallback-970-thread-1) [    ] o.a.s.c.c.ConnectionManager zkClient has connected
   [junit4]   2> 455803 INFO  (jetty-launcher-965-thread-1) [    ] o.e.j.s.AbstractConnector Started ServerConnector@412de5bc{SSL,[ssl, http/1.1]}{127.0.0.1:39208}
   [junit4]   2> 455804 INFO  (jetty-launcher-965-thread-1) [    ] o.e.j.s.Server Started @457975ms
   [junit4]   2> 455804 INFO  (jetty-launcher-965-thread-1) [    ] o.a.s.c.s.e.JettySolrRunner Jetty properties: {hostContext=/solr, hostPort=39208}
   [junit4]   2> 455804 ERROR (jetty-launcher-965-thread-1) [    ] o.a.s.u.StartupLoggingUtils Missing Java Option solr.log.dir. Logging may be missing or incomplete.
   [junit4]   2> 455804 INFO  (jetty-launcher-965-thread-1) [    ] o.a.s.s.SolrDispatchFilter  ___      _       Welcome to Apache Solr™ version 7.3.0
   [junit4]   2> 455804 INFO  (jetty-launcher-965-thread-1) [    ] o.a.s.s.SolrDispatchFilter / __| ___| |_ _   Starting in cloud mode on port null
   [junit4]   2> 455804 INFO  (jetty-launcher-965-thread-1) [    ] o.a.s.s.SolrDispatchFilter \__ \/ _ \ | '_|  Install dir: null
   [junit4]   2> 455804 INFO  (jetty-launcher-965-thread-1) [    ] o.a.s.s.SolrDispatchFilter |___/\___/_|_|    Start time: 2018-02-12T15:00:39.906Z
   [junit4]   2> 455804 INFO  (jetty-launcher-965-thread-2) [    ] o.a.s.s.SolrDispatchFilter solr.xml found in ZooKeeper. Loading...
   [junit4]   2> 455812 INFO  (jetty-launcher-965-thread-2) [    ] o.a.s.c.ZkContainer Zookeeper client=127.0.0.1:55242/solr
   [junit4]   2> 455813 INFO  (zkConnectionManagerCallback-972-thread-1) [    ] o.a.s.c.c.ConnectionManager zkClient has connected
   [junit4]   2> 455813 INFO  (jetty-launcher-965-thread-1) [    ] o.a.s.s.SolrDispatchFilter solr.xml found in ZooKeeper. Loading...
   [junit4]   2> 455818 INFO  (zkConnectionManagerCallback-976-thread-1) [    ] o.a.s.c.c.ConnectionManager zkClient has connected
   [junit4]   2> 455820 INFO  (jetty-launcher-965-thread-1) [    ] o.a.s.c.ZkContainer Zookeeper client=127.0.0.1:55242/solr
   [junit4]   2> 455824 INFO  (zkConnectionManagerCallback-980-thread-1) [    ] o.a.s.c.c.ConnectionManager zkClient has connected
   [junit4]   2> 455825 INFO  (zkConnectionManagerCallback-982-thread-1-processing-n:127.0.0.1:55310_solr) [n:127.0.0.1:55310_solr    ] o.a.s.c.c.ConnectionManager zkClient has connected
   [junit4]   2> 455911 INFO  (zkConnectionManagerCallback-984-thread-1-processing-n:127.0.0.1:39208_solr) [n:127.0.0.1:39208_solr    ] o.a.s.c.c.ConnectionManager zkClient has connected
   [junit4]   2> 455973 INFO  (jetty-launcher-965-thread-2) [n:127.0.0.1:55310_solr    ] o.a.s.c.Overseer Overseer (id=null) closing
   [junit4]   2> 455974 INFO  (jetty-launcher-965-thread-2) [n:127.0.0.1:55310_solr    ] o.a.s.c.OverseerElectionContext I am going to be the leader 127.0.0.1:55310_solr
   [junit4]   2> 455974 INFO  (jetty-launcher-965-thread-1) [n:127.0.0.1:39208_solr    ] o.a.s.c.Overseer Overseer (id=null) closing
   [junit4]   2> 455975 INFO  (jetty-launcher-965-thread-2) [n:127.0.0.1:55310_solr    ] o.a.s.c.Overseer Overseer (id=73283087609233413-127.0.0.1:55310_solr-n_0000000000) starting
   [junit4]   2> 455975 INFO  (jetty-launcher-965-thread-1) [n:127.0.0.1:39208_solr    ] o.a.s.c.ZkController Register node as live in ZooKeeper:/live_nodes/127.0.0.1:39208_solr
   [junit4]   2> 455988 INFO  (zkCallback-981-thread-1-processing-n:127.0.0.1:55310_solr) [n:127.0.0.1:55310_solr    ] o.a.s.c.c.ZkStateReader Updated live nodes from ZooKeeper... (0) -> (1)
   [junit4]   2> 456009 INFO  (jetty-launcher-965-thread-2) [n:127.0.0.1:55310_solr    ] o.a.s.c.ZkController Register node as live in ZooKeeper:/live_nodes/127.0.0.1:55310_solr
   [junit4]   2> 456024 INFO  (zkCallback-981-thread-1-processing-n:127.0.0.1:55310_solr) [n:127.0.0.1:55310_solr    ] o.a.s.c.c.ZkStateReader Updated live nodes from ZooKeeper... (1) -> (2)
   [junit4]   2> 456024 INFO  (zkCallback-983-thread-1-processing-n:127.0.0.1:39208_solr) [n:127.0.0.1:39208_solr    ] o.a.s.c.c.ZkStateReader Updated live nodes from ZooKeeper... (0) -> (1)
   [junit4]   2> 456031 DEBUG (OverseerAutoScalingTriggerThread-73283087609233413-127.0.0.1:55310_solr-n_0000000000) [n:127.0.0.1:55310_solr    ] o.a.s.c.a.OverseerTriggerThread Adding .autoAddReplicas trigger
   [junit4]   2> 456032 INFO  (zkCallback-983-thread-2-processing-n:127.0.0.1:39208_solr) [n:127.0.0.1:39208_solr    ] o.a.s.c.c.ZkStateReader Updated live nodes from ZooKeeper... (1) -> (2)
   [junit4]   2> 456037 DEBUG (OverseerAutoScalingTriggerThread-73283087609233413-127.0.0.1:55310_solr-n_0000000000) [n:127.0.0.1:55310_solr    ] o.a.s.c.a.OverseerTriggerThread Refreshing /autoscaling.json with znode version 1
   [junit4]   2> 456038 DEBUG (OverseerAutoScalingTriggerThread-73283087609233413-127.0.0.1:55310_solr-n_0000000000) [n:127.0.0.1:55310_solr    ] o.a.s.c.a.NodeLostTrigger Initial livenodes: [127.0.0.1:39208_solr, 127.0.0.1:55310_solr]
   [junit4]   2> 456038 DEBUG (OverseerAutoScalingTriggerThread-73283087609233413-127.0.0.1:55310_solr-n_0000000000) [n:127.0.0.1:55310_solr    ] o.a.s.c.a.OverseerTriggerThread Current znodeVersion 1, lastZnodeVersion -1
   [junit4]   2> 456038 DEBUG (OverseerAutoScalingTriggerThread-73283087609233413-127.0.0.1:55310_solr-n_0000000000) [n:127.0.0.1:55310_solr    ] o.a.s.c.a.OverseerTriggerThread Processed trigger updates upto znodeVersion 1
   [junit4]   2> 456051 DEBUG (OverseerAutoScalingTriggerThread-73283087609233413-127.0.0.1:55310_solr-n_0000000000) [n:127.0.0.1:55310_solr    ] o.a.s.c.a.OverseerTriggerThread -- clean old nodeAdded markers
   [junit4]   2> 456052 DEBUG (OverseerAutoScalingTriggerThread-73283087609233413-127.0.0.1:55310_solr-n_0000000000) [n:127.0.0.1:55310_solr    ] o.a.s.c.a.OverseerTriggerThread Current znodeVersion 1, lastZnodeVersion 1
   [junit4]   2> 456052 DEBUG (ScheduledTrigger-2004-thread-1) [n:127.0.0.1:55310_solr    ] o.a.s.c.a.NodeLostTrigger Running NodeLostTrigger: .auto_add_replicas with currently live nodes: 2
   [junit4]   2> 456137 INFO  (jetty-launcher-965-thread-1) [n:127.0.0.1:39208_solr    ] o.a.s.m.r.SolrJmxReporter JMX monitoring for 'solr_39208.solr.node' (registry 'solr.node') enabled at server: com.sun.jmx.mbeanserver.JmxMBeanServer@6ed76615
   [junit4]   2> 456140 INFO  (jetty-launcher-965-thread-2) [n:127.0.0.1:55310_solr    ] o.a.s.m.r.SolrJmxReporter JMX monitoring for 'solr_55310.solr.node' (registry 'solr.node') enabled at server: com.sun.jmx.mbeanserver.JmxMBeanServer@6ed76615
   [junit4]   2> 456148 INFO  (jetty-launcher-965-thread-2) [n:127.0.0.1:55310_solr    ] o.a.s.m.r.SolrJmxReporter JMX monitoring for 'solr_55310.solr.jvm' (registry 'solr.jvm') enabled at server: com.sun.jmx.mbeanserver.JmxMBeanServer@6ed76615
   [junit4]   2> 456148 INFO  (jetty-launcher-965-thread-2) [n:127.0.0.1:55310_solr    ] o.a.s.m.r.SolrJmxReporter JMX monitoring for 'solr_55310.solr.jetty' (registry 'solr.jetty') enabled at server: com.sun.jmx.mbeanserver.JmxMBeanServer@6ed76615
   [junit4]   2> 456148 INFO  (jetty-launcher-965-thread-1) [n:127.0.0.1:39208_solr    ] o.a.s.m.r.SolrJmxReporter JMX monitoring for 'solr_39208.solr.jvm' (registry 'solr.jvm') enabled at server: com.sun.jmx.mbeanserver.JmxMBeanServer@6ed76615
   [junit4]   2> 456148 INFO  (jetty-launcher-965-thread-1) [n:127.0.0.1:39208_solr    ] o.a.s.m.r.SolrJmxReporter JMX monitoring for 'solr_39208.solr.jetty' (registry 'solr.jetty') enabled at server: com.sun.jmx.mbeanserver.JmxMBeanServer@6ed76615
   [junit4]   2> 456149 INFO  (jetty-launcher-965-thread-2) [n:127.0.0.1:55310_solr    ] o.a.s.c.CorePropertiesLocator Found 0 core definitions underneath /x1/jenkins/jenkins-slave/workspace/Lucene-Solr-Tests-7.x/solr/build/solr-core/test/J1/temp/solr.cloud.autoscaling.TriggerIntegrationTest_265F98BEBC3430CA-001/tempDir-001/node2/.
   [junit4]   2> 456149 INFO  (jetty-launcher-965-thread-1) [n:127.0.0.1:39208_solr    ] o.a.s.c.CorePropertiesLocator Found 0 core definitions underneath /x1/jenkins/jenkins-slave/workspace/Lucene-Solr-Tests-7.x/solr/build/solr-core/test/J1/temp/solr.cloud.autoscaling.TriggerIntegrationTest_265F98BEBC3430CA-001/tempDir-001/node1/.
   [junit4]   2> 456196 INFO  (zkConnectionManagerCallback-990-thread-1) [    ] o.a.s.c.c.ConnectionManager zkClient has connected
   [junit4]   2> 456221 INFO  (zkConnectionManagerCallback-994-thread-1) [    ] o.a.s.c.c.ConnectionManager zkClient has connected
   [junit4]   2> 456222 INFO  (SUITE-TriggerIntegrationTest-seed#[265F98BEBC3430CA]-worker) [    ] o.a.s.c.c.ZkStateReader Updated live nodes from ZooKeeper... (0) -> (2)
   [junit4]   2> 456222 INFO  (SUITE-TriggerIntegrationTest-seed#[265F98BEBC3430CA]-worker) [    ] o.a.s.c.s.i.ZkClientClusterStateProvider Cluster at 127.0.0.1:55242/solr ready
   [junit4]   2> 456235 INFO  (TEST-TriggerIntegrationTest.testNodeMarkersRegistration-seed#[265F98BEBC3430CA]) [    ] o.a.s.SolrTestCaseJ4 ###Starting testNodeMarkersRegistration
   [junit4]   2> 456236 INFO  (TEST-TriggerIntegrationTest.testNodeMarkersRegistration-seed#[265F98BEBC3430CA]) [    ] o.a.s.c.a.TriggerIntegrationTest /autoscaling.json reset, new znode version 2
   [junit4]   2> 456236 DEBUG (zkCallback-981-thread-1-processing-n:127.0.0.1:55310_solr) [n:127.0.0.1:55310_solr    ] o.a.s.c.a.OverseerTriggerThread Refreshing /autoscaling.json with znode version 2
   [junit4]   2> 456236 DEBUG (OverseerAutoScalingTriggerThread-73283087609233413-127.0.0.1:55310_solr-n_0000000000) [n:127.0.0.1:55310_solr    ] o.a.s.c.a.OverseerTriggerThread Processed trigger updates upto znodeVersion 2
   [junit4]   2> 456238 DEBUG (OverseerAutoScalingTriggerThread-73283087609233413-127.0.0.1:55310_solr-n_0000000000) [n:127.0.0.1:55310_solr    ] o.a.s.c.a.OverseerTriggerThread -- clean old nodeLost markers
   [junit4]   2> 456238 DEBUG (OverseerAutoScalingTriggerThread-73283087609233413-127.0.0.1:55310_solr-n_0000000000) [n:127.0.0.1:55310_solr    ] o.a.s.c.a.OverseerTriggerThread -- clean old nodeAdded markers
   [junit4]   2> 456239 DEBUG (OverseerAutoScalingTriggerThread-73283087609233413-127.0.0.1:55310_solr-n_0000000000) [n:127.0.0.1:55310_solr    ] o.a.s.c.a.OverseerTriggerThread Current znodeVersion 2, lastZnodeVersion 2
   [junit4]   2> 456277 INFO  (qtp1443034644-4169) [n:127.0.0.1:39208_solr    ] o.a.s.h.a.CollectionsHandler Invoked Collection Action :overseerstatus with params action=OVERSEERSTATUS&wt=javabin&version=2 and sendToOCPQueue=true
   [junit4]   2> 456292 INFO  (qtp1443034644-4169) [n:127.0.0.1:39208_solr    ] o.a.s.s.HttpSolrCall [admin] webapp=null path=/admin/collections params={action=OVERSEERSTATUS&wt=javabin&version=2} status=0 QTime=14
   [junit4]   2> 456294 INFO  (TEST-TriggerIntegrationTest.testNodeMarkersRegistration-seed#[265F98BEBC3430CA]) [    ] o.e.j.s.Server jetty-9.4.8.v20171121, build timestamp: 2017-11-21T23:27:37+02:00, git hash: 82b8fb23f757335bb3329d540ce37a2a2615f0a8
   [junit4]   2> 456305 INFO  (TEST-TriggerIntegrationTest.testNodeMarkersRegistration-seed#[265F98BEBC3430CA]) [    ] o.e.j.s.session DefaultSessionIdManager workerName=node0
   [junit4]   2> 456305 INFO  (TEST-TriggerIntegrationTest.testNodeMarkersRegistration-seed#[265F98BEBC3430CA]) [    ] o.e.j.s.session No SessionScavenger set, using defaults
   [junit4]   2> 456305 INFO  (TEST-TriggerIntegrationTest.testNodeMarkersRegistration-seed#[265F98BEBC3430CA]) [    ] o.e.j.s.session Scavenging every 600000ms
   [junit4]   2> 456306 INFO  (TEST-TriggerIntegrationTest.testNodeMarkersRegistration-seed#[265F98BEBC3430CA]) [    ] o.e.j.s.h.ContextHandler Started o.e.j.s.ServletContextHandler@8f7476b{/solr,null,AVAILABLE}
   [junit4]   2> 456306 INFO  (TEST-TriggerIntegrationTest.testNodeMarkersRegistration-seed#[265F98BEBC3430CA]) [    ] o.e.j.s.AbstractConnector Started ServerConnector@29ce38f8{SSL,[ssl, http/1.1]}{127.0.0.1:59199}
   [junit4]   2> 456306 INFO  (TEST-TriggerIntegrationTest.testNodeMarkersRegistration-seed#[265F98BEBC3430CA]) [    ] o.e.j.s.Server Started @458478ms
   [junit4]   2> 456306 INFO  (TEST-TriggerIntegrationTest.testNodeMarkersRegistration-seed#[265F98BEBC3430CA]) [    ] o.a.s.c.s.e.JettySolrRunner Jetty properties: {hostContext=/solr, hostPort=59199}
   [junit4]   2> 456307 ERROR (TEST-TriggerIntegrationTest.testNodeMarkersRegistration-seed#[265F98BEBC3430CA]) [    ] o.a.s.u.StartupLoggingUtils Missing Java Option solr.log.dir. Logging may be missing or incomplete.
   [junit4]   2> 456307 INFO  (TEST-TriggerIntegrationTest.testNodeMarkersRegistration-seed#[265F98BEBC3430CA]) [    ] o.a.s.s.SolrDispatchFilter  ___      _       Welcome to Apache Solr™ version 7.3.0
   [junit4]   2> 456307 INFO  (TEST-TriggerIntegrationTest.testNodeMarkersRegistration-seed#[265F98BEBC3430CA]) [    ] o.a.s.s.SolrDispatchFilter / __| ___| |_ _   Starting in cloud mode on port null
   [junit4]   2> 456307 INFO  (TEST-TriggerIntegrationTest.testNodeMarkersRegistration-seed#[265F98BEBC3430CA]) [    ] o.a.s.s.SolrDispatchFilter \__ \/ _ \ | '_|  Install dir: null
   [junit4]   2> 456307 INFO  (TEST-TriggerIntegrationTest.testNodeMarkersRegistration-seed#[265F98BEBC3430CA]) [    ] o.a.s.s.SolrDispatchFilter |___/\___/_|_|    Start time: 2018-02-12T15:00:40.409Z
   [junit4]   2> 456314 INFO  (zkConnectionManagerCallback-996-thread-1) [    ] o.a.s.c.c.ConnectionManager zkClient has connected
   [junit4]   2> 456315 INFO  (TEST-TriggerIntegrationTest.testNodeMarkersRegistration-seed#[265F98BEBC3430CA]) [    ] o.a.s.s.SolrDispatchFilter solr.xml found in ZooKeeper. Loading...
   [junit4]   2> 456332 INFO  (TEST-TriggerIntegrationTest.testNodeMarkersRegistration-seed#[265F98BEBC3430CA]) [    ] o.a.s.c.ZkContainer Zookeeper client=127.0.0.1:55242/solr
   [junit4]   2> 456352 INFO  (zkConnectionManagerCallback-1000-thread-1) [    ] o.a.s.c.c.ConnectionManager zkClient has connected
   [junit4]   2> 456372 INFO  (zkConnectionManagerCallback-1002-thread-1-processing-n:127.0.0.1:59199_solr) [n:127.0.0.1:59199_solr    ] o.a.s.c.c.ConnectionManager zkClient has connected
   [junit4]   2> 456375 INFO  (TEST-TriggerIntegrationTest.testNodeMarkersRegistration-seed#[265F98BEBC3430CA]) [n:127.0.0.1:59199_solr    ] o.a.s.c.c.ZkStateReader Updated live nodes from ZooKeeper... (0) -> (2)
   [junit4]   2> 456376 INFO  (TEST-TriggerIntegrationTest.testNodeMarkersRegistration-seed#[265F98BEBC3430CA]) [n:127.0.0.1:59199_solr    ] o.a.s.c.Overseer Overseer (id=null) closing
   [junit4]   2> 456377 INFO  (TEST-TriggerIntegrationTest.testNodeMarkersRegistration-seed#[265F98BEBC3430CA]) [n:127.0.0.1:59199_solr    ] o.a.s.c.ZkController Register node as live in ZooKeeper:/live_nodes/127.0.0.1:59199_solr
   [junit4]   2> 456380 INFO  (zkCallback-983-thread-2-processing-n:127.0.0.1:39208_solr) [n:127.0.0.1:39208_solr    ] o.a.s.c.c.ZkStateReader Updated live nodes from ZooKeeper... (2) -> (3)
   [junit4]   2> 456383 INFO  (zkCallback-981-thread-1-processing-n:127.0.0.1:55310_solr) [n:127.0.0.1:55310_solr    ] o.a.s.c.c.ZkStateReader Updated live nodes from ZooKeeper... (2) -> (3)
   [junit4]   2> 456409 INFO  (zkCallback-993-thread-1) [    ] o.a.s.c.c.ZkStateReader Updated live nodes from ZooKeeper... (2) -> (3)
   [junit4]   2> 456414 INFO  (zkCallback-1001-thread-1-processing-n:127.0.0.1:59199_solr) [n:127.0.0.1:59199_solr    ] o.a.s.c.c.ZkStateReader Updated live nodes from ZooKeeper... (2) -> (3)
   [junit4]   2> 456458 INFO  (TEST-TriggerIntegrationTest.testNodeMarkersRegistration-seed#[265F98BEBC3430CA]) [n:127.0.0.1:59199_solr    ] o.a.s.m.r.SolrJmxReporter JMX monitoring for 'solr_59199.solr.node' (registry 'solr.node') enabled at server: com.sun.jmx.mbeanserver.JmxMBeanServer@6ed76615
   [junit4]   2> 456467 INFO  (TEST-TriggerIntegrationTest.testNodeMarkersRegistration-seed#[265F98BEBC3430CA]) [n:127.0.0.1:59199_solr    ] o.a.s.m.r.SolrJmxReporter JMX monitoring for 'solr_59199.solr.jvm' (registry 'solr.jvm') enabled at server: com.sun.jmx.mbeanserver.JmxMBeanServer@6ed76615
   [junit4]   2> 456468 INFO  (TEST-TriggerIntegrationTest.testNodeMarkersRegistration-seed#[265F98BEBC3430CA]) [n:127.0.0.1:59199_solr    ] o.a.s.m.r.SolrJmxReporter JMX monitoring for 'solr_59199.solr.jetty' (registry 'solr.jetty') enabled at server: com.sun.jmx.mbeanserver.JmxMBeanServer@6ed76615
   [junit4]   2> 456469 INFO  (TEST-TriggerIntegrationTest.testNodeMarkersRegistration-seed#[265F98BEBC3430CA]) [n:127.0.0.1:59199_solr    ] o.a.s.c.CorePropertiesLocator Found 0 core definitions underneath /x1/jenkins/jenkins-slave/workspace/Lucene-Solr-Tests-7.x/solr/build/solr-core/test/J1/temp/solr.cloud.autoscaling.TriggerIntegrationTest_265F98BEBC3430CA-001/tempDir-001/node3/.
   [junit4]   2> 456503 INFO  (TEST-TriggerIntegrationTest.testNodeMarkersRegistration-seed#[265F98BEBC3430CA]) [    ] o.a.s.c.a.TriggerIntegrationTest ====== KILL OVERSEER 1
   [junit4]   2> 456504 INFO  (TEST-TriggerIntegrationTest.testNodeMarkersRegistration-seed#[265F98BEBC3430CA]) [    ] o.e.j.s.AbstractConnector Stopped ServerConnector@f8a7e02{SSL,[ssl, http/1.1]}{127.0.0.1:0}
   [junit4]   2> 456504 INFO  (TEST-TriggerIntegrationTest.testNodeMarkersRegistration-seed#[265F98BEBC3430CA]) [    ] o.a.s.c.CoreContainer Shutting down CoreContainer instance=101435753
   [junit4]   2> 456505 INFO  (TEST-TriggerIntegrationTest.testNodeMarkersRegistration-seed#[265F98BEBC3430CA]) [    ] o.a.s.m.SolrMetricManager Closing metric reporters for registry=solr.node, tag=null
   [junit4]   2> 456505 INFO  (TEST-TriggerIntegrationTest.testNodeMarkersRegistration-seed#[265F98BEBC3430CA]) [    ] o.a.s.m.r.SolrJmxReporter Closing reporter [org.apache.solr.metrics.reporters.SolrJmxReporter@13c42d91: rootName = solr_55310, domain = solr.node, service url = null, agent id = null] for registry solr.node / com.codahale.metrics.MetricRegistry@3755588
   [junit4]   2> 456511 INFO  (TEST-TriggerIntegrationTest.testNodeMarkersRegistration-seed#[265F98BEBC3430CA]) [    ] o.a.s.m.SolrMetricManager Closing metric reporters for registry=solr.jvm, tag=null
   [junit4]   2> 456511 INFO  (TEST-TriggerIntegrationTest.testNodeMarkersRegistration-seed#[265F98BEBC3430CA]) [    ] o.a.s.m.r.SolrJmxReporter Closing reporter [org.apache.solr.metrics.reporters.SolrJmxReporter@16c6164a: rootName = solr_55310, domain = solr.jvm, service url = null, agent id = null] for registry solr.jvm / com.codahale.metrics.MetricRegistry@126d2418
   [junit4]   2> 456515 INFO  (TEST-TriggerIntegrationTest.testNodeMarkersRegistration-seed#[265F98BEBC3430CA]) [    ] o.a.s.m.SolrMetricManager Closing metric reporters for registry=solr.jetty, tag=null
   [junit4]   2> 456515 INFO  (TEST-TriggerIntegrationTest.testNodeMarkersRegistration-seed#[265F98BEBC3430CA]) [    ] o.a.s.m.r.SolrJmxReporter Closing reporter [org.apache.solr.metrics.reporters.SolrJmxReporter@1f51e81d: rootName = solr_55310, domain = solr.jetty, service url = null, agent id = null] for registry solr.jetty / com.codahale.metrics.MetricRegistry@1652a28d
   [junit4]   2> 456516 INFO  (TEST-TriggerIntegrationTest.testNodeMarkersRegistration-seed#[265F98BEBC3430CA]) [    ] o.a.s.c.ZkController Remove node as live in ZooKeeper:/live_nodes/127.0.0.1:55310_solr
   [junit4]   2> 456516 INFO  (TEST-TriggerIntegrationTest.testNodeMarkersRegistration-seed#[265F98BEBC3430CA]) [    ] o.a.s.m.SolrMetricManager Closing metric reporters for registry=solr.cluster, tag=null
   [junit4]   2> 456517 INFO  (TEST-TriggerIntegrationTest.testNodeMarkersRegistration-seed#[265F98BEBC3430CA]) [    ] o.a.s.c.TransientSolrCoreCacheDefault Allocating transient cache for 2147483647 transient cores
   [junit4]   2> 456517 INFO  (zkCallback-1001-thread-1-processing-n:127.0.0.1:59199_solr) [n:127.0.0.1:59199_solr    ] o.a.s.c.c.ZkStateReader Updated live nodes from ZooKeeper... (3) -> (2)
   [junit4]   2> 456517 INFO  (zkCallback-993-thread-1) [    ] o.a.s.c.c.ZkStateReader Updated live nodes from ZooKeeper... (3) -> (2)
   [junit4]   2> 456517 INFO  (TEST-TriggerIntegrationTest.testNodeMarkersRegistration-seed#[265F98BEBC3430CA]) [    ] o.a.s.c.Overseer Overseer (id=73283087609233413-127.0.0.1:55310_solr-n_0000000000) closing
   [junit4]   2> 456517 INFO  (OverseerStateUpdate-73283087609233413-127.0.0.1:55310_solr-n_0000000000) [n:127.0.0.1:55310_solr    ] o.a.s.c.Overseer Overseer Loop exiting : 127.0.0.1:55310_solr
   [junit4]   2> 456519 INFO  (zkCallback-983-thread-2-processing-n:127.0.0.1:39208_solr) [n:127.0.0.1:39208_solr    ] o.a.s.c.c.ZkStateReader Updated live nodes from ZooKeeper... (3) -> (2)
   [junit4]   2> 456524 WARN  (OverseerAutoScalingTriggerThread-73283087609233413-127.0.0.1:55310_solr-n_0000000000) [n:127.0.0.1:55310_solr    ] o.a.s.c.a.OverseerTriggerThread OverseerTriggerThread woken up but we are closed, exiting.
   [junit4]   2> 456530 DEBUG (TEST-TriggerIntegrationTest.testNodeMarkersRegistration-seed#[265F98BEBC3430CA]) [    ] o.a.s.c.a.OverseerTriggerThread OverseerTriggerThread has been closed explicitly
   [junit4]   2> 456531 WARN  (zkCallback-981-thread-2-processing-n:127.0.0.1:55310_solr) [n:127.0.0.1:55310_solr    ] o.a.s.c.c.ZkStateReader ZooKeeper watch triggered, but Solr cannot talk to ZK: [KeeperErrorCode = Session expired for /live_nodes]
   [junit4]   2> 456531 INFO  (zkCallback-983-thread-2-processing-n:127.0.0.1:39208_solr) [n:127.0.0.1:39208_solr    ] o.a.s.c.OverseerElectionContext I am going to be the leader 127.0.0.1:39208_solr
   [junit4]   2> 456531 INFO  (TEST-TriggerIntegrationTest.testNodeMarkersRegistration-seed#[265F98BEBC3430CA]) [    ] o.e.j.s.h.ContextHandler Stopped o.e.j.s.ServletContextHandler@68168ed8{/solr,null,UNAVAILABLE}
   [junit4]   2> 456532 INFO  (TEST-TriggerIntegrationTest.testNodeMarkersRegistration-seed#[265F98BEBC3430CA]) [    ] o.e.j.s.session Stopped scavenging
   [junit4]   2> 456533 INFO  (zkCallback-983-thread-2-processing-n:127.0.0.1:39208_solr) [n:127.0.0.1:39208_solr    ] o.a.s.c.Overseer Overseer (id=73283087609233414-127.0.0.1:39208_solr-n_0000000001) starting
   [junit4]   2> 456560 DEBUG (OverseerAutoScalingTriggerThread-73283087609233414-127.0.0.1:39208_solr-n_0000000001) [n:127.0.0.1:39208_solr    ] o.a.s.c.a.OverseerTriggerThread Adding .autoAddReplicas trigger
   [junit4]   2> 456561 DEBUG (OverseerAutoScalingTriggerThread-73283087609233414-127.0.0.1:39208_solr-n_0000000001) [n:127.0.0.1:39208_solr    ] o.a.s.c.a.OverseerTriggerThread Refreshing /autoscaling.json with znode version 3
   [junit4]   2> 456561 DEBUG (OverseerAutoScalingTriggerThread-73283087609233414-127.0.0.1:39208_solr-n_0000000001) [n:127.0.0.1:39208_solr    ] o.a.s.c.a.NodeLostTrigger Initial livenodes: [127.0.0.1:39208_solr, 127.0.0.1:59199_solr]
   [junit4]   2> 456561 DEBUG (OverseerAutoScalingTriggerThread-73283087609233414-127.0.0.1:39208_solr-n_0000000001) [n:127.0.0.1:39208_solr    ] o.a.s.c.a.OverseerTriggerThread Current znodeVersion 3, lastZnodeVersion -1
   [junit4]   2> 456561 DEBUG (OverseerAutoScalingTriggerThread-73283087609233414-127.0.0.1:39208_solr-n_0000000001) [n:127.0.0.1:39208_solr    ] o.a.s.c.a.OverseerTriggerThread Processed trigger updates upto znodeVersion 3
   [junit4]   2> 456582 DEBUG (OverseerAutoScalingTriggerThread-73283087609233414-127.0.0.1:39208_solr-n_0000000001) [n:127.0.0.1:39208_solr    ] o.a.s.c.a.OverseerTriggerThread -- clean old nodeAdded markers
   [junit4]   2> 456583 DEBUG (OverseerAutoScalingTriggerThread-73283087609233414-127.0.0.1:39208_solr-n_0000000001) [n:127.0.0.1:39208_solr    ] o.a.s.c.a.OverseerTriggerThread Current znodeVersion 3, lastZnodeVersion 3
   [junit4]   2> 456583 DEBUG (ScheduledTrigger-2019-thread-1) [n:127.0.0.1:39208_solr    ] o.a.s.c.a.NodeLostTrigger Running NodeLostTrigger: .auto_add_replicas with currently live nodes: 2
   [junit4]   2> 457584 DEBUG (ScheduledTrigger-2019-thread-1) [n:127.0.0.1:39208_solr    ] o.a.s.c.a.NodeLostTrigger Running NodeLostTrigger: .auto_add_replicas with currently live nodes: 2
   [junit4]   2> 458586 DEBUG (ScheduledTrigger-2019-thread-2) [n:127.0.0.1:39208_solr    ] o.a.s.c.a.NodeLostTrigger Running NodeLostTrigger: .auto_add_replicas with currently live nodes: 2
   [junit4]   2> 459586 DEBUG (ScheduledTrigger-2019-thread-1) [n:127.0.0.1:39208_solr    ] o.a.s.c.a.NodeLostTrigger Running NodeLostTrigger: .auto_add_replicas with currently live nodes: 2
   [junit4]   2> 460586 DEBUG (ScheduledTrigger-2019-thread-1) [n:127.0.0.1:39208_solr    ] o.a.s.c.a.NodeLostTrigger Running NodeLostTrigger: .auto_add_replicas with currently live nodes: 2
   [junit4]   2> 461533 INFO  (TEST-TriggerIntegrationTest.testNodeMarkersRegistration-seed#[265F98BEBC3430CA]) [    ] o.a.s.c.a.TriggerIntegrationTest ====== ADD TRIGGERS
   [junit4]   2> 461546 INFO  (qtp1443034644-4170) [n:127.0.0.1:39208_solr    ] o.a.s.s.HttpSolrCall [admin] webapp=null path=/admin/metrics params={prefix=CONTAINER.fs.usableSpace,CORE.coreName&wt=javabin&version=2&group=solr.node,solr.core} status=0 QTime=0
   [junit4]   2> 461580 INFO  (qtp746022335-4219) [n:127.0.0.1:59199_solr    ] o.a.s.s.HttpSolrCall [admin] webapp=null path=/admin/metrics params={prefix=CONTAINER.fs.usableSpace,CORE.coreName&wt=javabin&version=2&group=solr.node,solr.core} status=0 QTime=0
   [junit4]   2> 461580 DEBUG (qtp1443034644-4167) [n:127.0.0.1:39208_solr    ] o.a.s.c.a.AutoScalingHandler Verified autoscaling configuration
   [junit4]   2> 461581 INFO  (qtp1443034644-4167) [n:127.0.0.1:39208_solr    ] o.a.s.s.HttpSolrCall [admin] webapp=null path=/cluster/autoscaling params={wt=javabin&version=2} status=0 QTime=43
   [junit4]   2> 461582 DEBUG (zkCallback-983-thread-2-processing-n:127.0.0.1:39208_solr) [n:127.0.0.1:39208_solr    ] o.a.s.c.a.OverseerTriggerThread Refreshing /autoscaling.json with znode version 4
   [junit4]   2> 461587 DEBUG (ScheduledTrigger-2019-thread-1) [n:127.0.0.1:39208_solr    ] o.a.s.c.a.NodeLostTrigger Running NodeLostTrigger: .auto_add_replicas with currently live nodes: 2
   [junit4]   2> 461587 DEBUG (zkCallback-983-thread-2-processing-n:127.0.0.1:39208_solr) [n:127.0.0.1:39208_solr    ] o.a.s.c.a.NodeAddedTrigger Initial livenodes: [127.0.0.1:39208_solr, 127.0.0.1:59199_solr]
   [junit4]   2> 461588 DEBUG (zkCallback-983-thread-2-processing-n:127.0.0.1:39208_solr) [n:127.0.0.1:39208_solr    ] o.a.s.c.a.NodeAddedTrigger NodeAddedTrigger node_added_triggerMR instantiated with properties: {event=nodeAdded, waitFor=1, actions=[{name=test, class=org.apache.solr.cloud.autoscaling.TriggerIntegrationTest$TestEventMarkerAction}], enabled=true}
   [junit4]   2> 461588 DEBUG (zkCallback-983-thread-2-processing-n:127.0.0.1:39208_solr) [n:127.0.0.1:39208_solr    ] o.a.s.c.a.NodeLostTrigger Initial livenodes: [127.0.0.1:39208_solr, 127.0.0.1:59199_solr]
   [junit4]   2> 461589 DEBUG (OverseerAutoScalingTriggerThread-73283087609233414-127.0.0.1:39208_solr-n_0000000001) [n:127.0.0.1:39208_solr    ] o.a.s.c.a.OverseerTriggerThread Processed trigger updates upto znodeVersion 4
   [junit4]   2> 461589 INFO  (qtp1443034644-4171) [n:127.0.0.1:39208_solr    ] o.a.s.s.HttpSolrCall [admin] webapp=null path=/admin/metrics params={prefix=CONTAINER.fs.usableSpace,CORE.coreName&wt=javabin&version=2&group=solr.node,solr.core} status=0 QTime=0
   [junit4]   2> 461590 INFO  (OverseerAutoScalingTriggerThread-73283087609233414-127.0.0.1:39208_solr-n_0000000001) [n:127.0.0.1:39208_solr    ] o.a.s.c.a.TriggerIntegrationTest TestEventMarkerAction init
   [junit4]   2> 461591 INFO  (qtp746022335-4221) [n:127.0.0.1:59199_solr    ] o.a.s.s.HttpSolrCall [admin] webapp=null path=/admin/metrics params={prefix=CONTAINER.fs.usableSpace,CORE.coreName&wt=javabin&version=2&group=solr.node,solr.core} status=0 QTime=0
   [junit4]   2> 461591 DEBUG (qtp1443034644-4169) [n:127.0.0.1:39208_solr    ] o.a.s.c.a.AutoScalingHandler Verified autoscaling configuration
   [junit4]   2> 461592 DEBUG (OverseerAutoScalingTriggerThread-73283087609233414-127.0.0.1:39208_solr-n_0000000001) [n:127.0.0.1:39208_solr    ] o.a.s.c.a.OverseerTriggerThread Current znodeVersion 4, lastZnodeVersion 4
   [junit4]   2> 461592 INFO  (qtp1443034644-4169) [n:127.0.0.1:39208_solr    ] o.a.s.s.HttpSolrCall [admin] webapp=null path=/cluster/autoscaling params={wt=javabin&version=2} status=0 QTime=10
   [junit4]   2> 461592 DEBUG (zkCallback-983-thread-2-processing-n:127.0.0.1:39208_solr) [n:127.0.0.1:39208_solr    ] o.a.s.c.a.OverseerTriggerThread Refreshing /autoscaling.json with znode version 5
   [junit4]   2> 461592 DEBUG (ScheduledTrigger-2019-thread-3) [n:127.0.0.1:39208_solr    ] o.a.s.c.a.NodeAddedTrigger Running NodeAddedTrigger node_added_triggerMR
   [junit4]   2> 461593 DEBUG (ScheduledTrigger-2019-thread-3) [n:127.0.0.1:39208_solr    ] o.a.s.c.a.NodeAddedTrigger Found livenodes: 2
   [junit4]   2> 461593 INFO  (qtp1443034644-4167) [n:127.0.0.1:39208_solr    ] o.a.s.h.a.CollectionsHandler Invoked Collection Action :overseerstatus with params action=OVERSEERSTATUS&wt=javabin&version=2 and sendToOCPQueue=true
   [junit4]   2> 461599 DEBUG (zkCallback-983-thread-2-processing-n:127.0.0.1:39208_solr) [n:127.0.0.1:39208_solr    ] o.a.s.c.a.NodeLostTrigger Initial livenodes: [127.0.0.1:39208_solr, 127.0.0.1:59199_solr]
   [junit4]   2> 461603 DEBUG (zkCallback-983-thread-2-processing-n:127.0.0.1:39208_solr) [n:127.0.0.1:39208_solr    ] o.a.s.c.a.NodeAddedTrigger Initial livenodes: [127.0.0.1:39208_solr, 127.0.0.1:59199_solr]
   [junit4]   2> 461603 DEBUG (zkCallback-983-thread-2-processing-n:127.0.0.1:39208_solr) [n:127.0.0.1:39208_solr    ] o.a.s.c.a.NodeAddedTrigger NodeAddedTrigger node_added_triggerMR instantiated with properties: {event=nodeAdded, waitFor=1, actions=[{name=test, class=org.apache.solr.cloud.autoscaling.TriggerIntegrationTest$TestEventMarkerAction}], enabled=true}
   [junit4]   2> 461603 DEBUG (zkCallback-983-thread-2-processing-n:127.0.0.1:39208_solr) [n:127.0.0.1:39208_solr    ] o.a.s.c.a.NodeLostTrigger Initial livenodes: [127.0.0.1:39208_solr, 127.0.0.1:59199_solr]
   [junit4]   2> 461604 DEBUG (OverseerAutoScalingTriggerThread-73283087609233414-127.0.0.1:39208_solr-n_0000000001) [n:127.0.0.1:39208_solr    ] o.a.s.c.a.OverseerTriggerThread Processed trigger updates upto znodeVersion 5
   [junit4]   2> 461605 INFO  (OverseerAutoScalingTriggerThread-73283087609233414-127.0.0.1:39208_solr-n_0000000001) [n:127.0.0.1:39208_solr    ] o.a.s.c.a.TriggerIntegrationTest TestEventMarkerAction init
   [junit4]   2> 461606 DEBUG (OverseerAutoScalingTriggerThread-73283087609233414-127.0.0.1:39208_solr-n_0000000001) [n:127.0.0.1:39208_solr    ] o.a.s.c.a.OverseerTriggerThread Current znodeVersion 5, lastZnodeVersion 5
   [junit4]   2> 461606 DEBUG (ScheduledTrigger-2019-thread-1) [n:127.0.0.1:39208_solr    ] o.a.s.c.a.NodeLostTrigger Running NodeLostTrigger: node_lost_triggerMR with currently live nodes: 2
   [junit4]   2> 461609 INFO  (qtp1443034644-4167) [n:127.0.0.1:39208_solr    ] o.a.s.s.HttpSolrCall [admin] webapp=null path=/admin/collections params={action=OVERSEERSTATUS&wt=javabin&version=2} status=0 QTime=16
   [junit4]   2> 461610 INFO  (TEST-TriggerIntegrationTest.testNodeMarkersRegistration-seed#[265F98BEBC3430CA]) [    ] o.a.s.c.a.TriggerIntegrationTest ====== ADD NODE 1
   [junit4]   2> 461611 INFO  (TEST-TriggerIntegrationTest.testNodeMarkersRegistration-seed#[265F98BEBC3430CA]) [    ] o.e.j.s.Server jetty-9.4.8.v20171121, build timestamp: 2017-11-21T23:27:37+02:00, git hash: 82b8fb23f757335bb3329d540ce37a2a2615f0a8
   [junit4]   2> 461614 INFO  (TEST-TriggerIntegrationTest.testNodeMarkersRegistration-seed#[265F98BEBC3430CA]) [    ] o.e.j.s.session DefaultSessionIdManager workerName=node0
   [junit4]   2> 461614 INFO  (TEST-TriggerIntegrationTest.testNodeMarkersRegistration-seed#[265F98BEBC3430CA]) [    ] o.e.j.s.session No SessionScavenger set, using defaults
   [junit4]   2> 461614 INFO  (TEST-TriggerIntegrationTest.testNodeMarkersRegistration-seed#[265F98BEBC3430CA]) [    ] o.e.j.s.session Scavenging every 660000ms
   [junit4]   2> 461614 INFO  (TEST-TriggerIntegrationTest.testNodeMarkersRegistration-seed#[265F98BEBC3430CA]) [    ] o.e.j.s.h.ContextHandler Started o.e.j.s.ServletContextHandler@711367d6{/solr,null,AVAILABLE}
   [junit4]   2> 461615 INFO  (TEST-TriggerIntegrationTest.testNodeMarkersRegistration-seed#[265F98BEBC3430CA]) [    ] o.e.j.s.AbstractConnector Started ServerConnector@d9de1f4{SSL,[ssl, http/1.1]}{127.0.0.1:34522}
   [junit4]   2> 461615 INFO  (TEST-TriggerIntegrationTest.testNodeMarkersRegistration-seed#[265F98BEBC3430CA]) [    ] o.e.j.s.Server Started @463786ms
   [junit4]   2> 461615 INFO  (TEST-TriggerIntegrationTest.testNodeMarkersRegistration-seed#[265F98BEBC3430CA]) [    ] o.a.s.c.s.e.JettySolrRunner Jetty properties: {hostContext=/solr, hostPort=34522}
   [junit4]   2> 461615 ERROR (TEST-TriggerIntegrationTest.testNodeMarkersRegistration-seed#[265F98BEBC3430CA]) [    ] o.a.s.u.StartupLoggingUtils Missing Java Option solr.log.dir. Logging may be missing or incomplete.
   [junit4]   2> 461615 INFO  (TEST-TriggerIntegrationTest.testNodeMarkersRegistration-seed#[265F98BEBC3430CA]) [    ] o.a.s.s.SolrDispatchFilter  ___      _       Welcome to Apache Solr™ version 7.3.0
   [junit4]   2> 461615 INFO  (TEST-TriggerIntegrationTest.testNodeMarkersRegistration-seed#[265F98BEBC3430CA]) [    ] o.a.s.s.SolrDispatchFilter / __| ___| |_ _   Starting in cloud mode on port null
   [junit4]   2> 461615 INFO  (TEST-TriggerIntegrationTest.testNodeMarkersRegistration-seed#[265F98BEBC3430CA]) [    ] o.a.s.s.SolrDispatchFilter \__ \/ _ \ | '_|  Install dir: null
   [junit4]   2> 461615 INFO  (TEST-TriggerIntegrationTest.testNodeMarkersRegistration-seed#[265F98BEBC3430CA]) [    ] o.a.s.s.SolrDispatchFilter |___/\___/_|_|    Start time: 2018-02-12T15:00:45.717Z
   [junit4]   2> 461617 INFO  (zkConnectionManagerCallback-1006-thread-1) [    ] o.a.s.c.c.ConnectionManager zkClient has connected
   [junit4]   2> 461617 INFO  (TEST-TriggerIntegrationTest.testNodeMarkersRegistration-seed#[265F98BEBC3430CA]) [    ] o.a.s.s.SolrDispatchFilter solr.xml found in ZooKeeper. Loading...
   [junit4]   2> 461636 INFO  (TEST-TriggerIntegrationTest.testNodeMarkersRegistration-seed#[265F98BEBC3430CA]) [    ] o.a.s.c.ZkContainer Zookeeper client=127.0.0.1:55242/solr
   [junit4]   2> 461638 INFO  (zkConnectionManagerCallback-1010-thread-1) [    ] o.a.s.c.c.ConnectionManager zkClient has connected
   [junit4]   2> 461643 INFO  (zkConnectionManagerCallback-1012-thread-1-processing-n:127.0.0.1:34522_solr) [n:127.0.0.1:34522_solr    ] o.a.s.c.c.ConnectionManager zkClient has connected
   [junit4]   2> 461648 INFO  (TEST-TriggerIntegrationTest.testNodeMarkersRegistration-seed#[265F98BEBC3430CA]) [n:127.0.0.1:34522_solr    ] o.a.s.c.c.ZkStateReader Updated live nodes from ZooKeeper... (0) -> (2)
   [junit4]   2> 461650 INFO  (TEST-TriggerIntegrationTest.testNodeMarkersRegistration-seed#[265F98BEBC3430CA]) [n:127.0.0.1:34522_solr    ] o.a.s.c.Overseer Overseer (id=null) closing
   [junit4]   2> 461653 INFO  (TEST-TriggerIntegrationTest.testNodeMarkersRegistration-seed#[265F98BEBC3430CA]) [n:127.0.0.1:34522_solr    ] o.a.s.c.ZkController Register node as live in ZooKeeper:/live_nodes/127.0.0.1:34522_solr
   [junit4]   2> 461654 INFO  (zkCallback-1001-thread-1-processing-n:127.0.0.1:59199_solr) [n:127.0.0.1:59199_solr    ] o.a.s.c.c.ZkStateReader Updated live nodes from ZooKeeper... (2) -> (3)
   [junit4]   2> 461654 INFO  (zkCallback-993-thread-1) [    ] o.a.s.c.c.ZkStateReader Updated live nodes from ZooKeeper... (2) -> (3)
   [junit4]   2> 461655 INFO  (zkCallback-983-thread-2-processing-n:127.0.0.1:39208_solr) [n:127.0.0.1:39208_solr    ] o.a.s.c.c.ZkStateReader Updated live nodes from ZooKeeper... (2) -> (3)
   [junit4]   2> 461656 INFO  (zkCallback-1011-thread-1-processing-n:127.0.0.1:34522_solr) [n:127.0.0.1:34522_solr    ] o.a.s.c.c.ZkStateReader Updated live nodes from ZooKeeper... (2) -> (3)
   [junit4]   2> 461737 INFO  (TEST-TriggerIntegrationTest.testNodeMarkersRegistration-seed#[265F98BEBC3430CA]) [n:127.0.0.1:34522_solr    ] o.a.s.m.r.SolrJmxReporter JMX monitoring for 'solr_34522.solr.node' (registry 'solr.node') enabled at server: com.sun.jmx.mbeanserver.JmxMBeanServer@6ed76615
   [junit4]   2> 461747 INFO  (TEST-TriggerIntegrationTest.testNodeMarkersRegistration-seed#[265F98BEBC3430CA]) [n:127.0.0.1:34522_solr    ] o.a.s.m.r.SolrJmxReporter JMX monitoring for 'solr_34522.solr.jvm' (registry 'solr.jvm') enabled at server: com.sun.jmx.mbeanserver.JmxMBeanServer@6ed76615
   [junit4]   2> 461747 INFO  (TEST-TriggerIntegrationTest.testNodeMarkersRegistration-seed#[265F98BEBC3430CA]) [n:127.0.0.1:34522_solr    ] o.a.s.m.r.SolrJmxReporter JMX monitoring for 'solr_34522.solr.jetty' (registry 'solr.jetty') enabled at server: com.sun.jmx.mbeanserver.JmxMBeanServer@6ed76615
   [junit4]   2> 461748 INFO  (TEST-TriggerIntegrationTest.testNodeMarkersRegistration-seed#[265F98BEBC3430CA]) [n:127.0.0.1:34522_solr    ] o.a.s.c.CorePropertiesLocator Found 0 core definitions underneath /x1/jenkins/jenkins-slave/workspace/Lucene-Solr-Tests-7.x/solr/build/solr-core/test/J1/temp/solr.cloud.autoscaling.TriggerIntegrationTest_265F98BEBC3430CA-001/tempDir-001/node4/.
   [junit4]   2> 462588 DEBUG (ScheduledTrigger-2019-thread-4) [n:127.0.0.1:39208_solr    ] o.a.s.c.a.NodeLostTrigger Running NodeLostTrigger: .auto_add_replicas with currently live nodes: 3
   [junit4]   2> 462595 DEBUG (ScheduledTrigger-2019-thread-2) [n:127.0.0.1:39208_solr    ] o.a.s.c.a.NodeAddedTrigger Running NodeAddedTrigger node_added_triggerMR
   [junit4]   2> 462595 DEBUG (ScheduledTrigger-2019-thread-2) [n:127.0.0.1:39208_solr    ] o.a.s.c.a.NodeAddedTrigger Found livenodes: 3
   [junit4]   2> 462595 DEBUG (ScheduledTrigger-2019-thread-2) [n:127.0.0.1:39208_solr    ] o.a.s.c.a.NodeAddedTrigger Tracking new node: 127.0.0.1:34522_solr at time 18699554819572187
   [junit4]   2> 462608 DEBUG (ScheduledTrigger-2019-thread-3) [n:127.0.0.1:39208_solr    ] o.a.s.c.a.NodeLostTrigger Running NodeLostTrigger: node_lost_triggerMR with currently live nodes: 3
   [junit4]   2> 463588 DEBUG (ScheduledTrigger-2019-thread-1) [n:127.0.0.1:39208_solr    ] o.a.s.c.a.NodeLostTrigger Running NodeLostTrigger: .auto_add_replicas with currently live nodes: 3
   [junit4]   2> 463595 DEBUG (ScheduledTrigger-2019-thread-4) [n:127.0.0.1:39208_solr    ] o.a.s.c.a.NodeAddedTrigger Running NodeAddedTrigger node_added_triggerMR
   [junit4]   2> 463596 DEBUG (ScheduledTrigger-2019-thread-4) [n:127.0.0.1:39208_solr    ] o.a.s.c.a.NodeAddedTrigger Found livenodes: 3
   [junit4]   2> 463596 DEBUG (ScheduledTrigger-2019-thread-4) [n:127.0.0.1:39208_solr    ] o.a.s.c.a.NodeAddedTrigger NodeAddedTrigger node_added_triggerMR firing registered processor for nodes: [127.0.0.1:34522_solr] added at times [18699554819572187], now=18699555820340447
   [junit4]   2> 463596 DEBUG (ScheduledTrigger-2019-thread-4) [n:127.0.0.1:39208_solr    ] o.a.s.c.a.ScheduledTriggers ++++++++ Cooldown inactive - processing event: {
   [junit4]   2>   "id":"426f25627a81dbT99398meselj1hb3oc1q1v7ppq",
   [junit4]   2>   "source":"node_added_triggerMR",
   [junit4]   2>   "eventTime":18699554819572187,
   [junit4]   2>   "eventType":"NODEADDED",
   [junit4]   2>   "properties":{
   [junit4]   2>     "eventTimes":[18699554819572187],
   [junit4]   2>     "nodeNames":["127.0.0.1:34522_solr"]}}
   [junit4]   2> 463597 DEBUG (ScheduledTrigger-2019-thread-4) [n:127.0.0.1:39208_solr    ] o.a.s.c.a.ScheduledTriggers Pausing all triggers: [node_lost_triggerMR, node_added_triggerMR, .auto_add_replicas]
   [junit4]   2> 463597 INFO  (ScheduledTrigger-2019-thread-4) [n:127.0.0.1:39208_solr    ] o.a.s.c.a.SystemLogListener Collection .system does not exist, disabling logging.
   [junit4]   2> 463598 DEBUG (AutoscalingActionExecutor-2020-thread-1-processing-n:127.0.0.1:39208_solr) [n:127.0.0.1:39208_solr    ] o.a.s.c.a.ScheduledTriggers -- processing actions for {
   [junit4]   2>   "id":"426f25627a81dbT99398meselj1hb3oc1q1v7ppq",
   [junit4]   2>   "source":"node_added_triggerMR",
   [junit4]   2>   "eventTime":18699554819572187,
   [junit4]   2>   "eventType":"NODEADDED",
   [junit4]   2>   "properties":{
   [junit4]   2>     "eventTimes":[18699554819572187],
   [junit4]   2>     "_enqueue_time_":18699555821305375,
   [junit4]   2>     "nodeNames":["127.0.0.1:34522_solr"]}}
   [junit4]   2> 463600 DEBUG (AutoscalingActionExecutor-2020-thread-1-processing-n:127.0.0.1:39208_solr) [n:127.0.0.1:39208_solr    ] o.a.s.c.a.ScheduledTriggers Resuming trigger: node_lost_triggerMR after 5000ms
   [junit4]   2> 463600 DEBUG (AutoscalingActionExecutor-2020-thread-1-processing-n:127.0.0.1:39208_solr) [n:127.0.0.1:39208_solr    ] o.a.s.c.a.ScheduledTriggers Resuming trigger: node_added_triggerMR after 5000ms
   [junit4]   2> 463600 DEBUG (AutoscalingActionExecutor-2020-thread-1-processing-n:127.0.0.1:39208_solr) [n:127.0.0.1:39208_solr    ] o.a.s.c.a.ScheduledTriggers Resuming trigger: .auto_add_replicas after 5000ms
   [junit4]   2> 463600 DEBUG (AutoscalingActionExecutor-2020-thread-1-processing-n:127.0.0.1:39208_solr) [n:127.0.0.1:39208_solr    ] o.a.s.c.a.ScheduledTriggers -- processing took 2 ms for event id=426f25627a81dbT99398meselj1hb3oc1q1v7ppq
   [junit4]   2> 463605 INFO  (OverseerCollectionConfigSetProcessor-73283087609233414-127.0.0.1:39208_solr-n_0000000001) [n:127.0.0.1:39208_solr    ] o.a.s.c.OverseerTaskQueue Response ZK path: /overseer/collection-queue-work/qnr-0000000002 doesn't exist.  Requestor may have disconnected from ZooKeeper
   [junit4]   2> 466788 INFO  (TEST-TriggerIntegrationTest.testNodeMarkersRegistration-seed#[265F98BEBC3430CA]) [    ] o.a.s.c.a.TriggerIntegrationTest ====== KILL OVERSEER 2
   [junit4]   2> 466790 INFO  (TEST-TriggerIntegrationTest.testNodeMarkersRegistration-seed#[265F98BEBC3430CA]) [    ] o.e.j.s.AbstractConnector Stopped ServerConnector@412de5bc{SSL,[ssl, http/1.1]}{127.0.0.1:0}
   [junit4]   2> 466791 INFO  (TEST-TriggerIntegrationTest.testNodeMarkersRegistration-seed#[265F98BEBC3430CA]) [    ] o.a.s.c.CoreContainer Shutting down CoreContainer instance=187796342
   [junit4]   2> 466791 INFO  (TEST-TriggerIntegrationTest.testNodeMarkersRegistration-seed#[265F98BEBC3430CA]) [    ] o.a.s.m.SolrMetricManager Closing metric reporters for registry=solr.node, tag=null
   [junit4]   2> 466791 INFO  (TEST-TriggerIntegrationTest.testNodeMarkersRegistration-seed#[265F98BEBC3430CA]) [    ] o.a.s.m.r.SolrJmxReporter Closing reporter [org.apache.solr.metrics.reporters.SolrJmxReporter@41943ffa: rootName = solr_39208, domain = solr.node, service url = null, agent id = null] for registry solr.node / com.codahale.metrics.MetricRegistry@60123bb6
   [junit4]   2> 466797 INFO  (TEST-TriggerIntegrationTest.testNodeMarkersRegistration-seed#[265F98BEBC3430CA]) [    ] o.a.s.m.SolrMetricManager Closing metric reporters for registry=solr.jvm, tag=null
   [junit4]   2> 466797 INFO  (TEST-TriggerIntegrationTest.testNodeMarkersRegistration-seed#[265F98BEBC3430CA]) [    ] o.a.s.m.r.SolrJmxReporter Closing reporter [org.apache.solr.metrics.reporters.SolrJmxReporter@7001b39a: rootName = solr_39208, domain = solr.jvm, service url = null, agent id = null] for registry solr.jvm / com.codahale.metrics.MetricRegistry@126d2418
   [junit4]   2> 466801 INFO  (TEST-TriggerIntegrationTest.testNodeMarkersRegistration-seed#[265F98BEBC3430CA]) [    ] o.a.s.m.SolrMetricManager Closing metric reporters for registry=solr.jetty, tag=null
   [junit4]   2> 466801 INFO  (TEST-TriggerIntegrationTest.testNodeMarkersRegistration-seed#[265F98BEBC3430CA]) [    ] o.a.s.m.r.SolrJmxReporter Closing reporter [org.apache.solr.metrics.reporters.SolrJmxReporter@71619cd: rootName = solr_39208, domain = solr.jetty, service url = null, agent id = null] for registry solr.jetty / com.codahale.metrics.MetricRegistry@1652a28d
   [junit4]   2> 466808 INFO  (TEST-TriggerIntegrationTest.testNodeMarkersRegistration-seed#[265F98BEBC3430CA]) [    ] o.a.s.c.ZkController Remove node as live in ZooKeeper:/live_nodes/127.0.0.1:39208_solr
   [junit4]   2> 466809 INFO  (TEST-TriggerIntegrationTest.testNodeMarkersRegistration-seed#[265F98BEBC3430CA]) [    ] o.a.s.m.SolrMetricManager Closing metric reporters for registry=solr.cluster, tag=null
   [junit4]   2> 466809 INFO  (zkCallback-1011-thread-1-processing-n:127.0.0.1:34522_solr) [n:127.0.0.1:34522_solr    ] o.a.s.c.c.ZkStateReader Updated live nodes from ZooKeeper... (3) -> (2)
   [junit4]   2> 466809 INFO  (zkCallback-983-thread-2-processing-n:127.0.0.1:39208_solr) [n:127.0.0.1:39208_solr    ] o.a.s.c.c.ZkStateReader Updated live nodes from ZooKeeper... (3) -> (2)
   [junit4]   2> 466809 INFO  (zkCallback-993-thread-1) [    ] o.a.s.c.c.ZkStateReader Updated live nodes from ZooKeeper... (3) -> (2)
   [junit4]   2> 466809 INFO  (zkCallback-1001-thread-1-processing-n:127.0.0.1:59199_solr) [n:127.0.0.1:59199_solr    ] o.a.s.c.c.ZkStateReader Updated live nodes from ZooKeeper... (3) -> (2)
   [junit4]   2> 466810 INFO  (TEST-TriggerIntegrationTest.testNodeMarkersRegistration-seed#[265F98BEBC3430CA]) [    ] o.a.s.c.TransientSolrCoreCacheDefault Allocating transient cache for 2147483647 transient cores
   [junit4]   2> 466810 INFO  (TEST-TriggerIntegrationTest.testNodeMarkersRegistration-seed#[265F98BEBC3430CA]) [    ] o.a.s.c.Overseer Overseer (id=73283087609233414-127.0.0.1:39208_solr-n_0000000001) closing
   [junit4]   2> 466810 INFO  (OverseerStateUpdate-73283087609233414-127.0.0.1:39208_solr-n_0000000001) [n:127.0.0.1:39208_solr    ] o.a.s.c.Overseer Overseer Loop exiting : 127.0.0.1:39208_solr
   [junit4]   2> 466811 WARN  (OverseerAutoScalingTriggerThread-73283087609233414-127.0.0.1:39208_solr-n_0000000001) [n:127.0.0.1:39208_solr    ] o.a.s.c.a.OverseerTriggerThread OverseerTriggerThread woken up but we are closed, exiting.
   [junit4]   2> 466812 DEBUG (TEST-TriggerIntegrationTest.testNodeMarkersRegistration-seed#[265F98BEBC3430CA]) [    ] o.a.s.c.a.OverseerTriggerThread OverseerTriggerThread has been closed explicitly
   [junit4]   2> 466814 INFO  (TEST-TriggerIntegrationTest.testNodeMarkersRegistration-seed#[265F98BEBC3430CA]) [    ] o.e.j.s.h.ContextHandler Stopped o.e.j.s.ServletContextHandler@59520536{/solr,null,UNAVAILABLE}
   [junit4]   2> 466814 INFO  (TEST-TriggerIntegrationTest.testNodeMarkersRegistration-seed#[265F98BEBC3430CA]) [    ] o.e.j.s.session Stopped scavenging
   [junit4]   2> 466815 INFO  (zkCallback-1001-thread-1-processing-n:127.0.0.1:59199_solr) [n:127.0.0.1:59199_solr    ] o.a.s.c.OverseerElectionContext I am going to be the leader 127.0.0.1:59199_solr
   [junit4]   2> 466815 INFO  (zkCallback-1001-thread-1-processing-n:127.0.0.1:59199_solr) [n:127.0.0.1:59199_solr    ] o.a.s.c.Overseer Overseer (id=73283087609233419-127.0.0.1:59199_solr-n_0000000002) starting
   [junit4]   2> 466819 DEBUG (OverseerAutoScalingTriggerThread-73283087609233419-127.0.0.1:59199_solr-n_0000000002) [n:127.0.0.1:59199_solr    ] o.a.s.c.a.OverseerTriggerThread Refreshing /autoscaling.json with znode version 5
   [junit4]   2> 466820 DEBUG (OverseerAutoScalingTriggerThread-73283087609233419-127.0.0.1:59199_solr-n_0000000002) [n:127.0.0.1:59199_solr    ] o.a.s.c.a.NodeLostTrigger Initial livenodes: [127.0.0.1:34522_solr, 127.0.0.1:59199_solr]
   [junit4]   2> 466820 DEBUG (OverseerAutoScalingTriggerThread-73283087609233419-127.0.0.1:59199_solr-n_0000000002) [n:127.0.0.1:59199_solr    ] o.a.s.c.a.NodeAddedTrigger Initial livenodes: [127.0.0.1:34522_solr, 127.0.0.1:59199_solr]
   [junit4]   2> 466820 DEBUG (OverseerAutoScalingTriggerThread-73283087609233419-127.0.0.1:59199_solr-n_0000000002) [n:127.0.0.1:59199_solr    ] o.a.s.c.a.NodeAddedTrigger NodeAddedTrigger node_added_triggerMR instantiated with properties: {event=nodeAdded, waitFor=1, actions=[{name=test, class=org.apache.solr.cloud.autoscaling.TriggerIntegrationTest$TestEventMarkerAction}], enabled=true}
   [junit4]   2> 466821 DEBUG (OverseerAutoScalingTriggerThread-73283087609233419-127.0.0.1:59199_solr-n_0000000002) [n:127.0.0.1:59199_solr    ] o.a.s.c.a.NodeLostTrigger Initial livenodes: [127.0.0.1:34522_solr, 127.0.0.1:59199_solr]
   [junit4]   2> 466821 DEBUG (OverseerAutoScalingTriggerThread-73283087609233419-127.0.0.1:59199_solr-n_0000000002) [n:127.0.0.1:59199_solr    ] o.a.s.c.a.OverseerTriggerThread Current znodeVersion 5, lastZnodeVersion -1
   [junit4]   2> 466821 DEBUG (OverseerAutoScalingTriggerThread-73283087609233419-127.0.0.1:59199_solr-n_0000000002) [n:127.0.0.1:59199_solr    ] o.a.s.c.a.OverseerTriggerThread Processed trigger updates upto znodeVersion 5
   [junit4]   2> 466821 INFO  (OverseerAutoScalingTriggerThread-73283087609233419-127.0.0.1:59199_solr-n_0000000002) [n:127.0.0.1:59199_solr    ] o.a.s.c.a.TriggerIntegrationTest TestEventMarkerAction init
   [junit4]   2> 466821 DEBUG (OverseerAutoScalingTriggerThread-73283087609233419-127.0.0.1:59199_solr-n_0000000002) [n:127.0.0.1:59199_solr    ] o.a.s.c.a.NodeLostTrigger Adding lost node from marker path: 127.0.0.1:39208_solr
   [junit4]   2> 466822 INFO  (OverseerAutoScalingTriggerThread-73283087609233419-127.0.0.1:59199_solr-n_0000000002) [n:127.0.0.1:59199_solr    ] o.a.s.c.a.TriggerIntegrationTest TestEventMarkerAction init
   [junit4]   2> 466822 DEBUG (ScheduledTrigger-2030-thread-1) [n:127.0.0.1:59199_solr    ] o.a.s.c.a.NodeLostTrigger Running NodeLostTrigger: node_lost_triggerMR with currently live nodes: 2
   [junit4]   2> 466822 DEBUG (ScheduledTrigger-2030-thread-1) [n:127.0.0.1:59199_solr    ] o.a.s.c.a.NodeLostTrigger Tracking lost node: 127.0.0.1:39208_solr
   [junit4]   2> 466823 DEBUG (OverseerAutoScalingTriggerThread-73283087609233419-127.0.0.1:59199_solr-n_0000000002) [n:127.0.0.1:59199_solr    ] o.a.s.c.a.OverseerTriggerThread Current znodeVersion 5, lastZnodeVersion 5
   [junit4]   2> 466823 DEBUG (ScheduledTrigger-2030-thread-2) [n:127.0.0.1:59199_solr    ] o.a.s.c.a.NodeAddedTrigger Running NodeAddedTrigger node_added_triggerMR
   [junit4]   2> 466823 DEBUG (ScheduledTrigger-2030-thread-2) [n:127.0.0.1:59199_solr    ] o.a.s.c.a.NodeAddedTrigger Found livenodes: 2
   [junit4]   2> 466823 DEBUG (ScheduledTrigger-2030-thread-3) [n:127.0.0.1:59199_solr    ] o.a.s.c.a.NodeLostTrigger Running NodeLostTrigger: .auto_add_replicas with currently live nodes: 2
   [junit4]   2> 466823 DEBUG (ScheduledTrigger-2030-thread-3) [n:127.0.0.1:59199_solr    ] o.a.s.c.a.NodeLostTrigger Tracking lost node: 127.0.0.1:39208_solr
   [junit4]   2> 467824 DEBUG (ScheduledTrigger-2030-thread-2) [n:127.0.0.1:59199_solr    ] o.a.s.c.a.NodeLostTrigger Running NodeLostTrigger: node_lost_triggerMR with currently live nodes: 2
   [junit4]   2> 467824 DEBUG (ScheduledTrigger-2030-thread-2) [n:127.0.0.1:59199_solr    ] o.a.s.c.a.NodeLostTrigger NodeLostTrigger firing registered processor for lost nodes: [127.0.0.1:39208_solr]
   [junit4]   2> 467824 DEBUG (ScheduledTrigger-2030-thread-2) [n:127.0.0.1:59199_solr    ] o.a.s.c.a.ScheduledTriggers ++++++++ Cooldown inactive - processing event: {
   [junit4]   2>   "id":"426f265e7689b5T99398meselj1hb3oc1q1v7pps",
   [junit4]   2>   "source":"node_lost_triggerMR",
   [junit4]   2>   "eventTime":18699559047170485,
   [junit4]   2>   "eventType":"NODELOST",
   [junit4]   2>   "properties":{
   [junit4]   2>     "eventTimes":[18699559047170485],
   [junit4]   2>     "nodeNames":["127.0.0.1:39208_solr"]}}
   [junit4]   2> 467824 DEBUG (ScheduledTrigger-2030-thread-1) [n:127.0.0.1:59199_solr    ] o.a.s.c.a.NodeAddedTrigger Running NodeAddedTrigger node_added_triggerMR
   [junit4]   2> 467824 DEBUG (ScheduledTrigger-2030-thread-1) [n:127.0.0.1:59199_solr    ] o.a.s.c.a.NodeAddedTrigger Found livenodes: 2
   [junit4]   2> 467824 DEBUG (ScheduledTrigger-2030-thread-2) [n:127.0.0.1:59199_solr    ] o.a.s.c.a.ScheduledTriggers Pausing all triggers: [node_lost_triggerMR, node_added_triggerMR, .auto_add_replicas]
   [junit4]   2> 467824 DEBUG (ScheduledTrigger-2030-thread-4) [n:127.0.0.1:59199_solr    ] o.a.s.c.a.NodeLostTrigger Running NodeLostTrigger: .auto_add_replicas with currently live nodes: 2
   [junit4]   2> 467827 INFO  (ScheduledTrigger-2030-thread-2) [n:127.0.0.1:59199_solr    ] o.a.s.c.a.SystemLogListener Collection .system does not exist, disabling logging.
   [junit4]   2> 467828 DEBUG (AutoscalingActionExecutor-2031-thread-1-processing-n:127.0.0.1:59199_solr) [n:127.0.0.1:59199_solr    ] o.a.s.c.a.ScheduledTriggers -- processing actions for {
   [junit4]   2>   "id":"426f265e7689b5T99398meselj1hb3oc1q1v7pps",
   [junit4]   2>   "source":"node_lost_triggerMR",
   [junit4]   2>   "eventTime":18699559047170485,
   [junit4]   2>   "eventType":"NODELOST",
   [junit4]   2>   "properties":{
   [junit4]   2>     "eventTimes":[18699559047170485],
   [junit4]   2>     "_enqueue_time_":18699560048834280,
   [junit4]   2>     "nodeNames":["127.0.0.1:39208_solr"]}}
   [junit4]   2> 467829 INFO  (TEST-TriggerIntegrationTest.testNodeMarkersRegistration-seed#[265F98BEBC3430CA]) [    ] o.a.s.SolrTestCaseJ4 ###Ending testNodeMarkersRegistration
   [junit4]   2> 467839 DEBUG (AutoscalingActionExecutor-2031-thread-1-processing-n:127.0.0.1:59199_solr) [n:127.0.0.1:59199_solr    ] o.a.s.c.a.ScheduledTriggers Resuming trigger: node_lost_triggerMR after 5000ms
   [junit4]   2> 467839 DEBUG (AutoscalingActionExecutor-2031-thread-1-processing-n:127.0.0.1:59199_solr) [n:127.0.0.1:59199_solr    ] o.a.s.c.a.ScheduledTriggers Resuming trigger: node_added_triggerMR after 5000ms
   [junit4]   2> 467839 DEBUG (AutoscalingActionExecutor-2031-thread-1-processing-n:127.0.0.1:59199_solr) [n:127.0.0.1:59199_solr    ] o.a.s.c.a.ScheduledTriggers Resuming trigger: .auto_add_replicas after 5000ms
   [junit4]   2> 467839 DEBUG (AutoscalingActionExecutor-2031-thread-1-processing-n:127.0.0.1:59199_solr) [n:127.0.0.1:59199_solr    ] o.a.s.c.a.ScheduledTriggers -- processing took 11 ms for event id=426f265e7689b5T99398meselj1hb3oc1q1v7pps
   [junit4]   2> 467849 INFO  (TEST-TriggerIntegrationTest.testNodeAddedTriggerRestoreState-seed#[265F98BEBC3430CA]) [    ] o.a.s.SolrTestCaseJ4 ###Starting testNodeAddedTriggerRestoreState
   [junit4]   2> 467850 INFO  (TEST-TriggerIntegrationTest.testNodeAddedTriggerRestoreState-seed#[265F98BEBC3430CA]) [    ] o.a.s.c.a.TriggerIntegrationTest /autoscaling.json reset, new znode version 6
   [junit4]   2> 467850 DEBUG (zkCallback-1001-thread-1-processing-n:127.0.0.1:59199_solr) [n:127.0.0.1:59199_solr    ] o.a.s.c.a.OverseerTriggerThread Refreshing /autoscaling.json with znode version 6
   [junit4]   2> 467850 DEBUG (OverseerAutoScalingTriggerThread-73283087609233419-127.0.0.1:59199_solr-n_0000000002) [n:127.0.0.1:59199_solr    ] o.a.s.c.a.OverseerTriggerThread Processed trigger updates upto znodeVersion 6
   [junit4]   2> 467874 DEBUG (OverseerAutoScalingTriggerThread-73283087609233419-127.0.0.1:59199_solr-n_0000000002) [n:127.0.0.1:59199_solr    ] o.a.s.c.a.OverseerTriggerThread -- clean old nodeLost markers
   [junit4]   2> 467874 DEBUG (OverseerAutoScalingTriggerThread-73283087609233419-127.0.0.1:59199_solr-n_0000000002) [n:127.0.0.1:59199_solr    ] o.a.s.c.a.OverseerTriggerThread -- clean old nodeAdded markers
   [junit4]   2> 467874 DEBUG (OverseerAutoScalingTriggerThread-73283087609233419-127.0.0.1:59199_solr-n_0000000002) [n:127.0.0.1:59199_solr    ] o.a.s.c.a.OverseerTriggerThread Current znodeVersion 6, lastZnodeVersion 6
   [junit4]   2> 467899 INFO  (qtp469983493-4253) [n:127.0.0.1:34522_solr    ] o.a.s.s.HttpSolrCall [admin] webapp=null path=/admin/metrics params={prefix=CONTAINER.fs.usableSpace,CORE.coreName&wt=javabin&version=2&group=solr.node,solr.core} status=0 QTime=0
   [junit4]   2> 467902 INFO  (qtp746022335-4222) [n:127.0.0.1:59199_solr    ] o.a.s.s.HttpSolrCall [admin] webapp=null path=/admin/metrics params={prefix=CONTAINER.fs.usableSpace,CORE.coreName&wt=javabin&version=2&group=solr.node,solr.core} status=0 QTime=0
   [junit4]   2> 467902 DEBUG (qtp469983493-4258) [n:127.0.0.1:34522_solr    ] o.a.s.c.a.AutoScalingHandler Verified autoscaling configuration
   [junit4]   2> 467902 INFO  (qtp469983493-4258) [n:127.0.0.1:34522_solr    ] o.a.s.s.HttpSolrCall [admin] webapp=null path=/admin/autoscaling params={wt=javabin&version=2} status=0 QTime=10
   [junit4]   2> 467903 DEBUG (zkCallback-1001-thread-1-processing-n:127.0.0.1:59199_solr) [n:127.0.0.1:59199_solr    ] o.a.s.c.a.OverseerTriggerThread Refreshing /autoscaling.json with znode version 7
   [junit4]   2> 467903 DEBUG (zkCallback-1001-thread-1-processing-n:127.0.0.1:59199_solr) [n:127.0.0.1:59199_solr    ] o.a.s.c.a.NodeAddedTrigger Initial livenodes: [127.0.0.1:34522_solr, 127.0.0.1:59199_solr]
   [junit4]   2> 467903 DEBUG (zkCallback-1001-thread-1-processing-n:127.0.0.1:59199_solr) [n:127.0.0.1:59199_solr    ] o.a.s.c.a.NodeAddedTrigger NodeAddedTrigger node_added_restore_trigger instantiated with properties: {event=nodeAdded, waitFor=5, actions=[{name=test, class=org.apache.solr.cloud.autoscaling.TriggerIntegrationTest$TestTriggerAction}], enabled=true}
   [junit4]   2> 467903 DEBUG (OverseerAutoScalingTriggerThread-73283087609233419-127.0.0.1:59199_solr-n_0000000002) [n:127.0.0.1:59199_solr    ] o.a.s.c.a.OverseerTriggerThread Processed trigger updates upto znodeVersion 7
   [junit4]   2> 467904 INFO  (TEST-TriggerIntegrationTest.testNodeAddedTriggerRestoreState-seed#[265F98BEBC3430CA]) [    ] o.e.j.s.Server jetty-9.4.8.v20171121, build timestamp: 2017-11-21T23:27:37+02:00, git hash: 82b8fb23f757335bb3329d540ce37a2a2615f0a8
   [junit4]   2> 467905 INFO  (OverseerAutoScalingTriggerThread-73283087609233419-127.0.0.1:59199_solr-n_0000000002) [n:127.0.0.1:59199_solr    ] o.a.s.c.a.TriggerIntegrationTest TestTriggerAction init
   [junit4]   2> 467905 DEBUG (OverseerAutoScalingTriggerThread-73283087609233419-127.0.0.1:59199_solr-n_0000000002) [n:127.0.0.1:59199_solr    ] o.a.s.c.a.OverseerTriggerThread -- clean old nodeLost markers
   [junit4]   2> 467905 DEBUG (OverseerAutoScalingTriggerThread-73283087609233419-127.0.0.1:59199_solr-n_0000000002) [n:127.0.0.1:59199_solr    ] o.a.s.c.a.OverseerTriggerThread Current znodeVersion 7, lastZnodeVersion 7
   [junit4]   2> 467905 DEBUG (ScheduledTrigger-2030-thread-3) [n:127.0.0.1:59199_solr    ] o.a.s.c.a.NodeAddedTrigger Running NodeAddedTrigger node_added_restore_trigger
   [junit4]   2> 467905 DEBUG (ScheduledTrigger-2030-thread-3) [n:127.0.0.1:59199_solr    ] o.a.s.c.a.NodeAddedTrigger Found livenodes: 2
   [junit4]   2> 467906 INFO  (TEST-TriggerIntegrationTest.testNodeAddedTriggerRestoreState-seed#[265F98BEBC3430CA]) [    ] o.e.j.s.session DefaultSessionIdManager workerName=node0
   [junit4]   2> 467906 INFO  (TEST-TriggerIntegrationTest.testNodeAddedTriggerRestoreState-seed#[265F98BEBC3430CA]) [    ] o.e.j.s.session No SessionScavenger set, using defaults
   [junit4]   2> 467906 INFO  (TEST-TriggerIntegrationTest.testNodeAddedTriggerRestoreState-seed#[265F98BEBC3430CA]) [    ] o.e.j.s.session Scavenging every 660000ms
   [junit4]   2> 467907 INFO  (TEST-TriggerIntegrationTest.testNodeAddedTriggerRestoreState-seed#[265F98BEBC3430CA]) [    ] o.e.j.s.h.ContextHandler Started o.e.j.s.ServletContextHandler@2ace256b{/solr,null,AVAILABLE}
   [junit4]   2> 467907 INFO  (TEST-TriggerIntegrationTest.testNodeAddedTriggerRestoreState-seed#[265F98BEBC3430CA]) [    ] o.e.j.s.AbstractConnector Started ServerConnector@23a5e311{SSL,[ssl, http/1.1]}{127.0.0.1:32931}
   [junit4]   2> 467907 INFO  (TEST-TriggerIntegrationTest.testNodeAddedTriggerRestoreState-seed#[265F98BEBC3430CA]) [    ] o.e.j.s.Server Started @470078ms
   [junit4]   2> 467907 INFO  (TEST-TriggerIntegrationTest.testNodeAddedTriggerRestoreState-seed#[265F98BEBC3430CA]) [    ] o.a.s.c.s.e.JettySolrRunner Jetty properties: {hostContext=/solr, hostPort=32931}
   [junit4]   2> 467907 ERROR (TEST-TriggerIntegrationTest.testNodeAddedTriggerRestoreState-seed#[265F98BEBC3430CA]) [    ] o.a.s.u.StartupLoggingUtils Missing Java Option solr.log.dir. Logging may be missing or incomplete.
   [junit4]   2> 467907 INFO  (TEST-TriggerIntegrationTest.testNodeAddedTriggerRestoreState-seed#[265F98BEBC3430CA]) [    ] o.a.s.s.SolrDispatchFilter  ___      _       Welcome to Apache Solr™ version 7.3.0
   [junit4]   2> 467907 INFO  (TEST-TriggerIntegrationTest.testNodeAddedTriggerRestoreState-seed#[265F98BEBC3430CA]) [    ] o.a.s.s.SolrDispatchFilter / __| ___| |_ _   Starting in cloud mode on port null
   [junit4]   2> 467907 INFO  (TEST-TriggerIntegrationTest.testNodeAddedTriggerRestoreState-seed#[265F98BEBC3430CA]) [    ] o.a.s.s.SolrDispatchFilter \__ \/ _ \ | '_|  Install dir: null
   [junit4]   2> 467908 INFO  (TEST-TriggerIntegrationTest.testNodeAddedTriggerRestoreState-seed#[265F98BEBC3430CA]) [    ] o.a.s.s.SolrDispatchFilter |___/\___/_|_|    Start time: 2018-02-12T15:00:52.010Z
   [junit4]   2> 467911 INFO  (zkConnectionManagerCallback-1016-thread-1) [    ] o.a.s.c.c.ConnectionManager zkClient has connected
   [junit4]   2> 467911 INFO  (TEST-TriggerIntegrationTest.testNodeAddedTriggerRestoreState-seed#[265F98BEBC3430CA]) [    ] o.a.s.s.SolrDispatchFilter solr.xml found in ZooKeeper. Loading...
   [junit4]   2> 467921 INFO  (TEST-TriggerIntegrationTest.testNodeAddedTriggerRestoreState-seed#[265F98BEBC3430CA]) [    ] o.a.s.c.ZkContainer Zookeeper client=127.0.0.1:55242/solr
   [junit4]   2> 467923 INFO  (zkConnectionManagerCallback-1020-thread-1) [    ] o.a.s.c.c.ConnectionManager zkClient has connected
   [junit4]   2> 467925 INFO  (zkConnectionManagerCallback-1022-thread-1-processing-n:127.0.0.1:32931_solr) [n:127.0.0.1:32931_solr    ] o.a.s.c.c.ConnectionManager zkClient has connected
   [junit4]   2> 467930 INFO  (TEST-TriggerIntegrationTest.testNodeAddedTriggerRestoreState-seed#[265F98BEBC3430CA]) [n:127.0.0.1:32931_solr    ] o.a.s.c.c.ZkStateReader Updated live nodes from ZooKeeper... (0) -> (2)
   [junit4]   2> 467932 INFO  (TEST-TriggerIntegrationTest.testNodeAddedTriggerRestoreState-seed#[265F98BEBC3430CA]) [n:127.0.0.1:32931_solr    ] o.a.s.c.Overseer Overseer (id=null) closing
   [junit4]   2> 467933 INFO  (TEST-TriggerIntegrationTest.testNodeAddedTriggerRestoreState-seed#[265F98BEBC3430CA]) [n:127.0.0.1:32931_solr    ] o.a.s.c.ZkController Register node as live in ZooKeeper:/live_nodes/127.0.0.1:32931_solr
   [junit4]   2> 467934 INFO  (zkCallback-1011-thread-1-processing-n:127.0.0.1:34522_solr) [n:127.0.0.1:34522_solr    ] o.a.s.c.c.ZkStateReader Updated live nodes from ZooKeeper... (2) -> (3)
   [junit4]   2> 467935 INFO  (zkCallback-1001-thread-1-processing-n:127.0.0.1:59199_solr) [n:127.0.0.1:59199_solr    ] o.a.s.c.c.ZkStateReader Updated live nodes from ZooKeeper... (2) -> (3)
   [junit4]   2> 467936 INFO  (zkCallback-993-thread-1) [    ] o.a.s.c.c.ZkStateReader Updated live nodes from ZooKeeper... (2) -> (3)
   [junit4]   2> 467936 INFO  (zkCallback-1021-thread-1-processing-n:127.0.0.1:32931_solr) [n:127.0.0.1:32931_solr    ] o.a.s.c.c.ZkStateReader Updated live nodes from ZooKeeper... (2) -> (3)
   [junit4]   2> 468015 INFO  (TEST-TriggerIntegrationTest.testNodeAddedTriggerRestoreState-seed#[265F98BEBC3430CA]) [n:127.0.0.1:32931_solr    ] o.a.s.m.r.SolrJmxReporter JMX monitoring for 'solr_32931.solr.node' (registry 'solr.node') enabled at server: com.sun.jmx.mbeanserver.JmxMBeanServer@6ed76615
   [junit4]   2> 468025 INFO  (TEST-TriggerIntegrationTest.testNodeAddedTriggerRestoreState-seed#[265F98BEBC3430CA]) [n:127.0.0.1:32931_solr    ] o.a.s.m.r.SolrJmxReporter JMX monitoring for 'solr_32931.solr.jvm' (registry 'solr.jvm') enabled at server: com.sun.jmx.mbeanserver.JmxMBeanServer@6ed76615
   [junit4]   2> 468025 INFO  (TEST-TriggerIntegrationTest.testNodeAddedTriggerRestoreState-seed#[265F98BEBC3430CA]) [n:127.0.0.1:32931_solr    ] o.a.s.m.r.SolrJmxReporter JMX monitoring for 'solr_32931.solr.jetty' (registry 'solr.jetty') enabled at server: com.sun.jmx.mbeanserver.JmxMBeanServer@6ed76615
   [junit4]   2> 468026 INFO  (TEST-TriggerIntegrationTest.testNodeAddedTriggerRestoreState-seed#[265F98BEBC3430CA]) [n:127.0.0.1:32931_solr    ] o.a.s.c.CorePropertiesLocator Found 0 core definitions underneath /x1/jenkins/jenkins-slave/workspace/Lucene-Solr-Tests-7.x/solr/build/solr-core/test/J1/temp/solr.cloud.autoscaling.TriggerIntegrationTest_265F98BEBC3430CA-001/tempDir-001/node5/.
   [junit4]   2> 468906 DEBUG (ScheduledTrigger-2030-thread-3) [n:127.0.0.1:59199_solr    ] o.a.s.c.a.NodeAddedTrigger Running NodeAddedTrigger node_added_restore_trigger
   [junit4]   2> 468906 DEBUG (ScheduledTrigger-2030-thread-3) [n:127.0.0.1:59199_solr    ] o.a.s.c.a.NodeAddedTrigger Found livenodes: 3
   [junit4]   2> 468906 DEBUG (ScheduledTrigger-2030-thread-3) [n:127.0.0.1:59199_solr    ] o.a.s.c.a.NodeAddedTrigger Tracking new node: 127.0.0.1:32931_solr at time 18699561130761265
   [junit4]   2> 469609 INFO  (qtp533945757-4297) [n:127.0.0.1:32931_solr    ] o.a.s.s.HttpSolrCall [admin] webapp=null path=/admin/metrics params={prefix=CONTAINER.fs.usableSpace,CORE.coreName&wt=javabin&version=2&group=solr.node,solr.core} status=0 QTime=0
   [junit4]   2> 469612 INFO  (qtp469983493-4256) [n:127.0.0.1:34522_solr    ] o.a.s.s.HttpSolrCall [admin] webapp=null path=/admin/metrics params={prefix=CONTAINER.fs.usableSpace,CORE.coreName&wt=javabin&version=2&group=solr.node,solr.core} status=0 QTime=0
   [junit4]   2> 469617 INFO  (qtp746022335-4219) [n:127.0.0.1:59199_solr    ] o.a.s.s.HttpSolrCall [admin] webapp=null path=/admin/metrics params={prefix=CONTAINER.fs.usableSpace,CORE.coreName&wt=javabin&version=2&group=solr.node,solr.core} status=0 QTime=0
   [junit4]   2> 469617 DEBUG (qtp533945757-4293) [n:127.0.0.1:32931_solr    ] o.a.s.c.a.AutoScalingHandler Verified autoscaling configuration
   [junit4]   2> 469618 DEBUG (zkCallback-1001-thread-1-processing-n:127.0.0.1:59199_solr) [n:127.0.0.1:59199_solr    ] o.a.s.c.a.OverseerTriggerThread Refreshing /autoscaling.json with znode version 8
   [junit4]   2> 469618 DEBUG (zkCallback-1001-thread-1-processing-n:127.0.0.1:59199_solr) [n:127.0.0.1:59199_solr    ] o.a.s.c.a.NodeAddedTrigger Initial livenodes: [127.0.0.1:34522_solr, 127.0.0.1:32931_solr, 127.0.0.1:59199_solr]
   [junit4]   2> 469618 DEBUG (zkCallback-1001-thread-1-processing-n:127.0.0.1:59199_solr) [n:127.0.0.1:59199_solr    ] o.a.s.c.a.NodeAddedTrigger NodeAddedTrigger node_added_restore_trigger instantiated with properties: {event=nodeAdded, waitFor=0, actions=[{name=test, class=org.apache.solr.cloud.autoscaling.TriggerIntegrationTest$TestTriggerAction}], enabled=true}
   [junit4]   2> 469618 DEBUG (OverseerAutoScalingTriggerThread-73283087609233419-127.0.0.1:59199_solr-n_0000000002) [n:127.0.0.1:59199_solr    ] o.a.s.c.a.OverseerTriggerThread Processed trigger updates upto znodeVersion 8
   [junit4]   2> 469619 INFO  (OverseerAutoScalingTriggerThread-73283087609233419-127.0.0.1:59199_solr-n_0000000002) [n:127.0.0.1:59199_solr    ] o.a.s.c.a.TriggerIntegrationTest TestTriggerAction init
   [junit4]   2> 469619 DEBUG (OverseerAutoScalingTriggerThread-73283087609233419-127.0.0.1:59199_solr-n_0000000002) [n:127.0.0.1:59199_solr    ] o.a.s.c.a.NodeAddedTrigger Adding node from marker path: 127.0.0.1:32931_solr
   [junit4]   2> 469619 DEBUG (OverseerAutoScalingTriggerThread-73283087609233419-127.0.0.1:59199_solr-n_0000000002) [n:127.0.0.1:59199_solr    ] o.a.s.c.a.OverseerTriggerThread -- clean old nodeLost markers
   [junit4]   2> 469619 DEBUG (ScheduledTrigger-2030-thread-1) [n:127.0.0.1:59199_solr    ] o.a.s.c.a.NodeAddedTrigger Running NodeAddedTrigger node_added_restore_trigger
   [junit4]   2> 469619 DEBUG (ScheduledTrigger-2030-thread-1) [n:127.0.0.1:59199_solr    ] o.a.s.c.a.NodeAddedTrigger Found livenodes: 3
   [junit4]   2> 469619 DEBUG (ScheduledTrigger-2030-thread-1) [n:127.0.0.1:59199_solr    ] o.a.s.c.a.NodeAddedTrigger NodeAddedTrigger node_added_restore_trigger firing registered processor for nodes: [127.0.0.1:32931_solr] added at times [18699561843643008], now=18699561844070308
   [junit4]   2> 469619 DEBUG (OverseerAutoScalingTriggerThread-73283087609233419-127.0.0.1:59199_solr-n_0000000002) [n:127.0.0.1:59199_solr    ] o.a.s.c.a.OverseerTriggerThread Current znodeVersion 8, lastZnodeVersion 8
   [junit4]   2> 469619 DEBUG (ScheduledTrigger-2030-thread-1) [n:127.0.0.1:59199_solr    ] o.a.s.c.a.ScheduledTriggers ++++++++ Cooldown inactive - processing event: {
   [junit4]   2>   "id":"426f2705255280T99398meselj1hb3oc1q1v7ppu",
   [junit4]   2>   "source":"node_added_restore_trigger",
   [junit4]   2>   "eventTime":18699561843643008,
   [junit4]   2>   "eventType":"NODEADDED",
   [junit4]   2>   "properties":{
   [junit4]   2>     "eventTimes":[18699561843643008],
   [junit4]   2>     "nodeNames":["127.0.0.1:32931_solr"]}}
   [junit4]   2> 469619 DEBUG (ScheduledTrigger-2030-thread-1) [n:127.0.0.1:59199_solr    ] o.a.s.c.a.ScheduledTriggers Pausing all triggers: [node_added_restore_trigger]
   [junit4]   2> 469620 INFO  (qtp533945757-4293) [n:127.0.0.1:32931_solr    ] o.a.s.s.HttpSolrCall [admin] webapp=null path=/admin/autoscaling params={wt=javabin&version=2} status=0 QTime=14
   [junit4]   2> 469620 INFO  (ScheduledTrigger-2030-thread-1) [n:127.0.0.1:59199_solr    ] o.a.s.c.a.SystemLogListener Collection .system does not exist, disabling logging.
   [junit4]   2> 469620 DEBUG (AutoscalingActionExecutor-2031-thread-1-processing-n:127.0.0.1:59199_solr) [n:127.0.0.1:59199_solr    ] o.a.s.c.a.ScheduledTriggers -- processing actions for {
   [junit4]   2>   "id":"426f2705255280T99398meselj1hb3oc1q1v7ppu",
   [junit4]   2>   "source":"node_added_restore_trigger",
   [junit4]   2>   "eventTime":18699561843643008,
   [junit4]   2>   "eventType":"NODEADDED",
   [junit4]   2>   "properties":{
   [junit4]   2>     "eventTimes":[18699561843643008],
   [junit4]   2>     "_enqueue_time_":18699561844248851,
   [junit4]   2>     "nodeNames":["127.0.0.1:32931_solr"]}}
   [junit4]   2> 469621 DEBUG (AutoscalingActionExecutor-2031-thread-1-processing-n:127.0.0.1:59199_solr) [n:127.0.0.1:59199_solr    ] o.a.s.c.a.ScheduledTriggers Resuming trigger: node_added_restore_trigger after 5000ms
   [junit4]   2> 469621 DEBUG (AutoscalingActionExecutor-2031-thread-1-processing-n:127.0.0.1:59199_solr) [n:127.0.0.1:59199_solr    ] o.a.s.c.a.ScheduledTriggers -- processing took 0 ms for event id=426f2705255280T99398meselj1hb3oc1q1v7ppu
   [junit4]   2> 469621 INFO  (TEST-TriggerIntegrationTest.testNodeAddedTriggerRestoreState-seed#[265F98BEBC3430CA]) [    ] o.a.s.SolrTestCaseJ4 ###Ending testNodeAddedTriggerRestoreState
   [junit4]   2> 469636 INFO  (TEST-TriggerIntegrationTest.testEventQueue-seed#[265F98BEBC3430CA]) [    ] o.a.s.SolrTestCaseJ4 ###Starting testEventQueue
   [junit4]   2> 469636 INFO  (TEST-TriggerIntegrationTest.testEventQueue-seed#[265F98BEBC3430CA]) [    ] o.a.s.c.a.TriggerIntegrationTest /autoscaling.json reset, new znode version 9
   [junit4]   2> 469636 DEBUG (zkCallback-1001-thread-1-processing-n:127.0.0.1:59199_solr) [n:127.0.0.1:59199_solr    ] o.a.s.c.a.OverseerTriggerThread Refreshing /autoscaling.json with znode version 9
   [junit4]   2> 469636 DEBUG (OverseerAutoScalingTriggerThread-73283087609233419-127.0.0.1:59199_solr-n_0000000002) [n:127.0.0.1:59199_solr    ] o.a.s.c.a.OverseerTriggerThread Processed trigger updates upto znodeVersion 9
   [junit4]   2> 469637 DEBUG (OverseerAutoScalingTriggerThread-73283087609233419-127.0.0.1:59199_solr-n_0000000002) [n:127.0.0.1:59199_solr    ] o.a.s.c.a.OverseerTriggerThread -- clean old nodeLost markers
   [junit4]   2> 469637 DEBUG (OverseerAutoScalingTriggerThread-73283087609233419-127.0.0.1:59199_solr-n_0000000002) [n:127.0.0.1:59199_solr    ] o.a.s.c.a.OverseerTriggerThread -- clean old nodeAdded markers
   [junit4]   2> 469638 DEBUG (OverseerAutoScalingTriggerThread-73283087609233419-127.0.0.1:59199_solr-n_0000000002) [n:127.0.0.1:59199_solr    ] o.a.s.c.a.OverseerTriggerThread Current znodeVersion 9, lastZnodeVersion 9
   [junit4]   2> 469640 INFO  (qtp533945757-4295) [n:127.0.0.1:32931_solr    ] o.a.s.h.a.CollectionsHandler Invoked Collection Action :overseerstatus with params action=OVERSEERSTATUS&wt=javabin&version=2 and sendToOCPQueue=true
   [junit4]   2> 469643 INFO  (qtp533945757-4295) [n:127.0.0.1:32931_solr    ] o.a.s.s.HttpSolrCall [admin] webapp=null path=/admin/collections params={action=OVERSEERSTATUS&wt=javabin&version=2} status=0 QTime=3
   [junit4]   2> 469648 INFO  (qtp533945757-4296) [n:127.0.0.1:32931_solr    ] o.a.s.s.HttpSolrCall [admin] webapp=null path=/admin/metrics params={prefix=CONTAINER.fs.usableSpace,CORE.coreName&wt=javabin&version=2&group=solr.node,solr.core} status=0 QTime=0
   [junit4]   2> 469649 INFO  (qtp469983493-4258) [n:127.0.0.1:34522_solr    ] o.a.s.s.HttpSolrCall [admin] webapp=null path=/admin/metrics params={prefix=CONTAINER.fs.usableSpace,CORE.coreName&wt=javabin&version=2&group=solr.node,solr.core} status=0 QTime=0
   [junit4]   2> 469650 INFO  (qtp746022335-4222) [n:127.0.0.1:59199_solr    ] o.a.s.s.HttpSolrCall [admin] webapp=null path=/admin/metrics params={prefix=CONTAINER.fs.usableSpace,CORE.coreName&wt=javabin&version=2&group=solr.node,solr.core} status=0 QTime=0
   [junit4]   2> 469650 DEBUG (qtp533945757-4293) [n:127.0.0.1:32931_solr    ] o.a.s.c.a.AutoScalingHandler Verified autoscaling configuration
   [junit4]   2> 469650 INFO  (qtp533945757-4293) [n:127.0.0.1:32931_solr    ] o.a.s.s.HttpSolrCall [admin] webapp=null path=/cluster/autoscaling params={wt=javabin&version=2} status=0 QTime=6
   [junit4]   2> 469651 DEBUG (zkCallback-1001-thread-1-processing-n:127.0.0.1:59199_solr) [n:127.0.0.1:59199_solr    ] o.a.s.c.a.OverseerTriggerThread Refreshing /autoscaling.json with znode version 10
   [junit4]   2> 469651 INFO  (zkCallback-1001-thread-1-processing-n:127.0.0.1:59199_solr) [n:127.0.0.1:59199_solr    ] o.a.s.c.a.TriggerIntegrationTest TestEventQueueAction instantiated
   [junit4]   2> 469651 DEBUG (zkCallback-1001-thread-1-processing-n:127.0.0.1:59199_solr) [n:127.0.0.1:59199_solr    ] o.a.s.c.a.NodeAddedTrigger Initial livenodes: [127.0.0.1:34522_solr, 127.0.0.1:32931_solr, 127.0.0.1:59199_solr]
   [junit4]   2> 469651 DEBUG (zkCallback-1001-thread-1-processing-n:127.0.0.1:59199_solr) [n:127.0.0.1:59199_solr    ] o.a.s.c.a.NodeAddedTrigger NodeAddedTrigger node_added_triggerEQ instantiated with properties: {event=nodeAdded, waitFor=1, actions=[{name=test, class=org.apache.solr.cloud.autoscaling.TriggerIntegrationTest$TestEventQueueAction}], enabled=true}
   [junit4]   2> 469651 DEBUG (OverseerAutoScalingTriggerThread-73283087609233419-127.0.0.1:59199_solr-n_0000000002) [n:127.0.0.1:59199_solr    ] o.a.s.c.a.OverseerTriggerThread Processed trigger updates upto znodeVersion 10
   [junit4]   2> 469652 DEBUG (OverseerAutoScalingTriggerThread-73283087609233419-127.0.0.1:59199_solr-n_0000000002) [n:127.0.0.1:59199_solr    ] o.a.s.c.a.TriggerIntegrationTest TestTriggerAction init
   [junit4]   2> 469653 INFO  (TEST-TriggerIntegrationTest.testEventQueue-seed#[265F98BEBC3430CA]) [    ] o.e.j.s.Server jetty-9.4.8.v20171121, build timestamp: 2017-11-21T23:27:37+02:00, git hash: 82b8fb23f757335bb3329d540ce37a2a2615f0a8
   [junit4]   2> 469653 DEBUG (OverseerAutoScalingTriggerThread-73283087609233419-127.0.0.1:59199_solr-n_0000000002) [n:127.0.0.1:59199_solr    ] o.a.s.c.a.OverseerTriggerThread -- clean old nodeLost markers
   [junit4]   2> 469654 DEBUG (OverseerAutoScalingTriggerThread-73283087609233419-127.0.0.1:59199_solr-n_0000000002) [n:127.0.0.1:59199_solr    ] o.a.s.c.a.OverseerTriggerThread Current znodeVersion 10, lastZnodeVersion 10
   [junit4]   2> 469654 DEBUG (ScheduledTrigger-2030-thread-3) [n:127.0.0.1:59199_solr    ] o.a.s.c.a.NodeAddedTrigger Running NodeAddedTrigger node_added_triggerEQ
   [junit4]   2> 469654 DEBUG (ScheduledTrigger-2030-thread-3) [n:127.0.0.1:59199_solr    ] o.a.s.c.a.NodeAddedTrigger Found livenodes: 3
   [junit4]   2> 469655 INFO  (TEST-TriggerIntegrationTest.testEventQueue-seed#[265F98BEBC3430CA]) [    ] o.e.j.s.session DefaultSessionIdManager workerName=node0
   [junit4]   2> 469655 INFO  (TEST-TriggerIntegrationTest.testEventQueue-seed#[265F98BEBC3430CA]) [    ] o.e.j.s.session No SessionScavenger set, using defaults
   [junit4]   2> 469655 INFO  (TEST-TriggerIntegrationTest.testEventQueue-seed#[265F98BEBC3430CA]) [    ] o.e.j.s.session Scavenging every 600000ms
   [junit4]   2> 469655 INFO  (TEST-TriggerIntegrationTest.testEventQueue-seed#[265F98BEBC3430CA]) [    ] o.e.j.s.h.ContextHandler Started o.e.j.s.ServletContextHandler@5efa9d08{/solr,null,AVAILABLE}
   [junit4]   2> 469655 INFO  (TEST-TriggerIntegrationTest.testEventQueue-seed#[265F98BEBC3430CA]) [    ] o.e.j.s.AbstractConnector Started ServerConnector@3940a30{SSL,[ssl, http/1.1]}{127.0.0.1:56282}
   [junit4]   2> 469655 INFO  (TEST-TriggerIntegrationTest.testEventQueue-seed#[265F98BEBC3430CA]) [    ] o.e.j.s.Server Started @471827ms
   [junit4]   2> 469656 INFO  (TEST-TriggerIntegrationTest.testEventQueue-seed#[265F98BEBC3430CA]) [    ] o.a.s.c.s.e.JettySolrRunner Jetty properties: {hostContext=/solr, hostPort=56282}
   [junit4]   2> 469656 ERROR (TEST-TriggerIntegrationTest.testEventQueue-seed#[265F98BEBC3430CA]) [    ] o.a.s.u.StartupLoggingUtils Missing Java Option solr.log.dir. Logging may be missing or incomplete.
   [junit4]   2> 469656 INFO  (TEST-TriggerIntegrationTest.testEventQueue-seed#[265F98BEBC3430CA]) [    ] o.a.s.s.SolrDispatchFilter  ___      _       Welcome to Apache Solr™ version 7.3.0
   [junit4]   2> 469656 INFO  (TEST-TriggerIntegrationTest.testEventQueue-seed#[265F98BEBC3430CA]) [    ] o.a.s.s.SolrDispatchFilter / __| ___| |_ _   Starting in cloud mode on port null
   [junit4]   2> 469656 INFO  (TEST-TriggerIntegrationTest.testEventQueue-seed#[265F98BEBC3430CA]) [    ] o.a.s.s.SolrDispatchFilter \__ \/ _ \ | '_|  Install dir: null
   [junit4]   2> 469656 INFO  (TEST-TriggerIntegrationTest.testEventQueue-seed#[265F98BEBC3430CA]) [    ] o.a.s.s.SolrDispatchFilter |___/\___/_|_|    Start time: 2018-02-12T15:00:53.758Z
   [junit4]   2> 469663 INFO  (zkConnectionManagerCallback-1026-thread-1) [    ] o.a.s.c.c.ConnectionManager zkClient has connected
   [junit4]   2> 469664 INFO  (TEST-TriggerIntegrationTest.testEventQueue-seed#[265F98BEBC3430CA]) [    ] o.a.s.s.SolrDispatchFilter solr.xml found in ZooKeeper. Loading...
   [junit4]   2> 469671 INFO  (TEST-TriggerIntegrationTest.testEventQueue-seed#[265F98BEBC3430CA]) [    ] o.a.s.c.ZkContainer Zookeeper client=127.0.0.1:55242/solr
   [junit4]   2> 469672 INFO  (zkConnectionManagerCallback-1030-thread-1) [    ] o.a.s.c.c.ConnectionManager zkClient has connected
   [junit4]   2> 469677 INFO  (zkConnectionManagerCallback-1032-thread-1-processing-n:127.0.0.1:56282_solr) [n:127.0.0.1:56282_solr    ] o.a.s.c.c.ConnectionManager zkClient has connected
   [junit4]   2> 469681 INFO  (TEST-TriggerIntegrationTest.testEventQueue-seed#[265F98BEBC3430CA]) [n:127.0.0.1:56282_solr    ] o.a.s.c.c.ZkStateReader Updated live nodes from ZooKeeper... (0) -> (3)
   [junit4]   2> 469683 INFO  (TEST-TriggerIntegrationTest.testEventQueue-seed#[265F98BEBC3430CA]) [n:127.0.0.1:56282_solr    ] o.a.s.c.Overseer Overseer (id=null) closing
   [junit4]   2> 469684 INFO  (TEST-TriggerIntegrationTest.testEventQueue-seed#[265F98BEBC3430CA]) [n:127.0.0.1:56282_solr    ] o.a.s.c.ZkController Register node as live in ZooKeeper:/live_nodes/127.0.0.1:56282_solr
   [junit4]   2> 469687 INFO  (zkCallback-993-thread-1) [    ] o.a.s.c.c.ZkStateReader Updated live nodes from ZooKeeper... (3) -> (4)
   [junit4]   2> 469687 INFO  (zkCallback-1001-thread-1-processing-n:127.0.0.1:59199_solr) [n:127.0.0.1:59199_solr    ] o.a.s.c.c.ZkStateReader Updated live nodes from ZooKeeper... (3) -> (4)
   [junit4]   2> 469687 INFO  (zkCallback-1021-thread-1-processing-n:127.0.0.1:32931_solr) [n:127.0.0.1:32931_solr    ] o.a.s.c.c.ZkStateReader Updated live nodes from ZooKeeper... (3) -> (4)
   [junit4]   2> 469688 INFO  (zkCallback-1011-thread-1-processing-n:127.0.0.1:34522_solr) [n:127.0.0.1:34522_solr    ] o.a.s.c.c.ZkStateReader Updated live nodes from ZooKeeper... (3) -> (4)
   [junit4]   2> 469688 INFO  (zkCallback-1031-thread-1-processing-n:127.0.0.1:56282_solr) [n:127.0.0.1:56282_solr    ] o.a.s.c.c.ZkStateReader Updated live nodes from ZooKeeper... (3) -> (4)
   [junit4]   2> 469754 INFO  (TEST-TriggerIntegrationTest.testEventQueue-seed#[265F98BEBC3430CA]) [n:127.0.0.1:56282_solr    ] o.a.s.m.r.SolrJmxReporter JMX monitoring for 'solr_56282.solr.node' (registry 'solr.node') enabled at server: com.sun.jmx.mbeanserver.JmxMBeanServer@6ed76615
   [junit4]   2> 469763 INFO  (TEST-TriggerIntegrationTest.testEventQueue-seed#[265F98BEBC3430CA]) [n:127.0.0.1:56282_solr    ] o.a.s.m.r.SolrJmxReporter JMX monitoring for 'solr_56282.solr.jvm' (registry 'solr.jvm') enabled at server: com.sun.jmx.mbea

[...truncated too long message...]

{/solr,null,UNAVAILABLE}
   [junit4]   2> 668580 WARN  (NIOServerCxn.Factory:0.0.0.0/0.0.0.0:0) [    ] o.a.z.s.NIOServerCnxn Unable to read additional data from client sessionid 0x1045a9474fe0038, likely client has closed socket
   [junit4]   2> 668581 INFO  (jetty-closer-966-thread-11) [    ] o.e.j.s.session Stopped scavenging
   [junit4]   2> 668583 INFO  (coreCloseExecutor-2228-thread-1) [n:127.0.0.1:50140_solr c:testMetricTrigger s:shard2 r:core_node4 x:testMetricTrigger_shard2_replica_n2] o.a.s.m.SolrMetricManager Closing metric reporters for registry=solr.collection.testMetricTrigger.shard2.leader, tag=810248638
   [junit4]   2> 668583 INFO  (coreCloseExecutor-2230-thread-1) [n:127.0.0.1:38173_solr c:collection1 s:shard1 r:core_node16 x:collection1_shard1_replica_n15] o.a.s.m.SolrMetricManager Closing metric reporters for registry=solr.collection.collection1.shard1.leader, tag=1152322988
   [junit4]   2> 668589 WARN  (NIOServerCxn.Factory:0.0.0.0/0.0.0.0:0) [    ] o.a.z.s.NIOServerCnxn Unable to read additional data from client sessionid 0x1045a9474fe0035, likely client has closed socket
   [junit4]   2> 668589 INFO  (jetty-closer-966-thread-8) [    ] o.e.j.s.h.ContextHandler Stopped o.e.j.s.ServletContextHandler@443da93f{/solr,null,UNAVAILABLE}
   [junit4]   2> 668590 INFO  (jetty-closer-966-thread-8) [    ] o.e.j.s.session Stopped scavenging
   [junit4]   2> 668591 INFO  (jetty-closer-966-thread-10) [    ] o.e.j.s.h.ContextHandler Stopped o.e.j.s.ServletContextHandler@3bdfa22a{/solr,null,UNAVAILABLE}
   [junit4]   2> 668591 INFO  (jetty-closer-966-thread-10) [    ] o.e.j.s.session Stopped scavenging
   [junit4]   2> 668592 INFO  (coreCloseExecutor-2218-thread-2) [n:127.0.0.1:32971_solr c:collection1 s:shard1 r:core_node14 x:collection1_shard1_replica_n13] o.a.s.m.SolrMetricManager Closing metric reporters for registry=solr.collection.collection1.shard1.leader, tag=1963875179
   [junit4]   2> 668594 INFO  (jetty-closer-966-thread-3) [    ] o.e.j.s.h.ContextHandler Stopped o.e.j.s.ServletContextHandler@3fd348fb{/solr,null,UNAVAILABLE}
   [junit4]   2> 668594 INFO  (jetty-closer-966-thread-3) [    ] o.e.j.s.session Stopped scavenging
   [junit4]   2> 669885 WARN  (zkCallback-1101-thread-2-processing-n:127.0.0.1:42558_solr) [n:127.0.0.1:42558_solr    ] o.a.s.c.ZkController Unable to register nodeLost path for 127.0.0.1:47611_solr
   [junit4]   2> org.apache.zookeeper.KeeperException$SessionExpiredException: KeeperErrorCode = Session expired for /autoscaling/nodeLost/127.0.0.1:47611_solr
   [junit4]   2> 	at org.apache.zookeeper.KeeperException.create(KeeperException.java:130)
   [junit4]   2> 	at org.apache.zookeeper.KeeperException.create(KeeperException.java:54)
   [junit4]   2> 	at org.apache.zookeeper.ZooKeeper.create(ZooKeeper.java:786)
   [junit4]   2> 	at org.apache.solr.common.cloud.SolrZkClient.lambda$create$7(SolrZkClient.java:365)
   [junit4]   2> 	at org.apache.solr.common.cloud.ZkCmdExecutor.retryOperation(ZkCmdExecutor.java:60)
   [junit4]   2> 	at org.apache.solr.common.cloud.SolrZkClient.create(SolrZkClient.java:365)
   [junit4]   2> 	at org.apache.solr.cloud.ZkController.lambda$registerLiveNodesListener$2(ZkController.java:882)
   [junit4]   2> 	at org.apache.solr.common.cloud.ZkStateReader.lambda$refreshLiveNodes$1(ZkStateReader.java:704)
   [junit4]   2> 	at java.util.concurrent.ConcurrentHashMap$KeySetView.forEach(ConcurrentHashMap.java:4649)
   [junit4]   2> 	at org.apache.solr.common.cloud.ZkStateReader.refreshLiveNodes(ZkStateReader.java:703)
   [junit4]   2> 	at org.apache.solr.common.cloud.ZkStateReader.access$900(ZkStateReader.java:72)
   [junit4]   2> 	at org.apache.solr.common.cloud.ZkStateReader$LiveNodeWatcher.refreshAndWatch(ZkStateReader.java:1090)
   [junit4]   2> 	at org.apache.solr.common.cloud.ZkStateReader$LiveNodeWatcher.process(ZkStateReader.java:1085)
   [junit4]   2> 	at org.apache.solr.common.cloud.SolrZkClient$1.lambda$process$1(SolrZkClient.java:269)
   [junit4]   2> 	at java.util.concurrent.Executors$RunnableAdapter.call(Executors.java:511)
   [junit4]   2> 	at java.util.concurrent.FutureTask.run(FutureTask.java:266)
   [junit4]   2> 	at org.apache.solr.common.util.ExecutorUtil$MDCAwareThreadPoolExecutor.lambda$execute$0(ExecutorUtil.java:188)
   [junit4]   2> 	at java.util.concurrent.ThreadPoolExecutor.runWorker(ThreadPoolExecutor.java:1149)
   [junit4]   2> 	at java.util.concurrent.ThreadPoolExecutor$Worker.run(ThreadPoolExecutor.java:624)
   [junit4]   2> 	at java.lang.Thread.run(Thread.java:748)
   [junit4]   2> 669886 INFO  (jetty-closer-966-thread-7) [    ] o.e.j.s.h.ContextHandler Stopped o.e.j.s.ServletContextHandler@532a9cd6{/solr,null,UNAVAILABLE}
   [junit4]   2> 669887 INFO  (jetty-closer-966-thread-7) [    ] o.e.j.s.session Stopped scavenging
   [junit4]   2> 669888 ERROR (SUITE-TriggerIntegrationTest-seed#[265F98BEBC3430CA]-worker) [    ] o.a.z.s.ZooKeeperServer ZKShutdownHandler is not registered, so ZooKeeper server won't take any action on ERROR or SHUTDOWN server state changes
   [junit4]   2> 669888 INFO  (SUITE-TriggerIntegrationTest-seed#[265F98BEBC3430CA]-worker) [    ] o.a.s.c.ZkTestServer connecting to 127.0.0.1:55242 55242
   [junit4]   2> 670101 INFO  (Thread-805) [    ] o.a.s.c.ZkTestServer connecting to 127.0.0.1:55242 55242
   [junit4]   2> 670101 WARN  (Thread-805) [    ] o.a.s.c.ZkTestServer Watch limit violations: 
   [junit4]   2> Maximum concurrent create/delete watches above limit:
   [junit4]   2> 
   [junit4]   2> 	41	/solr/collections/collection1/terms/shard1
   [junit4]   2> 	22	/solr/aliases.json
   [junit4]   2> 	21	/solr/security.json
   [junit4]   2> 	10	/solr/collections/testMetricTrigger/terms/shard1
   [junit4]   2> 	10	/solr/configs/conf
   [junit4]   2> 	2	/solr/collections/testMetricTrigger/terms/shard2
   [junit4]   2> 
   [junit4]   2> Maximum concurrent data watches above limit:
   [junit4]   2> 
   [junit4]   2> 	149	/solr/collections/collection1/state.json
   [junit4]   2> 	37	/solr/collections/testMetricTrigger/state.json
   [junit4]   2> 	22	/solr/clusterprops.json
   [junit4]   2> 	22	/solr/clusterstate.json
   [junit4]   2> 	6	/solr/autoscaling.json
   [junit4]   2> 	3	/solr/overseer_elect/election/73283087609233452-127.0.0.1:38173_solr-n_0000000013
   [junit4]   2> 	3	/solr/overseer_elect/election/73283087609233443-127.0.0.1:36383_solr-n_0000000010
   [junit4]   2> 	2	/solr/overseer_elect/election/73283087609233437-127.0.0.1:59081_solr-n_0000000008
   [junit4]   2> 	2	/solr/overseer_elect/election/73283087609233434-127.0.0.1:32971_solr-n_0000000007
   [junit4]   2> 	2	/solr/overseer_elect/election/73283087609233440-127.0.0.1:42375_solr-n_0000000009
   [junit4]   2> 	2	/solr/collections/collection1/leader_elect/shard1/election/73283087609233431-core_node6-n_0000000002
   [junit4]   2> 	2	/solr/overseer_elect/election/73283087609233464-127.0.0.1:47611_solr-n_0000000017
   [junit4]   2> 
   [junit4]   2> Maximum concurrent children watches above limit:
   [junit4]   2> 
   [junit4]   2> 	22	/solr/collections
   [junit4]   2> 	21	/solr/live_nodes
   [junit4]   2> 	6	/solr/overseer/queue-work
   [junit4]   2> 	6	/solr/autoscaling/events/.auto_add_replicas
   [junit4]   2> 	6	/solr/overseer/collection-queue-work
   [junit4]   2> 	5	/solr/overseer/queue
   [junit4]   2> 	2	/solr/autoscaling/events/node_lost_triggerMR
   [junit4]   2> 	2	/solr/autoscaling/events/node_added_triggerCTOOR
   [junit4]   2> 
   [junit4]   2> NOTE: leaving temporary files on disk at: /x1/jenkins/jenkins-slave/workspace/Lucene-Solr-Tests-7.x/solr/build/solr-core/test/J1/temp/solr.cloud.autoscaling.TriggerIntegrationTest_265F98BEBC3430CA-001
   [junit4]   2> Feb 12, 2018 3:04:14 PM com.carrotsearch.randomizedtesting.ThreadLeakControl checkThreadLeaks
   [junit4]   2> WARNING: Will linger awaiting termination of 1 leaked thread(s).
   [junit4]   2> NOTE: test params are: codec=HighCompressionCompressingStoredFields(storedFieldsFormat=CompressingStoredFieldsFormat(compressionMode=HIGH_COMPRESSION, chunkSize=3, maxDocsPerChunk=546, blockSize=666), termVectorsFormat=CompressingTermVectorsFormat(compressionMode=HIGH_COMPRESSION, chunkSize=3, blockSize=666)), sim=RandomSimilarity(queryNorm=false): {}, locale=et, timezone=Universal
   [junit4]   2> NOTE: Linux 3.13.0-88-generic amd64/Oracle Corporation 1.8.0_144 (64-bit)/cpus=4,threads=1,free=176083152,total=458752000
   [junit4]   2> NOTE: All tests run in this JVM: [TestFieldTypeResource, TestBlendedInfixSuggestions, ResourceLoaderTest, SimpleMLTQParserTest, PreAnalyzedFieldManagedSchemaCloudTest, TestRTGBase, TestLegacyNumericRangeQueryBuilder, SliceStateTest, TestFieldCollectionResource, TestCloudDeleteByQuery, SyncSliceTest, ChangedSchemaMergeTest, TestRecovery, BasicAuthStandaloneTest, TestPointFields, TestConfigSetsAPIExclusivity, TestNumericRangeQuery32, HdfsRestartWhileUpdatingTest, MetricTriggerTest, SolrInfoBeanTest, TestReplicaProperties, AddSchemaFieldsUpdateProcessorFactoryTest, TestReplicationHandlerBackup, CustomHighlightComponentTest, TestSolrCloudSnapshots, TestQueryUtils, AnalysisErrorHandlingTest, HighlighterTest, FacetPivotSmallTest, TestManagedSynonymGraphFilterFactory, PeerSyncWithIndexFingerprintCachingTest, TestPullReplicaErrorHandling, DOMUtilTest, AutoAddReplicasPlanActionTest, JavabinLoaderTest, QueryParsingTest, TestPayloadCheckQParserPlugin, OverriddenZkACLAndCredentialsProvidersTest, ConfigSetsAPITest, ConjunctionSolrSpellCheckerTest, TestSortByMinMaxFunction, SolrCloudReportersTest, BaseCdcrDistributedZkTest, TestFieldCacheSort, DistributedMLTComponentTest, SuggestComponentTest, UpdateRequestProcessorFactoryTest, TestDeleteCollectionOnDownNodes, SOLR749Test, FastVectorHighlighterTest, TestHttpShardHandlerFactory, SearchRateTriggerTest, TestInPlaceUpdatesStandalone, TestLRUCache, TestFastLRUCache, TestLegacyNumericUtils, TriggerIntegrationTest]
   [junit4] Completed [171/775 (1!)] on J1 in 215.28s, 14 tests, 1 failure <<< FAILURES!

[...truncated 50619 lines...]

Mime
View raw message