lucene-dev mailing list archives

Site index · List index
Message view « Date » · « Thread »
Top « Date » · « Thread »
From Policeman Jenkins Server <jenk...@thetaphi.de>
Subject [JENKINS] Lucene-Solr-master-Linux (32bit/jdk1.8.0_162) - Build # 21546 - Still Unstable!
Date Tue, 27 Feb 2018 18:52:06 GMT
Build: https://jenkins.thetaphi.de/job/Lucene-Solr-master-Linux/21546/
Java: 32bit/jdk1.8.0_162 -server -XX:+UseSerialGC

7 tests failed.
FAILED:  org.apache.solr.cloud.autoscaling.HdfsAutoAddReplicasIntegrationTest.testSimple

Error Message:
Waiting for collection testSimple1 null Live Nodes: [127.0.0.1:35107_solr, 127.0.0.1:36787_solr] Last available state: DocCollection(testSimple1//collections/testSimple1/state.json/14)={   "pullReplicas":"0",   "replicationFactor":"2",   "shards":{     "shard1":{       "range":"80000000-ffffffff",       "state":"active",       "replicas":{         "core_node3":{           "dataDir":"hdfs://localhost.localdomain:36449/data/testSimple1/core_node3/data/",           "base_url":"http://127.0.0.1:35107/solr",           "node_name":"127.0.0.1:35107_solr",           "type":"NRT",           "ulogDir":"hdfs://localhost.localdomain:36449/data/testSimple1/core_node3/data/tlog",           "core":"testSimple1_shard1_replica_n1",           "shared_storage":"true",           "state":"active",           "leader":"true"},         "core_node5":{           "dataDir":"hdfs://localhost.localdomain:36449/data/testSimple1/core_node5/data/",           "base_url":"http://127.0.0.1:35107/solr",           "node_name":"127.0.0.1:35107_solr",           "type":"NRT",           "ulogDir":"hdfs://localhost.localdomain:36449/data/testSimple1/core_node5/data/tlog",           "core":"testSimple1_shard1_replica_n2",           "shared_storage":"true",           "state":"active"}}},     "shard2":{       "range":"0-7fffffff",       "state":"active",       "replicas":{         "core_node7":{           "dataDir":"hdfs://localhost.localdomain:36449/data/testSimple1/core_node7/data/",           "base_url":"http://127.0.0.1:35107/solr",           "node_name":"127.0.0.1:35107_solr",           "type":"NRT",           "ulogDir":"hdfs://localhost.localdomain:36449/data/testSimple1/core_node7/data/tlog",           "core":"testSimple1_shard2_replica_n4",           "shared_storage":"true",           "state":"active",           "leader":"true"},         "core_node8":{           "dataDir":"hdfs://localhost.localdomain:36449/data/testSimple1/core_node8/data/",           "base_url":"http://127.0.0.1:39747/solr",           "node_name":"127.0.0.1:39747_solr",           "type":"NRT",           "ulogDir":"hdfs://localhost.localdomain:36449/data/testSimple1/core_node8/data/tlog",           "core":"testSimple1_shard2_replica_n6",           "shared_storage":"true",           "state":"down"}}}},   "router":{"name":"compositeId"},   "maxShardsPerNode":"2",   "autoAddReplicas":"true",   "nrtReplicas":"2",   "tlogReplicas":"0"}

Stack Trace:
java.lang.AssertionError: Waiting for collection testSimple1
null
Live Nodes: [127.0.0.1:35107_solr, 127.0.0.1:36787_solr]
Last available state: DocCollection(testSimple1//collections/testSimple1/state.json/14)={
  "pullReplicas":"0",
  "replicationFactor":"2",
  "shards":{
    "shard1":{
      "range":"80000000-ffffffff",
      "state":"active",
      "replicas":{
        "core_node3":{
          "dataDir":"hdfs://localhost.localdomain:36449/data/testSimple1/core_node3/data/",
          "base_url":"http://127.0.0.1:35107/solr",
          "node_name":"127.0.0.1:35107_solr",
          "type":"NRT",
          "ulogDir":"hdfs://localhost.localdomain:36449/data/testSimple1/core_node3/data/tlog",
          "core":"testSimple1_shard1_replica_n1",
          "shared_storage":"true",
          "state":"active",
          "leader":"true"},
        "core_node5":{
          "dataDir":"hdfs://localhost.localdomain:36449/data/testSimple1/core_node5/data/",
          "base_url":"http://127.0.0.1:35107/solr",
          "node_name":"127.0.0.1:35107_solr",
          "type":"NRT",
          "ulogDir":"hdfs://localhost.localdomain:36449/data/testSimple1/core_node5/data/tlog",
          "core":"testSimple1_shard1_replica_n2",
          "shared_storage":"true",
          "state":"active"}}},
    "shard2":{
      "range":"0-7fffffff",
      "state":"active",
      "replicas":{
        "core_node7":{
          "dataDir":"hdfs://localhost.localdomain:36449/data/testSimple1/core_node7/data/",
          "base_url":"http://127.0.0.1:35107/solr",
          "node_name":"127.0.0.1:35107_solr",
          "type":"NRT",
          "ulogDir":"hdfs://localhost.localdomain:36449/data/testSimple1/core_node7/data/tlog",
          "core":"testSimple1_shard2_replica_n4",
          "shared_storage":"true",
          "state":"active",
          "leader":"true"},
        "core_node8":{
          "dataDir":"hdfs://localhost.localdomain:36449/data/testSimple1/core_node8/data/",
          "base_url":"http://127.0.0.1:39747/solr",
          "node_name":"127.0.0.1:39747_solr",
          "type":"NRT",
          "ulogDir":"hdfs://localhost.localdomain:36449/data/testSimple1/core_node8/data/tlog",
          "core":"testSimple1_shard2_replica_n6",
          "shared_storage":"true",
          "state":"down"}}}},
  "router":{"name":"compositeId"},
  "maxShardsPerNode":"2",
  "autoAddReplicas":"true",
  "nrtReplicas":"2",
  "tlogReplicas":"0"}
	at __randomizedtesting.SeedInfo.seed([79D2302ED31AB03A:416114D0F4E964EB]:0)
	at org.junit.Assert.fail(Assert.java:93)
	at org.apache.solr.cloud.SolrCloudTestCase.waitForState(SolrCloudTestCase.java:269)
	at org.apache.solr.cloud.autoscaling.AutoAddReplicasIntegrationTest.testSimple(AutoAddReplicasIntegrationTest.java:105)
	at sun.reflect.NativeMethodAccessorImpl.invoke0(Native Method)
	at sun.reflect.NativeMethodAccessorImpl.invoke(NativeMethodAccessorImpl.java:62)
	at sun.reflect.DelegatingMethodAccessorImpl.invoke(DelegatingMethodAccessorImpl.java:43)
	at java.lang.reflect.Method.invoke(Method.java:498)
	at com.carrotsearch.randomizedtesting.RandomizedRunner.invoke(RandomizedRunner.java:1737)
	at com.carrotsearch.randomizedtesting.RandomizedRunner$8.evaluate(RandomizedRunner.java:934)
	at com.carrotsearch.randomizedtesting.RandomizedRunner$9.evaluate(RandomizedRunner.java:970)
	at com.carrotsearch.randomizedtesting.RandomizedRunner$10.evaluate(RandomizedRunner.java:984)
	at com.carrotsearch.randomizedtesting.rules.SystemPropertiesRestoreRule$1.evaluate(SystemPropertiesRestoreRule.java:57)
	at org.apache.lucene.util.TestRuleSetupTeardownChained$1.evaluate(TestRuleSetupTeardownChained.java:49)
	at org.apache.lucene.util.AbstractBeforeAfterRule$1.evaluate(AbstractBeforeAfterRule.java:45)
	at org.apache.lucene.util.TestRuleThreadAndTestName$1.evaluate(TestRuleThreadAndTestName.java:48)
	at org.apache.lucene.util.TestRuleIgnoreAfterMaxFailures$1.evaluate(TestRuleIgnoreAfterMaxFailures.java:64)
	at org.apache.lucene.util.TestRuleMarkFailure$1.evaluate(TestRuleMarkFailure.java:47)
	at com.carrotsearch.randomizedtesting.rules.StatementAdapter.evaluate(StatementAdapter.java:36)
	at com.carrotsearch.randomizedtesting.ThreadLeakControl$StatementRunner.run(ThreadLeakControl.java:368)
	at com.carrotsearch.randomizedtesting.ThreadLeakControl.forkTimeoutingTask(ThreadLeakControl.java:817)
	at com.carrotsearch.randomizedtesting.ThreadLeakControl$3.evaluate(ThreadLeakControl.java:468)
	at com.carrotsearch.randomizedtesting.RandomizedRunner.runSingleTest(RandomizedRunner.java:943)
	at com.carrotsearch.randomizedtesting.RandomizedRunner$5.evaluate(RandomizedRunner.java:829)
	at com.carrotsearch.randomizedtesting.RandomizedRunner$6.evaluate(RandomizedRunner.java:879)
	at com.carrotsearch.randomizedtesting.RandomizedRunner$7.evaluate(RandomizedRunner.java:890)
	at com.carrotsearch.randomizedtesting.rules.StatementAdapter.evaluate(StatementAdapter.java:36)
	at com.carrotsearch.randomizedtesting.rules.SystemPropertiesRestoreRule$1.evaluate(SystemPropertiesRestoreRule.java:57)
	at org.apache.lucene.util.AbstractBeforeAfterRule$1.evaluate(AbstractBeforeAfterRule.java:45)
	at com.carrotsearch.randomizedtesting.rules.StatementAdapter.evaluate(StatementAdapter.java:36)
	at org.apache.lucene.util.TestRuleStoreClassName$1.evaluate(TestRuleStoreClassName.java:41)
	at com.carrotsearch.randomizedtesting.rules.NoShadowingOrOverridesOnMethodsRule$1.evaluate(NoShadowingOrOverridesOnMethodsRule.java:40)
	at com.carrotsearch.randomizedtesting.rules.NoShadowingOrOverridesOnMethodsRule$1.evaluate(NoShadowingOrOverridesOnMethodsRule.java:40)
	at com.carrotsearch.randomizedtesting.rules.StatementAdapter.evaluate(StatementAdapter.java:36)
	at com.carrotsearch.randomizedtesting.rules.StatementAdapter.evaluate(StatementAdapter.java:36)
	at com.carrotsearch.randomizedtesting.rules.StatementAdapter.evaluate(StatementAdapter.java:36)
	at org.apache.lucene.util.TestRuleAssertionsRequired$1.evaluate(TestRuleAssertionsRequired.java:53)
	at org.apache.lucene.util.TestRuleMarkFailure$1.evaluate(TestRuleMarkFailure.java:47)
	at org.apache.lucene.util.TestRuleIgnoreAfterMaxFailures$1.evaluate(TestRuleIgnoreAfterMaxFailures.java:64)
	at org.apache.lucene.util.TestRuleIgnoreTestSuites$1.evaluate(TestRuleIgnoreTestSuites.java:54)
	at com.carrotsearch.randomizedtesting.rules.StatementAdapter.evaluate(StatementAdapter.java:36)
	at com.carrotsearch.randomizedtesting.ThreadLeakControl$StatementRunner.run(ThreadLeakControl.java:368)
	at java.lang.Thread.run(Thread.java:748)


FAILED:  junit.framework.TestSuite.org.apache.solr.cloud.SSLMigrationTest

Error Message:
ObjectTracker found 2 object(s) that were not released!!! [InternalHttpClient, InternalHttpClient] org.apache.solr.common.util.ObjectReleaseTracker$ObjectTrackerException: org.apache.http.impl.client.InternalHttpClient  at org.apache.solr.common.util.ObjectReleaseTracker.track(ObjectReleaseTracker.java:42)  at org.apache.solr.client.solrj.impl.HttpClientUtil.createClient(HttpClientUtil.java:289)  at org.apache.solr.client.solrj.impl.HttpClientUtil.createClient(HttpClientUtil.java:298)  at org.apache.solr.client.solrj.impl.HttpClientUtil.createClient(HttpClientUtil.java:236)  at org.apache.solr.client.solrj.impl.HttpClientUtil.createClient(HttpClientUtil.java:223)  at org.apache.solr.client.solrj.impl.LBHttpSolrClient.constructClient(LBHttpSolrClient.java:292)  at org.apache.solr.client.solrj.impl.LBHttpSolrClient.<init>(LBHttpSolrClient.java:270)  at org.apache.solr.client.solrj.impl.LBHttpSolrClient$Builder.build(LBHttpSolrClient.java:967)  at org.apache.solr.SolrTestCaseJ4.getLBHttpSolrClient(SolrTestCaseJ4.java:2473)  at org.apache.solr.cloud.SSLMigrationTest.setUrlScheme(SSLMigrationTest.java:132)  at org.apache.solr.cloud.SSLMigrationTest.testMigrateSSL(SSLMigrationTest.java:66)  at org.apache.solr.cloud.SSLMigrationTest.test(SSLMigrationTest.java:60)  at sun.reflect.NativeMethodAccessorImpl.invoke0(Native Method)  at sun.reflect.NativeMethodAccessorImpl.invoke(NativeMethodAccessorImpl.java:62)  at sun.reflect.DelegatingMethodAccessorImpl.invoke(DelegatingMethodAccessorImpl.java:43)  at java.lang.reflect.Method.invoke(Method.java:498)  at com.carrotsearch.randomizedtesting.RandomizedRunner.invoke(RandomizedRunner.java:1737)  at com.carrotsearch.randomizedtesting.RandomizedRunner$8.evaluate(RandomizedRunner.java:934)  at com.carrotsearch.randomizedtesting.RandomizedRunner$9.evaluate(RandomizedRunner.java:970)  at com.carrotsearch.randomizedtesting.RandomizedRunner$10.evaluate(RandomizedRunner.java:984)  at org.apache.solr.BaseDistributedSearchTestCase$ShardsRepeatRule$ShardsFixedStatement.callStatement(BaseDistributedSearchTestCase.java:993)  at org.apache.solr.BaseDistributedSearchTestCase$ShardsRepeatRule$ShardsStatement.evaluate(BaseDistributedSearchTestCase.java:968)  at com.carrotsearch.randomizedtesting.rules.SystemPropertiesRestoreRule$1.evaluate(SystemPropertiesRestoreRule.java:57)  at org.apache.lucene.util.TestRuleSetupTeardownChained$1.evaluate(TestRuleSetupTeardownChained.java:49)  at org.apache.lucene.util.AbstractBeforeAfterRule$1.evaluate(AbstractBeforeAfterRule.java:45)  at org.apache.lucene.util.TestRuleThreadAndTestName$1.evaluate(TestRuleThreadAndTestName.java:48)  at org.apache.lucene.util.TestRuleIgnoreAfterMaxFailures$1.evaluate(TestRuleIgnoreAfterMaxFailures.java:64)  at org.apache.lucene.util.TestRuleMarkFailure$1.evaluate(TestRuleMarkFailure.java:47)  at com.carrotsearch.randomizedtesting.rules.StatementAdapter.evaluate(StatementAdapter.java:36)  at com.carrotsearch.randomizedtesting.ThreadLeakControl$StatementRunner.run(ThreadLeakControl.java:368)  at com.carrotsearch.randomizedtesting.ThreadLeakControl.forkTimeoutingTask(ThreadLeakControl.java:817)  at com.carrotsearch.randomizedtesting.ThreadLeakControl$3.evaluate(ThreadLeakControl.java:468)  at com.carrotsearch.randomizedtesting.RandomizedRunner.runSingleTest(RandomizedRunner.java:943)  at com.carrotsearch.randomizedtesting.RandomizedRunner$5.evaluate(RandomizedRunner.java:829)  at com.carrotsearch.randomizedtesting.RandomizedRunner$6.evaluate(RandomizedRunner.java:879)  at com.carrotsearch.randomizedtesting.RandomizedRunner$7.evaluate(RandomizedRunner.java:890)  at com.carrotsearch.randomizedtesting.rules.StatementAdapter.evaluate(StatementAdapter.java:36)  at com.carrotsearch.randomizedtesting.rules.SystemPropertiesRestoreRule$1.evaluate(SystemPropertiesRestoreRule.java:57)  at org.apache.lucene.util.AbstractBeforeAfterRule$1.evaluate(AbstractBeforeAfterRule.java:45)  at com.carrotsearch.randomizedtesting.rules.StatementAdapter.evaluate(StatementAdapter.java:36)  at org.apache.lucene.util.TestRuleStoreClassName$1.evaluate(TestRuleStoreClassName.java:41)  at com.carrotsearch.randomizedtesting.rules.NoShadowingOrOverridesOnMethodsRule$1.evaluate(NoShadowingOrOverridesOnMethodsRule.java:40)  at com.carrotsearch.randomizedtesting.rules.NoShadowingOrOverridesOnMethodsRule$1.evaluate(NoShadowingOrOverridesOnMethodsRule.java:40)  at com.carrotsearch.randomizedtesting.rules.StatementAdapter.evaluate(StatementAdapter.java:36)  at com.carrotsearch.randomizedtesting.rules.StatementAdapter.evaluate(StatementAdapter.java:36)  at com.carrotsearch.randomizedtesting.rules.StatementAdapter.evaluate(StatementAdapter.java:36)  at org.apache.lucene.util.TestRuleAssertionsRequired$1.evaluate(TestRuleAssertionsRequired.java:53)  at org.apache.lucene.util.TestRuleMarkFailure$1.evaluate(TestRuleMarkFailure.java:47)  at org.apache.lucene.util.TestRuleIgnoreAfterMaxFailures$1.evaluate(TestRuleIgnoreAfterMaxFailures.java:64)  at org.apache.lucene.util.TestRuleIgnoreTestSuites$1.evaluate(TestRuleIgnoreTestSuites.java:54)  at com.carrotsearch.randomizedtesting.rules.StatementAdapter.evaluate(StatementAdapter.java:36)  at com.carrotsearch.randomizedtesting.ThreadLeakControl$StatementRunner.run(ThreadLeakControl.java:368)  at java.lang.Thread.run(Thread.java:748)  org.apache.solr.common.util.ObjectReleaseTracker$ObjectTrackerException: org.apache.http.impl.client.InternalHttpClient  at org.apache.solr.common.util.ObjectReleaseTracker.track(ObjectReleaseTracker.java:42)  at org.apache.solr.client.solrj.impl.HttpClientUtil.createClient(HttpClientUtil.java:289)  at org.apache.solr.client.solrj.impl.HttpClientUtil.createClient(HttpClientUtil.java:298)  at org.apache.solr.client.solrj.impl.HttpClientUtil.createClient(HttpClientUtil.java:236)  at org.apache.solr.client.solrj.impl.HttpClientUtil.createClient(HttpClientUtil.java:223)  at org.apache.solr.client.solrj.impl.LBHttpSolrClient.constructClient(LBHttpSolrClient.java:292)  at org.apache.solr.client.solrj.impl.LBHttpSolrClient.<init>(LBHttpSolrClient.java:270)  at org.apache.solr.client.solrj.impl.LBHttpSolrClient$Builder.build(LBHttpSolrClient.java:967)  at org.apache.solr.SolrTestCaseJ4.getLBHttpSolrClient(SolrTestCaseJ4.java:2473)  at org.apache.solr.cloud.SSLMigrationTest.setUrlScheme(SSLMigrationTest.java:132)  at org.apache.solr.cloud.SSLMigrationTest.testMigrateSSL(SSLMigrationTest.java:66)  at org.apache.solr.cloud.SSLMigrationTest.test(SSLMigrationTest.java:61)  at sun.reflect.NativeMethodAccessorImpl.invoke0(Native Method)  at sun.reflect.NativeMethodAccessorImpl.invoke(NativeMethodAccessorImpl.java:62)  at sun.reflect.DelegatingMethodAccessorImpl.invoke(DelegatingMethodAccessorImpl.java:43)  at java.lang.reflect.Method.invoke(Method.java:498)  at com.carrotsearch.randomizedtesting.RandomizedRunner.invoke(RandomizedRunner.java:1737)  at com.carrotsearch.randomizedtesting.RandomizedRunner$8.evaluate(RandomizedRunner.java:934)  at com.carrotsearch.randomizedtesting.RandomizedRunner$9.evaluate(RandomizedRunner.java:970)  at com.carrotsearch.randomizedtesting.RandomizedRunner$10.evaluate(RandomizedRunner.java:984)  at org.apache.solr.BaseDistributedSearchTestCase$ShardsRepeatRule$ShardsFixedStatement.callStatement(BaseDistributedSearchTestCase.java:993)  at org.apache.solr.BaseDistributedSearchTestCase$ShardsRepeatRule$ShardsStatement.evaluate(BaseDistributedSearchTestCase.java:968)  at com.carrotsearch.randomizedtesting.rules.SystemPropertiesRestoreRule$1.evaluate(SystemPropertiesRestoreRule.java:57)  at org.apache.lucene.util.TestRuleSetupTeardownChained$1.evaluate(TestRuleSetupTeardownChained.java:49)  at org.apache.lucene.util.AbstractBeforeAfterRule$1.evaluate(AbstractBeforeAfterRule.java:45)  at org.apache.lucene.util.TestRuleThreadAndTestName$1.evaluate(TestRuleThreadAndTestName.java:48)  at org.apache.lucene.util.TestRuleIgnoreAfterMaxFailures$1.evaluate(TestRuleIgnoreAfterMaxFailures.java:64)  at org.apache.lucene.util.TestRuleMarkFailure$1.evaluate(TestRuleMarkFailure.java:47)  at com.carrotsearch.randomizedtesting.rules.StatementAdapter.evaluate(StatementAdapter.java:36)  at com.carrotsearch.randomizedtesting.ThreadLeakControl$StatementRunner.run(ThreadLeakControl.java:368)  at com.carrotsearch.randomizedtesting.ThreadLeakControl.forkTimeoutingTask(ThreadLeakControl.java:817)  at com.carrotsearch.randomizedtesting.ThreadLeakControl$3.evaluate(ThreadLeakControl.java:468)  at com.carrotsearch.randomizedtesting.RandomizedRunner.runSingleTest(RandomizedRunner.java:943)  at com.carrotsearch.randomizedtesting.RandomizedRunner$5.evaluate(RandomizedRunner.java:829)  at com.carrotsearch.randomizedtesting.RandomizedRunner$6.evaluate(RandomizedRunner.java:879)  at com.carrotsearch.randomizedtesting.RandomizedRunner$7.evaluate(RandomizedRunner.java:890)  at com.carrotsearch.randomizedtesting.rules.StatementAdapter.evaluate(StatementAdapter.java:36)  at com.carrotsearch.randomizedtesting.rules.SystemPropertiesRestoreRule$1.evaluate(SystemPropertiesRestoreRule.java:57)  at org.apache.lucene.util.AbstractBeforeAfterRule$1.evaluate(AbstractBeforeAfterRule.java:45)  at com.carrotsearch.randomizedtesting.rules.StatementAdapter.evaluate(StatementAdapter.java:36)  at org.apache.lucene.util.TestRuleStoreClassName$1.evaluate(TestRuleStoreClassName.java:41)  at com.carrotsearch.randomizedtesting.rules.NoShadowingOrOverridesOnMethodsRule$1.evaluate(NoShadowingOrOverridesOnMethodsRule.java:40)  at com.carrotsearch.randomizedtesting.rules.NoShadowingOrOverridesOnMethodsRule$1.evaluate(NoShadowingOrOverridesOnMethodsRule.java:40)  at com.carrotsearch.randomizedtesting.rules.StatementAdapter.evaluate(StatementAdapter.java:36)  at com.carrotsearch.randomizedtesting.rules.StatementAdapter.evaluate(StatementAdapter.java:36)  at com.carrotsearch.randomizedtesting.rules.StatementAdapter.evaluate(StatementAdapter.java:36)  at org.apache.lucene.util.TestRuleAssertionsRequired$1.evaluate(TestRuleAssertionsRequired.java:53)  at org.apache.lucene.util.TestRuleMarkFailure$1.evaluate(TestRuleMarkFailure.java:47)  at org.apache.lucene.util.TestRuleIgnoreAfterMaxFailures$1.evaluate(TestRuleIgnoreAfterMaxFailures.java:64)  at org.apache.lucene.util.TestRuleIgnoreTestSuites$1.evaluate(TestRuleIgnoreTestSuites.java:54)  at com.carrotsearch.randomizedtesting.rules.StatementAdapter.evaluate(StatementAdapter.java:36)  at com.carrotsearch.randomizedtesting.ThreadLeakControl$StatementRunner.run(ThreadLeakControl.java:368)  at java.lang.Thread.run(Thread.java:748)  

Stack Trace:
java.lang.AssertionError: ObjectTracker found 2 object(s) that were not released!!! [InternalHttpClient, InternalHttpClient]
org.apache.solr.common.util.ObjectReleaseTracker$ObjectTrackerException: org.apache.http.impl.client.InternalHttpClient
	at org.apache.solr.common.util.ObjectReleaseTracker.track(ObjectReleaseTracker.java:42)
	at org.apache.solr.client.solrj.impl.HttpClientUtil.createClient(HttpClientUtil.java:289)
	at org.apache.solr.client.solrj.impl.HttpClientUtil.createClient(HttpClientUtil.java:298)
	at org.apache.solr.client.solrj.impl.HttpClientUtil.createClient(HttpClientUtil.java:236)
	at org.apache.solr.client.solrj.impl.HttpClientUtil.createClient(HttpClientUtil.java:223)
	at org.apache.solr.client.solrj.impl.LBHttpSolrClient.constructClient(LBHttpSolrClient.java:292)
	at org.apache.solr.client.solrj.impl.LBHttpSolrClient.<init>(LBHttpSolrClient.java:270)
	at org.apache.solr.client.solrj.impl.LBHttpSolrClient$Builder.build(LBHttpSolrClient.java:967)
	at org.apache.solr.SolrTestCaseJ4.getLBHttpSolrClient(SolrTestCaseJ4.java:2473)
	at org.apache.solr.cloud.SSLMigrationTest.setUrlScheme(SSLMigrationTest.java:132)
	at org.apache.solr.cloud.SSLMigrationTest.testMigrateSSL(SSLMigrationTest.java:66)
	at org.apache.solr.cloud.SSLMigrationTest.test(SSLMigrationTest.java:60)
	at sun.reflect.NativeMethodAccessorImpl.invoke0(Native Method)
	at sun.reflect.NativeMethodAccessorImpl.invoke(NativeMethodAccessorImpl.java:62)
	at sun.reflect.DelegatingMethodAccessorImpl.invoke(DelegatingMethodAccessorImpl.java:43)
	at java.lang.reflect.Method.invoke(Method.java:498)
	at com.carrotsearch.randomizedtesting.RandomizedRunner.invoke(RandomizedRunner.java:1737)
	at com.carrotsearch.randomizedtesting.RandomizedRunner$8.evaluate(RandomizedRunner.java:934)
	at com.carrotsearch.randomizedtesting.RandomizedRunner$9.evaluate(RandomizedRunner.java:970)
	at com.carrotsearch.randomizedtesting.RandomizedRunner$10.evaluate(RandomizedRunner.java:984)
	at org.apache.solr.BaseDistributedSearchTestCase$ShardsRepeatRule$ShardsFixedStatement.callStatement(BaseDistributedSearchTestCase.java:993)
	at org.apache.solr.BaseDistributedSearchTestCase$ShardsRepeatRule$ShardsStatement.evaluate(BaseDistributedSearchTestCase.java:968)
	at com.carrotsearch.randomizedtesting.rules.SystemPropertiesRestoreRule$1.evaluate(SystemPropertiesRestoreRule.java:57)
	at org.apache.lucene.util.TestRuleSetupTeardownChained$1.evaluate(TestRuleSetupTeardownChained.java:49)
	at org.apache.lucene.util.AbstractBeforeAfterRule$1.evaluate(AbstractBeforeAfterRule.java:45)
	at org.apache.lucene.util.TestRuleThreadAndTestName$1.evaluate(TestRuleThreadAndTestName.java:48)
	at org.apache.lucene.util.TestRuleIgnoreAfterMaxFailures$1.evaluate(TestRuleIgnoreAfterMaxFailures.java:64)
	at org.apache.lucene.util.TestRuleMarkFailure$1.evaluate(TestRuleMarkFailure.java:47)
	at com.carrotsearch.randomizedtesting.rules.StatementAdapter.evaluate(StatementAdapter.java:36)
	at com.carrotsearch.randomizedtesting.ThreadLeakControl$StatementRunner.run(ThreadLeakControl.java:368)
	at com.carrotsearch.randomizedtesting.ThreadLeakControl.forkTimeoutingTask(ThreadLeakControl.java:817)
	at com.carrotsearch.randomizedtesting.ThreadLeakControl$3.evaluate(ThreadLeakControl.java:468)
	at com.carrotsearch.randomizedtesting.RandomizedRunner.runSingleTest(RandomizedRunner.java:943)
	at com.carrotsearch.randomizedtesting.RandomizedRunner$5.evaluate(RandomizedRunner.java:829)
	at com.carrotsearch.randomizedtesting.RandomizedRunner$6.evaluate(RandomizedRunner.java:879)
	at com.carrotsearch.randomizedtesting.RandomizedRunner$7.evaluate(RandomizedRunner.java:890)
	at com.carrotsearch.randomizedtesting.rules.StatementAdapter.evaluate(StatementAdapter.java:36)
	at com.carrotsearch.randomizedtesting.rules.SystemPropertiesRestoreRule$1.evaluate(SystemPropertiesRestoreRule.java:57)
	at org.apache.lucene.util.AbstractBeforeAfterRule$1.evaluate(AbstractBeforeAfterRule.java:45)
	at com.carrotsearch.randomizedtesting.rules.StatementAdapter.evaluate(StatementAdapter.java:36)
	at org.apache.lucene.util.TestRuleStoreClassName$1.evaluate(TestRuleStoreClassName.java:41)
	at com.carrotsearch.randomizedtesting.rules.NoShadowingOrOverridesOnMethodsRule$1.evaluate(NoShadowingOrOverridesOnMethodsRule.java:40)
	at com.carrotsearch.randomizedtesting.rules.NoShadowingOrOverridesOnMethodsRule$1.evaluate(NoShadowingOrOverridesOnMethodsRule.java:40)
	at com.carrotsearch.randomizedtesting.rules.StatementAdapter.evaluate(StatementAdapter.java:36)
	at com.carrotsearch.randomizedtesting.rules.StatementAdapter.evaluate(StatementAdapter.java:36)
	at com.carrotsearch.randomizedtesting.rules.StatementAdapter.evaluate(StatementAdapter.java:36)
	at org.apache.lucene.util.TestRuleAssertionsRequired$1.evaluate(TestRuleAssertionsRequired.java:53)
	at org.apache.lucene.util.TestRuleMarkFailure$1.evaluate(TestRuleMarkFailure.java:47)
	at org.apache.lucene.util.TestRuleIgnoreAfterMaxFailures$1.evaluate(TestRuleIgnoreAfterMaxFailures.java:64)
	at org.apache.lucene.util.TestRuleIgnoreTestSuites$1.evaluate(TestRuleIgnoreTestSuites.java:54)
	at com.carrotsearch.randomizedtesting.rules.StatementAdapter.evaluate(StatementAdapter.java:36)
	at com.carrotsearch.randomizedtesting.ThreadLeakControl$StatementRunner.run(ThreadLeakControl.java:368)
	at java.lang.Thread.run(Thread.java:748)

org.apache.solr.common.util.ObjectReleaseTracker$ObjectTrackerException: org.apache.http.impl.client.InternalHttpClient
	at org.apache.solr.common.util.ObjectReleaseTracker.track(ObjectReleaseTracker.java:42)
	at org.apache.solr.client.solrj.impl.HttpClientUtil.createClient(HttpClientUtil.java:289)
	at org.apache.solr.client.solrj.impl.HttpClientUtil.createClient(HttpClientUtil.java:298)
	at org.apache.solr.client.solrj.impl.HttpClientUtil.createClient(HttpClientUtil.java:236)
	at org.apache.solr.client.solrj.impl.HttpClientUtil.createClient(HttpClientUtil.java:223)
	at org.apache.solr.client.solrj.impl.LBHttpSolrClient.constructClient(LBHttpSolrClient.java:292)
	at org.apache.solr.client.solrj.impl.LBHttpSolrClient.<init>(LBHttpSolrClient.java:270)
	at org.apache.solr.client.solrj.impl.LBHttpSolrClient$Builder.build(LBHttpSolrClient.java:967)
	at org.apache.solr.SolrTestCaseJ4.getLBHttpSolrClient(SolrTestCaseJ4.java:2473)
	at org.apache.solr.cloud.SSLMigrationTest.setUrlScheme(SSLMigrationTest.java:132)
	at org.apache.solr.cloud.SSLMigrationTest.testMigrateSSL(SSLMigrationTest.java:66)
	at org.apache.solr.cloud.SSLMigrationTest.test(SSLMigrationTest.java:61)
	at sun.reflect.NativeMethodAccessorImpl.invoke0(Native Method)
	at sun.reflect.NativeMethodAccessorImpl.invoke(NativeMethodAccessorImpl.java:62)
	at sun.reflect.DelegatingMethodAccessorImpl.invoke(DelegatingMethodAccessorImpl.java:43)
	at java.lang.reflect.Method.invoke(Method.java:498)
	at com.carrotsearch.randomizedtesting.RandomizedRunner.invoke(RandomizedRunner.java:1737)
	at com.carrotsearch.randomizedtesting.RandomizedRunner$8.evaluate(RandomizedRunner.java:934)
	at com.carrotsearch.randomizedtesting.RandomizedRunner$9.evaluate(RandomizedRunner.java:970)
	at com.carrotsearch.randomizedtesting.RandomizedRunner$10.evaluate(RandomizedRunner.java:984)
	at org.apache.solr.BaseDistributedSearchTestCase$ShardsRepeatRule$ShardsFixedStatement.callStatement(BaseDistributedSearchTestCase.java:993)
	at org.apache.solr.BaseDistributedSearchTestCase$ShardsRepeatRule$ShardsStatement.evaluate(BaseDistributedSearchTestCase.java:968)
	at com.carrotsearch.randomizedtesting.rules.SystemPropertiesRestoreRule$1.evaluate(SystemPropertiesRestoreRule.java:57)
	at org.apache.lucene.util.TestRuleSetupTeardownChained$1.evaluate(TestRuleSetupTeardownChained.java:49)
	at org.apache.lucene.util.AbstractBeforeAfterRule$1.evaluate(AbstractBeforeAfterRule.java:45)
	at org.apache.lucene.util.TestRuleThreadAndTestName$1.evaluate(TestRuleThreadAndTestName.java:48)
	at org.apache.lucene.util.TestRuleIgnoreAfterMaxFailures$1.evaluate(TestRuleIgnoreAfterMaxFailures.java:64)
	at org.apache.lucene.util.TestRuleMarkFailure$1.evaluate(TestRuleMarkFailure.java:47)
	at com.carrotsearch.randomizedtesting.rules.StatementAdapter.evaluate(StatementAdapter.java:36)
	at com.carrotsearch.randomizedtesting.ThreadLeakControl$StatementRunner.run(ThreadLeakControl.java:368)
	at com.carrotsearch.randomizedtesting.ThreadLeakControl.forkTimeoutingTask(ThreadLeakControl.java:817)
	at com.carrotsearch.randomizedtesting.ThreadLeakControl$3.evaluate(ThreadLeakControl.java:468)
	at com.carrotsearch.randomizedtesting.RandomizedRunner.runSingleTest(RandomizedRunner.java:943)
	at com.carrotsearch.randomizedtesting.RandomizedRunner$5.evaluate(RandomizedRunner.java:829)
	at com.carrotsearch.randomizedtesting.RandomizedRunner$6.evaluate(RandomizedRunner.java:879)
	at com.carrotsearch.randomizedtesting.RandomizedRunner$7.evaluate(RandomizedRunner.java:890)
	at com.carrotsearch.randomizedtesting.rules.StatementAdapter.evaluate(StatementAdapter.java:36)
	at com.carrotsearch.randomizedtesting.rules.SystemPropertiesRestoreRule$1.evaluate(SystemPropertiesRestoreRule.java:57)
	at org.apache.lucene.util.AbstractBeforeAfterRule$1.evaluate(AbstractBeforeAfterRule.java:45)
	at com.carrotsearch.randomizedtesting.rules.StatementAdapter.evaluate(StatementAdapter.java:36)
	at org.apache.lucene.util.TestRuleStoreClassName$1.evaluate(TestRuleStoreClassName.java:41)
	at com.carrotsearch.randomizedtesting.rules.NoShadowingOrOverridesOnMethodsRule$1.evaluate(NoShadowingOrOverridesOnMethodsRule.java:40)
	at com.carrotsearch.randomizedtesting.rules.NoShadowingOrOverridesOnMethodsRule$1.evaluate(NoShadowingOrOverridesOnMethodsRule.java:40)
	at com.carrotsearch.randomizedtesting.rules.StatementAdapter.evaluate(StatementAdapter.java:36)
	at com.carrotsearch.randomizedtesting.rules.StatementAdapter.evaluate(StatementAdapter.java:36)
	at com.carrotsearch.randomizedtesting.rules.StatementAdapter.evaluate(StatementAdapter.java:36)
	at org.apache.lucene.util.TestRuleAssertionsRequired$1.evaluate(TestRuleAssertionsRequired.java:53)
	at org.apache.lucene.util.TestRuleMarkFailure$1.evaluate(TestRuleMarkFailure.java:47)
	at org.apache.lucene.util.TestRuleIgnoreAfterMaxFailures$1.evaluate(TestRuleIgnoreAfterMaxFailures.java:64)
	at org.apache.lucene.util.TestRuleIgnoreTestSuites$1.evaluate(TestRuleIgnoreTestSuites.java:54)
	at com.carrotsearch.randomizedtesting.rules.StatementAdapter.evaluate(StatementAdapter.java:36)
	at com.carrotsearch.randomizedtesting.ThreadLeakControl$StatementRunner.run(ThreadLeakControl.java:368)
	at java.lang.Thread.run(Thread.java:748)


	at __randomizedtesting.SeedInfo.seed([79D2302ED31AB03A]:0)
	at org.junit.Assert.fail(Assert.java:93)
	at org.junit.Assert.assertTrue(Assert.java:43)
	at org.junit.Assert.assertNull(Assert.java:551)
	at org.apache.solr.SolrTestCaseJ4.teardownTestCases(SolrTestCaseJ4.java:297)
	at sun.reflect.NativeMethodAccessorImpl.invoke0(Native Method)
	at sun.reflect.NativeMethodAccessorImpl.invoke(NativeMethodAccessorImpl.java:62)
	at sun.reflect.DelegatingMethodAccessorImpl.invoke(DelegatingMethodAccessorImpl.java:43)
	at java.lang.reflect.Method.invoke(Method.java:498)
	at com.carrotsearch.randomizedtesting.RandomizedRunner.invoke(RandomizedRunner.java:1737)
	at com.carrotsearch.randomizedtesting.RandomizedRunner$7.evaluate(RandomizedRunner.java:897)
	at com.carrotsearch.randomizedtesting.rules.StatementAdapter.evaluate(StatementAdapter.java:36)
	at com.carrotsearch.randomizedtesting.rules.SystemPropertiesRestoreRule$1.evaluate(SystemPropertiesRestoreRule.java:57)
	at org.apache.lucene.util.AbstractBeforeAfterRule$1.evaluate(AbstractBeforeAfterRule.java:45)
	at com.carrotsearch.randomizedtesting.rules.StatementAdapter.evaluate(StatementAdapter.java:36)
	at org.apache.lucene.util.TestRuleStoreClassName$1.evaluate(TestRuleStoreClassName.java:41)
	at com.carrotsearch.randomizedtesting.rules.NoShadowingOrOverridesOnMethodsRule$1.evaluate(NoShadowingOrOverridesOnMethodsRule.java:40)
	at com.carrotsearch.randomizedtesting.rules.NoShadowingOrOverridesOnMethodsRule$1.evaluate(NoShadowingOrOverridesOnMethodsRule.java:40)
	at com.carrotsearch.randomizedtesting.rules.StatementAdapter.evaluate(StatementAdapter.java:36)
	at com.carrotsearch.randomizedtesting.rules.StatementAdapter.evaluate(StatementAdapter.java:36)
	at com.carrotsearch.randomizedtesting.rules.StatementAdapter.evaluate(StatementAdapter.java:36)
	at org.apache.lucene.util.TestRuleAssertionsRequired$1.evaluate(TestRuleAssertionsRequired.java:53)
	at org.apache.lucene.util.TestRuleMarkFailure$1.evaluate(TestRuleMarkFailure.java:47)
	at org.apache.lucene.util.TestRuleIgnoreAfterMaxFailures$1.evaluate(TestRuleIgnoreAfterMaxFailures.java:64)
	at org.apache.lucene.util.TestRuleIgnoreTestSuites$1.evaluate(TestRuleIgnoreTestSuites.java:54)
	at com.carrotsearch.randomizedtesting.rules.StatementAdapter.evaluate(StatementAdapter.java:36)
	at com.carrotsearch.randomizedtesting.ThreadLeakControl$StatementRunner.run(ThreadLeakControl.java:368)
	at java.lang.Thread.run(Thread.java:748)


FAILED:  junit.framework.TestSuite.org.apache.solr.cloud.SSLMigrationTest

Error Message:
2 threads leaked from SUITE scope at org.apache.solr.cloud.SSLMigrationTest:     1) Thread[id=20555, name=Connection evictor, state=TIMED_WAITING, group=TGRP-SSLMigrationTest]         at java.lang.Thread.sleep(Native Method)         at org.apache.http.impl.client.IdleConnectionEvictor$1.run(IdleConnectionEvictor.java:66)         at java.lang.Thread.run(Thread.java:748)    2) Thread[id=20694, name=Connection evictor, state=TIMED_WAITING, group=TGRP-SSLMigrationTest]         at java.lang.Thread.sleep(Native Method)         at org.apache.http.impl.client.IdleConnectionEvictor$1.run(IdleConnectionEvictor.java:66)         at java.lang.Thread.run(Thread.java:748)

Stack Trace:
com.carrotsearch.randomizedtesting.ThreadLeakError: 2 threads leaked from SUITE scope at org.apache.solr.cloud.SSLMigrationTest: 
   1) Thread[id=20555, name=Connection evictor, state=TIMED_WAITING, group=TGRP-SSLMigrationTest]
        at java.lang.Thread.sleep(Native Method)
        at org.apache.http.impl.client.IdleConnectionEvictor$1.run(IdleConnectionEvictor.java:66)
        at java.lang.Thread.run(Thread.java:748)
   2) Thread[id=20694, name=Connection evictor, state=TIMED_WAITING, group=TGRP-SSLMigrationTest]
        at java.lang.Thread.sleep(Native Method)
        at org.apache.http.impl.client.IdleConnectionEvictor$1.run(IdleConnectionEvictor.java:66)
        at java.lang.Thread.run(Thread.java:748)
	at __randomizedtesting.SeedInfo.seed([79D2302ED31AB03A]:0)


FAILED:  org.apache.solr.cloud.ZkControllerTest.testPublishAndWaitForDownStates

Error Message:
The ZkController.publishAndWaitForDownStates should have timed out but it didn't

Stack Trace:
java.lang.AssertionError: The ZkController.publishAndWaitForDownStates should have timed out but it didn't
	at __randomizedtesting.SeedInfo.seed([79D2302ED31AB03A:5EDD5CC2728DFF05]:0)
	at org.junit.Assert.fail(Assert.java:93)
	at org.junit.Assert.assertTrue(Assert.java:43)
	at org.apache.solr.cloud.ZkControllerTest.testPublishAndWaitForDownStates(ZkControllerTest.java:306)
	at sun.reflect.NativeMethodAccessorImpl.invoke0(Native Method)
	at sun.reflect.NativeMethodAccessorImpl.invoke(NativeMethodAccessorImpl.java:62)
	at sun.reflect.DelegatingMethodAccessorImpl.invoke(DelegatingMethodAccessorImpl.java:43)
	at java.lang.reflect.Method.invoke(Method.java:498)
	at com.carrotsearch.randomizedtesting.RandomizedRunner.invoke(RandomizedRunner.java:1737)
	at com.carrotsearch.randomizedtesting.RandomizedRunner$8.evaluate(RandomizedRunner.java:934)
	at com.carrotsearch.randomizedtesting.RandomizedRunner$9.evaluate(RandomizedRunner.java:970)
	at com.carrotsearch.randomizedtesting.RandomizedRunner$10.evaluate(RandomizedRunner.java:984)
	at com.carrotsearch.randomizedtesting.rules.SystemPropertiesRestoreRule$1.evaluate(SystemPropertiesRestoreRule.java:57)
	at org.apache.lucene.util.TestRuleSetupTeardownChained$1.evaluate(TestRuleSetupTeardownChained.java:49)
	at org.apache.lucene.util.AbstractBeforeAfterRule$1.evaluate(AbstractBeforeAfterRule.java:45)
	at org.apache.lucene.util.TestRuleThreadAndTestName$1.evaluate(TestRuleThreadAndTestName.java:48)
	at org.apache.lucene.util.TestRuleIgnoreAfterMaxFailures$1.evaluate(TestRuleIgnoreAfterMaxFailures.java:64)
	at org.apache.lucene.util.TestRuleMarkFailure$1.evaluate(TestRuleMarkFailure.java:47)
	at com.carrotsearch.randomizedtesting.rules.StatementAdapter.evaluate(StatementAdapter.java:36)
	at com.carrotsearch.randomizedtesting.ThreadLeakControl$StatementRunner.run(ThreadLeakControl.java:368)
	at com.carrotsearch.randomizedtesting.ThreadLeakControl.forkTimeoutingTask(ThreadLeakControl.java:817)
	at com.carrotsearch.randomizedtesting.ThreadLeakControl$3.evaluate(ThreadLeakControl.java:468)
	at com.carrotsearch.randomizedtesting.RandomizedRunner.runSingleTest(RandomizedRunner.java:943)
	at com.carrotsearch.randomizedtesting.RandomizedRunner$5.evaluate(RandomizedRunner.java:829)
	at com.carrotsearch.randomizedtesting.RandomizedRunner$6.evaluate(RandomizedRunner.java:879)
	at com.carrotsearch.randomizedtesting.RandomizedRunner$7.evaluate(RandomizedRunner.java:890)
	at com.carrotsearch.randomizedtesting.rules.StatementAdapter.evaluate(StatementAdapter.java:36)
	at com.carrotsearch.randomizedtesting.rules.SystemPropertiesRestoreRule$1.evaluate(SystemPropertiesRestoreRule.java:57)
	at org.apache.lucene.util.AbstractBeforeAfterRule$1.evaluate(AbstractBeforeAfterRule.java:45)
	at com.carrotsearch.randomizedtesting.rules.StatementAdapter.evaluate(StatementAdapter.java:36)
	at org.apache.lucene.util.TestRuleStoreClassName$1.evaluate(TestRuleStoreClassName.java:41)
	at com.carrotsearch.randomizedtesting.rules.NoShadowingOrOverridesOnMethodsRule$1.evaluate(NoShadowingOrOverridesOnMethodsRule.java:40)
	at com.carrotsearch.randomizedtesting.rules.NoShadowingOrOverridesOnMethodsRule$1.evaluate(NoShadowingOrOverridesOnMethodsRule.java:40)
	at com.carrotsearch.randomizedtesting.rules.StatementAdapter.evaluate(StatementAdapter.java:36)
	at com.carrotsearch.randomizedtesting.rules.StatementAdapter.evaluate(StatementAdapter.java:36)
	at com.carrotsearch.randomizedtesting.rules.StatementAdapter.evaluate(StatementAdapter.java:36)
	at org.apache.lucene.util.TestRuleAssertionsRequired$1.evaluate(TestRuleAssertionsRequired.java:53)
	at org.apache.lucene.util.TestRuleMarkFailure$1.evaluate(TestRuleMarkFailure.java:47)
	at org.apache.lucene.util.TestRuleIgnoreAfterMaxFailures$1.evaluate(TestRuleIgnoreAfterMaxFailures.java:64)
	at org.apache.lucene.util.TestRuleIgnoreTestSuites$1.evaluate(TestRuleIgnoreTestSuites.java:54)
	at com.carrotsearch.randomizedtesting.rules.StatementAdapter.evaluate(StatementAdapter.java:36)
	at com.carrotsearch.randomizedtesting.ThreadLeakControl$StatementRunner.run(ThreadLeakControl.java:368)
	at java.lang.Thread.run(Thread.java:748)


FAILED:  org.apache.solr.core.TestJmxIntegration.testJmxOnCoreReload

Error Message:
Number of registered MBeans is not the same as info registry size expected:<107> but was:<0>

Stack Trace:
java.lang.AssertionError: Number of registered MBeans is not the same as info registry size expected:<107> but was:<0>
	at __randomizedtesting.SeedInfo.seed([79D2302ED31AB03A:7B6BEB42A0596CF7]:0)
	at org.junit.Assert.fail(Assert.java:93)
	at org.junit.Assert.failNotEquals(Assert.java:647)
	at org.junit.Assert.assertEquals(Assert.java:128)
	at org.junit.Assert.assertEquals(Assert.java:472)
	at org.apache.solr.core.TestJmxIntegration.testJmxOnCoreReload(TestJmxIntegration.java:180)
	at sun.reflect.NativeMethodAccessorImpl.invoke0(Native Method)
	at sun.reflect.NativeMethodAccessorImpl.invoke(NativeMethodAccessorImpl.java:62)
	at sun.reflect.DelegatingMethodAccessorImpl.invoke(DelegatingMethodAccessorImpl.java:43)
	at java.lang.reflect.Method.invoke(Method.java:498)
	at com.carrotsearch.randomizedtesting.RandomizedRunner.invoke(RandomizedRunner.java:1737)
	at com.carrotsearch.randomizedtesting.RandomizedRunner$8.evaluate(RandomizedRunner.java:934)
	at com.carrotsearch.randomizedtesting.RandomizedRunner$9.evaluate(RandomizedRunner.java:970)
	at com.carrotsearch.randomizedtesting.RandomizedRunner$10.evaluate(RandomizedRunner.java:984)
	at com.carrotsearch.randomizedtesting.rules.SystemPropertiesRestoreRule$1.evaluate(SystemPropertiesRestoreRule.java:57)
	at org.apache.lucene.util.TestRuleSetupTeardownChained$1.evaluate(TestRuleSetupTeardownChained.java:49)
	at org.apache.lucene.util.AbstractBeforeAfterRule$1.evaluate(AbstractBeforeAfterRule.java:45)
	at org.apache.lucene.util.TestRuleThreadAndTestName$1.evaluate(TestRuleThreadAndTestName.java:48)
	at org.apache.lucene.util.TestRuleIgnoreAfterMaxFailures$1.evaluate(TestRuleIgnoreAfterMaxFailures.java:64)
	at org.apache.lucene.util.TestRuleMarkFailure$1.evaluate(TestRuleMarkFailure.java:47)
	at com.carrotsearch.randomizedtesting.rules.StatementAdapter.evaluate(StatementAdapter.java:36)
	at com.carrotsearch.randomizedtesting.ThreadLeakControl$StatementRunner.run(ThreadLeakControl.java:368)
	at com.carrotsearch.randomizedtesting.ThreadLeakControl.forkTimeoutingTask(ThreadLeakControl.java:817)
	at com.carrotsearch.randomizedtesting.ThreadLeakControl$3.evaluate(ThreadLeakControl.java:468)
	at com.carrotsearch.randomizedtesting.RandomizedRunner.runSingleTest(RandomizedRunner.java:943)
	at com.carrotsearch.randomizedtesting.RandomizedRunner$5.evaluate(RandomizedRunner.java:829)
	at com.carrotsearch.randomizedtesting.RandomizedRunner$6.evaluate(RandomizedRunner.java:879)
	at com.carrotsearch.randomizedtesting.RandomizedRunner$7.evaluate(RandomizedRunner.java:890)
	at com.carrotsearch.randomizedtesting.rules.StatementAdapter.evaluate(StatementAdapter.java:36)
	at com.carrotsearch.randomizedtesting.rules.SystemPropertiesRestoreRule$1.evaluate(SystemPropertiesRestoreRule.java:57)
	at org.apache.lucene.util.AbstractBeforeAfterRule$1.evaluate(AbstractBeforeAfterRule.java:45)
	at com.carrotsearch.randomizedtesting.rules.StatementAdapter.evaluate(StatementAdapter.java:36)
	at org.apache.lucene.util.TestRuleStoreClassName$1.evaluate(TestRuleStoreClassName.java:41)
	at com.carrotsearch.randomizedtesting.rules.NoShadowingOrOverridesOnMethodsRule$1.evaluate(NoShadowingOrOverridesOnMethodsRule.java:40)
	at com.carrotsearch.randomizedtesting.rules.NoShadowingOrOverridesOnMethodsRule$1.evaluate(NoShadowingOrOverridesOnMethodsRule.java:40)
	at com.carrotsearch.randomizedtesting.rules.StatementAdapter.evaluate(StatementAdapter.java:36)
	at com.carrotsearch.randomizedtesting.rules.StatementAdapter.evaluate(StatementAdapter.java:36)
	at com.carrotsearch.randomizedtesting.rules.StatementAdapter.evaluate(StatementAdapter.java:36)
	at org.apache.lucene.util.TestRuleAssertionsRequired$1.evaluate(TestRuleAssertionsRequired.java:53)
	at org.apache.lucene.util.TestRuleMarkFailure$1.evaluate(TestRuleMarkFailure.java:47)
	at org.apache.lucene.util.TestRuleIgnoreAfterMaxFailures$1.evaluate(TestRuleIgnoreAfterMaxFailures.java:64)
	at org.apache.lucene.util.TestRuleIgnoreTestSuites$1.evaluate(TestRuleIgnoreTestSuites.java:54)
	at com.carrotsearch.randomizedtesting.rules.StatementAdapter.evaluate(StatementAdapter.java:36)
	at com.carrotsearch.randomizedtesting.ThreadLeakControl$StatementRunner.run(ThreadLeakControl.java:368)
	at java.lang.Thread.run(Thread.java:748)


FAILED:  org.apache.solr.handler.TestReplicationHandler.doTestIndexFetchOnMasterRestart

Error Message:
IOException occured when talking to server at: http://127.0.0.1:46191/solr/collection1

Stack Trace:
org.apache.solr.client.solrj.SolrServerException: IOException occured when talking to server at: http://127.0.0.1:46191/solr/collection1
	at __randomizedtesting.SeedInfo.seed([79D2302ED31AB03A:A125F4CA78C17266]:0)
	at org.apache.solr.client.solrj.impl.HttpSolrClient.executeMethod(HttpSolrClient.java:657)
	at org.apache.solr.client.solrj.impl.HttpSolrClient.request(HttpSolrClient.java:255)
	at org.apache.solr.client.solrj.impl.HttpSolrClient.request(HttpSolrClient.java:244)
	at org.apache.solr.client.solrj.SolrRequest.process(SolrRequest.java:194)
	at org.apache.solr.client.solrj.SolrClient.add(SolrClient.java:173)
	at org.apache.solr.client.solrj.SolrClient.add(SolrClient.java:138)
	at org.apache.solr.client.solrj.SolrClient.add(SolrClient.java:152)
	at org.apache.solr.handler.TestReplicationHandler.index(TestReplicationHandler.java:180)
	at org.apache.solr.handler.TestReplicationHandler.doTestIndexFetchOnMasterRestart(TestReplicationHandler.java:643)
	at sun.reflect.NativeMethodAccessorImpl.invoke0(Native Method)
	at sun.reflect.NativeMethodAccessorImpl.invoke(NativeMethodAccessorImpl.java:62)
	at sun.reflect.DelegatingMethodAccessorImpl.invoke(DelegatingMethodAccessorImpl.java:43)
	at java.lang.reflect.Method.invoke(Method.java:498)
	at com.carrotsearch.randomizedtesting.RandomizedRunner.invoke(RandomizedRunner.java:1737)
	at com.carrotsearch.randomizedtesting.RandomizedRunner$8.evaluate(RandomizedRunner.java:934)
	at com.carrotsearch.randomizedtesting.RandomizedRunner$9.evaluate(RandomizedRunner.java:970)
	at com.carrotsearch.randomizedtesting.RandomizedRunner$10.evaluate(RandomizedRunner.java:984)
	at com.carrotsearch.randomizedtesting.rules.SystemPropertiesRestoreRule$1.evaluate(SystemPropertiesRestoreRule.java:57)
	at org.apache.lucene.util.TestRuleSetupTeardownChained$1.evaluate(TestRuleSetupTeardownChained.java:49)
	at org.apache.lucene.util.AbstractBeforeAfterRule$1.evaluate(AbstractBeforeAfterRule.java:45)
	at org.apache.lucene.util.TestRuleThreadAndTestName$1.evaluate(TestRuleThreadAndTestName.java:48)
	at org.apache.lucene.util.TestRuleIgnoreAfterMaxFailures$1.evaluate(TestRuleIgnoreAfterMaxFailures.java:64)
	at org.apache.lucene.util.TestRuleMarkFailure$1.evaluate(TestRuleMarkFailure.java:47)
	at com.carrotsearch.randomizedtesting.rules.StatementAdapter.evaluate(StatementAdapter.java:36)
	at com.carrotsearch.randomizedtesting.ThreadLeakControl$StatementRunner.run(ThreadLeakControl.java:368)
	at com.carrotsearch.randomizedtesting.ThreadLeakControl.forkTimeoutingTask(ThreadLeakControl.java:817)
	at com.carrotsearch.randomizedtesting.ThreadLeakControl$3.evaluate(ThreadLeakControl.java:468)
	at com.carrotsearch.randomizedtesting.RandomizedRunner.runSingleTest(RandomizedRunner.java:943)
	at com.carrotsearch.randomizedtesting.RandomizedRunner$5.evaluate(RandomizedRunner.java:829)
	at com.carrotsearch.randomizedtesting.RandomizedRunner$6.evaluate(RandomizedRunner.java:879)
	at com.carrotsearch.randomizedtesting.RandomizedRunner$7.evaluate(RandomizedRunner.java:890)
	at com.carrotsearch.randomizedtesting.rules.StatementAdapter.evaluate(StatementAdapter.java:36)
	at com.carrotsearch.randomizedtesting.rules.SystemPropertiesRestoreRule$1.evaluate(SystemPropertiesRestoreRule.java:57)
	at org.apache.lucene.util.AbstractBeforeAfterRule$1.evaluate(AbstractBeforeAfterRule.java:45)
	at com.carrotsearch.randomizedtesting.rules.StatementAdapter.evaluate(StatementAdapter.java:36)
	at org.apache.lucene.util.TestRuleStoreClassName$1.evaluate(TestRuleStoreClassName.java:41)
	at com.carrotsearch.randomizedtesting.rules.NoShadowingOrOverridesOnMethodsRule$1.evaluate(NoShadowingOrOverridesOnMethodsRule.java:40)
	at com.carrotsearch.randomizedtesting.rules.NoShadowingOrOverridesOnMethodsRule$1.evaluate(NoShadowingOrOverridesOnMethodsRule.java:40)
	at com.carrotsearch.randomizedtesting.rules.StatementAdapter.evaluate(StatementAdapter.java:36)
	at com.carrotsearch.randomizedtesting.rules.StatementAdapter.evaluate(StatementAdapter.java:36)
	at com.carrotsearch.randomizedtesting.rules.StatementAdapter.evaluate(StatementAdapter.java:36)
	at org.apache.lucene.util.TestRuleAssertionsRequired$1.evaluate(TestRuleAssertionsRequired.java:53)
	at org.apache.lucene.util.TestRuleMarkFailure$1.evaluate(TestRuleMarkFailure.java:47)
	at org.apache.lucene.util.TestRuleIgnoreAfterMaxFailures$1.evaluate(TestRuleIgnoreAfterMaxFailures.java:64)
	at org.apache.lucene.util.TestRuleIgnoreTestSuites$1.evaluate(TestRuleIgnoreTestSuites.java:54)
	at com.carrotsearch.randomizedtesting.rules.StatementAdapter.evaluate(StatementAdapter.java:36)
	at com.carrotsearch.randomizedtesting.ThreadLeakControl$StatementRunner.run(ThreadLeakControl.java:368)
	at java.lang.Thread.run(Thread.java:748)
Caused by: org.apache.http.NoHttpResponseException: 127.0.0.1:46191 failed to respond
	at org.apache.http.impl.conn.DefaultHttpResponseParser.parseHead(DefaultHttpResponseParser.java:141)
	at org.apache.http.impl.conn.DefaultHttpResponseParser.parseHead(DefaultHttpResponseParser.java:56)
	at org.apache.http.impl.io.AbstractMessageParser.parse(AbstractMessageParser.java:259)
	at org.apache.http.impl.DefaultBHttpClientConnection.receiveResponseHeader(DefaultBHttpClientConnection.java:163)
	at org.apache.http.impl.conn.CPoolProxy.receiveResponseHeader(CPoolProxy.java:165)
	at org.apache.http.protocol.HttpRequestExecutor.doReceiveResponse(HttpRequestExecutor.java:273)
	at org.apache.http.protocol.HttpRequestExecutor.execute(HttpRequestExecutor.java:125)
	at org.apache.http.impl.execchain.MainClientExec.execute(MainClientExec.java:272)
	at org.apache.http.impl.execchain.ProtocolExec.execute(ProtocolExec.java:185)
	at org.apache.http.impl.execchain.RetryExec.execute(RetryExec.java:89)
	at org.apache.http.impl.execchain.RedirectExec.execute(RedirectExec.java:111)
	at org.apache.http.impl.client.InternalHttpClient.doExecute(InternalHttpClient.java:185)
	at org.apache.http.impl.client.CloseableHttpClient.execute(CloseableHttpClient.java:83)
	at org.apache.http.impl.client.CloseableHttpClient.execute(CloseableHttpClient.java:56)
	at org.apache.solr.client.solrj.impl.HttpSolrClient.executeMethod(HttpSolrClient.java:542)
	... 47 more


FAILED:  org.apache.solr.ltr.TestLTRReRankingPipeline.testDifferentTopN

Error Message:
expected:<1.0> but was:<0.0>

Stack Trace:
java.lang.AssertionError: expected:<1.0> but was:<0.0>
	at __randomizedtesting.SeedInfo.seed([41384692239A4B38:B09934C2162181AA]:0)
	at org.junit.Assert.fail(Assert.java:93)
	at org.junit.Assert.failNotEquals(Assert.java:647)
	at org.junit.Assert.assertEquals(Assert.java:443)
	at org.junit.Assert.assertEquals(Assert.java:512)
	at org.apache.solr.ltr.TestLTRReRankingPipeline.testDifferentTopN(TestLTRReRankingPipeline.java:256)
	at sun.reflect.NativeMethodAccessorImpl.invoke0(Native Method)
	at sun.reflect.NativeMethodAccessorImpl.invoke(NativeMethodAccessorImpl.java:62)
	at sun.reflect.DelegatingMethodAccessorImpl.invoke(DelegatingMethodAccessorImpl.java:43)
	at java.lang.reflect.Method.invoke(Method.java:498)
	at com.carrotsearch.randomizedtesting.RandomizedRunner.invoke(RandomizedRunner.java:1737)
	at com.carrotsearch.randomizedtesting.RandomizedRunner$8.evaluate(RandomizedRunner.java:934)
	at com.carrotsearch.randomizedtesting.RandomizedRunner$9.evaluate(RandomizedRunner.java:970)
	at com.carrotsearch.randomizedtesting.RandomizedRunner$10.evaluate(RandomizedRunner.java:984)
	at org.apache.lucene.util.TestRuleSetupTeardownChained$1.evaluate(TestRuleSetupTeardownChained.java:49)
	at org.apache.lucene.util.AbstractBeforeAfterRule$1.evaluate(AbstractBeforeAfterRule.java:45)
	at org.apache.lucene.util.TestRuleThreadAndTestName$1.evaluate(TestRuleThreadAndTestName.java:48)
	at org.apache.lucene.util.TestRuleIgnoreAfterMaxFailures$1.evaluate(TestRuleIgnoreAfterMaxFailures.java:64)
	at org.apache.lucene.util.TestRuleMarkFailure$1.evaluate(TestRuleMarkFailure.java:47)
	at com.carrotsearch.randomizedtesting.rules.StatementAdapter.evaluate(StatementAdapter.java:36)
	at com.carrotsearch.randomizedtesting.ThreadLeakControl$StatementRunner.run(ThreadLeakControl.java:368)
	at com.carrotsearch.randomizedtesting.ThreadLeakControl.forkTimeoutingTask(ThreadLeakControl.java:817)
	at com.carrotsearch.randomizedtesting.ThreadLeakControl$3.evaluate(ThreadLeakControl.java:468)
	at com.carrotsearch.randomizedtesting.RandomizedRunner.runSingleTest(RandomizedRunner.java:943)
	at com.carrotsearch.randomizedtesting.RandomizedRunner$5.evaluate(RandomizedRunner.java:829)
	at com.carrotsearch.randomizedtesting.RandomizedRunner$6.evaluate(RandomizedRunner.java:879)
	at com.carrotsearch.randomizedtesting.RandomizedRunner$7.evaluate(RandomizedRunner.java:890)
	at org.apache.lucene.util.AbstractBeforeAfterRule$1.evaluate(AbstractBeforeAfterRule.java:45)
	at com.carrotsearch.randomizedtesting.rules.StatementAdapter.evaluate(StatementAdapter.java:36)
	at org.apache.lucene.util.TestRuleStoreClassName$1.evaluate(TestRuleStoreClassName.java:41)
	at com.carrotsearch.randomizedtesting.rules.NoShadowingOrOverridesOnMethodsRule$1.evaluate(NoShadowingOrOverridesOnMethodsRule.java:40)
	at com.carrotsearch.randomizedtesting.rules.NoShadowingOrOverridesOnMethodsRule$1.evaluate(NoShadowingOrOverridesOnMethodsRule.java:40)
	at com.carrotsearch.randomizedtesting.rules.StatementAdapter.evaluate(StatementAdapter.java:36)
	at com.carrotsearch.randomizedtesting.rules.StatementAdapter.evaluate(StatementAdapter.java:36)
	at com.carrotsearch.randomizedtesting.rules.StatementAdapter.evaluate(StatementAdapter.java:36)
	at org.apache.lucene.util.TestRuleAssertionsRequired$1.evaluate(TestRuleAssertionsRequired.java:53)
	at org.apache.lucene.util.TestRuleMarkFailure$1.evaluate(TestRuleMarkFailure.java:47)
	at org.apache.lucene.util.TestRuleIgnoreAfterMaxFailures$1.evaluate(TestRuleIgnoreAfterMaxFailures.java:64)
	at org.apache.lucene.util.TestRuleIgnoreTestSuites$1.evaluate(TestRuleIgnoreTestSuites.java:54)
	at com.carrotsearch.randomizedtesting.rules.StatementAdapter.evaluate(StatementAdapter.java:36)
	at com.carrotsearch.randomizedtesting.ThreadLeakControl$StatementRunner.run(ThreadLeakControl.java:368)
	at java.lang.Thread.run(Thread.java:748)




Build Log:
[...truncated 12700 lines...]
   [junit4] Suite: org.apache.solr.cloud.autoscaling.HdfsAutoAddReplicasIntegrationTest
   [junit4]   2> 608397 INFO  (SUITE-HdfsAutoAddReplicasIntegrationTest-seed#[79D2302ED31AB03A]-worker) [    ] o.a.s.SolrTestCaseJ4 SecureRandom sanity checks: test.solr.allowed.securerandom=null & java.security.egd=file:/dev/./urandom
   [junit4]   2> Creating dataDir: /home/jenkins/workspace/Lucene-Solr-master-Linux/solr/build/solr-core/test/J1/temp/solr.cloud.autoscaling.HdfsAutoAddReplicasIntegrationTest_79D2302ED31AB03A-001/init-core-data-001
   [junit4]   2> 608398 INFO  (SUITE-HdfsAutoAddReplicasIntegrationTest-seed#[79D2302ED31AB03A]-worker) [    ] o.a.s.SolrTestCaseJ4 Using PointFields (NUMERIC_POINTS_SYSPROP=true) w/NUMERIC_DOCVALUES_SYSPROP=false
   [junit4]   2> 608398 INFO  (SUITE-HdfsAutoAddReplicasIntegrationTest-seed#[79D2302ED31AB03A]-worker) [    ] o.a.s.SolrTestCaseJ4 Randomized ssl (false) and clientAuth (true) via: @org.apache.solr.util.RandomizeSSL(reason=, ssl=NaN, value=NaN, clientAuth=NaN)
   [junit4]   2> 608399 INFO  (SUITE-HdfsAutoAddReplicasIntegrationTest-seed#[79D2302ED31AB03A]-worker) [    ] o.a.s.c.MiniSolrCloudCluster Starting cluster of 3 servers in /home/jenkins/workspace/Lucene-Solr-master-Linux/solr/build/solr-core/test/J1/temp/solr.cloud.autoscaling.HdfsAutoAddReplicasIntegrationTest_79D2302ED31AB03A-001/tempDir-001
   [junit4]   2> 608399 INFO  (SUITE-HdfsAutoAddReplicasIntegrationTest-seed#[79D2302ED31AB03A]-worker) [    ] o.a.s.c.ZkTestServer STARTING ZK TEST SERVER
   [junit4]   2> 608405 INFO  (Thread-4241) [    ] o.a.s.c.ZkTestServer client port:0.0.0.0/0.0.0.0:0
   [junit4]   2> 608405 INFO  (Thread-4241) [    ] o.a.s.c.ZkTestServer Starting server
   [junit4]   2> 608421 ERROR (Thread-4241) [    ] o.a.z.s.ZooKeeperServer ZKShutdownHandler is not registered, so ZooKeeper server won't take any action on ERROR or SHUTDOWN server state changes
   [junit4]   2> 608505 INFO  (SUITE-HdfsAutoAddReplicasIntegrationTest-seed#[79D2302ED31AB03A]-worker) [    ] o.a.s.c.ZkTestServer start zk server on port:43541
   [junit4]   2> 608507 INFO  (zkConnectionManagerCallback-1372-thread-1) [    ] o.a.s.c.c.ConnectionManager zkClient has connected
   [junit4]   2> 608510 INFO  (jetty-launcher-1369-thread-1) [    ] o.e.j.s.Server jetty-9.4.8.v20171121, build timestamp: 2017-11-22T00:27:37+03:00, git hash: 82b8fb23f757335bb3329d540ce37a2a2615f0a8
   [junit4]   2> 608511 INFO  (jetty-launcher-1369-thread-2) [    ] o.e.j.s.Server jetty-9.4.8.v20171121, build timestamp: 2017-11-22T00:27:37+03:00, git hash: 82b8fb23f757335bb3329d540ce37a2a2615f0a8
   [junit4]   2> 608512 INFO  (jetty-launcher-1369-thread-3) [    ] o.e.j.s.Server jetty-9.4.8.v20171121, build timestamp: 2017-11-22T00:27:37+03:00, git hash: 82b8fb23f757335bb3329d540ce37a2a2615f0a8
   [junit4]   2> 608533 INFO  (jetty-launcher-1369-thread-2) [    ] o.e.j.s.session DefaultSessionIdManager workerName=node0
   [junit4]   2> 608533 INFO  (jetty-launcher-1369-thread-2) [    ] o.e.j.s.session No SessionScavenger set, using defaults
   [junit4]   2> 608533 INFO  (jetty-launcher-1369-thread-2) [    ] o.e.j.s.session Scavenging every 660000ms
   [junit4]   2> 608539 INFO  (jetty-launcher-1369-thread-2) [    ] o.e.j.s.h.ContextHandler Started o.e.j.s.ServletContextHandler@906599{/solr,null,AVAILABLE}
   [junit4]   2> 608542 INFO  (jetty-launcher-1369-thread-1) [    ] o.e.j.s.session DefaultSessionIdManager workerName=node0
   [junit4]   2> 608542 INFO  (jetty-launcher-1369-thread-1) [    ] o.e.j.s.session No SessionScavenger set, using defaults
   [junit4]   2> 608542 INFO  (jetty-launcher-1369-thread-1) [    ] o.e.j.s.session Scavenging every 600000ms
   [junit4]   2> 608543 INFO  (jetty-launcher-1369-thread-2) [    ] o.e.j.s.AbstractConnector Started ServerConnector@18ccbbc{HTTP/1.1,[http/1.1]}{127.0.0.1:36787}
   [junit4]   2> 608544 INFO  (jetty-launcher-1369-thread-2) [    ] o.e.j.s.Server Started @609966ms
   [junit4]   2> 608544 INFO  (jetty-launcher-1369-thread-2) [    ] o.a.s.c.s.e.JettySolrRunner Jetty properties: {hostContext=/solr, hostPort=36787}
   [junit4]   2> 608544 ERROR (jetty-launcher-1369-thread-2) [    ] o.a.s.u.StartupLoggingUtils Missing Java Option solr.log.dir. Logging may be missing or incomplete.
   [junit4]   2> 608544 INFO  (jetty-launcher-1369-thread-2) [    ] o.a.s.s.SolrDispatchFilter  ___      _       Welcome to Apache Solr™ version 8.0.0
   [junit4]   2> 608544 INFO  (jetty-launcher-1369-thread-2) [    ] o.a.s.s.SolrDispatchFilter / __| ___| |_ _   Starting in cloud mode on port null
   [junit4]   2> 608544 INFO  (jetty-launcher-1369-thread-2) [    ] o.a.s.s.SolrDispatchFilter \__ \/ _ \ | '_|  Install dir: null
   [junit4]   2> 608544 INFO  (jetty-launcher-1369-thread-2) [    ] o.a.s.s.SolrDispatchFilter |___/\___/_|_|    Start time: 2018-02-27T17:35:20.769Z
   [junit4]   2> 608545 INFO  (jetty-launcher-1369-thread-3) [    ] o.e.j.s.session DefaultSessionIdManager workerName=node0
   [junit4]   2> 608545 INFO  (jetty-launcher-1369-thread-3) [    ] o.e.j.s.session No SessionScavenger set, using defaults
   [junit4]   2> 608545 INFO  (jetty-launcher-1369-thread-3) [    ] o.e.j.s.session Scavenging every 660000ms
   [junit4]   2> 608552 INFO  (jetty-launcher-1369-thread-1) [    ] o.e.j.s.h.ContextHandler Started o.e.j.s.ServletContextHandler@1c542da{/solr,null,AVAILABLE}
   [junit4]   2> 608553 INFO  (jetty-launcher-1369-thread-1) [    ] o.e.j.s.AbstractConnector Started ServerConnector@872ee7{HTTP/1.1,[http/1.1]}{127.0.0.1:39747}
   [junit4]   2> 608553 INFO  (jetty-launcher-1369-thread-3) [    ] o.e.j.s.h.ContextHandler Started o.e.j.s.ServletContextHandler@1c16e4d{/solr,null,AVAILABLE}
   [junit4]   2> 608553 INFO  (jetty-launcher-1369-thread-1) [    ] o.e.j.s.Server Started @609975ms
   [junit4]   2> 608553 INFO  (jetty-launcher-1369-thread-1) [    ] o.a.s.c.s.e.JettySolrRunner Jetty properties: {hostContext=/solr, hostPort=39747}
   [junit4]   2> 608553 ERROR (jetty-launcher-1369-thread-1) [    ] o.a.s.u.StartupLoggingUtils Missing Java Option solr.log.dir. Logging may be missing or incomplete.
   [junit4]   2> 608553 INFO  (jetty-launcher-1369-thread-1) [    ] o.a.s.s.SolrDispatchFilter  ___      _       Welcome to Apache Solr™ version 8.0.0
   [junit4]   2> 608553 INFO  (jetty-launcher-1369-thread-1) [    ] o.a.s.s.SolrDispatchFilter / __| ___| |_ _   Starting in cloud mode on port null
   [junit4]   2> 608553 INFO  (jetty-launcher-1369-thread-1) [    ] o.a.s.s.SolrDispatchFilter \__ \/ _ \ | '_|  Install dir: null
   [junit4]   2> 608553 INFO  (jetty-launcher-1369-thread-1) [    ] o.a.s.s.SolrDispatchFilter |___/\___/_|_|    Start time: 2018-02-27T17:35:20.778Z
   [junit4]   2> 608553 INFO  (zkConnectionManagerCallback-1374-thread-1) [    ] o.a.s.c.c.ConnectionManager zkClient has connected
   [junit4]   2> 608553 INFO  (jetty-launcher-1369-thread-3) [    ] o.e.j.s.AbstractConnector Started ServerConnector@1f66a6e{HTTP/1.1,[http/1.1]}{127.0.0.1:35107}
   [junit4]   2> 608553 INFO  (jetty-launcher-1369-thread-3) [    ] o.e.j.s.Server Started @609976ms
   [junit4]   2> 608553 INFO  (jetty-launcher-1369-thread-3) [    ] o.a.s.c.s.e.JettySolrRunner Jetty properties: {hostContext=/solr, hostPort=35107}
   [junit4]   2> 608553 ERROR (jetty-launcher-1369-thread-3) [    ] o.a.s.u.StartupLoggingUtils Missing Java Option solr.log.dir. Logging may be missing or incomplete.
   [junit4]   2> 608553 INFO  (jetty-launcher-1369-thread-3) [    ] o.a.s.s.SolrDispatchFilter  ___      _       Welcome to Apache Solr™ version 8.0.0
   [junit4]   2> 608553 INFO  (jetty-launcher-1369-thread-3) [    ] o.a.s.s.SolrDispatchFilter / __| ___| |_ _   Starting in cloud mode on port null
   [junit4]   2> 608554 INFO  (jetty-launcher-1369-thread-3) [    ] o.a.s.s.SolrDispatchFilter \__ \/ _ \ | '_|  Install dir: null
   [junit4]   2> 608554 INFO  (jetty-launcher-1369-thread-3) [    ] o.a.s.s.SolrDispatchFilter |___/\___/_|_|    Start time: 2018-02-27T17:35:20.779Z
   [junit4]   2> 608554 INFO  (jetty-launcher-1369-thread-2) [    ] o.a.s.s.SolrDispatchFilter solr.xml found in ZooKeeper. Loading...
   [junit4]   2> 608561 INFO  (zkConnectionManagerCallback-1376-thread-1) [    ] o.a.s.c.c.ConnectionManager zkClient has connected
   [junit4]   2> 608562 INFO  (jetty-launcher-1369-thread-1) [    ] o.a.s.s.SolrDispatchFilter solr.xml found in ZooKeeper. Loading...
   [junit4]   2> 608574 INFO  (jetty-launcher-1369-thread-2) [    ] o.a.s.c.ZkContainer Zookeeper client=127.0.0.1:43541/solr
   [junit4]   2> 608575 INFO  (zkConnectionManagerCallback-1378-thread-1) [    ] o.a.s.c.c.ConnectionManager zkClient has connected
   [junit4]   2> 608576 INFO  (jetty-launcher-1369-thread-3) [    ] o.a.s.s.SolrDispatchFilter solr.xml found in ZooKeeper. Loading...
   [junit4]   2> 608583 INFO  (zkConnectionManagerCallback-1382-thread-1) [    ] o.a.s.c.c.ConnectionManager zkClient has connected
   [junit4]   2> 608586 INFO  (jetty-launcher-1369-thread-1) [    ] o.a.s.c.ZkContainer Zookeeper client=127.0.0.1:43541/solr
   [junit4]   2> 608593 INFO  (zkConnectionManagerCallback-1386-thread-1) [    ] o.a.s.c.c.ConnectionManager zkClient has connected
   [junit4]   2> 608599 INFO  (jetty-launcher-1369-thread-3) [    ] o.a.s.c.ZkContainer Zookeeper client=127.0.0.1:43541/solr
   [junit4]   2> 608600 INFO  (zkConnectionManagerCallback-1388-thread-1-processing-n:127.0.0.1:36787_solr) [n:127.0.0.1:36787_solr    ] o.a.s.c.c.ConnectionManager zkClient has connected
   [junit4]   2> 608617 INFO  (zkConnectionManagerCallback-1394-thread-1) [    ] o.a.s.c.c.ConnectionManager zkClient has connected
   [junit4]   2> 608626 INFO  (zkConnectionManagerCallback-1392-thread-1-processing-n:127.0.0.1:39747_solr) [n:127.0.0.1:39747_solr    ] o.a.s.c.c.ConnectionManager zkClient has connected
   [junit4]   2> 608631 INFO  (jetty-launcher-1369-thread-1) [n:127.0.0.1:39747_solr    ] o.a.s.c.Overseer Overseer (id=null) closing
   [junit4]   2> 608632 INFO  (jetty-launcher-1369-thread-1) [n:127.0.0.1:39747_solr    ] o.a.s.c.OverseerElectionContext I am going to be the leader 127.0.0.1:39747_solr
   [junit4]   2> 608632 INFO  (jetty-launcher-1369-thread-1) [n:127.0.0.1:39747_solr    ] o.a.s.c.Overseer Overseer (id=72222487927259143-127.0.0.1:39747_solr-n_0000000000) starting
   [junit4]   2> 608637 INFO  (jetty-launcher-1369-thread-2) [n:127.0.0.1:36787_solr    ] o.a.s.c.Overseer Overseer (id=null) closing
   [junit4]   2> 608637 INFO  (jetty-launcher-1369-thread-2) [n:127.0.0.1:36787_solr    ] o.a.s.c.ZkController Register node as live in ZooKeeper:/live_nodes/127.0.0.1:36787_solr
   [junit4]   2> 608637 INFO  (zkConnectionManagerCallback-1397-thread-1-processing-n:127.0.0.1:35107_solr) [n:127.0.0.1:35107_solr    ] o.a.s.c.c.ConnectionManager zkClient has connected
   [junit4]   2> 608641 INFO  (jetty-launcher-1369-thread-3) [n:127.0.0.1:35107_solr    ] o.a.s.c.c.ZkStateReader Updated live nodes from ZooKeeper... (0) -> (1)
   [junit4]   2> 608642 INFO  (jetty-launcher-1369-thread-3) [n:127.0.0.1:35107_solr    ] o.a.s.c.Overseer Overseer (id=null) closing
   [junit4]   2> 608645 INFO  (jetty-launcher-1369-thread-3) [n:127.0.0.1:35107_solr    ] o.a.s.c.ZkController Register node as live in ZooKeeper:/live_nodes/127.0.0.1:35107_solr
   [junit4]   2> 608662 INFO  (zkCallback-1390-thread-1-processing-n:127.0.0.1:39747_solr) [n:127.0.0.1:39747_solr    ] o.a.s.c.c.ZkStateReader Updated live nodes from ZooKeeper... (0) -> (1)
   [junit4]   2> 608670 INFO  (zkCallback-1387-thread-1-processing-n:127.0.0.1:36787_solr) [n:127.0.0.1:36787_solr    ] o.a.s.c.c.ZkStateReader Updated live nodes from ZooKeeper... (0) -> (2)
   [junit4]   2> 608681 INFO  (zkCallback-1390-thread-2-processing-n:127.0.0.1:39747_solr) [n:127.0.0.1:39747_solr    ] o.a.s.c.c.ZkStateReader Updated live nodes from ZooKeeper... (1) -> (2)
   [junit4]   2> 608708 INFO  (zkCallback-1396-thread-1-processing-n:127.0.0.1:35107_solr) [n:127.0.0.1:35107_solr    ] o.a.s.c.c.ZkStateReader Updated live nodes from ZooKeeper... (1) -> (2)
   [junit4]   2> 608718 DEBUG (OverseerAutoScalingTriggerThread-72222487927259143-127.0.0.1:39747_solr-n_0000000000) [n:127.0.0.1:39747_solr    ] o.a.s.c.a.OverseerTriggerThread Adding .autoAddReplicas trigger
   [junit4]   2> 608718 INFO  (jetty-launcher-1369-thread-1) [n:127.0.0.1:39747_solr    ] o.a.s.c.ZkController Register node as live in ZooKeeper:/live_nodes/127.0.0.1:39747_solr
   [junit4]   2> 608718 INFO  (zkCallback-1387-thread-1-processing-n:127.0.0.1:36787_solr) [n:127.0.0.1:36787_solr    ] o.a.s.c.c.ZkStateReader Updated live nodes from ZooKeeper... (2) -> (3)
   [junit4]   2> 608719 INFO  (zkCallback-1396-thread-1-processing-n:127.0.0.1:35107_solr) [n:127.0.0.1:35107_solr    ] o.a.s.c.c.ZkStateReader Updated live nodes from ZooKeeper... (2) -> (3)
   [junit4]   2> 608719 INFO  (zkCallback-1390-thread-2-processing-n:127.0.0.1:39747_solr) [n:127.0.0.1:39747_solr    ] o.a.s.c.c.ZkStateReader Updated live nodes from ZooKeeper... (2) -> (3)
   [junit4]   2> 608719 DEBUG (OverseerAutoScalingTriggerThread-72222487927259143-127.0.0.1:39747_solr-n_0000000000) [n:127.0.0.1:39747_solr    ] o.a.s.c.a.OverseerTriggerThread Refreshing /autoscaling.json with znode version 1
   [junit4]   2> 608727 DEBUG (OverseerAutoScalingTriggerThread-72222487927259143-127.0.0.1:39747_solr-n_0000000000) [n:127.0.0.1:39747_solr    ] o.a.s.c.a.NodeLostTrigger Initial livenodes: [127.0.0.1:36787_solr, 127.0.0.1:35107_solr, 127.0.0.1:39747_solr]
   [junit4]   2> 608728 DEBUG (OverseerAutoScalingTriggerThread-72222487927259143-127.0.0.1:39747_solr-n_0000000000) [n:127.0.0.1:39747_solr    ] o.a.s.c.a.OverseerTriggerThread Current znodeVersion 1, lastZnodeVersion -1
   [junit4]   2> 608728 DEBUG (OverseerAutoScalingTriggerThread-72222487927259143-127.0.0.1:39747_solr-n_0000000000) [n:127.0.0.1:39747_solr    ] o.a.s.c.a.OverseerTriggerThread Processed trigger updates upto znodeVersion 1
   [junit4]   2> 608745 DEBUG (OverseerAutoScalingTriggerThread-72222487927259143-127.0.0.1:39747_solr-n_0000000000) [n:127.0.0.1:39747_solr    ] o.a.s.c.a.OverseerTriggerThread -- clean old nodeAdded markers
   [junit4]   2> 608746 DEBUG (OverseerAutoScalingTriggerThread-72222487927259143-127.0.0.1:39747_solr-n_0000000000) [n:127.0.0.1:39747_solr    ] o.a.s.c.a.OverseerTriggerThread Current znodeVersion 1, lastZnodeVersion 1
   [junit4]   2> 608746 DEBUG (ScheduledTrigger-2470-thread-1) [n:127.0.0.1:39747_solr    ] o.a.s.c.a.NodeLostTrigger Running NodeLostTrigger: .auto_add_replicas with currently live nodes: 3
   [junit4]   2> 608771 INFO  (jetty-launcher-1369-thread-2) [n:127.0.0.1:36787_solr    ] o.a.s.m.r.SolrJmxReporter JMX monitoring for 'solr_36787.solr.node' (registry 'solr.node') enabled at server: com.sun.jmx.mbeanserver.JmxMBeanServer@14e20a0
   [junit4]   2> 608779 INFO  (jetty-launcher-1369-thread-2) [n:127.0.0.1:36787_solr    ] o.a.s.m.r.SolrJmxReporter JMX monitoring for 'solr_36787.solr.jvm' (registry 'solr.jvm') enabled at server: com.sun.jmx.mbeanserver.JmxMBeanServer@14e20a0
   [junit4]   2> 608780 INFO  (jetty-launcher-1369-thread-2) [n:127.0.0.1:36787_solr    ] o.a.s.m.r.SolrJmxReporter JMX monitoring for 'solr_36787.solr.jetty' (registry 'solr.jetty') enabled at server: com.sun.jmx.mbeanserver.JmxMBeanServer@14e20a0
   [junit4]   2> 608781 INFO  (jetty-launcher-1369-thread-2) [n:127.0.0.1:36787_solr    ] o.a.s.c.CorePropertiesLocator Found 0 core definitions underneath /home/jenkins/workspace/Lucene-Solr-master-Linux/solr/build/solr-core/test/J1/temp/solr.cloud.autoscaling.HdfsAutoAddReplicasIntegrationTest_79D2302ED31AB03A-001/tempDir-001/node2/.
   [junit4]   2> 608790 INFO  (jetty-launcher-1369-thread-3) [n:127.0.0.1:35107_solr    ] o.a.s.m.r.SolrJmxReporter JMX monitoring for 'solr_35107.solr.node' (registry 'solr.node') enabled at server: com.sun.jmx.mbeanserver.JmxMBeanServer@14e20a0
   [junit4]   2> 608792 INFO  (jetty-launcher-1369-thread-1) [n:127.0.0.1:39747_solr    ] o.a.s.m.r.SolrJmxReporter JMX monitoring for 'solr_39747.solr.node' (registry 'solr.node') enabled at server: com.sun.jmx.mbeanserver.JmxMBeanServer@14e20a0
   [junit4]   2> 608797 INFO  (jetty-launcher-1369-thread-3) [n:127.0.0.1:35107_solr    ] o.a.s.m.r.SolrJmxReporter JMX monitoring for 'solr_35107.solr.jvm' (registry 'solr.jvm') enabled at server: com.sun.jmx.mbeanserver.JmxMBeanServer@14e20a0
   [junit4]   2> 608797 INFO  (jetty-launcher-1369-thread-3) [n:127.0.0.1:35107_solr    ] o.a.s.m.r.SolrJmxReporter JMX monitoring for 'solr_35107.solr.jetty' (registry 'solr.jetty') enabled at server: com.sun.jmx.mbeanserver.JmxMBeanServer@14e20a0
   [junit4]   2> 608798 INFO  (jetty-launcher-1369-thread-3) [n:127.0.0.1:35107_solr    ] o.a.s.c.CorePropertiesLocator Found 0 core definitions underneath /home/jenkins/workspace/Lucene-Solr-master-Linux/solr/build/solr-core/test/J1/temp/solr.cloud.autoscaling.HdfsAutoAddReplicasIntegrationTest_79D2302ED31AB03A-001/tempDir-001/node3/.
   [junit4]   2> 608800 INFO  (jetty-launcher-1369-thread-1) [n:127.0.0.1:39747_solr    ] o.a.s.m.r.SolrJmxReporter JMX monitoring for 'solr_39747.solr.jvm' (registry 'solr.jvm') enabled at server: com.sun.jmx.mbeanserver.JmxMBeanServer@14e20a0
   [junit4]   2> 608800 INFO  (jetty-launcher-1369-thread-1) [n:127.0.0.1:39747_solr    ] o.a.s.m.r.SolrJmxReporter JMX monitoring for 'solr_39747.solr.jetty' (registry 'solr.jetty') enabled at server: com.sun.jmx.mbeanserver.JmxMBeanServer@14e20a0
   [junit4]   2> 608801 INFO  (jetty-launcher-1369-thread-1) [n:127.0.0.1:39747_solr    ] o.a.s.c.CorePropertiesLocator Found 0 core definitions underneath /home/jenkins/workspace/Lucene-Solr-master-Linux/solr/build/solr-core/test/J1/temp/solr.cloud.autoscaling.HdfsAutoAddReplicasIntegrationTest_79D2302ED31AB03A-001/tempDir-001/node1/.
   [junit4]   2> 608905 INFO  (zkConnectionManagerCallback-1404-thread-1) [    ] o.a.s.c.c.ConnectionManager zkClient has connected
   [junit4]   2> 608937 INFO  (zkConnectionManagerCallback-1408-thread-1) [    ] o.a.s.c.c.ConnectionManager zkClient has connected
   [junit4]   2> 608938 INFO  (SUITE-HdfsAutoAddReplicasIntegrationTest-seed#[79D2302ED31AB03A]-worker) [    ] o.a.s.c.c.ZkStateReader Updated live nodes from ZooKeeper... (0) -> (3)
   [junit4]   2> 608938 INFO  (SUITE-HdfsAutoAddReplicasIntegrationTest-seed#[79D2302ED31AB03A]-worker) [    ] o.a.s.c.s.i.ZkClientClusterStateProvider Cluster at 127.0.0.1:43541/solr ready
   [junit4]   1> Formatting using clusterid: testClusterID
   [junit4]   2> 609040 WARN  (SUITE-HdfsAutoAddReplicasIntegrationTest-seed#[79D2302ED31AB03A]-worker) [    ] o.a.h.m.i.MetricsConfig Cannot locate configuration: tried hadoop-metrics2-namenode.properties,hadoop-metrics2.properties
   [junit4]   2> 609049 WARN  (SUITE-HdfsAutoAddReplicasIntegrationTest-seed#[79D2302ED31AB03A]-worker) [    ] o.a.h.h.HttpRequestLog Jetty request log can only be enabled using Log4j
   [junit4]   2> 609051 INFO  (SUITE-HdfsAutoAddReplicasIntegrationTest-seed#[79D2302ED31AB03A]-worker) [    ] o.m.log jetty-6.1.26
   [junit4]   2> 609066 INFO  (SUITE-HdfsAutoAddReplicasIntegrationTest-seed#[79D2302ED31AB03A]-worker) [    ] o.m.log Extract jar:file:/home/jenkins/.ivy2/cache/org.apache.hadoop/hadoop-hdfs/tests/hadoop-hdfs-2.7.4-tests.jar!/webapps/hdfs to ./temp/Jetty_localhost_localdomain_38887_hdfs____la5oy4/webapp
   [junit4]   2> 609566 INFO  (SUITE-HdfsAutoAddReplicasIntegrationTest-seed#[79D2302ED31AB03A]-worker) [    ] o.m.log Started HttpServer2$SelectChannelConnectorWithSafeStartup@localhost.localdomain:38887
   [junit4]   2> 609658 WARN  (SUITE-HdfsAutoAddReplicasIntegrationTest-seed#[79D2302ED31AB03A]-worker) [    ] o.a.h.h.HttpRequestLog Jetty request log can only be enabled using Log4j
   [junit4]   2> 609659 INFO  (SUITE-HdfsAutoAddReplicasIntegrationTest-seed#[79D2302ED31AB03A]-worker) [    ] o.m.log jetty-6.1.26
   [junit4]   2> 609670 INFO  (SUITE-HdfsAutoAddReplicasIntegrationTest-seed#[79D2302ED31AB03A]-worker) [    ] o.m.log Extract jar:file:/home/jenkins/.ivy2/cache/org.apache.hadoop/hadoop-hdfs/tests/hadoop-hdfs-2.7.4-tests.jar!/webapps/datanode to ./temp/Jetty_localhost_42327_datanode____kczuqp/webapp
   [junit4]   2> 609747 DEBUG (ScheduledTrigger-2470-thread-1) [n:127.0.0.1:39747_solr    ] o.a.s.c.a.NodeLostTrigger Running NodeLostTrigger: .auto_add_replicas with currently live nodes: 3
   [junit4]   2> 610130 INFO  (SUITE-HdfsAutoAddReplicasIntegrationTest-seed#[79D2302ED31AB03A]-worker) [    ] o.m.log Started HttpServer2$SelectChannelConnectorWithSafeStartup@localhost:42327
   [junit4]   2> 610253 WARN  (SUITE-HdfsAutoAddReplicasIntegrationTest-seed#[79D2302ED31AB03A]-worker) [    ] o.a.h.h.HttpRequestLog Jetty request log can only be enabled using Log4j
   [junit4]   2> 610254 INFO  (SUITE-HdfsAutoAddReplicasIntegrationTest-seed#[79D2302ED31AB03A]-worker) [    ] o.m.log jetty-6.1.26
   [junit4]   2> 610278 INFO  (SUITE-HdfsAutoAddReplicasIntegrationTest-seed#[79D2302ED31AB03A]-worker) [    ] o.m.log Extract jar:file:/home/jenkins/.ivy2/cache/org.apache.hadoop/hadoop-hdfs/tests/hadoop-hdfs-2.7.4-tests.jar!/webapps/datanode to ./temp/Jetty_localhost_42027_datanode____glfpge/webapp
   [junit4]   2> 610369 ERROR (DataNode: [[[DISK]file:/home/jenkins/workspace/Lucene-Solr-master-Linux/solr/build/solr-core/test/J1/temp/solr.cloud.autoscaling.HdfsAutoAddReplicasIntegrationTest_79D2302ED31AB03A-001/tempDir-002/hdfsBaseDir/data/data1/, [DISK]file:/home/jenkins/workspace/Lucene-Solr-master-Linux/solr/build/solr-core/test/J1/temp/solr.cloud.autoscaling.HdfsAutoAddReplicasIntegrationTest_79D2302ED31AB03A-001/tempDir-002/hdfsBaseDir/data/data2/]]  heartbeating to localhost.localdomain/127.0.0.1:36449) [    ] o.a.h.h.s.d.DirectoryScanner dfs.datanode.directoryscan.throttle.limit.ms.per.sec set to value below 1 ms/sec. Assuming default value of 1000
   [junit4]   2> 610383 INFO  (Block report processor) [    ] BlockStateChange BLOCK* processReport 0x8f05d3c1f693f: from storage DS-70df5f6e-84c0-48c3-bb6b-09cd8aa71914 node DatanodeRegistration(127.0.0.1:33161, datanodeUuid=9aceb1de-30ec-4ee4-8c36-99cd96e605c4, infoPort=38513, infoSecurePort=0, ipcPort=41943, storageInfo=lv=-56;cid=testClusterID;nsid=803200400;c=0), blocks: 0, hasStaleStorage: true, processing time: 0 msecs
   [junit4]   2> 610383 INFO  (Block report processor) [    ] BlockStateChange BLOCK* processReport 0x8f05d3c1f693f: from storage DS-a920c5e4-ffc6-430a-8012-8df0c4574ee2 node DatanodeRegistration(127.0.0.1:33161, datanodeUuid=9aceb1de-30ec-4ee4-8c36-99cd96e605c4, infoPort=38513, infoSecurePort=0, ipcPort=41943, storageInfo=lv=-56;cid=testClusterID;nsid=803200400;c=0), blocks: 0, hasStaleStorage: false, processing time: 0 msecs
   [junit4]   2> 610748 DEBUG (ScheduledTrigger-2470-thread-2) [n:127.0.0.1:39747_solr    ] o.a.s.c.a.NodeLostTrigger Running NodeLostTrigger: .auto_add_replicas with currently live nodes: 3
   [junit4]   2> 610781 INFO  (SUITE-HdfsAutoAddReplicasIntegrationTest-seed#[79D2302ED31AB03A]-worker) [    ] o.m.log Started HttpServer2$SelectChannelConnectorWithSafeStartup@localhost:42027
   [junit4]   2> 610879 ERROR (DataNode: [[[DISK]file:/home/jenkins/workspace/Lucene-Solr-master-Linux/solr/build/solr-core/test/J1/temp/solr.cloud.autoscaling.HdfsAutoAddReplicasIntegrationTest_79D2302ED31AB03A-001/tempDir-002/hdfsBaseDir/data/data3/, [DISK]file:/home/jenkins/workspace/Lucene-Solr-master-Linux/solr/build/solr-core/test/J1/temp/solr.cloud.autoscaling.HdfsAutoAddReplicasIntegrationTest_79D2302ED31AB03A-001/tempDir-002/hdfsBaseDir/data/data4/]]  heartbeating to localhost.localdomain/127.0.0.1:36449) [    ] o.a.h.h.s.d.DirectoryScanner dfs.datanode.directoryscan.throttle.limit.ms.per.sec set to value below 1 ms/sec. Assuming default value of 1000
   [junit4]   2> 610882 INFO  (Block report processor) [    ] BlockStateChange BLOCK* processReport 0x8f05d59e7d9ab: from storage DS-03023de3-63ca-4a8c-8547-09744c54f4b1 node DatanodeRegistration(127.0.0.1:46051, datanodeUuid=f07ce6bc-673b-4405-be52-7bb58a5460be, infoPort=43367, infoSecurePort=0, ipcPort=45831, storageInfo=lv=-56;cid=testClusterID;nsid=803200400;c=0), blocks: 0, hasStaleStorage: true, processing time: 0 msecs
   [junit4]   2> 610882 INFO  (Block report processor) [    ] BlockStateChange BLOCK* processReport 0x8f05d59e7d9ab: from storage DS-025e54bd-d78e-4291-9ce5-c048e9e1b576 node DatanodeRegistration(127.0.0.1:46051, datanodeUuid=f07ce6bc-673b-4405-be52-7bb58a5460be, infoPort=43367, infoSecurePort=0, ipcPort=45831, storageInfo=lv=-56;cid=testClusterID;nsid=803200400;c=0), blocks: 0, hasStaleStorage: false, processing time: 0 msecs
   [junit4]   2> 610983 INFO  (TEST-HdfsAutoAddReplicasIntegrationTest.testSimple-seed#[79D2302ED31AB03A]) [    ] o.a.s.SolrTestCaseJ4 ###Starting testSimple
   [junit4]   2> 610984 INFO  (qtp2802119-9079) [n:127.0.0.1:36787_solr    ] o.a.s.h.a.CollectionsHandler Invoked Collection Action :create with params replicationFactor=2&collection.configName=conf&maxShardsPerNode=2&autoAddReplicas=true&name=testSimple1&nrtReplicas=2&action=CREATE&numShards=2&createNodeSet=127.0.0.1:36787_solr,127.0.0.1:35107_solr&wt=javabin&version=2 and sendToOCPQueue=true
   [junit4]   2> 610988 INFO  (OverseerThreadFactory-2472-thread-1-processing-n:127.0.0.1:39747_solr) [n:127.0.0.1:39747_solr    ] o.a.s.c.a.c.CreateCollectionCmd Create collection testSimple1
   [junit4]   2> 611092 INFO  (OverseerStateUpdate-72222487927259143-127.0.0.1:39747_solr-n_0000000000) [n:127.0.0.1:39747_solr    ] o.a.s.c.o.SliceMutator createReplica() {
   [junit4]   2>   "operation":"ADDREPLICA",
   [junit4]   2>   "collection":"testSimple1",
   [junit4]   2>   "shard":"shard1",
   [junit4]   2>   "core":"testSimple1_shard1_replica_n1",
   [junit4]   2>   "state":"down",
   [junit4]   2>   "base_url":"http://127.0.0.1:35107/solr",
   [junit4]   2>   "type":"NRT",
   [junit4]   2>   "waitForFinalState":"false"} 
   [junit4]   2> 611092 INFO  (OverseerStateUpdate-72222487927259143-127.0.0.1:39747_solr-n_0000000000) [n:127.0.0.1:39747_solr    ] o.a.s.c.o.SliceMutator createReplica() {
   [junit4]   2>   "operation":"ADDREPLICA",
   [junit4]   2>   "collection":"testSimple1",
   [junit4]   2>   "shard":"shard1",
   [junit4]   2>   "core":"testSimple1_shard1_replica_n2",
   [junit4]   2>   "state":"down",
   [junit4]   2>   "base_url":"http://127.0.0.1:36787/solr",
   [junit4]   2>   "type":"NRT",
   [junit4]   2>   "waitForFinalState":"false"} 
   [junit4]   2> 611093 INFO  (OverseerStateUpdate-72222487927259143-127.0.0.1:39747_solr-n_0000000000) [n:127.0.0.1:39747_solr    ] o.a.s.c.o.SliceMutator createReplica() {
   [junit4]   2>   "operation":"ADDREPLICA",
   [junit4]   2>   "collection":"testSimple1",
   [junit4]   2>   "shard":"shard2",
   [junit4]   2>   "core":"testSimple1_shard2_replica_n4",
   [junit4]   2>   "state":"down",
   [junit4]   2>   "base_url":"http://127.0.0.1:35107/solr",
   [junit4]   2>   "type":"NRT",
   [junit4]   2>   "waitForFinalState":"false"} 
   [junit4]   2> 611094 INFO  (OverseerStateUpdate-72222487927259143-127.0.0.1:39747_solr-n_0000000000) [n:127.0.0.1:39747_solr    ] o.a.s.c.o.SliceMutator createReplica() {
   [junit4]   2>   "operation":"ADDREPLICA",
   [junit4]   2>   "collection":"testSimple1",
   [junit4]   2>   "shard":"shard2",
   [junit4]   2>   "core":"testSimple1_shard2_replica_n6",
   [junit4]   2>   "state":"down",
   [junit4]   2>   "base_url":"http://127.0.0.1:36787/solr",
   [junit4]   2>   "type":"NRT",
   [junit4]   2>   "waitForFinalState":"false"} 
   [junit4]   2> 611296 INFO  (qtp2802119-9092) [n:127.0.0.1:36787_solr    ] o.a.s.h.a.CoreAdminOperation core create command qt=/admin/cores&coreNodeName=core_node8&collection.configName=conf&newCollection=true&name=testSimple1_shard2_replica_n6&action=CREATE&numShards=2&collection=testSimple1&shard=shard2&wt=javabin&version=2&replicaType=NRT
   [junit4]   2> 611297 INFO  (qtp2802119-9092) [n:127.0.0.1:36787_solr    ] o.a.s.c.TransientSolrCoreCacheDefault Allocating transient cache for 2147483647 transient cores
   [junit4]   2> 611297 INFO  (qtp29887857-9087) [n:127.0.0.1:35107_solr    ] o.a.s.h.a.CoreAdminOperation core create command qt=/admin/cores&coreNodeName=core_node7&collection.configName=conf&newCollection=true&name=testSimple1_shard2_replica_n4&action=CREATE&numShards=2&collection=testSimple1&shard=shard2&wt=javabin&version=2&replicaType=NRT
   [junit4]   2> 611298 INFO  (qtp2802119-9084) [n:127.0.0.1:36787_solr    ] o.a.s.h.a.CoreAdminOperation core create command qt=/admin/cores&coreNodeName=core_node5&collection.configName=conf&newCollection=true&name=testSimple1_shard1_replica_n2&action=CREATE&numShards=2&collection=testSimple1&shard=shard1&wt=javabin&version=2&replicaType=NRT
   [junit4]   2> 611298 INFO  (qtp29887857-9087) [n:127.0.0.1:35107_solr    ] o.a.s.c.TransientSolrCoreCacheDefault Allocating transient cache for 2147483647 transient cores
   [junit4]   2> 611302 INFO  (qtp29887857-9090) [n:127.0.0.1:35107_solr    ] o.a.s.h.a.CoreAdminOperation core create command qt=/admin/cores&coreNodeName=core_node3&collection.configName=conf&newCollection=true&name=testSimple1_shard1_replica_n1&action=CREATE&numShards=2&collection=testSimple1&shard=shard1&wt=javabin&version=2&replicaType=NRT
   [junit4]   2> 611410 INFO  (zkCallback-1387-thread-1-processing-n:127.0.0.1:36787_solr) [n:127.0.0.1:36787_solr    ] o.a.s.c.c.ZkStateReader A cluster state change: [WatchedEvent state:SyncConnected type:NodeDataChanged path:/collections/testSimple1/state.json] for collection [testSimple1] has occurred - updating... (live nodes size: [3])
   [junit4]   2> 611410 INFO  (zkCallback-1396-thread-1-processing-n:127.0.0.1:35107_solr) [n:127.0.0.1:35107_solr    ] o.a.s.c.c.ZkStateReader A cluster state change: [WatchedEvent state:SyncConnected type:NodeDataChanged path:/collections/testSimple1/state.json] for collection [testSimple1] has occurred - updating... (live nodes size: [3])
   [junit4]   2> 611410 INFO  (zkCallback-1396-thread-2-processing-n:127.0.0.1:35107_solr) [n:127.0.0.1:35107_solr    ] o.a.s.c.c.ZkStateReader A cluster state change: [WatchedEvent state:SyncConnected type:NodeDataChanged path:/collections/testSimple1/state.json] for collection [testSimple1] has occurred - updating... (live nodes size: [3])
   [junit4]   2> 611748 DEBUG (ScheduledTrigger-2470-thread-1) [n:127.0.0.1:39747_solr    ] o.a.s.c.a.NodeLostTrigger Running NodeLostTrigger: .auto_add_replicas with currently live nodes: 3
   [junit4]   2> 612305 INFO  (qtp2802119-9084) [n:127.0.0.1:36787_solr c:testSimple1 s:shard1 r:core_node5 x:testSimple1_shard1_replica_n2] o.a.s.c.SolrConfig Using Lucene MatchVersion: 8.0.0
   [junit4]   2> 612306 INFO  (qtp2802119-9092) [n:127.0.0.1:36787_solr c:testSimple1 s:shard2 r:core_node8 x:testSimple1_shard2_replica_n6] o.a.s.c.SolrConfig Using Lucene MatchVersion: 8.0.0
   [junit4]   2> 612603 INFO  (qtp2802119-9084) [n:127.0.0.1:36787_solr c:testSimple1 s:shard1 r:core_node5 x:testSimple1_shard1_replica_n2] o.a.s.s.IndexSchema [testSimple1_shard1_replica_n2] Schema name=minimal
   [junit4]   2> 612603 INFO  (qtp2802119-9092) [n:127.0.0.1:36787_solr c:testSimple1 s:shard2 r:core_node8 x:testSimple1_shard2_replica_n6] o.a.s.s.IndexSchema [testSimple1_shard2_replica_n6] Schema name=minimal
   [junit4]   2> 612606 INFO  (qtp2802119-9084) [n:127.0.0.1:36787_solr c:testSimple1 s:shard1 r:core_node5 x:testSimple1_shard1_replica_n2] o.a.s.s.IndexSchema Loaded schema minimal/1.1 with uniqueid field id
   [junit4]   2> 612606 INFO  (qtp2802119-9092) [n:127.0.0.1:36787_solr c:testSimple1 s:shard2 r:core_node8 x:testSimple1_shard2_replica_n6] o.a.s.s.IndexSchema Loaded schema minimal/1.1 with uniqueid field id
   [junit4]   2> 612606 INFO  (qtp2802119-9084) [n:127.0.0.1:36787_solr c:testSimple1 s:shard1 r:core_node5 x:testSimple1_shard1_replica_n2] o.a.s.c.CoreContainer Creating SolrCore 'testSimple1_shard1_replica_n2' using configuration from collection testSimple1, trusted=true
   [junit4]   2> 612606 INFO  (qtp2802119-9092) [n:127.0.0.1:36787_solr c:testSimple1 s:shard2 r:core_node8 x:testSimple1_shard2_replica_n6] o.a.s.c.CoreContainer Creating SolrCore 'testSimple1_shard2_replica_n6' using configuration from collection testSimple1, trusted=true
   [junit4]   2> 612607 INFO  (qtp2802119-9084) [n:127.0.0.1:36787_solr c:testSimple1 s:shard1 r:core_node5 x:testSimple1_shard1_replica_n2] o.a.s.m.r.SolrJmxReporter JMX monitoring for 'solr_36787.solr.core.testSimple1.shard1.replica_n2' (registry 'solr.core.testSimple1.shard1.replica_n2') enabled at server: com.sun.jmx.mbeanserver.JmxMBeanServer@14e20a0
   [junit4]   2> 612607 INFO  (qtp2802119-9092) [n:127.0.0.1:36787_solr c:testSimple1 s:shard2 r:core_node8 x:testSimple1_shard2_replica_n6] o.a.s.m.r.SolrJmxReporter JMX monitoring for 'solr_36787.solr.core.testSimple1.shard2.replica_n6' (registry 'solr.core.testSimple1.shard2.replica_n6') enabled at server: com.sun.jmx.mbeanserver.JmxMBeanServer@14e20a0
   [junit4]   2> 612607 INFO  (qtp2802119-9084) [n:127.0.0.1:36787_solr c:testSimple1 s:shard1 r:core_node5 x:testSimple1_shard1_replica_n2] o.a.s.c.HdfsDirectoryFactory solr.hdfs.home=hdfs://localhost.localdomain:36449/data
   [junit4]   2> 612607 INFO  (qtp2802119-9092) [n:127.0.0.1:36787_solr c:testSimple1 s:shard2 r:core_node8 x:testSimple1_shard2_replica_n6] o.a.s.c.HdfsDirectoryFactory solr.hdfs.home=hdfs://localhost.localdomain:36449/data
   [junit4]   2> 612607 INFO  (qtp2802119-9084) [n:127.0.0.1:36787_solr c:testSimple1 s:shard1 r:core_node5 x:testSimple1_shard1_replica_n2] o.a.s.c.HdfsDirectoryFactory Solr Kerberos Authentication disabled
   [junit4]   2> 612607 INFO  (qtp2802119-9084) [n:127.0.0.1:36787_solr c:testSimple1 s:shard1 r:core_node5 x:testSimple1_shard1_replica_n2] o.a.s.c.SolrCore solr.RecoveryStrategy.Builder
   [junit4]   2> 612607 INFO  (qtp2802119-9092) [n:127.0.0.1:36787_solr c:testSimple1 s:shard2 r:core_node8 x:testSimple1_shard2_replica_n6] o.a.s.c.HdfsDirectoryFactory Solr Kerberos Authentication disabled
   [junit4]   2> 612607 INFO  (qtp2802119-9092) [n:127.0.0.1:36787_solr c:testSimple1 s:shard2 r:core_node8 x:testSimple1_shard2_replica_n6] o.a.s.c.SolrCore solr.RecoveryStrategy.Builder
   [junit4]   2> 612607 INFO  (qtp2802119-9084) [n:127.0.0.1:36787_solr c:testSimple1 s:shard1 r:core_node5 x:testSimple1_shard1_replica_n2] o.a.s.c.SolrCore [[testSimple1_shard1_replica_n2] ] Opening new SolrCore at [/home/jenkins/workspace/Lucene-Solr-master-Linux/solr/build/solr-core/test/J1/temp/solr.cloud.autoscaling.HdfsAutoAddReplicasIntegrationTest_79D2302ED31AB03A-001/tempDir-001/node2/testSimple1_shard1_replica_n2], dataDir=[hdfs://localhost.localdomain:36449/data/testSimple1/core_node5/data/]
   [junit4]   2> 612607 INFO  (qtp2802119-9092) [n:127.0.0.1:36787_solr c:testSimple1 s:shard2 r:core_node8 x:testSimple1_shard2_replica_n6] o.a.s.c.SolrCore [[testSimple1_shard2_replica_n6] ] Opening new SolrCore at [/home/jenkins/workspace/Lucene-Solr-master-Linux/solr/build/solr-core/test/J1/temp/solr.cloud.autoscaling.HdfsAutoAddReplicasIntegrationTest_79D2302ED31AB03A-001/tempDir-001/node2/testSimple1_shard2_replica_n6], dataDir=[hdfs://localhost.localdomain:36449/data/testSimple1/core_node8/data/]
   [junit4]   2> 612607 INFO  (qtp29887857-9087) [n:127.0.0.1:35107_solr c:testSimple1 s:shard2 r:core_node7 x:testSimple1_shard2_replica_n4] o.a.s.c.SolrConfig Using Lucene MatchVersion: 8.0.0
   [junit4]   2> 612608 INFO  (qtp2802119-9084) [n:127.0.0.1:36787_solr c:testSimple1 s:shard1 r:core_node5 x:testSimple1_shard1_replica_n2] o.a.s.c.HdfsDirectoryFactory creating directory factory for path hdfs://localhost.localdomain:36449/data/testSimple1/core_node5/data/snapshot_metadata
   [junit4]   2> 612608 INFO  (qtp2802119-9092) [n:127.0.0.1:36787_solr c:testSimple1 s:shard2 r:core_node8 x:testSimple1_shard2_replica_n6] o.a.s.c.HdfsDirectoryFactory creating directory factory for path hdfs://localhost.localdomain:36449/data/testSimple1/core_node8/data/snapshot_metadata
   [junit4]   2> 612611 INFO  (qtp29887857-9090) [n:127.0.0.1:35107_solr c:testSimple1 s:shard1 r:core_node3 x:testSimple1_shard1_replica_n1] o.a.s.c.SolrConfig Using Lucene MatchVersion: 8.0.0
   [junit4]   2> 612621 INFO  (qtp29887857-9087) [n:127.0.0.1:35107_solr c:testSimple1 s:shard2 r:core_node7 x:testSimple1_shard2_replica_n4] o.a.s.s.IndexSchema [testSimple1_shard2_replica_n4

[...truncated too long message...]

RReRankingPipeline.testDifferentTopN(TestLTRReRankingPipeline.java:256)
   [junit4]    > 	at java.lang.Thread.run(Thread.java:748)
   [junit4] OK      0.05s J0 | TestLTRReRankingPipeline.testRescorer
   [junit4]   2> NOTE: test params are: codec=Asserting(Lucene70): {field=FST50, id=FSTOrd50, final-score=FSTOrd50}, docValues:{final-score=DocValuesFormat(name=Asserting)}, maxPointsInLeafNode=282, maxMBSortInHeap=6.47197799714947, sim=Asserting(org.apache.lucene.search.similarities.AssertingSimilarity@18d5bf9), locale=ca, timezone=Jamaica
   [junit4]   2> NOTE: Linux 4.13.0-32-generic i386/Oracle Corporation 1.8.0_162 (32-bit)/cpus=8,threads=1,free=54218624,total=64880640
   [junit4]   2> NOTE: All tests run in this JVM: [TestLTRReRankingPipeline]
   [junit4] Completed [2/5 (2!)] on J0 in 1.34s, 3 tests, 1 failure <<< FAILURES!
   [junit4] 
   [junit4] Suite: org.apache.solr.ltr.TestLTRReRankingPipeline
   [junit4]   2> 0    INFO  (SUITE-TestLTRReRankingPipeline-seed#[41384692239A4B38]) [    ] o.a.s.c.SolrResourceLoader solr home defaulted to 'solr/' (could not find system property or JNDI)
   [junit4] OK      0.11s J1 | TestLTRReRankingPipeline.testDocParam
   [junit4]   2> 940  INFO  (TEST-TestLTRReRankingPipeline.testDifferentTopN-seed#[41384692239A4B38]) [    ] o.a.s.l.TestLTRReRankingPipeline rerank 1 documents 
   [junit4]   2> 942  INFO  (TEST-TestLTRReRankingPipeline.testDifferentTopN-seed#[41384692239A4B38]) [    ] o.a.s.l.TestLTRReRankingPipeline doc 0 in pos 0
   [junit4]   2> NOTE: reproduce with: ant test  -Dtestcase=TestLTRReRankingPipeline -Dtests.method=testDifferentTopN -Dtests.seed=41384692239A4B38 -Dtests.multiplier=3 -Dtests.slow=true -Dtests.locale=ca -Dtests.timezone=Jamaica -Dtests.asserts=true -Dtests.file.encoding=ISO-8859-1
   [junit4] FAILURE 0.44s J1 | TestLTRReRankingPipeline.testDifferentTopN <<<
   [junit4]    > Throwable #1: java.lang.AssertionError: expected:<1.0> but was:<0.0>
   [junit4]    > 	at __randomizedtesting.SeedInfo.seed([41384692239A4B38:B09934C2162181AA]:0)
   [junit4]    > 	at org.apache.solr.ltr.TestLTRReRankingPipeline.testDifferentTopN(TestLTRReRankingPipeline.java:256)
   [junit4]    > 	at java.lang.Thread.run(Thread.java:748)
   [junit4] OK      0.06s J1 | TestLTRReRankingPipeline.testRescorer
   [junit4]   2> NOTE: test params are: codec=Asserting(Lucene70): {field=FST50, id=FSTOrd50, final-score=FSTOrd50}, docValues:{final-score=DocValuesFormat(name=Asserting)}, maxPointsInLeafNode=282, maxMBSortInHeap=6.47197799714947, sim=Asserting(org.apache.lucene.search.similarities.AssertingSimilarity@18d5bf9), locale=ca, timezone=Jamaica
   [junit4]   2> NOTE: Linux 4.13.0-32-generic i386/Oracle Corporation 1.8.0_162 (32-bit)/cpus=8,threads=1,free=54546848,total=64880640
   [junit4]   2> NOTE: All tests run in this JVM: [TestLTRReRankingPipeline]
   [junit4] Completed [3/5 (3!)] on J1 in 1.31s, 3 tests, 1 failure <<< FAILURES!
   [junit4] 
   [junit4] Duplicate suite name used with XML reports: org.apache.solr.ltr.TestLTRReRankingPipeline. This may confuse tools that process XML reports. Set 'ignoreDuplicateSuites' to true to skip this message.
   [junit4] Suite: org.apache.solr.ltr.TestLTRReRankingPipeline
   [junit4] OK      0.02s J2 | TestLTRReRankingPipeline.testDocParam
   [junit4]   2> 1288 INFO  (TEST-TestLTRReRankingPipeline.testDifferentTopN-seed#[41384692239A4B38]) [    ] o.a.s.l.TestLTRReRankingPipeline rerank 1 documents 
   [junit4]   2> 1289 INFO  (TEST-TestLTRReRankingPipeline.testDifferentTopN-seed#[41384692239A4B38]) [    ] o.a.s.l.TestLTRReRankingPipeline doc 0 in pos 0
   [junit4]   2> NOTE: reproduce with: ant test  -Dtestcase=TestLTRReRankingPipeline -Dtests.method=testDifferentTopN -Dtests.seed=41384692239A4B38 -Dtests.multiplier=3 -Dtests.slow=true -Dtests.locale=ca -Dtests.timezone=Jamaica -Dtests.asserts=true -Dtests.file.encoding=ISO-8859-1
   [junit4] FAILURE 0.02s J2 | TestLTRReRankingPipeline.testDifferentTopN <<<
   [junit4]    > Throwable #1: java.lang.AssertionError: expected:<1.0> but was:<0.0>
   [junit4]    > 	at __randomizedtesting.SeedInfo.seed([41384692239A4B38:B09934C2162181AA]:0)
   [junit4]    > 	at org.apache.solr.ltr.TestLTRReRankingPipeline.testDifferentTopN(TestLTRReRankingPipeline.java:256)
   [junit4]    > 	at java.lang.Thread.run(Thread.java:748)
   [junit4] OK      0.01s J2 | TestLTRReRankingPipeline.testRescorer
   [junit4]   2> NOTE: test params are: codec=Asserting(Lucene70): {field=FST50, id=FSTOrd50, final-score=FSTOrd50}, docValues:{final-score=DocValuesFormat(name=Asserting)}, maxPointsInLeafNode=282, maxMBSortInHeap=6.47197799714947, sim=Asserting(org.apache.lucene.search.similarities.AssertingSimilarity@16fca60), locale=ca, timezone=Jamaica
   [junit4]   2> NOTE: Linux 4.13.0-32-generic i386/Oracle Corporation 1.8.0_162 (32-bit)/cpus=8,threads=1,free=53707208,total=64880640
   [junit4]   2> NOTE: All tests run in this JVM: [TestLTRReRankingPipeline, TestLTRReRankingPipeline]
   [junit4] Completed [4/5 (4!)] on J2 in 0.07s, 3 tests, 1 failure <<< FAILURES!
   [junit4] 
   [junit4] Suite: org.apache.solr.ltr.TestLTRReRankingPipeline
   [junit4] OK      0.01s J1 | TestLTRReRankingPipeline.testDocParam
   [junit4]   2> 1333 INFO  (TEST-TestLTRReRankingPipeline.testDifferentTopN-seed#[41384692239A4B38]) [    ] o.a.s.l.TestLTRReRankingPipeline rerank 1 documents 
   [junit4]   2> 1334 INFO  (TEST-TestLTRReRankingPipeline.testDifferentTopN-seed#[41384692239A4B38]) [    ] o.a.s.l.TestLTRReRankingPipeline doc 0 in pos 0
   [junit4]   2> NOTE: reproduce with: ant test  -Dtestcase=TestLTRReRankingPipeline -Dtests.method=testDifferentTopN -Dtests.seed=41384692239A4B38 -Dtests.multiplier=3 -Dtests.slow=true -Dtests.locale=ca -Dtests.timezone=Jamaica -Dtests.asserts=true -Dtests.file.encoding=ISO-8859-1
   [junit4] FAILURE 0.02s J1 | TestLTRReRankingPipeline.testDifferentTopN <<<
   [junit4]    > Throwable #1: java.lang.AssertionError: expected:<1.0> but was:<0.0>
   [junit4]    > 	at __randomizedtesting.SeedInfo.seed([41384692239A4B38:B09934C2162181AA]:0)
   [junit4]    > 	at org.apache.solr.ltr.TestLTRReRankingPipeline.testDifferentTopN(TestLTRReRankingPipeline.java:256)
   [junit4]    > 	at java.lang.Thread.run(Thread.java:748)
   [junit4] OK      0.03s J1 | TestLTRReRankingPipeline.testRescorer
   [junit4]   2> NOTE: test params are: codec=Asserting(Lucene70): {field=FST50, id=FSTOrd50, final-score=FSTOrd50}, docValues:{final-score=DocValuesFormat(name=Asserting)}, maxPointsInLeafNode=282, maxMBSortInHeap=6.47197799714947, sim=Asserting(org.apache.lucene.search.similarities.AssertingSimilarity@16fca60), locale=ca, timezone=Jamaica
   [junit4]   2> NOTE: Linux 4.13.0-32-generic i386/Oracle Corporation 1.8.0_162 (32-bit)/cpus=8,threads=1,free=53750008,total=64880640
   [junit4]   2> NOTE: All tests run in this JVM: [TestLTRReRankingPipeline, TestLTRReRankingPipeline]
   [junit4] Completed [5/5 (5!)] on J1 in 0.08s, 3 tests, 1 failure <<< FAILURES!
   [junit4] 
   [junit4] 
   [junit4] Tests with failures [seed: 41384692239A4B38]:
   [junit4]   - org.apache.solr.ltr.TestLTRReRankingPipeline.testDifferentTopN
   [junit4]   - org.apache.solr.ltr.TestLTRReRankingPipeline.testDifferentTopN
   [junit4]   - org.apache.solr.ltr.TestLTRReRankingPipeline.testDifferentTopN
   [junit4]   - org.apache.solr.ltr.TestLTRReRankingPipeline.testDifferentTopN
   [junit4]   - org.apache.solr.ltr.TestLTRReRankingPipeline.testDifferentTopN
   [junit4] 
   [junit4] 
   [junit4] JVM J0:     0.35 ..     2.23 =     1.87s
   [junit4] JVM J1:     0.35 ..     2.73 =     2.38s
   [junit4] JVM J2:     0.35 ..     2.71 =     2.36s
   [junit4] Execution time total: 2.74 sec.
   [junit4] Tests summary: 5 suites, 15 tests, 5 failures

BUILD FAILED
/home/jenkins/workspace/Lucene-Solr-master-Linux/lucene/common-build.xml:1561: The following error occurred while executing this line:
/home/jenkins/workspace/Lucene-Solr-master-Linux/lucene/common-build.xml:1085: There were test failures: 5 suites, 15 tests, 5 failures [seed: 41384692239A4B38]

Total time: 3 seconds

[repro] Setting last failure code to 256

[repro] Failures:
[repro]   0/5 failed: org.apache.solr.cloud.autoscaling.HdfsAutoAddReplicasIntegrationTest
[repro]   5/5 failed: org.apache.solr.cloud.SSLMigrationTest
[repro]   5/5 failed: org.apache.solr.cloud.ZkControllerTest
[repro]   5/5 failed: org.apache.solr.core.TestJmxIntegration
[repro]   5/5 failed: org.apache.solr.handler.TestReplicationHandler
[repro]   5/5 failed: org.apache.solr.ltr.TestLTRReRankingPipeline
[repro] Exiting with code 256
+ mv lucene/build lucene/build.repro
+ mv solr/build solr/build.repro
+ mv lucene/build.orig lucene/build
+ mv solr/build.orig solr/build
Archiving artifacts
Setting ANT_1_8_2_HOME=/var/lib/jenkins/tools/hudson.tasks.Ant_AntInstallation/ANT_1.8.2
[WARNINGS] Parsing warnings in console log with parser Java Compiler (javac)
Setting ANT_1_8_2_HOME=/var/lib/jenkins/tools/hudson.tasks.Ant_AntInstallation/ANT_1.8.2
Setting ANT_1_8_2_HOME=/var/lib/jenkins/tools/hudson.tasks.Ant_AntInstallation/ANT_1.8.2
<Git Blamer> Using GitBlamer to create author and commit information for all warnings.
<Git Blamer> GIT_COMMIT=d512cd7604741a2f55deb0c840188f0342f1ba57, workspace=/var/lib/jenkins/workspace/Lucene-Solr-master-Linux
[WARNINGS] Computing warning deltas based on reference build #21545
Recording test results
Setting ANT_1_8_2_HOME=/var/lib/jenkins/tools/hudson.tasks.Ant_AntInstallation/ANT_1.8.2
Build step 'Publish JUnit test result report' changed build result to UNSTABLE
Email was triggered for: Unstable (Test Failures)
Sending email for trigger: Unstable (Test Failures)
Setting ANT_1_8_2_HOME=/var/lib/jenkins/tools/hudson.tasks.Ant_AntInstallation/ANT_1.8.2
Setting ANT_1_8_2_HOME=/var/lib/jenkins/tools/hudson.tasks.Ant_AntInstallation/ANT_1.8.2
Setting ANT_1_8_2_HOME=/var/lib/jenkins/tools/hudson.tasks.Ant_AntInstallation/ANT_1.8.2
Setting ANT_1_8_2_HOME=/var/lib/jenkins/tools/hudson.tasks.Ant_AntInstallation/ANT_1.8.2

Mime
View raw message