lucene-dev mailing list archives

Site index · List index
Message view « Date » · « Thread »
Top « Date » · « Thread »
From Policeman Jenkins Server <jenk...@thetaphi.de>
Subject [JENKINS-EA] Lucene-Solr-master-Linux (64bit/jdk-10-ea+41) - Build # 21373 - Still Unstable!
Date Thu, 01 Feb 2018 04:51:27 GMT
Build: https://jenkins.thetaphi.de/job/Lucene-Solr-master-Linux/21373/
Java: 64bit/jdk-10-ea+41 -XX:+UseCompressedOops -XX:+UseG1GC

2 tests failed.
FAILED:  org.apache.solr.cloud.autoscaling.TriggerIntegrationTest.testMetricTrigger

Error Message:


Stack Trace:
java.lang.AssertionError
	at __randomizedtesting.SeedInfo.seed([2B791F8AD696B655:91752805897E601A]:0)
	at org.junit.Assert.fail(Assert.java:92)
	at org.junit.Assert.assertTrue(Assert.java:43)
	at org.junit.Assert.assertNull(Assert.java:551)
	at org.junit.Assert.assertNull(Assert.java:562)
	at org.apache.solr.cloud.autoscaling.TriggerIntegrationTest.testMetricTrigger(TriggerIntegrationTest.java:1575)
	at java.base/jdk.internal.reflect.NativeMethodAccessorImpl.invoke0(Native Method)
	at java.base/jdk.internal.reflect.NativeMethodAccessorImpl.invoke(NativeMethodAccessorImpl.java:62)
	at java.base/jdk.internal.reflect.DelegatingMethodAccessorImpl.invoke(DelegatingMethodAccessorImpl.java:43)
	at java.base/java.lang.reflect.Method.invoke(Method.java:564)
	at com.carrotsearch.randomizedtesting.RandomizedRunner.invoke(RandomizedRunner.java:1737)
	at com.carrotsearch.randomizedtesting.RandomizedRunner$8.evaluate(RandomizedRunner.java:934)
	at com.carrotsearch.randomizedtesting.RandomizedRunner$9.evaluate(RandomizedRunner.java:970)
	at com.carrotsearch.randomizedtesting.RandomizedRunner$10.evaluate(RandomizedRunner.java:984)
	at com.carrotsearch.randomizedtesting.rules.SystemPropertiesRestoreRule$1.evaluate(SystemPropertiesRestoreRule.java:57)
	at org.apache.lucene.util.TestRuleSetupTeardownChained$1.evaluate(TestRuleSetupTeardownChained.java:49)
	at org.apache.lucene.util.AbstractBeforeAfterRule$1.evaluate(AbstractBeforeAfterRule.java:45)
	at org.apache.lucene.util.TestRuleThreadAndTestName$1.evaluate(TestRuleThreadAndTestName.java:48)
	at org.apache.lucene.util.TestRuleIgnoreAfterMaxFailures$1.evaluate(TestRuleIgnoreAfterMaxFailures.java:64)
	at org.apache.lucene.util.TestRuleMarkFailure$1.evaluate(TestRuleMarkFailure.java:47)
	at com.carrotsearch.randomizedtesting.rules.StatementAdapter.evaluate(StatementAdapter.java:36)
	at com.carrotsearch.randomizedtesting.ThreadLeakControl$StatementRunner.run(ThreadLeakControl.java:368)
	at com.carrotsearch.randomizedtesting.ThreadLeakControl.forkTimeoutingTask(ThreadLeakControl.java:817)
	at com.carrotsearch.randomizedtesting.ThreadLeakControl$3.evaluate(ThreadLeakControl.java:468)
	at com.carrotsearch.randomizedtesting.RandomizedRunner.runSingleTest(RandomizedRunner.java:943)
	at com.carrotsearch.randomizedtesting.RandomizedRunner$5.evaluate(RandomizedRunner.java:829)
	at com.carrotsearch.randomizedtesting.RandomizedRunner$6.evaluate(RandomizedRunner.java:879)
	at com.carrotsearch.randomizedtesting.RandomizedRunner$7.evaluate(RandomizedRunner.java:890)
	at com.carrotsearch.randomizedtesting.rules.StatementAdapter.evaluate(StatementAdapter.java:36)
	at com.carrotsearch.randomizedtesting.rules.SystemPropertiesRestoreRule$1.evaluate(SystemPropertiesRestoreRule.java:57)
	at org.apache.lucene.util.AbstractBeforeAfterRule$1.evaluate(AbstractBeforeAfterRule.java:45)
	at com.carrotsearch.randomizedtesting.rules.StatementAdapter.evaluate(StatementAdapter.java:36)
	at org.apache.lucene.util.TestRuleStoreClassName$1.evaluate(TestRuleStoreClassName.java:41)
	at com.carrotsearch.randomizedtesting.rules.NoShadowingOrOverridesOnMethodsRule$1.evaluate(NoShadowingOrOverridesOnMethodsRule.java:40)
	at com.carrotsearch.randomizedtesting.rules.NoShadowingOrOverridesOnMethodsRule$1.evaluate(NoShadowingOrOverridesOnMethodsRule.java:40)
	at com.carrotsearch.randomizedtesting.rules.StatementAdapter.evaluate(StatementAdapter.java:36)
	at com.carrotsearch.randomizedtesting.rules.StatementAdapter.evaluate(StatementAdapter.java:36)
	at org.apache.lucene.util.TestRuleAssertionsRequired$1.evaluate(TestRuleAssertionsRequired.java:53)
	at org.apache.lucene.util.TestRuleMarkFailure$1.evaluate(TestRuleMarkFailure.java:47)
	at org.apache.lucene.util.TestRuleIgnoreAfterMaxFailures$1.evaluate(TestRuleIgnoreAfterMaxFailures.java:64)
	at org.apache.lucene.util.TestRuleIgnoreTestSuites$1.evaluate(TestRuleIgnoreTestSuites.java:54)
	at com.carrotsearch.randomizedtesting.rules.StatementAdapter.evaluate(StatementAdapter.java:36)
	at com.carrotsearch.randomizedtesting.ThreadLeakControl$StatementRunner.run(ThreadLeakControl.java:368)
	at java.base/java.lang.Thread.run(Thread.java:844)


FAILED:  org.apache.solr.handler.admin.SegmentsInfoRequestHandlerTest.testSegmentInfosVersion

Error Message:
Exception during query

Stack Trace:
java.lang.RuntimeException: Exception during query
	at __randomizedtesting.SeedInfo.seed([2B791F8AD696B655:D3A78A62AEFA6706]:0)
	at org.apache.solr.SolrTestCaseJ4.assertQ(SolrTestCaseJ4.java:902)
	at org.apache.solr.handler.admin.SegmentsInfoRequestHandlerTest.testSegmentInfosVersion(SegmentsInfoRequestHandlerTest.java:68)
	at java.base/jdk.internal.reflect.NativeMethodAccessorImpl.invoke0(Native Method)
	at java.base/jdk.internal.reflect.NativeMethodAccessorImpl.invoke(NativeMethodAccessorImpl.java:62)
	at java.base/jdk.internal.reflect.DelegatingMethodAccessorImpl.invoke(DelegatingMethodAccessorImpl.java:43)
	at java.base/java.lang.reflect.Method.invoke(Method.java:564)
	at com.carrotsearch.randomizedtesting.RandomizedRunner.invoke(RandomizedRunner.java:1737)
	at com.carrotsearch.randomizedtesting.RandomizedRunner$8.evaluate(RandomizedRunner.java:934)
	at com.carrotsearch.randomizedtesting.RandomizedRunner$9.evaluate(RandomizedRunner.java:970)
	at com.carrotsearch.randomizedtesting.RandomizedRunner$10.evaluate(RandomizedRunner.java:984)
	at com.carrotsearch.randomizedtesting.rules.SystemPropertiesRestoreRule$1.evaluate(SystemPropertiesRestoreRule.java:57)
	at org.apache.lucene.util.TestRuleSetupTeardownChained$1.evaluate(TestRuleSetupTeardownChained.java:49)
	at org.apache.lucene.util.AbstractBeforeAfterRule$1.evaluate(AbstractBeforeAfterRule.java:45)
	at org.apache.lucene.util.TestRuleThreadAndTestName$1.evaluate(TestRuleThreadAndTestName.java:48)
	at org.apache.lucene.util.TestRuleIgnoreAfterMaxFailures$1.evaluate(TestRuleIgnoreAfterMaxFailures.java:64)
	at org.apache.lucene.util.TestRuleMarkFailure$1.evaluate(TestRuleMarkFailure.java:47)
	at com.carrotsearch.randomizedtesting.rules.StatementAdapter.evaluate(StatementAdapter.java:36)
	at com.carrotsearch.randomizedtesting.ThreadLeakControl$StatementRunner.run(ThreadLeakControl.java:368)
	at com.carrotsearch.randomizedtesting.ThreadLeakControl.forkTimeoutingTask(ThreadLeakControl.java:817)
	at com.carrotsearch.randomizedtesting.ThreadLeakControl$3.evaluate(ThreadLeakControl.java:468)
	at com.carrotsearch.randomizedtesting.RandomizedRunner.runSingleTest(RandomizedRunner.java:943)
	at com.carrotsearch.randomizedtesting.RandomizedRunner$5.evaluate(RandomizedRunner.java:829)
	at com.carrotsearch.randomizedtesting.RandomizedRunner$6.evaluate(RandomizedRunner.java:879)
	at com.carrotsearch.randomizedtesting.RandomizedRunner$7.evaluate(RandomizedRunner.java:890)
	at com.carrotsearch.randomizedtesting.rules.StatementAdapter.evaluate(StatementAdapter.java:36)
	at com.carrotsearch.randomizedtesting.rules.SystemPropertiesRestoreRule$1.evaluate(SystemPropertiesRestoreRule.java:57)
	at org.apache.lucene.util.AbstractBeforeAfterRule$1.evaluate(AbstractBeforeAfterRule.java:45)
	at com.carrotsearch.randomizedtesting.rules.StatementAdapter.evaluate(StatementAdapter.java:36)
	at org.apache.lucene.util.TestRuleStoreClassName$1.evaluate(TestRuleStoreClassName.java:41)
	at com.carrotsearch.randomizedtesting.rules.NoShadowingOrOverridesOnMethodsRule$1.evaluate(NoShadowingOrOverridesOnMethodsRule.java:40)
	at com.carrotsearch.randomizedtesting.rules.NoShadowingOrOverridesOnMethodsRule$1.evaluate(NoShadowingOrOverridesOnMethodsRule.java:40)
	at com.carrotsearch.randomizedtesting.rules.StatementAdapter.evaluate(StatementAdapter.java:36)
	at com.carrotsearch.randomizedtesting.rules.StatementAdapter.evaluate(StatementAdapter.java:36)
	at org.apache.lucene.util.TestRuleAssertionsRequired$1.evaluate(TestRuleAssertionsRequired.java:53)
	at org.apache.lucene.util.TestRuleMarkFailure$1.evaluate(TestRuleMarkFailure.java:47)
	at org.apache.lucene.util.TestRuleIgnoreAfterMaxFailures$1.evaluate(TestRuleIgnoreAfterMaxFailures.java:64)
	at org.apache.lucene.util.TestRuleIgnoreTestSuites$1.evaluate(TestRuleIgnoreTestSuites.java:54)
	at com.carrotsearch.randomizedtesting.rules.StatementAdapter.evaluate(StatementAdapter.java:36)
	at com.carrotsearch.randomizedtesting.ThreadLeakControl$StatementRunner.run(ThreadLeakControl.java:368)
	at java.base/java.lang.Thread.run(Thread.java:844)
Caused by: java.lang.RuntimeException: REQUEST FAILED: xpath=2=count(//lst[@name='segments']/lst/str[@name='version'][.='8.0.0'])
	xml response was: <?xml version="1.0" encoding="UTF-8"?>
<response>
<lst name="responseHeader"><int name="status">0</int><int name="QTime">0</int></lst><lst name="segments"><lst name="_0"><str name="name">_0</str><int name="delCount">1</int><long name="sizeInBytes">2255</long><int name="size">4</int><date name="age">2018-02-01T04:02:55.610Z</date><str name="source">flush</str><str name="version">8.0.0</str></lst><lst name="_1"><str name="name">_1</str><int name="delCount">0</int><long name="sizeInBytes">2077</long><int name="size">1</int><date name="age">2018-02-01T04:02:55.611Z</date><str name="source">flush</str><str name="version">8.0.0</str></lst><lst name="_2"><str name="name">_2</str><int name="delCount">0</int><long name="sizeInBytes">2188</long><int name="size">4</int><date name="age">2018-02-01T04:02:55.615Z</date><str name="source">flush</str><str name="version">8.0.0</str></lst><lst name="_3"><str name="name">_3</str><int name="delCount">0</int><long name="sizeInBytes">2077</long><int name="size">1</int><date name="age">2018-02-01T04:02:55.616Z</date><str name="source">flush</str><str name="version">8.0.0</str></lst></lst>
</response>

	request was:qt=/admin/segments&wt=xml
	at org.apache.solr.SolrTestCaseJ4.assertQ(SolrTestCaseJ4.java:895)
	... 39 more




Build Log:
[...truncated 12048 lines...]
   [junit4] Suite: org.apache.solr.handler.admin.SegmentsInfoRequestHandlerTest
   [junit4]   2> 473431 INFO  (SUITE-SegmentsInfoRequestHandlerTest-seed#[2B791F8AD696B655]-worker) [    ] o.a.s.SolrTestCaseJ4 SecureRandom sanity checks: test.solr.allowed.securerandom=null & java.security.egd=file:/dev/./urandom
   [junit4]   2> Creating dataDir: /home/jenkins/workspace/Lucene-Solr-master-Linux/solr/build/solr-core/test/J1/temp/solr.handler.admin.SegmentsInfoRequestHandlerTest_2B791F8AD696B655-001/init-core-data-001
   [junit4]   2> 473431 WARN  (SUITE-SegmentsInfoRequestHandlerTest-seed#[2B791F8AD696B655]-worker) [    ] o.a.s.SolrTestCaseJ4 startTrackingSearchers: numOpens=4831 numCloses=4831
   [junit4]   2> 473431 INFO  (SUITE-SegmentsInfoRequestHandlerTest-seed#[2B791F8AD696B655]-worker) [    ] o.a.s.SolrTestCaseJ4 Using PointFields (NUMERIC_POINTS_SYSPROP=true) w/NUMERIC_DOCVALUES_SYSPROP=false
   [junit4]   2> 473431 INFO  (SUITE-SegmentsInfoRequestHandlerTest-seed#[2B791F8AD696B655]-worker) [    ] o.a.s.SolrTestCaseJ4 Randomized ssl (true) and clientAuth (false) via: @org.apache.solr.util.RandomizeSSL(reason="", ssl=0.0/0.0, value=0.0/0.0, clientAuth=0.0/0.0)
   [junit4]   2> 473432 INFO  (SUITE-SegmentsInfoRequestHandlerTest-seed#[2B791F8AD696B655]-worker) [    ] o.a.s.SolrTestCaseJ4 ####initCore
   [junit4]   2> 473432 INFO  (SUITE-SegmentsInfoRequestHandlerTest-seed#[2B791F8AD696B655]-worker) [    ] o.a.s.c.SolrResourceLoader [null] Added 2 libs to classloader, from paths: [/home/jenkins/workspace/Lucene-Solr-master-Linux/solr/core/src/test-files/solr/collection1/lib, /home/jenkins/workspace/Lucene-Solr-master-Linux/solr/core/src/test-files/solr/collection1/lib/classes]
   [junit4]   2> 473444 INFO  (SUITE-SegmentsInfoRequestHandlerTest-seed#[2B791F8AD696B655]-worker) [    ] o.a.s.c.SolrConfig Using Lucene MatchVersion: 8.0.0
   [junit4]   2> 473455 INFO  (SUITE-SegmentsInfoRequestHandlerTest-seed#[2B791F8AD696B655]-worker) [    ] o.a.s.s.IndexSchema [null] Schema name=test
   [junit4]   2> 473492 WARN  (SUITE-SegmentsInfoRequestHandlerTest-seed#[2B791F8AD696B655]-worker) [    ] o.a.s.s.IndexSchema Field text is not multivalued and destination for multiple copyFields (2)
   [junit4]   2> 473492 INFO  (SUITE-SegmentsInfoRequestHandlerTest-seed#[2B791F8AD696B655]-worker) [    ] o.a.s.s.IndexSchema Loaded schema test/1.4 with uniqueid field id
   [junit4]   2> 473514 INFO  (SUITE-SegmentsInfoRequestHandlerTest-seed#[2B791F8AD696B655]-worker) [    ] o.a.s.m.r.SolrJmxReporter JMX monitoring for 'solr.node' (registry 'solr.node') enabled at server: com.sun.jmx.mbeanserver.JmxMBeanServer@7dff6729
   [junit4]   2> 473519 INFO  (SUITE-SegmentsInfoRequestHandlerTest-seed#[2B791F8AD696B655]-worker) [    ] o.a.s.m.r.SolrJmxReporter JMX monitoring for 'solr.jvm' (registry 'solr.jvm') enabled at server: com.sun.jmx.mbeanserver.JmxMBeanServer@7dff6729
   [junit4]   2> 473519 INFO  (SUITE-SegmentsInfoRequestHandlerTest-seed#[2B791F8AD696B655]-worker) [    ] o.a.s.m.r.SolrJmxReporter JMX monitoring for 'solr.jetty' (registry 'solr.jetty') enabled at server: com.sun.jmx.mbeanserver.JmxMBeanServer@7dff6729
   [junit4]   2> 473520 INFO  (coreLoadExecutor-2336-thread-1) [    ] o.a.s.c.TransientSolrCoreCacheDefault Allocating transient cache for 2147483647 transient cores
   [junit4]   2> 473520 INFO  (coreLoadExecutor-2336-thread-1) [    x:collection1] o.a.s.c.SolrResourceLoader [null] Added 2 libs to classloader, from paths: [/home/jenkins/workspace/Lucene-Solr-master-Linux/solr/core/src/test-files/solr/collection1/lib, /home/jenkins/workspace/Lucene-Solr-master-Linux/solr/core/src/test-files/solr/collection1/lib/classes]
   [junit4]   2> 473536 INFO  (coreLoadExecutor-2336-thread-1) [    x:collection1] o.a.s.c.SolrConfig Using Lucene MatchVersion: 8.0.0
   [junit4]   2> 473574 INFO  (coreLoadExecutor-2336-thread-1) [    x:collection1] o.a.s.s.IndexSchema [collection1] Schema name=test
   [junit4]   2> 473616 WARN  (coreLoadExecutor-2336-thread-1) [    x:collection1] o.a.s.s.IndexSchema Field text is not multivalued and destination for multiple copyFields (2)
   [junit4]   2> 473616 INFO  (coreLoadExecutor-2336-thread-1) [    x:collection1] o.a.s.s.IndexSchema Loaded schema test/1.4 with uniqueid field id
   [junit4]   2> 473621 INFO  (coreLoadExecutor-2336-thread-1) [    x:collection1] o.a.s.c.CoreContainer Creating SolrCore 'collection1' using configuration from instancedir /home/jenkins/workspace/Lucene-Solr-master-Linux/solr/core/src/test-files/solr/collection1, trusted=true
   [junit4]   2> 473621 INFO  (coreLoadExecutor-2336-thread-1) [    x:collection1] o.a.s.m.r.SolrJmxReporter JMX monitoring for 'solr.core.collection1' (registry 'solr.core.collection1') enabled at server: com.sun.jmx.mbeanserver.JmxMBeanServer@7dff6729
   [junit4]   2> 473621 INFO  (coreLoadExecutor-2336-thread-1) [    x:collection1] o.a.s.c.SolrCore solr.RecoveryStrategy.Builder
   [junit4]   2> 473621 INFO  (coreLoadExecutor-2336-thread-1) [    x:collection1] o.a.s.c.SolrCore [[collection1] ] Opening new SolrCore at [/home/jenkins/workspace/Lucene-Solr-master-Linux/solr/core/src/test-files/solr/collection1], dataDir=[/home/jenkins/workspace/Lucene-Solr-master-Linux/solr/build/solr-core/test/J1/temp/solr.handler.admin.SegmentsInfoRequestHandlerTest_2B791F8AD696B655-001/init-core-data-001/]
   [junit4]   2> 473656 INFO  (coreLoadExecutor-2336-thread-1) [    x:collection1] o.a.s.u.CommitTracker Hard AutoCommit: disabled
   [junit4]   2> 473656 INFO  (coreLoadExecutor-2336-thread-1) [    x:collection1] o.a.s.u.CommitTracker Soft AutoCommit: disabled
   [junit4]   2> 473657 INFO  (coreLoadExecutor-2336-thread-1) [    x:collection1] o.a.s.s.SolrIndexSearcher Opening [Searcher@3ceabc49[collection1] main]
   [junit4]   2> 473657 INFO  (coreLoadExecutor-2336-thread-1) [    x:collection1] o.a.s.h.c.SpellCheckComponent Initializing spell checkers
   [junit4]   2> 474300 INFO  (coreLoadExecutor-2336-thread-1) [    x:collection1] o.a.s.s.DirectSolrSpellChecker init: {name=direct,classname=DirectSolrSpellChecker,field=lowerfilt,minQueryLength=3}
   [junit4]   2> 474380 INFO  (coreLoadExecutor-2336-thread-1) [    x:collection1] o.a.s.h.ReplicationHandler Commits will be reserved for 10000ms.
   [junit4]   2> 474380 INFO  (searcherExecutor-2337-thread-1-processing-x:collection1) [    x:collection1] o.a.s.h.c.SpellCheckComponent Loading spell index for spellchecker: default
   [junit4]   2> 474380 INFO  (searcherExecutor-2337-thread-1-processing-x:collection1) [    x:collection1] o.a.s.h.c.SpellCheckComponent Loading spell index for spellchecker: direct
   [junit4]   2> 474380 INFO  (searcherExecutor-2337-thread-1-processing-x:collection1) [    x:collection1] o.a.s.h.c.SpellCheckComponent Loading spell index for spellchecker: wordbreak
   [junit4]   2> 474380 INFO  (searcherExecutor-2337-thread-1-processing-x:collection1) [    x:collection1] o.a.s.h.c.SpellCheckComponent Loading spell index for spellchecker: multipleFields
   [junit4]   2> 474381 INFO  (searcherExecutor-2337-thread-1-processing-x:collection1) [    x:collection1] o.a.s.h.c.SpellCheckComponent Loading spell index for spellchecker: jarowinkler
   [junit4]   2> 474381 INFO  (searcherExecutor-2337-thread-1-processing-x:collection1) [    x:collection1] o.a.s.h.c.SpellCheckComponent Loading spell index for spellchecker: external
   [junit4]   2> 474381 INFO  (searcherExecutor-2337-thread-1-processing-x:collection1) [    x:collection1] o.a.s.h.c.SpellCheckComponent Loading spell index for spellchecker: freq
   [junit4]   2> 474381 INFO  (SUITE-SegmentsInfoRequestHandlerTest-seed#[2B791F8AD696B655]-worker) [    ] o.a.s.SolrTestCaseJ4 ####initCore end
   [junit4]   2> 474381 INFO  (searcherExecutor-2337-thread-1-processing-x:collection1) [    x:collection1] o.a.s.h.c.SpellCheckComponent Loading spell index for spellchecker: fqcn
   [junit4]   2> 474381 INFO  (searcherExecutor-2337-thread-1-processing-x:collection1) [    x:collection1] o.a.s.h.c.SpellCheckComponent Loading spell index for spellchecker: perDict
   [junit4]   2> 474381 INFO  (SUITE-SegmentsInfoRequestHandlerTest-seed#[2B791F8AD696B655]-worker) [    ] o.a.s.u.p.LogUpdateProcessorFactory [collection1]  webapp=null path=null params={}{add=[SOLR1000]} 0 0
   [junit4]   2> 474382 INFO  (searcherExecutor-2337-thread-1-processing-x:collection1) [    x:collection1] o.a.s.c.SolrCore [collection1] Registered new searcher Searcher@3ceabc49[collection1] main{ExitableDirectoryReader(UninvertingDirectoryReader())}
   [junit4]   2> 474382 INFO  (SUITE-SegmentsInfoRequestHandlerTest-seed#[2B791F8AD696B655]-worker) [    ] o.a.s.u.p.LogUpdateProcessorFactory [collection1]  webapp=null path=null params={}{add=[SOLR1001]} 0 0
   [junit4]   2> 474382 INFO  (SUITE-SegmentsInfoRequestHandlerTest-seed#[2B791F8AD696B655]-worker) [    ] o.a.s.u.p.LogUpdateProcessorFactory [collection1]  webapp=null path=null params={}{add=[SOLR1002]} 0 0
   [junit4]   2> 474384 INFO  (SUITE-SegmentsInfoRequestHandlerTest-seed#[2B791F8AD696B655]-worker) [    ] o.a.s.u.p.LogUpdateProcessorFactory [collection1]  webapp=null path=null params={}{add=[SOLR1003]} 0 1
   [junit4]   2> 474384 INFO  (SUITE-SegmentsInfoRequestHandlerTest-seed#[2B791F8AD696B655]-worker) [    ] o.a.s.u.p.LogUpdateProcessorFactory [collection1]  webapp=null path=null params={}{add=[SOLR1004]} 0 0
   [junit4]   2> 474384 INFO  (SUITE-SegmentsInfoRequestHandlerTest-seed#[2B791F8AD696B655]-worker) [    ] o.a.s.u.p.LogUpdateProcessorFactory [collection1]  webapp=null path=null params={}{delete=[SOLR1000]} 0 0
   [junit4]   2> 474384 INFO  (SUITE-SegmentsInfoRequestHandlerTest-seed#[2B791F8AD696B655]-worker) [    ] o.a.s.u.DirectUpdateHandler2 start commit{,optimize=false,openSearcher=true,waitSearcher=true,expungeDeletes=false,softCommit=false,prepareCommit=false}
   [junit4]   2> 474384 INFO  (SUITE-SegmentsInfoRequestHandlerTest-seed#[2B791F8AD696B655]-worker) [    ] o.a.s.u.SolrIndexWriter Calling setCommitData with IW:org.apache.solr.update.SolrIndexWriter@73f60e9c commitCommandVersion:0
   [junit4]   2> 474386 INFO  (SUITE-SegmentsInfoRequestHandlerTest-seed#[2B791F8AD696B655]-worker) [    ] o.a.s.s.SolrIndexSearcher Opening [Searcher@31ebec4e[collection1] main]
   [junit4]   2> 474386 INFO  (SUITE-SegmentsInfoRequestHandlerTest-seed#[2B791F8AD696B655]-worker) [    ] o.a.s.u.DirectUpdateHandler2 end_commit_flush
   [junit4]   2> 474388 INFO  (searcherExecutor-2337-thread-1) [    ] o.a.s.c.SolrCore [collection1] Registered new searcher Searcher@31ebec4e[collection1] main{ExitableDirectoryReader(UninvertingDirectoryReader(Uninverting(_0(8.0.0):C4/1:delGen=1) Uninverting(_1(8.0.0):C1)))}
   [junit4]   2> 474388 INFO  (SUITE-SegmentsInfoRequestHandlerTest-seed#[2B791F8AD696B655]-worker) [    ] o.a.s.u.p.LogUpdateProcessorFactory [collection1]  webapp=null path=null params={}{commit=} 0 3
   [junit4]   2> 474388 INFO  (SUITE-SegmentsInfoRequestHandlerTest-seed#[2B791F8AD696B655]-worker) [    ] o.a.s.u.p.LogUpdateProcessorFactory [collection1]  webapp=null path=null params={}{add=[SOLR2000]} 0 0
   [junit4]   2> 474389 INFO  (SUITE-SegmentsInfoRequestHandlerTest-seed#[2B791F8AD696B655]-worker) [    ] o.a.s.u.p.LogUpdateProcessorFactory [collection1]  webapp=null path=null params={}{add=[SOLR2001]} 0 0
   [junit4]   2> 474389 INFO  (SUITE-SegmentsInfoRequestHandlerTest-seed#[2B791F8AD696B655]-worker) [    ] o.a.s.u.p.LogUpdateProcessorFactory [collection1]  webapp=null path=null params={}{add=[SOLR2002]} 0 0
   [junit4]   2> 474389 INFO  (SUITE-SegmentsInfoRequestHandlerTest-seed#[2B791F8AD696B655]-worker) [    ] o.a.s.u.p.LogUpdateProcessorFactory [collection1]  webapp=null path=null params={}{add=[SOLR2003]} 0 0
   [junit4]   2> 474389 INFO  (SUITE-SegmentsInfoRequestHandlerTest-seed#[2B791F8AD696B655]-worker) [    ] o.a.s.u.p.LogUpdateProcessorFactory [collection1]  webapp=null path=null params={}{add=[SOLR2004]} 0 0
   [junit4]   2> 474390 INFO  (SUITE-SegmentsInfoRequestHandlerTest-seed#[2B791F8AD696B655]-worker) [    ] o.a.s.u.DirectUpdateHandler2 start commit{,optimize=false,openSearcher=true,waitSearcher=true,expungeDeletes=false,softCommit=false,prepareCommit=false}
   [junit4]   2> 474390 INFO  (SUITE-SegmentsInfoRequestHandlerTest-seed#[2B791F8AD696B655]-worker) [    ] o.a.s.u.SolrIndexWriter Calling setCommitData with IW:org.apache.solr.update.SolrIndexWriter@73f60e9c commitCommandVersion:0
   [junit4]   2> 474391 INFO  (SUITE-SegmentsInfoRequestHandlerTest-seed#[2B791F8AD696B655]-worker) [    ] o.a.s.s.SolrIndexSearcher Opening [Searcher@75edb413[collection1] main]
   [junit4]   2> 474391 INFO  (SUITE-SegmentsInfoRequestHandlerTest-seed#[2B791F8AD696B655]-worker) [    ] o.a.s.u.DirectUpdateHandler2 end_commit_flush
   [junit4]   2> 474393 INFO  (searcherExecutor-2337-thread-1) [    ] o.a.s.c.SolrCore [collection1] Registered new searcher Searcher@75edb413[collection1] main{ExitableDirectoryReader(UninvertingDirectoryReader(Uninverting(_0(8.0.0):C4/1:delGen=1) Uninverting(_1(8.0.0):C1) Uninverting(_2(8.0.0):C4) Uninverting(_3(8.0.0):C1)))}
   [junit4]   2> 474393 INFO  (SUITE-SegmentsInfoRequestHandlerTest-seed#[2B791F8AD696B655]-worker) [    ] o.a.s.u.p.LogUpdateProcessorFactory [collection1]  webapp=null path=null params={}{commit=} 0 3
   [junit4]   2> 474395 INFO  (TEST-SegmentsInfoRequestHandlerTest.testSegmentInfosVersion-seed#[2B791F8AD696B655]) [    ] o.a.s.SolrTestCaseJ4 ###Starting testSegmentInfosVersion
   [junit4]   2> 474395 INFO  (TEST-SegmentsInfoRequestHandlerTest.testSegmentInfosVersion-seed#[2B791F8AD696B655]) [    ] o.a.s.c.S.Request [collection1]  webapp=null path=null params={qt=/admin/segments&wt=xml} status=0 QTime=0
   [junit4]   2> 474396 ERROR (TEST-SegmentsInfoRequestHandlerTest.testSegmentInfosVersion-seed#[2B791F8AD696B655]) [    ] o.a.s.SolrTestCaseJ4 REQUEST FAILED: xpath=2=count(//lst[@name='segments']/lst/str[@name='version'][.='8.0.0'])
   [junit4]   2> 	xml response was: <?xml version="1.0" encoding="UTF-8"?>
   [junit4]   2> <response>
   [junit4]   2> <lst name="responseHeader"><int name="status">0</int><int name="QTime">0</int></lst><lst name="segments"><lst name="_0"><str name="name">_0</str><int name="delCount">1</int><long name="sizeInBytes">2255</long><int name="size">4</int><date name="age">2018-02-01T04:02:55.610Z</date><str name="source">flush</str><str name="version">8.0.0</str></lst><lst name="_1"><str name="name">_1</str><int name="delCount">0</int><long name="sizeInBytes">2077</long><int name="size">1</int><date name="age">2018-02-01T04:02:55.611Z</date><str name="source">flush</str><str name="version">8.0.0</str></lst><lst name="_2"><str name="name">_2</str><int name="delCount">0</int><long name="sizeInBytes">2188</long><int name="size">4</int><date name="age">2018-02-01T04:02:55.615Z</date><str name="source">flush</str><str name="version">8.0.0</str></lst><lst name="_3"><str name="name">_3</str><int name="delCount">0</int><long name="sizeInBytes">2077</long><int name="size">1</int><date name="age">2018-02-01T04:02:55.616Z</date><str name="source">flush</str><str name="version">8.0.0</str></lst></lst>
   [junit4]   2> </response>
   [junit4]   2> 
   [junit4]   2> 	request was:qt=/admin/segments&wt=xml
   [junit4]   2> 474396 ERROR (TEST-SegmentsInfoRequestHandlerTest.testSegmentInfosVersion-seed#[2B791F8AD696B655]) [    ] o.a.s.SolrTestCaseJ4 REQUEST FAILED: qt=/admin/segments&wt=xml:java.lang.RuntimeException: REQUEST FAILED: xpath=2=count(//lst[@name='segments']/lst/str[@name='version'][.='8.0.0'])
   [junit4]   2> 	xml response was: <?xml version="1.0" encoding="UTF-8"?>
   [junit4]   2> <response>
   [junit4]   2> <lst name="responseHeader"><int name="status">0</int><int name="QTime">0</int></lst><lst name="segments"><lst name="_0"><str name="name">_0</str><int name="delCount">1</int><long name="sizeInBytes">2255</long><int name="size">4</int><date name="age">2018-02-01T04:02:55.610Z</date><str name="source">flush</str><str name="version">8.0.0</str></lst><lst name="_1"><str name="name">_1</str><int name="delCount">0</int><long name="sizeInBytes">2077</long><int name="size">1</int><date name="age">2018-02-01T04:02:55.611Z</date><str name="source">flush</str><str name="version">8.0.0</str></lst><lst name="_2"><str name="name">_2</str><int name="delCount">0</int><long name="sizeInBytes">2188</long><int name="size">4</int><date name="age">2018-02-01T04:02:55.615Z</date><str name="source">flush</str><str name="version">8.0.0</str></lst><lst name="_3"><str name="name">_3</str><int name="delCount">0</int><long name="sizeInBytes">2077</long><int name="size">1</int><date name="age">2018-02-01T04:02:55.616Z</date><str name="source">flush</str><str name="version">8.0.0</str></lst></lst>
   [junit4]   2> </response>
   [junit4]   2> 
   [junit4]   2> 	request was:qt=/admin/segments&wt=xml
   [junit4]   2> 	at org.apache.solr.SolrTestCaseJ4.assertQ(SolrTestCaseJ4.java:895)
   [junit4]   2> 	at org.apache.solr.handler.admin.SegmentsInfoRequestHandlerTest.testSegmentInfosVersion(SegmentsInfoRequestHandlerTest.java:68)
   [junit4]   2> 	at java.base/jdk.internal.reflect.NativeMethodAccessorImpl.invoke0(Native Method)
   [junit4]   2> 	at java.base/jdk.internal.reflect.NativeMethodAccessorImpl.invoke(NativeMethodAccessorImpl.java:62)
   [junit4]   2> 	at java.base/jdk.internal.reflect.DelegatingMethodAccessorImpl.invoke(DelegatingMethodAccessorImpl.java:43)
   [junit4]   2> 	at java.base/java.lang.reflect.Method.invoke(Method.java:564)
   [junit4]   2> 	at com.carrotsearch.randomizedtesting.RandomizedRunner.invoke(RandomizedRunner.java:1737)
   [junit4]   2> 	at com.carrotsearch.randomizedtesting.RandomizedRunner$8.evaluate(RandomizedRunner.java:934)
   [junit4]   2> 	at com.carrotsearch.randomizedtesting.RandomizedRunner$9.evaluate(RandomizedRunner.java:970)
   [junit4]   2> 	at com.carrotsearch.randomizedtesting.RandomizedRunner$10.evaluate(RandomizedRunner.java:984)
   [junit4]   2> 	at com.carrotsearch.randomizedtesting.rules.SystemPropertiesRestoreRule$1.evaluate(SystemPropertiesRestoreRule.java:57)
   [junit4]   2> 	at org.apache.lucene.util.TestRuleSetupTeardownChained$1.evaluate(TestRuleSetupTeardownChained.java:49)
   [junit4]   2> 	at org.apache.lucene.util.AbstractBeforeAfterRule$1.evaluate(AbstractBeforeAfterRule.java:45)
   [junit4]   2> 	at org.apache.lucene.util.TestRuleThreadAndTestName$1.evaluate(TestRuleThreadAndTestName.java:48)
   [junit4]   2> 	at org.apache.lucene.util.TestRuleIgnoreAfterMaxFailures$1.evaluate(TestRuleIgnoreAfterMaxFailures.java:64)
   [junit4]   2> 	at org.apache.lucene.util.TestRuleMarkFailure$1.evaluate(TestRuleMarkFailure.java:47)
   [junit4]   2> 	at com.carrotsearch.randomizedtesting.rules.StatementAdapter.evaluate(StatementAdapter.java:36)
   [junit4]   2> 	at com.carrotsearch.randomizedtesting.ThreadLeakControl$StatementRunner.run(ThreadLeakControl.java:368)
   [junit4]   2> 	at com.carrotsearch.randomizedtesting.ThreadLeakControl.forkTimeoutingTask(ThreadLeakControl.java:817)
   [junit4]   2> 	at com.carrotsearch.randomizedtesting.ThreadLeakControl$3.evaluate(ThreadLeakControl.java:468)
   [junit4]   2> 	at com.carrotsearch.randomizedtesting.RandomizedRunner.runSingleTest(RandomizedRunner.java:943)
   [junit4]   2> 	at com.carrotsearch.randomizedtesting.RandomizedRunner$5.evaluate(RandomizedRunner.java:829)
   [junit4]   2> 	at com.carrotsearch.randomizedtesting.RandomizedRunner$6.evaluate(RandomizedRunner.java:879)
   [junit4]   2> 	at com.carrotsearch.randomizedtesting.RandomizedRunner$7.evaluate(RandomizedRunner.java:890)
   [junit4]   2> 	at com.carrotsearch.randomizedtesting.rules.StatementAdapter.evaluate(StatementAdapter.java:36)
   [junit4]   2> 	at com.carrotsearch.randomizedtesting.rules.SystemPropertiesRestoreRule$1.evaluate(SystemPropertiesRestoreRule.java:57)
   [junit4]   2> 	at org.apache.lucene.util.AbstractBeforeAfterRule$1.evaluate(AbstractBeforeAfterRule.java:45)
   [junit4]   2> 	at com.carrotsearch.randomizedtesting.rules.StatementAdapter.evaluate(StatementAdapter.java:36)
   [junit4]   2> 	at org.apache.lucene.util.TestRuleStoreClassName$1.evaluate(TestRuleStoreClassName.java:41)
   [junit4]   2> 	at com.carrotsearch.randomizedtesting.rules.NoShadowingOrOverridesOnMethodsRule$1.evaluate(NoShadowingOrOverridesOnMethodsRule.java:40)
   [junit4]   2> 	at com.carrotsearch.randomizedtesting.rules.NoShadowingOrOverridesOnMethodsRule$1.evaluate(NoShadowingOrOverridesOnMethodsRule.java:40)
   [junit4]   2> 	at com.carrotsearch.randomizedtesting.rules.StatementAdapter.evaluate(StatementAdapter.java:36)
   [junit4]   2> 	at com.carrotsearch.randomizedtesting.rules.StatementAdapter.evaluate(StatementAdapter.java:36)
   [junit4]   2> 	at org.apache.lucene.util.TestRuleAssertionsRequired$1.evaluate(TestRuleAssertionsRequired.java:53)
   [junit4]   2> 	at org.apache.lucene.util.TestRuleMarkFailure$1.evaluate(TestRuleMarkFailure.java:47)
   [junit4]   2> 	at org.apache.lucene.util.TestRuleIgnoreAfterMaxFailures$1.evaluate(TestRuleIgnoreAfterMaxFailures.java:64)
   [junit4]   2> 	at org.apache.lucene.util.TestRuleIgnoreTestSuites$1.evaluate(TestRuleIgnoreTestSuites.java:54)
   [junit4]   2> 	at com.carrotsearch.randomizedtesting.rules.StatementAdapter.evaluate(StatementAdapter.java:36)
   [junit4]   2> 	at com.carrotsearch.randomizedtesting.ThreadLeakControl$StatementRunner.run(ThreadLeakControl.java:368)
   [junit4]   2> 	at java.base/java.lang.Thread.run(Thread.java:844)
   [junit4]   2> 
   [junit4]   2> 474397 INFO  (TEST-SegmentsInfoRequestHandlerTest.testSegmentInfosVersion-seed#[2B791F8AD696B655]) [    ] o.a.s.SolrTestCaseJ4 ###Ending testSegmentInfosVersion
   [junit4]   2> NOTE: reproduce with: ant test  -Dtestcase=SegmentsInfoRequestHandlerTest -Dtests.method=testSegmentInfosVersion -Dtests.seed=2B791F8AD696B655 -Dtests.multiplier=3 -Dtests.slow=true -Dtests.locale=en-IN -Dtests.timezone=Africa/Tunis -Dtests.asserts=true -Dtests.file.encoding=US-ASCII
   [junit4] ERROR   0.01s J1 | SegmentsInfoRequestHandlerTest.testSegmentInfosVersion <<<
   [junit4]    > Throwable #1: java.lang.RuntimeException: Exception during query
   [junit4]    > 	at __randomizedtesting.SeedInfo.seed([2B791F8AD696B655:D3A78A62AEFA6706]:0)
   [junit4]    > 	at org.apache.solr.SolrTestCaseJ4.assertQ(SolrTestCaseJ4.java:902)
   [junit4]    > 	at org.apache.solr.handler.admin.SegmentsInfoRequestHandlerTest.testSegmentInfosVersion(SegmentsInfoRequestHandlerTest.java:68)
   [junit4]    > 	at java.base/jdk.internal.reflect.NativeMethodAccessorImpl.invoke0(Native Method)
   [junit4]    > 	at java.base/jdk.internal.reflect.NativeMethodAccessorImpl.invoke(NativeMethodAccessorImpl.java:62)
   [junit4]    > 	at java.base/jdk.internal.reflect.DelegatingMethodAccessorImpl.invoke(DelegatingMethodAccessorImpl.java:43)
   [junit4]    > 	at java.base/java.lang.reflect.Method.invoke(Method.java:564)
   [junit4]    > 	at java.base/java.lang.Thread.run(Thread.java:844)
   [junit4]    > Caused by: java.lang.RuntimeException: REQUEST FAILED: xpath=2=count(//lst[@name='segments']/lst/str[@name='version'][.='8.0.0'])
   [junit4]    > 	xml response was: <?xml version="1.0" encoding="UTF-8"?>
   [junit4]    > <response>
   [junit4]    > <lst name="responseHeader"><int name="status">0</int><int name="QTime">0</int></lst><lst name="segments"><lst name="_0"><str name="name">_0</str><int name="delCount">1</int><long name="sizeInBytes">2255</long><int name="size">4</int><date name="age">2018-02-01T04:02:55.610Z</date><str name="source">flush</str><str name="version">8.0.0</str></lst><lst name="_1"><str name="name">_1</str><int name="delCount">0</int><long name="sizeInBytes">2077</long><int name="size">1</int><date name="age">2018-02-01T04:02:55.611Z</date><str name="source">flush</str><str name="version">8.0.0</str></lst><lst name="_2"><str name="name">_2</str><int name="delCount">0</int><long name="sizeInBytes">2188</long><int name="size">4</int><date name="age">2018-02-01T04:02:55.615Z</date><str name="source">flush</str><str name="version">8.0.0</str></lst><lst name="_3"><str name="name">_3</str><int name="delCount">0</int><long name="sizeInBytes">2077</long><int name="size">1</int><date name="age">2018-02-01T04:02:55.616Z</date><str name="source">flush</str><str name="version">8.0.0</str></lst></lst>
   [junit4]    > </response>
   [junit4]    > 	request was:qt=/admin/segments&wt=xml
   [junit4]    > 	at org.apache.solr.SolrTestCaseJ4.assertQ(SolrTestCaseJ4.java:895)
   [junit4]    > 	... 39 more
   [junit4]   2> 474399 INFO  (TEST-SegmentsInfoRequestHandlerTest.testSegmentInfosData-seed#[2B791F8AD696B655]) [    ] o.a.s.SolrTestCaseJ4 ###Starting testSegmentInfosData
   [junit4]   2> 474399 INFO  (TEST-SegmentsInfoRequestHandlerTest.testSegmentInfosData-seed#[2B791F8AD696B655]) [    ] o.a.s.c.S.Request [collection1]  webapp=null path=null params={qt=/admin/segments&wt=xml} status=0 QTime=0
   [junit4]   2> 474399 INFO  (TEST-SegmentsInfoRequestHandlerTest.testSegmentInfosData-seed#[2B791F8AD696B655]) [    ] o.a.s.SolrTestCaseJ4 ###Ending testSegmentInfosData
   [junit4]   2> 474400 INFO  (TEST-SegmentsInfoRequestHandlerTest.testSegmentInfos-seed#[2B791F8AD696B655]) [    ] o.a.s.SolrTestCaseJ4 ###Starting testSegmentInfos
   [junit4]   2> 474400 INFO  (TEST-SegmentsInfoRequestHandlerTest.testSegmentInfos-seed#[2B791F8AD696B655]) [    ] o.a.s.c.S.Request [collection1]  webapp=null path=null params={qt=/admin/segments&wt=xml} status=0 QTime=0
   [junit4]   2> 474400 INFO  (TEST-SegmentsInfoRequestHandlerTest.testSegmentInfos-seed#[2B791F8AD696B655]) [    ] o.a.s.SolrTestCaseJ4 ###Ending testSegmentInfos
   [junit4]   2> 474400 INFO  (SUITE-SegmentsInfoRequestHandlerTest-seed#[2B791F8AD696B655]-worker) [    ] o.a.s.SolrTestCaseJ4 ###deleteCore
   [junit4]   2> 474401 INFO  (SUITE-SegmentsInfoRequestHandlerTest-seed#[2B791F8AD696B655]-worker) [    ] o.a.s.c.CoreContainer Shutting down CoreContainer instance=766120390
   [junit4]   2> 474401 INFO  (SUITE-SegmentsInfoRequestHandlerTest-seed#[2B791F8AD696B655]-worker) [    ] o.a.s.m.SolrMetricManager Closing metric reporters for registry=solr.node, tag=null
   [junit4]   2> 474401 INFO  (SUITE-SegmentsInfoRequestHandlerTest-seed#[2B791F8AD696B655]-worker) [    ] o.a.s.m.r.SolrJmxReporter Closing reporter [org.apache.solr.metrics.reporters.SolrJmxReporter@71b0d050: rootName = null, domain = solr.node, service url = null, agent id = null] for registry solr.node / com.codahale.metrics.MetricRegistry@4e5b4df9
   [junit4]   2> 474403 INFO  (SUITE-SegmentsInfoRequestHandlerTest-seed#[2B791F8AD696B655]-worker) [    ] o.a.s.m.SolrMetricManager Closing metric reporters for registry=solr.jvm, tag=null
   [junit4]   2> 474403 INFO  (SUITE-SegmentsInfoRequestHandlerTest-seed#[2B791F8AD696B655]-worker) [    ] o.a.s.m.r.SolrJmxReporter Closing reporter [org.apache.solr.metrics.reporters.SolrJmxReporter@248abb1d: rootName = null, domain = solr.jvm, service url = null, agent id = null] for registry solr.jvm / com.codahale.metrics.MetricRegistry@640504bb
   [junit4]   2> 474405 INFO  (SUITE-SegmentsInfoRequestHandlerTest-seed#[2B791F8AD696B655]-worker) [    ] o.a.s.m.SolrMetricManager Closing metric reporters for registry=solr.jetty, tag=null
   [junit4]   2> 474405 INFO  (SUITE-SegmentsInfoRequestHandlerTest-seed#[2B791F8AD696B655]-worker) [    ] o.a.s.m.r.SolrJmxReporter Closing reporter [org.apache.solr.metrics.reporters.SolrJmxReporter@6b0a7f12: rootName = null, domain = solr.jetty, service url = null, agent id = null] for registry solr.jetty / com.codahale.metrics.MetricRegistry@3ebddd14
   [junit4]   2> 474405 INFO  (coreCloseExecutor-2341-thread-1) [    x:collection1] o.a.s.c.SolrCore [collection1]  CLOSING SolrCore org.apache.solr.core.SolrCore@59e6587
   [junit4]   2> 474405 INFO  (coreCloseExecutor-2341-thread-1) [    x:collection1] o.a.s.m.SolrMetricManager Closing metric reporters for registry=solr.core.collection1, tag=94266759
   [junit4]   2> 474405 INFO  (coreCloseExecutor-2341-thread-1) [    x:collection1] o.a.s.m.r.SolrJmxReporter Closing reporter [org.apache.solr.metrics.reporters.SolrJmxReporter@3db1fd66: rootName = null, domain = solr.core.collection1, service url = null, agent id = null] for registry solr.core.collection1 / com.codahale.metrics.MetricRegistry@46c2a243
   [junit4]   2> NOTE: leaving temporary files on disk at: /home/jenkins/workspace/Lucene-Solr-master-Linux/solr/build/solr-core/test/J1/temp/solr.handler.admin.SegmentsInfoRequestHandlerTest_2B791F8AD696B655-001
   [junit4]   2> NOTE: test params are: codec=Asserting(Lucene70): {name=TestBloomFilteredLucenePostings(BloomFilteringPostingsFormat(Lucene50(blocksize=128))), id=TestBloomFilteredLucenePostings(BloomFilteringPostingsFormat(Lucene50(blocksize=128)))}, docValues:{}, maxPointsInLeafNode=1226, maxMBSortInHeap=5.350515728728, sim=Asserting(org.apache.lucene.search.similarities.AssertingSimilarity@7b6d745b), locale=en-IN, timezone=Africa/Tunis
   [junit4]   2> NOTE: Linux 4.13.0-32-generic amd64/Oracle Corporation 10-ea (64-bit)/cpus=8,threads=1,free=195417848,total=536870912
   [junit4]   2> NOTE: All tests run in this JVM: [TestFieldCacheSortRandom, TestShardHandlerFactory, SubstringBytesRefFilterTest, TestGraphMLResponseWriter, SolrMetricsIntegrationTest, TestCursorMarkWithoutUniqueKey, DOMUtilTest, CdcrBootstrapTest, BasicFunctionalityTest, SampleTest, TestDynamicLoading, TestNumericRangeQuery32, TestDistributedGrouping, TestPayloadScoreQParserPlugin, SuggestComponentTest, TestCollectionAPI, TestCollectionAPIs, SimplePostToolTest, PeerSyncTest, MissingSegmentRecoveryTest, HdfsBasicDistributedZk2Test, HdfsChaosMonkeySafeLeaderTest, TestReplicationHandler, DocumentBuilderTest, RuleEngineTest, TestConfigOverlay, SolrCLIZkUtilsTest, TestElisionMultitermQuery, TestLRUCache, TestImpersonationWithHadoopAuth, CdcrRequestHandlerTest, TestComputePlanAction, TestPointFields, TestLegacyFieldCache, TestConfigSets, DirectUpdateHandlerOptimizeTest, TestQueryUtils, TestLeaderElectionZkExpiry, TestTriggerIntegration, TestFuzzyAnalyzedSuggestions, JSONWriterTest, DocValuesMissingTest, TestTrieFacet, SolrIndexMetricsTest, TestReloadDeadlock, TestPullReplica, SpellCheckCollatorWithCollapseTest, TestStressInPlaceUpdates, SegmentsInfoRequestHandlerTest]
   [junit4] Completed [123/774 (1!)] on J1 in 0.99s, 3 tests, 1 error <<< FAILURES!

[...truncated 1733 lines...]
   [junit4] Suite: org.apache.solr.cloud.autoscaling.TriggerIntegrationTest
   [junit4]   2> 2194159 INFO  (SUITE-TriggerIntegrationTest-seed#[2B791F8AD696B655]-worker) [    ] o.a.s.SolrTestCaseJ4 SecureRandom sanity checks: test.solr.allowed.securerandom=null & java.security.egd=file:/dev/./urandom
   [junit4]   2> Creating dataDir: /home/jenkins/workspace/Lucene-Solr-master-Linux/solr/build/solr-core/test/J1/temp/solr.cloud.autoscaling.TriggerIntegrationTest_2B791F8AD696B655-001/init-core-data-001
   [junit4]   2> 2194159 WARN  (SUITE-TriggerIntegrationTest-seed#[2B791F8AD696B655]-worker) [    ] o.a.s.SolrTestCaseJ4 startTrackingSearchers: numOpens=32 numCloses=32
   [junit4]   2> 2194160 INFO  (SUITE-TriggerIntegrationTest-seed#[2B791F8AD696B655]-worker) [    ] o.a.s.SolrTestCaseJ4 Using PointFields (NUMERIC_POINTS_SYSPROP=true) w/NUMERIC_DOCVALUES_SYSPROP=true
   [junit4]   2> 2194160 INFO  (SUITE-TriggerIntegrationTest-seed#[2B791F8AD696B655]-worker) [    ] o.a.s.SolrTestCaseJ4 Randomized ssl (true) and clientAuth (false) via: @org.apache.solr.util.RandomizeSSL(reason="", ssl=0.0/0.0, value=0.0/0.0, clientAuth=0.0/0.0)
   [junit4]   2> 2194161 INFO  (SUITE-TriggerIntegrationTest-seed#[2B791F8AD696B655]-worker) [    ] o.a.s.c.MiniSolrCloudCluster Starting cluster of 2 servers in /home/jenkins/workspace/Lucene-Solr-master-Linux/solr/build/solr-core/test/J1/temp/solr.cloud.autoscaling.TriggerIntegrationTest_2B791F8AD696B655-001/tempDir-001
   [junit4]   2> 2194161 INFO  (SUITE-TriggerIntegrationTest-seed#[2B791F8AD696B655]-worker) [    ] o.a.s.c.ZkTestServer STARTING ZK TEST SERVER
   [junit4]   2> 2194161 INFO  (Thread-5188) [    ] o.a.s.c.ZkTestServer client port:0.0.0.0/0.0.0.0:0
   [junit4]   2> 2194161 INFO  (Thread-5188) [    ] o.a.s.c.ZkTestServer Starting server
   [junit4]   2> 2194163 ERROR (Thread-5188) [    ] o.a.z.s.ZooKeeperServer ZKShutdownHandler is not registered, so ZooKeeper server won't take any action on ERROR or SHUTDOWN server state changes
   [junit4]   2> 2194261 INFO  (SUITE-TriggerIntegrationTest-seed#[2B791F8AD696B655]-worker) [    ] o.a.s.c.ZkTestServer start zk server on port:46059
   [junit4]   2> 2194263 INFO  (zkConnectionManagerCallback-6177-thread-1) [    ] o.a.s.c.c.ConnectionManager zkClient has connected
   [junit4]   2> 2194265 INFO  (jetty-launcher-6174-thread-2) [    ] o.e.j.s.Server jetty-9.4.8.v20171121, build timestamp: ????-??-??T??:??:??+03:00, git hash: 82b8fb23f757335bb3329d540ce37a2a2615f0a8
   [junit4]   2> 2194265 INFO  (jetty-launcher-6174-thread-1) [    ] o.e.j.s.Server jetty-9.4.8.v20171121, build timestamp: ????-??-??T??:??:??+03:00, git hash: 82b8fb23f757335bb3329d540ce37a2a2615f0a8
   [junit4]   2> 2194266 INFO  (jetty-launcher-6174-thread-2) [    ] o.e.j.s.session DefaultSessionIdManager workerName=node0
   [junit4]   2> 2194266 INFO  (jetty-launcher-6174-thread-1) [    ] o.e.j.s.session DefaultSessionIdManager workerName=node0
   [junit4]   2> 2194266 INFO  (jetty-launcher-6174-thread-2) [    ] o.e.j.s.session No SessionScavenger set, using defaults
   [junit4]   2> 2194266 INFO  (jetty-launcher-6174-thread-1) [    ] o.e.j.s.session No SessionScavenger set, using defaults
   [junit4]   2> 2194266 INFO  (jetty-launcher-6174-thread-2) [    ] o.e.j.s.session Scavenging every 660000ms
   [junit4]   2> 2194266 INFO  (jetty-launcher-6174-thread-1) [    ] o.e.j.s.session Scavenging every 660000ms
   [junit4]   2> 2194266 INFO  (jetty-launcher-6174-thread-2) [    ] o.e.j.s.h.ContextHandler Started o.e.j.s.ServletContextHandler@6c995f94{/solr,null,AVAILABLE}
   [junit4]   2> 2194266 INFO  (jetty-launcher-6174-thread-1) [    ] o.e.j.s.h.ContextHandler Started o.e.j.s.ServletContextHandler@43547fb0{/solr,null,AVAILABLE}
   [junit4]   2> 2194268 INFO  (jetty-launcher-6174-thread-1) [    ] o.e.j.s.AbstractConnector Started ServerConnector@3e1360d{SSL,[ssl, http/1.1]}{127.0.0.1:40655}
   [junit4]   2> 2194268 INFO  (jetty-launcher-6174-thread-2) [    ] o.e.j.s.AbstractConnector Started ServerConnector@6994dce1{SSL,[ssl, http/1.1]}{127.0.0.1:34059}
   [junit4]   2> 2194268 INFO  (jetty-launcher-6174-thread-1) [    ] o.e.j.s.Server Started @2197191ms
   [junit4]   2> 2194268 INFO  (jetty-launcher-6174-thread-2) [    ] o.e.j.s.Server Started @2197191ms
   [junit4]   2> 2194268 INFO  (jetty-launcher-6174-thread-1) [    ] o.a.s.c.s.e.JettySolrRunner Jetty properties: {hostContext=/solr, hostPort=40655}
   [junit4]   2> 2194268 INFO  (jetty-launcher-6174-thread-2) [    ] o.a.s.c.s.e.JettySolrRunner Jetty properties: {hostContext=/solr, hostPort=34059}
   [junit4]   2> 2194268 ERROR (jetty-launcher-6174-thread-1) [    ] o.a.s.u.StartupLoggingUtils Missing Java Option solr.log.dir. Logging may be missing or incomplete.
   [junit4]   2> 2194268 ERROR (jetty-launcher-6174-thread-2) [    ] o.a.s.u.StartupLoggingUtils Missing Java Option solr.log.dir. Logging may be missing or incomplete.
   [junit4]   2> 2194268 INFO  (jetty-launcher-6174-thread-1) [    ] o.a.s.s.SolrDispatchFilter  ___      _       Welcome to Apache Solr? version 8.0.0
   [junit4]   2> 2194268 INFO  (jetty-launcher-6174-thread-2) [    ] o.a.s.s.SolrDispatchFilter  ___      _       Welcome to Apache Solr? version 8.0.0
   [junit4]   2> 2194269 INFO  (jetty-launcher-6174-thread-1) [    ] o.a.s.s.SolrDispatchFilter / __| ___| |_ _   Starting in cloud mode on port null
   [junit4]   2> 2194269 INFO  (jetty-launcher-6174-thread-2) [    ] o.a.s.s.SolrDispatchFilter / __| ___| |_ _   Starting in cloud mode on port null
   [junit4]   2> 2194269 INFO  (jetty-launcher-6174-thread-1) [    ] o.a.s.s.SolrDispatchFilter \__ \/ _ \ | '_|  Install dir: null
   [junit4]   2> 2194269 INFO  (jetty-launcher-6174-thread-2) [    ] o.a.s.s.SolrDispatchFilter \__ \/ _ \ | '_|  Install dir: null
   [junit4]   2> 2194269 INFO  (jetty-launcher-6174-thread-1) [    ] o.a.s.s.SolrDispatchFilter |___/\___/_|_|    Start time: 2018-02-01T04:31:35.495123Z
   [junit4]   2> 2194269 INFO  (jetty-launcher-6174-thread-2) [    ] o.a.s.s.SolrDispatchFilter |___/\___/_|_|    Start time: 2018-02-01T04:31:35.495160Z
   [junit4]   2> 2194269 INFO  (zkConnectionManagerCallback-6179-thread-1) [    ] o.a.s.c.c.ConnectionManager zkClient has connected
   [junit4]   2> 2194270 INFO  (zkConnectionManagerCallback-6181-thread-1) [    ] o.a.s.c.c.ConnectionManager zkClient has connected
   [junit4]   2> 2194270 INFO  (jetty-launcher-6174-thread-1) [    ] o.a.s.s.SolrDispatchFilter solr.xml found in ZooKeeper. Loading...
   [junit4]   2> 2194270 INFO  (jetty-launcher-6174-thread-2) [    ] o.a.s.s.SolrDispatchFilter solr.xml found in ZooKeeper. Loading...
   [junit4]   2> 2194273 INFO  (jetty-launcher-6174-thread-1) [    ] o.a.s.c.ZkContainer Zookeeper client=127.0.0.1:46059/solr
   [junit4]   2> 2194274 INFO  (jetty-launcher-6174-thread-2) [    ] o.a.s.c.ZkContainer Zookeeper client=127.0.0.1:46059/solr
   [junit4]   2> 2194274 INFO  (zkConnectionManagerCallback-6186-thread-1) [    ] o.a.s.c.c.ConnectionManager zkClient has connected
   [junit4]   2> 2194275 INFO  (zkConnectionManagerCallback-6189-thread-1) [    ] o.a.s.c.c.ConnectionManager zkClient has connected
   [junit4]   2> 2194275 INFO  (zkConnectionManagerCallback-6191-thread-1-processing-n:127.0.0.1:40655_solr) [n:127.0.0.1:40655_solr    ] o.a.s.c.c.ConnectionManager zkClient has connected
   [junit4]   2> 2194275 INFO  (zkConnectionManagerCallback-6193-thread-1-processing-n:127.0.0.1:34059_solr) [n:127.0.0.1:34059_solr    ] o.a.s.c.c.ConnectionManager zkClient has connected
   [junit4]   2> 2194302 INFO  (jetty-launcher-6174-thread-1) [n:127.0.0.1:40655_solr    ] o.a.s.c.Overseer Overseer (id=null) closing
   [junit4]   2> 2194302 INFO  (jetty-launcher-6174-thread-2) [n:127.0.0.1:34059_solr    ] o.a.s.c.Overseer Overseer (id=null) closing
   [junit4]   2> 2194302 INFO  (jetty-launcher-6174-thread-1) [n:127.0.0.1:40655_solr    ] o.a.s.c.OverseerElectionContext I am going to be the leader 127.0.0.1:40655_solr
   [junit4]   2> 2194302 INFO  (jetty-launcher-6174-thread-2) [n:127.0.0.1:34059_solr    ] o.a.s.c.ZkController Register node as live in ZooKeeper:/live_nodes/127.0.0.1:34059_solr
   [junit4]   2> 2194303 INFO  (jetty-launcher-6174-thread-1) [n:127.0.0.1:40655_solr    ] o.a.s.c.Overseer Overseer (id=72072186010075141-127.0.0.1:40655_solr-n_0000000000) starting
   [junit4]   2> 2194304 INFO  (zkCallback-6192-thread-1-processing-n:127.0.0.1:34059_solr) [n:127.0.0.1:34059_solr    ] o.a.s.c.c.ZkStateReader Updated live nodes from ZooKeeper... (0) -> (1)
   [junit4]   2> 2194304 INFO  (zkCallback-6190-thread-1-processing-n:127.0.0.1:40655_solr) [n:127.0.0.1:40655_solr    ] o.a.s.c.c.ZkStateReader Updated live nodes from ZooKeeper... (0) -> (1)
   [junit4]   2> 2194306 DEBUG (OverseerAutoScalingTriggerThread-72072186010075141-127.0.0.1:40655_solr-n_0000000000) [n:127.0.0.1:40655_solr    ] o.a.s.c.a.OverseerTriggerThread Adding .autoAddReplicas trigger
   [junit4]   2> 2194306 INFO  (jetty-launcher-6174-thread-1) [n:127.0.0.1:40655_solr    ] o.a.s.c.ZkController Register node as live in ZooKeeper:/live_nodes/127.0.0.1:40655_solr
   [junit4]   2> 2194306 DEBUG (OverseerAutoScalingTriggerThread-72072186010075141-127.0.0.1:40655_solr-n_0000000000) [n:127.0.0.1:40655_solr    ] o.a.s.c.a.OverseerTriggerThread Refreshing /autoscaling.json with znode version 1
   [junit4]   2> 2194306 DEBUG (OverseerAutoScalingTriggerThread-72072186010075141-127.0.0.1:40655_solr-n_0000000000) [n:127.0.0.1:40655_solr    ] o.a.s.c.a.NodeLostTrigger Initial livenodes: [127.0.0.1:34059_solr]
   [junit4]   2> 2194306 DEBUG (OverseerAutoScalingTriggerThread-72072186010075141-127.0.0.1:40655_solr-n_0000000000) [n:127.0.0.1:40655_solr    ] o.a.s.c.a.OverseerTriggerThread Current znodeVersion 1, lastZnodeVersion -1
   [junit4]   2> 2194306 DEBUG (OverseerAutoScalingTriggerThread-72072186010075141-127.0.0.1:40655_solr-n_0000000000) [n:127.0.0.1:40655_solr    ] o.a.s.c.a.OverseerTriggerThread Processed trigger updates upto znodeVersion 1
   [junit4]   2> 2194308 INFO  (zkCallback-6192-thread-1-processing-n:127.0.0.1:34059_solr) [n:127.0.0.1:34059_solr    ] o.a.s.c.c.ZkStateReader Updated live nodes from ZooKeeper... (1) -> (2)
   [junit4]   2> 2194308 INFO  (zkCallback-6190-thread-1-processing-n:127.0.0.1:40655_solr) [n:127.0.0.1:40655_solr    ] o.a.s.c.c.ZkStateReader Updated live nodes from ZooKeeper... (1) -> (2)
   [junit4]   2> 2194309 DEBUG (OverseerAutoScalingTriggerThread-72072186010075141-127.0.0.1:40655_solr-n_0000000000) [n:127.0.0.1:40655_solr    ] o.a.s.c.a.OverseerTriggerThread -- clean old nodeAdded markers
   [junit4]   2> 2194309 DEBUG (OverseerAutoScalingTriggerThread-72072186010075141-127.0.0.1:40655_solr-n_0000000000) [n:127.0.0.1:40655_solr    ] o.a.s.c.a.OverseerTriggerThread Current znodeVersion 1, lastZnodeVersion 1
   [junit4]   2> 2194309 DEBUG (ScheduledTrigger-8769-thread-1) [n:127.0.0.1:40655_solr    ] o.a.s.c.a.NodeLostTrigger Running NodeLostTrigger: .auto_add_replicas with currently live nodes: 2
   [junit4]   2> 2194358 INFO  (jetty-launcher-6174-thread-1) [n:127.0.0.1:40655_solr    ] o.a.s.m.r.SolrJmxReporter JMX monitoring for 'solr_40655.solr.node' (registry 'solr.node') enabled at server: com.sun.jmx.mbeanserver.JmxMBeanServer@7dff6729
   [junit4]   2> 2194364 INFO  (jetty-launcher-6174-thread-1) [n:127.0.0.1:40655_solr    ] o.a.s.m.r.SolrJmxReporter JMX monitoring for 'solr_40655.solr.jvm' (registry 'solr.jvm') enabled at server: com.sun.jmx.mbeanserver.JmxMBeanServer@7dff6729
   [junit4]   2> 2194364 INFO  (jetty-launcher-6174-thread-2) [n:127.0.0.1:34059_solr    ] o.a.s.m.r.SolrJmxReporter JMX monitoring for 'solr_34059.solr.node' (registry 'solr.node') enabled at server: com.sun.jmx.mbeanserver.JmxMBeanServer@7dff6729
   [junit4]   2> 2194364 INFO  (jetty-launcher-6174-thread-1) [n:127.0.0.1:40655_solr    ] o.a.s.m.r.SolrJmxReporter JMX monitoring for 'solr_40655.solr.jetty' (registry 'solr.jetty') enabled at server: com.sun.jmx.mbeanserver.JmxMBeanServer@7dff6729
   [junit4]   2> 2194365 INFO  (jetty-launcher-6174-thread-1) [n:127.0.0.1:40655_solr    ] o.a.s.c.CorePropertiesLocator Found 0 core definitions underneath /home/jenkins/workspace/Lucene-Solr-master-Linux/solr/build/solr-core/test/J1/temp/solr.cloud.autoscaling.TriggerIntegrationTest_2B791F8AD696B655-001/tempDir-001/node1/.
   [junit4]   2> 2194374 INFO  (jetty-launcher-6174-thread-2) [n:127.0.0.1:34059_solr    ] o.a.s.m.r.SolrJmxReporter JMX monitoring for 'solr_34059.solr.jvm' (registry 'solr.jvm') enabled at server: com.sun.jmx.mbeanserver.JmxMBeanServer@7dff6729
   [junit4]   2> 2194375 INFO  (jetty-launcher-6174-thread-2) [n:127.0.0.1:34059_solr    ] o.a.s.m.r.SolrJmxReporter JMX monitoring for 'solr_34059.solr.jetty' (registry 'solr.jetty') enabled at server: com.sun.jmx.mbeanserver.JmxMBeanServer@7dff6729
   [junit4]   2> 2194376 INFO  (jetty-launcher-6174-thread-2) [n:127.0.0.1:34059_solr    ] o.a.s.c.CorePropertiesLocator Found 0 core definitions underneath /home/jenkins/workspace/Lucene-Solr-master-Linux/solr/build/solr-core/test/J1/temp/solr.cloud.autoscaling.TriggerIntegrationTest_2B791F8AD696B655-001/tempDir-001/node2/.
   [junit4]   2> 2194394 INFO  (zkConnectionManagerCallback-6199-thread-1) [    ] o.a.s.c.c.ConnectionManager zkClient has connected
   [junit4]   2> 2194400 INFO  (zkConnectionManagerCallback-6203-thread-1) [    ] o.a.s.c.c.ConnectionManager zkClient has connected
   [junit4]   2> 2194401 INFO  (SUITE-TriggerIntegrationTest-seed#[2B791F8AD696B655]-worker) [    ] o.a.s.c.c.ZkStateReader Updated live nodes from ZooKeeper... (0) -> (2)
   [junit4]   2> 2194401 INFO  (SUITE-TriggerIntegrationTest-seed#[2B791F8AD696B655]-worker) [    ] o.a.s.c.s.i.ZkClientClusterStateProvider Cluster at 127.0.0.1:46059/solr ready
   [junit4]   2> 2194418 INFO  (TEST-TriggerIntegrationTest.testEventFromRestoredState-seed#[2B791F8AD696B655]) [    ] o.a.s.SolrTestCaseJ4 ###Starting testEventFromRestoredState
   [junit4]   2> 2194418 INFO  (TEST-TriggerIntegrationTest.testEventFromRestoredState-seed#[2B791F8AD696B655]) [    ] o.a.s.c.a.TriggerIntegrationTest /autoscaling.json reset, new znode version 2
   [junit4]   2> 2194419 DEBUG (zkCallback-6190-thread-1-processing-n:127.0.0.1:40655_solr) [n:127.0.0.1:40655_solr    ] o.a.s.c.a.OverseerTriggerThread Refreshing /autoscaling.json with znode version 2
   [junit4]   2> 2194419 DEBUG (OverseerAutoScalingTriggerThread-72072186010075141-127.0.0.1:40655_solr-n_0000000000) [n:127.0.0.1:40655_solr    ] o.a.s.c.a.OverseerTriggerThread Processed trigger updates upto znodeVersion 2
   [junit4]   2> 2194419 DEBUG (OverseerAutoScalingTriggerThread-72072186010075141-127.0.0.1:40655_solr-n_0000000000) [n:127.0.0.1:40655_solr    ] o.a.s.c.a.OverseerTriggerThread -- clean old nodeLost markers
   [junit4]   2> 2194419 DEBUG (OverseerAutoScalingTriggerThread-72072186010075141-127.0.0.1:40655_solr-n_0000000000) [n:127.0.0.1:40655_solr    ] o.a.s.c.a.OverseerTriggerThread -- clean old nodeAdded markers
   [junit4]   2> 2194419 DEBUG (OverseerAutoScalingTriggerThread-72072186010075141-127.0.0.1:40655_solr-n_0000000000) [n:127.0.0.1:40655_solr    ] o.a.s.c.a.OverseerTriggerThread Current znodeVersion 2, lastZnodeVersion 2
   [junit4]   2> 2194454 INFO  (qtp428420724-22931) [n:127.0.0.1:34059_solr    ] o.a.s.s.HttpSolrCall [admin] webapp=null path=/admin/metrics params={prefix=CONTAINER.fs.usableSpace,CORE.coreName&wt=javabin&version=2&group=solr.node,solr.core} status=0 QTime=0
   [junit4]   2> 2194476 INFO  (qtp1260021948-22942) [n:127.0.0.1:40655_solr    ] o.a.s.s.HttpSolrCall [admin] webapp=null path=/admin/metrics params={prefix=CONTAINER.fs.usableSpace,CORE.coreName&wt=javabin&version=2&group=solr.node,solr.core} status=0 QTime=0
   [junit4]   2> 2194476 DEBUG (qtp428420724-22939) [n:127.0.0.1:34059_solr    ] o.a.s.c.a.AutoScalingHandler Verified autoscaling configuration
   [junit4]   2> 2194476 INFO  (qtp428420724-22939) [n:127.0.0.1:34059_solr    ] o.a.s.s.HttpSolrCall [admin] webapp=null path=/admin/autoscaling params={wt=javabin&version=2} status=0 QTime=41
   [junit4]   2> 2194477 DEBUG (zkCallback-6190-thread-1-processing-n:127.0.0.1:40655_solr) [n:127.0.0.1:40655_solr    ] o.a.s.c.a.OverseerTriggerThread Refreshing /autoscaling.json with znode version 3
   [junit4]   2> 2194477 DEBUG (zkCallback-6190-thread-1-processing-n:127.0.0.1:40655_solr) [n:127.0.0.1:40655_solr    ] o.a.s.c.a.NodeAddedTrigger Initial livenodes: [127.0.0.1:40655_solr, 127.0.0.1:34059_solr]
   [junit4]   2> 2194477 DEBUG (zkCallback-6190-thread-1-processing-n:127.0.0.1:40655_solr) [n:127.0.0.1:40655_solr    ] o.a.s.c.a.NodeAddedTrigger NodeAddedTrigger node_added_triggerEFRS instantiated with properties: {event=nodeAdded, waitFor=10, actions=[{name=test, class=org.apache.solr.cloud.autoscaling.TriggerIntegrationTest$TestTriggerAction}], enabled=true}
   [junit4]   2> 2194477 DEBUG (OverseerAutoScalingTriggerThread-72072186010075141-127.0.0.1:40655_solr-n_0000000000) [n:127.0.0.1:40655_solr    ] o.a.s.c.a.OverseerTriggerThread Processed trigger updates upto znodeVersion 3
   [junit4]   2> 2194482 INFO  (OverseerAutoScalingTriggerThread-72072186010075141-127.0.0.1:40655_solr-n_0000000000) [n:127.0.0.1:40655_solr    ] o.a.s.c.a.TriggerIntegrationTest TestTriggerAction init
   [junit4]   2> 2194482 INFO  (qtp428420724-22941) [n:127.0.0.1:34059_solr    ] o.a.s.h.a.CollectionsHandler Invoked Collection Action :overseerstatus with params action=OVERSEERSTATUS&wt=javabin&version=2 and sendToOCPQueue=true
   [junit4]   2> 2194484 DEBUG (ScheduledTrigger-8769-thread-1) [n:127.0.0.1:40655_solr    ] o.a.s.c.a.NodeAddedTrigger Running NodeAddedTrigger node_added_triggerEFRS
   [junit4]   2> 2194484 DEBUG (ScheduledTrigger-8769-thread-1) [n:127.0.0.1:40655_solr    ] o.a.s.c.a.NodeAddedTrigger Found livenodes: 2
   [junit4]   2> 2194484 DEBUG (OverseerAutoScalingTriggerThread-72072186010075141-127.0.0.1:40655_solr-n_0000000000) [n:127.0.0.1:40655_solr    ] o.a.s.c.a.OverseerTriggerThread -- clean old nodeLost markers
   [junit4]   2> 2194484 DEBUG (OverseerAutoScalingTriggerThread-72072186010075141-127.0.0.1:40655_solr-n_0000000000) [n:127.0.0.1:40655_solr    ] o.a.s.c.a.OverseerTriggerThread Current znodeVersion 3, lastZnodeVersion 3
   [junit4]   2> 2194507 INFO  (qtp428420724-22941) [n:127.0.0.1:34059_solr    ] o.a.s.s.HttpSolrCall [admin] webapp=null path=/admin/collections params={action=OVERSEERSTATUS&wt=javabin&version=2} status=0 QTime=24
   [junit4]   2> 2194508 INFO  (TEST-TriggerIntegrationTest.testEventFromRestoredState-seed#[2B791F8AD696B655]) [    ] o.e.j.s.Server jetty-9.4.8.v20171121, build timestamp: ????-??-??T??:??:??+03:00, git hash: 82b8fb23f757335bb3329d540ce37a2a2615f0a8
   [junit4]   2> 2194523 INFO  (TEST-TriggerIntegrationTest.testEventFromRestoredState-seed#[2B791F8AD696B655]) [    ] o.e.j.s.session DefaultSessionIdManager workerName=node0
   [junit4]   2> 2194523 INFO  (TEST-TriggerIntegrationTest.testEventFromRestoredState-seed#[2B791F8AD696B655]) [    ] o.e.j.s.session No SessionScavenger set, using defaults
   [junit4]   2> 2194523 INFO  (TEST-TriggerIntegrationTest.testEventFromRestoredState-seed#[2B791F8AD696B655]) [    ] o.e.j.s.session Scavenging every 600000ms
   [junit4]   2> 2194523 INFO  (TEST-TriggerIntegrationTest.testEventFromRestoredState-seed#[2B791F8AD696B655]) [    ] o.e.j.s.h.ContextHandler Started o.e.j.s.ServletContextHandler@3538265d{/solr,null,AVAILABLE}
   [junit4]   2> 2194524 INFO  (TEST-TriggerIntegrationTest.testEventFromRestoredState-seed#[2B791F8AD696B655]) [    ] o.e.j.s.AbstractConnector Started ServerConnector@28a11d50{SSL,[ssl, http/1.1]}{127.0.0.1:45889}
   [junit4]   2> 2194524 INFO  (TEST-TriggerIntegrationTest.testEventFromRestoredState-seed#[2B791F8AD696B655]) [    ] o.e.j.s.Server Started @2197446ms
   [junit4]   2> 2194524 INFO  (TEST-TriggerIntegrationTest.testEventFromRestoredState-seed#[2B791F8AD696B655]) [    ] o.a.s.c.s.e.JettySolrRunner Jetty properties: {hostContext=/solr, hostPort=45889}
   [junit4]   2> 2194524 ERROR (TEST-TriggerIntegrationTest.testEventFromRestoredState-seed#[2B791F8AD696B655]) [    ] o.a.s.u.StartupLoggingUtils Missing Java Option solr.log.dir. Logging may be missing or incomplete.
   [junit4]   2> 2194524 INFO  (TEST-TriggerIntegrationTest.testEventFromRestoredState-seed#[2B791F8AD696B655]) [    ] o.a.s.s.SolrDispatchFilter  ___      _       Welcome to Apache Solr? version 8.0.0
   [junit4]   2> 2194524 INFO  (TEST-TriggerIntegrationTest.testEventFromRestoredState-seed#[2B791F8AD696B655]) [    ] o.a.s.s.SolrDispatchFilter / __| ___| |_ _   Starting in cloud mode on port null
   [junit4]   2> 2194524 INFO  (TEST-TriggerIntegrationTest.testEventFromRestoredState-seed#[2B791F8AD696B655]) [    ] o.a.s.s.SolrDispatchFilter \__ \/ _ \ | '_|  Install dir: null
   [junit4]   2> 2194524 INFO  (TEST-TriggerIntegrationTest.testEventFromRestoredState-seed#[2B791F8AD696B655]) [    ] o.a.s.s.SolrDispatchFilter |___/\___/_|_|    Start time: 2018-02-01T04:31:35.750806Z
   [junit4]   2> 2194527 INFO  (zkConnectionManagerCallback-6205-thread-1) [    ] o.a.s.c.c.ConnectionManager zkClient has connected
   [junit4]   2> 2194528 INFO  (TEST-TriggerIntegrationTest.testEventFromRestoredState-seed#[2B791F8AD696B655]) [    ] o.a.s.s.SolrDispatchFilter solr.xml found in ZooKeeper. Loading...
   [junit4]   2> 2194533 INFO  (TEST-TriggerIntegrationTest.testEventFromRestoredState-seed#[2B791F8AD696B655]) [    ] o.a.s.c.ZkContainer Zookeeper client=127.0.0.1:46059/solr
   [junit4]   2> 2194534 INFO  (zkConnectionManagerCallback-6209-thread-1) [    ] o.a.s.c.c.ConnectionManager zkClient has connected
   [junit4]   2> 2194535 INFO  (zkConnectionManagerCallback-6211-thread-1-processing-n:127.0.0.1:45889_solr) [n:127.0.0.1:45889_solr    ] o.a.s.c.c.ConnectionManager zkClient has connected
   [junit4]   2> 2194537 INFO  (TEST-TriggerIntegrationTest.testEventFromRestoredState-seed#[2B791F8AD696B655]) [n:127.0.0.1:45889_solr    ] o.a.s.c.c.ZkStateReader Updated live nodes from ZooKeeper... (0) -> (2)
   [junit4]   2> 2194538 INFO  (TEST-TriggerIntegrationTest.testEventFromRestoredState-seed#[2B791F8AD696B655]) [n:127.0.0.1:45889_solr    ] o.a.s.c.Overseer Overseer (id=null) closing
   [junit4]   2> 2194538 INFO  (TEST-TriggerIntegrationTest.testEventFromRestoredState-seed#[2B791F8AD696B655]) [n:127.0.0.1:45889_solr    ] o.a.s.c.ZkController Register node as live in ZooKeeper:/live_nodes/127.0.0.1:45889_solr
   [junit4]   2> 2194539 INFO  (zkCallback-6192-thread-1-processing-n:127.0.0.1:34059_solr) [n:127.0.0.1:34059_solr    ] o.a.s.c.c.ZkStateReader Updated live nodes from ZooKeeper... (2) -> (3)
   [junit4]   2> 2194539 INFO  (zkCallback-6190-thread-1-processing-n:127.0.0.1:40655_solr) [n:127.0.0.1:40655_solr    ] o.a.s.c.c.ZkStateReader Updated live nodes from ZooKeeper... (2) -> (3)
   [junit4]   2> 2194540 INFO  (zkCallback-6210-thread-1-processing-n:127.0.0.1:45889_solr) [n:127.0.0.1:45889_solr    ] o.a.s.c.c.ZkStateReader Updated live nodes from ZooKeeper... (2) -> (3)
   [junit4]   2> 2194541 INFO  (zkCallback-6202-thread-1) [    ] o.a.s.c.c.ZkStateReader Updated live nodes from ZooKeeper... (2) -> (3)
   [junit4]   2> 2194563 INFO  (TEST-TriggerIntegrationTest.testEventFromRestoredState-seed#[2B791F8AD696B655]) [n:127.0.0.1:45889_solr    ] o.a.s.m.r.SolrJmxReporter JMX monitoring for 'solr_45889.solr.node' (registry 'solr.node') enabled at server: com.sun.jmx.mbeanserver.JmxMBeanServer@7dff6729
   [junit4]   2> 2194570 INFO  (TEST-TriggerIntegrationTest.testEventFromRestoredState-seed#[2B791F8AD696B655]) [n:127.0.0.1:45889_solr    ] o.a.s.m.r.SolrJmxReporter JMX monitoring for 'solr_45889.solr.jvm' (registry 'solr.jvm') enabled at server: com.sun.jmx.mbeanserver.JmxMBeanServer@7dff6729
   [junit4]   2> 2194571 INFO  (TEST-TriggerIntegrationTest.testEventFromRestoredState-seed#[2B791F8AD696B655]) [n:127.0.0.1:45889_solr    ] o.a.s.m.r.SolrJmxReporter JMX monitoring for 'solr_45889.solr.jetty' (registry 'solr.jetty') enabled at server: com.sun.jmx.mbeanserver.JmxMBeanServer@7dff6729
   [junit4]   2> 2194572 INFO  (TEST-TriggerIntegrationTest.testEventFromRestoredState-seed#[2B791F8AD696B655]) [n:127.0.0.1:45889_solr    ] o.a.s.c.CorePropertiesLocator Found 0 core definitions underneath /home/jenkins/workspace/Lucene-Solr-master-Linux/solr/build/solr-core/test/J1/temp/solr.cloud.autoscaling.TriggerIntegrationTest_2B791F8AD696B655-001/tempDir-001/node3/.
   [junit4]   2> 2195484 DEBUG (ScheduledTrigger-8769-thread-2) [n:127.0.0.1:40655_solr    ] o.a.s.c.a.NodeAddedTrigger Running NodeAddedTrigger node_added_triggerEFRS
   [junit4]   2> 2195484 DEBUG (ScheduledTrigger-8769-thread-2) [n:127.0.0.1:40655_solr    ] o.a.s.c.a.NodeAddedTrigger Found livenodes: 3
   [junit4]   2> 2195484 DEBUG (ScheduledTrigger-8769-thread-2) [n:127.0.0.1:40655_solr    ] o.a.s.c.a.NodeAddedTrigger Tracking new node: 127.0.0.1:45889_solr at time 222657148428539
   [junit4]   2> 2196485 DEBUG (ScheduledTrigger-8769-thread-2) [n:127.0.0.1:40655_solr    ] o.a.s.c.a.NodeAddedTrigger Running NodeAddedTrigger node_added_triggerEFRS
   [junit4]   2> 2196485 DEBUG (ScheduledTrigger-8769-thread-2) [n:127.0.0.1:40655_solr    ] o.a.s.c.a.NodeAddedTrigger Found livenodes: 3
   [junit4]   2> 2196493 INFO  (OverseerCollectionConfigSetProcessor-72072186010075141-127.0.0.1:40655_solr-n_0000000000) [n:127.0.0.1:40655_solr    ] o.a.s.c.OverseerTaskQueue Response ZK path: /overseer/collection-queue-work/qnr-0000000000 doesn't exist.  Requestor may have disconnected from ZooKeeper
   [junit4]   2> 2197485 DEBUG (ScheduledTrigger-8769-thread-2) [n:127.0.0.1:40655_solr    ] o.a.s.c.a.NodeAddedTrigger Running NodeAddedTrigger node_added_triggerEFRS
   [junit4]   2> 2197485 DEBUG (ScheduledTrigger-8769-thread-2) [n:127.0.0.1:40655_solr    ] o.a.s.c.a.NodeAddedTrigger Found livenodes: 3
   [junit4]   2> 2198486 DEBUG (ScheduledTrigger-8769-thread-2) [n:127.0.0.1:40655_solr    ] o.a.s.c.a.NodeAddedTrigger Running NodeAddedTrigger node_added_triggerEFRS
   [junit4]   2> 2198486 DEBUG (ScheduledTrigger-8769-thread-2) [n:127.0.0.1:40655_solr    ] o.a.s.c.a.NodeAddedTrigger Found livenodes: 3
   [junit4]   2> 2199486 DEBUG (ScheduledTrigger-8769-thread-2) [n:127.0.0.1:40655_solr    ] o.a.s.c.a.NodeAddedTrigger Running NodeAddedTrigger node_added_triggerEFRS
   [junit4]   2> 2199486 DEBUG (ScheduledTrigger-8769-thread-2) [n:127.0.0.1:40655_solr    ] o.a.s.c.a.NodeAddedTrigger Found livenodes: 3
   [junit4]   2> 2200486 DEBUG (ScheduledTrigger-8769-thread-2) [n:127.0.0.1:40655_solr    ] o.a.s.c.a.NodeAddedTrigger Running NodeAddedTrigger node_added_triggerEFRS
   [junit4]   2> 2200486 DEBUG (ScheduledTrigger-8769-thread-2) [n:127.0.0.1:40655_solr    ] o.a.s.c.a.NodeAddedTrigger Found livenodes: 3
   [junit4]   2> 2201486 DEBUG (ScheduledTrigger-8769-thread-2) [n:127.0.0.1:40655_solr    ] o.a.s.c.a.NodeAddedTrigger Running NodeAddedTrigger node_added_triggerEFRS
   [junit4]   2> 2201486 DEBUG (ScheduledTrigger-8769-thread-2) [n:127.0.0.1:40655_solr    ] o.a.s.c.a.NodeAddedTrigger Found livenodes: 3
   [junit4]   2> 2202486 DEBUG (ScheduledTrigger-8769-thread-2) [n:127.0.0.1:40655_solr    ] o.a.s.c.a.NodeAddedTrigger Running NodeAddedTrigger node_added_triggerEFRS
   [junit4]   2> 2202487 DEBUG (ScheduledTrigger-8769-thread-2) [n:127.0.0.1:40655_solr    ] o.a.s.c.a.NodeAddedTrigger Found livenodes: 3
   [junit4]   2> 2203487 DEBUG (ScheduledTrigger-8769-thread-2) [n:127.0.0.1:40655_solr    ] o.a.s.c.a.NodeAddedTrigger Running NodeAddedTrigger node_added_triggerEFRS
   [junit4]   2> 2203487 DEBUG (ScheduledTrigger-8769-thread-2) [n:127.0.0.1:40655_solr    ] o.a.s.c.a.NodeAddedTrigger Found livenodes: 3
   [junit4]   2> 2204487 DEBUG (ScheduledTrigger-8769-thread-2) [n:127.0.0.1:40655_solr    ] o.a.s.c.a.NodeAddedTrigger Running NodeAddedTrigger node_added_triggerEFRS
   [junit4]   2> 2204487 DEBUG (ScheduledTrigger-8769-thread-2) [n:127.0.0.1:40655_solr    ] o.a.s.c.a.NodeAddedTrigger Found livenodes: 3
   [junit4]   2> 2205487 DEBUG (ScheduledTrigger-8769-thread-2) [n:127.0.0.1:40655_solr    ] o.a.s.c.a.NodeAddedTrigger Running NodeAddedTrigger node_added_triggerEFRS
   [junit4]   2> 2205487 DEBUG (ScheduledTrigger-8769-thread-2) [n:127.0.0.1:40655_solr    ] o.a.s.c.a.NodeAddedTrigger Found livenodes: 3
   [junit4]   2> 2205488 DEBUG (ScheduledTrigger-8769-thread-2) [n:127.0.0.1:40655_solr    ] o.a.s.c.a.NodeAddedTrigger NodeAddedTrigger node_added_triggerEFRS firing registered processor for nodes: [127.0.0.1:45889_solr] added at times [222657148428539], now=222667151484951
   [junit4]   2> 2205488 DEBUG (ScheduledTrigger-8769-thread-2) [n:127.0.0.1:40655_solr    ] o.a.s.c.a.ScheduledTriggers ++++++++ Cooldown inactive - processing event: {
   [junit4]   2>   "id":"ca81683d20fbTcg0pd4zrqj0brxzp4xo4cku3g",
   [junit4]   2>   "source":"node_added_triggerEFRS",
   [junit4]   2>   "eventTime":222657148428539,
   [junit4]   2>   "eventType":"NODEADDED",
   [junit4]   2>   "properties":{
   [junit4]   2>     "eventTimes":[222657148428539],
   [junit4]   2>     "nodeNames":["127.0.0.1:45889_solr"]}}
   [junit4]   2> 2205488 DEBUG (ScheduledTrigger-8769-thread-2) [n:127.0.0.1:40655_solr    ] o.a.s.c.a.ScheduledTriggers Pausing all triggers: [node_added_triggerEFRS]
   [junit4]   2> 2205489 INFO  (ScheduledTrigger-8769-thread-2) [n:127.0.0.1:40655_solr    ] o.a.s.c.a.SystemLogListener Collection .system does not exist, disabling logging.
   [junit4]   2> 2205489 DEBUG (AutoscalingActionExecutor-8770-thread-1-processing-n:127.0.0.1:40655_solr) [n:127.0.0.1:40655_solr    ] o.a.s.c.a.ScheduledTriggers -- processing actions for {
   [junit4]   2>   "id":"ca81683d20fbTcg0pd4zrqj0brxzp4xo4cku3g",
   [junit4]   2>   "source":"node_added_triggerEFRS",
   [junit4]   2>   "eventTime":222657148428539,
   [junit4]   2>   "eventType":"NODEADDED",
   [junit4]   2>   "properties":{
   [junit4]   2>     "eventTimes":[222657148428539],
   [junit4]   2>     "_enqueue_time_":222667151984024,
   [junit4]   2>     "nodeNames":["127.0.0.1:45889_solr"]}}
   [junit4]   2> 2205489 DEBUG (AutoscalingActionExecutor-8770-thread-1-processing-n:127.0.0.1:40655_solr) [n:127.0.0.1:40655_solr    ] o.a.s.c.a.ScheduledTriggers Resuming trigger: node_added_triggerEFRS after 5000ms
   [junit4]   2> 2205489 DEBUG (AutoscalingActionExecutor-8770-thread-1-processing-n:127.0.0.1:40655_solr) [n:127.0.0.1:40655_solr    ] o.a.s.c.a.ScheduledTriggers -- processing took 0 ms for event id=ca81683d20fbTcg0pd4zrqj0brxzp4xo4cku3g
   [junit4]   2> 2205490 INFO  (TEST-TriggerIntegrationTest.testEventFromRestoredState-seed#[2B791F8AD696B655]) [    ] o.e.j.s.Server jetty-9.4.8.v20171121, build timestamp: ????-??-??T??:??:??+03:00, git hash: 82b8fb23f757335bb3329d540ce37a2a2615f0a8
   [junit4]   2> 2205491 INFO  (TEST-TriggerIntegrationTest.testEventFromRestoredState-seed#[2B791F8AD696B655]) [    ] o.e.j.s.session DefaultSessionIdManager workerName=node0
   [junit4]   2> 2205491 INFO  (TEST-TriggerIntegrationTest.testEventFromRestoredState-seed#[2B791F8AD696B655]) [    ] o.e.j.s.session No SessionScavenger set, using defaults
   [junit4]   2> 2205491 INFO  (TEST-TriggerIntegrationTest.testEventFromRestoredState-seed#[2B791F8AD696B655]) [    ] o.e.j.s.session Scavenging every 600000ms
   [junit4]   2> 2205491 INFO  (TEST-TriggerIntegrationTest.testEventFromRestoredState-seed#[2B791F8AD696B655]) [    ] o.e.j.s.h.ContextHandler Started o.e.j.s.ServletContextHandler@2d6e4314{/solr,null,AVAILABLE}
   [junit4]   2> 2205492 INFO  (TEST-TriggerIntegrationTest.testEventFromRestoredState-seed#[2B791F8AD696B655]) [    ] o.e.j.s.AbstractConnector Started ServerConnector@138131c8{SSL,[ssl, http/1.1]}{127.0.0.1:35231}
   [junit4]   2> 2205492 INFO  (TEST-TriggerIntegrationTest.testEventFromRestoredState-seed#[2B791F8AD696B655]) [    ] o.e.j.s.Server Started @2208414ms
   [junit4]   2> 2205492 INFO  (TEST-TriggerIntegrationTest.testEventFromRestoredState-seed#[2B791F8AD696B655]) [    ] o.a.s.c.s.e.JettySolrRunner Jetty properties: {hostContext=/solr, hostPort=35231}
   [junit4]   2> 2205492 ERROR (TEST-TriggerIntegrationTest.testEventFromRestoredState-seed#[2B791F8AD696B655]) [    ] o.a.s.u.StartupLoggingUtils Missing Java Option solr.log.dir. Logging may be missing or incomplete.
   [junit4]   2> 2205492 INFO  (TEST-TriggerIntegrationTest.testEventFromRestoredState-seed#[2B791F8AD696B655]) [    ] o.a.s.s.SolrDispatchFilter  ___      _       Welcome to Apache Solr? version 8.0.0
   [junit4]   2> 2205492 INFO  (TEST-TriggerIntegrationTest.testEventFromRestoredState-seed#[2B791F8AD696B655]) [    ] o.a.s.s.SolrDispatchFilter / __| ___| |_ _   Starting in cloud mode on port null
   [junit4]   2> 2205492 INFO  (TEST-TriggerIntegrationTest.testEventFromRestoredState-seed#[2B791F8AD696B655]) [    ] o.a.s.s.SolrDispatchFilter \__ \/ _ \ | '_|  Install dir: null
   [junit4]   2> 2205492 INFO  (TEST-TriggerIntegrationTest.testEventFromRestoredState-seed#[2B791F8AD696B655]) [    ] o.a.s.s.SolrDispatchFilter |___/\___/_|_|    Start time: 2018-02-01T04:31:46.718774Z
   [junit4]   2> 2205493 INFO  (zkConnectionManagerCallback-6215-thread-1) [    ] o.a.s.c.c.ConnectionManager zkClient has connected
   [junit4]   2> 2205494 INFO  (TEST-TriggerIntegrationTest.testEventFromRestoredState-seed#[2B791F8AD696B655]) [    ] o.a.s.s.SolrDispatchFilter solr.xml found in ZooKeeper. Loading...
   [junit4]   2> 2205512 INFO  (TEST-TriggerIntegrationTest.testEventFromRestoredState-seed#[2B791F8AD696B655]) [    ] o.a.s.c.ZkContainer Zookeeper client=127.0.0.1:46059/solr
   [junit4]   2> 2205512 INFO  (zkConnectionManagerCallback-6219-thread-1) [    ] o.a.s.c.c.ConnectionManager zkClient has connected
   [junit4]   2> 2205514 INFO  (zkConnectionManagerCallback-6221-thread-1-processing-n:127.0.0.1:35231_solr) [n:127.0.0.1:35231_solr    ] o.a.s.c.c.ConnectionManager zkClient has connected
   [junit4]   2> 2205517 INFO  (TEST-TriggerIntegrationTest.testEventFromRestoredState-seed#[2B791F8AD696B655]) [n:127.0.0.1:35231_solr    ] o.a.s.c.c.ZkStateReader Updated live nodes from ZooKeeper... (0) -> (3)
   [junit4]   2> 2205518 INFO  (TEST-TriggerIntegrationTest.testEventFromRestoredState-seed#[2B791F8AD696B655]) [n:127.0.0.1:35231_solr    ] o.a.s.c.Overseer Overseer (id=null) closing
   [junit4]   2> 2205519 INFO  (TEST-TriggerIntegrationTest.testEventFromRestoredState-seed#[2B791F8AD696B655]) [n:127.0.0.1:35231_solr    ] o.a.s.c.ZkController Register node as live in ZooKeeper:/live_nodes/127.0.0.1:35231_solr
   [junit4]   2> 2205520 INFO  (zkCallback-6192-thread-1-processing-n:127.0.0.1:34059_solr) [n:127.0.0.1:34059_solr    ] o.a.s.c.c.ZkStateReader Updated live nodes from ZooKeeper... (3) -> (4)
   [junit4]   2> 2205520 INFO  (zkCallback-6210-thread-1-processing-n:127.0.0.1:45889_solr) [n:127.0.0.1:45889_solr    ] o.a.s.c.c.ZkStateReader Updated live nodes from ZooKeeper... (3) -> (4)
   [junit4]   2> 2205520 INFO  (zkCallback-6190-thread-1-processing-n:127.0.0.1:40655_solr) [n:127.0.0.1:40655_solr    ] o.a.s.c.c.ZkStateReader Updated live nodes from ZooKeeper... (3) -> (4)
   [junit4]   2> 2205520 INFO  (zkCallback-6202-thread-1) [    ] o.a.s.c.c.ZkStateReader Updated live nodes from ZooKeeper... (3) -> (4)
   [junit4]   2> 2205520 INFO  (zkCallback-6220-thread-1-processing-n:127.0.0.1:35231_solr) [n:127.0.0.1:35231_solr    ] o.a.s.c.c.ZkStateReader Updated live nodes from ZooKeeper... (3) -> (4)
   [junit4]   2> 2205563 INFO  (TEST-TriggerIntegrationTest.testEventFromRestoredState-seed#[2B791F8AD696B655]) [n:127.0.0.1:35231_solr    ] o.a.s.m.r.SolrJmxReporter JMX monitoring for 'solr_35231.solr.node' (registry 'solr.node') enabled at server: com.sun.jmx.mbeanserver.JmxMBeanServer@7dff6729
   [junit4]   2> 2205571 INFO  (TEST-TriggerIntegrationTest.testEventFromRestoredState-seed#[2B791F8AD696B655]) [n:127.0.0.1:35231_solr    ] o.a.s.m.r.SolrJmxReporter JMX monitoring for 'solr_35231.solr.jvm' (registry 'solr.jvm') enabled at server: com.sun.jmx.mbeanserver.JmxMBeanServer@7dff6729
   [junit4]   2> 2205571 INFO  (TEST-TriggerIntegrationTest.testEventFromRestoredState-seed#[2B791F8AD696B655]) [n:127.0.0.1:35231_solr    ] o.a.s.m.r.SolrJmxReporter JMX monitoring for 'solr_35231.solr.jetty' (registry 'solr.jetty') enabled at server: com.sun.jmx.mbeanserver.JmxMBeanServer@7dff6729
   [junit4]   2> 2205572 INFO  (TEST-TriggerIntegrationTest.testEventFromRestoredState-seed#[2B791F8AD696B655]) [n:127.0.0.1:35231_solr    ] o.a.s.c.CorePropertiesLocator Found 0 core definitions underneath /home/jenkins/workspace/Lucene-Solr-master-Linux/solr/build/solr-core/test/J1/temp/solr.cloud.autoscaling.TriggerIntegrationTest_2B791F8AD696B655-001/tempDir-001/node4/.
   [junit4]   2> 2210490 DEBUG (ScheduledTrigger-8769-thread-1) [n:127.0.0.1:40655_solr    ] o.a.s.c.a.NodeAddedTrigger Running NodeAddedTrigger node_added_triggerEFRS
   [junit4]   2> 2210490 DEBUG (ScheduledTrigger-8769-thread-1) [n:127.0.0.1:40655_solr    ] o.a.s.c.a.NodeAddedTrigger Found livenodes: 4
   [junit4]   2> 2210490 DEBUG (ScheduledTrigger-8769-thread-1) [n:127.0.0.1:40655_solr    ] o.a.s.c.a.NodeAddedTrigger Tracking new node: 127.0.0.1:35231_solr at time 222672153738199
   [junit4]   2> 2211490 DEBUG (ScheduledTrigger-8769-thread-1) [n:127.0.0.1:40655_solr    ] o.a.s.c.a.NodeAddedTrigger Running NodeAddedTrigger node_added_triggerEFRS
   [junit4]   2> 2211490 DEBUG (ScheduledTrigger-8769-thread-1) [n:127.0.0.1:40655_solr    ] o.a.s.c.a.NodeAddedTrigger Found livenodes: 4
   [junit4]   2> 2212491 DEBUG (ScheduledTrigger-8769-thread-1) [n:127.0.0.1:40655_solr    ] o.a.s.c.a.NodeAddedTrigger Running NodeAddedTrigger node_added_triggerEFRS
   [junit4]   2> 2212491 DEBUG (ScheduledTrigger-8769-thread-1) [n:127.0.0.1:40655_solr    ] o.a.s.c.a.NodeAddedTrigger Found livenodes: 4
   [junit4]   2> 2213491 DEBUG (ScheduledTrigger-8769-thread-1) [n:127.0.0.1:40655_solr    ] o.a.s.c.a.NodeAddedTrigger Running NodeAddedTrigger node_added_triggerEFRS
   [junit4]   2> 2213491 DEBUG (ScheduledTrigger-8769-thread-1) [n:127.0.0.1:40655_solr    ] o.a.s.c.a.NodeAddedTrigger Found livenodes: 4
   [junit4]   2> 2214491 DEBUG (ScheduledTrigger-8769-thread-1) [n:127.0.0.1:40655_solr    ] o.a.s.c.a.NodeAddedTrigger Running NodeAddedTrigger node_added_triggerEFRS
   [junit4]   2> 2214491 DEBUG (ScheduledTrigger-8769-thread-1) [n:127.0.0.1:40655_solr    ] o.a.s.c.a.NodeAddedTrigger Found livenodes: 4
   [junit4]   2> 2215491 DEBUG (ScheduledTrigger-8769-thread-1) [n:127.0.0.1:40655_solr    ] o.a.s.c.a.NodeAddedTrigger Running NodeAddedTrigger node_added_triggerEFRS
   [junit4]   2> 2215491 DEBUG (ScheduledTrigger-8769-thread-1) [n:127.0.0.1:40655_solr    ] o.a.s.c.a.NodeAddedTrigger Found livenodes: 4
   [junit4]   2> 2215604 INFO  (TEST-TriggerIntegrationTest.testEventFromRestoredState-seed#[2B791F8AD696B655]) [    ] o.e.j.s.AbstractConnector Stopped ServerConnector@3e1360d{SSL,[ssl, http/1.1]}{127.0.0.1:0}
   [junit4]   2> 2215605 INFO  (TEST-TriggerIntegrationTest.testEventFromRestoredState-seed#[2B791F8AD696B655]) [    ] o.a.s.c.CoreContainer Shutting down CoreContainer instance=1256080024
   [junit4]   2> 2215605 INFO  (TEST-TriggerIntegrationTest.testEventFromRestoredState-seed#[2B791F8AD696B655]) [    ] o.a.s.m.SolrMetricManager Closing metric reporters for registry=solr.node, tag=null
   [junit4]   2> 2215605 INFO  (TEST-TriggerIntegrationTest.testEventFromRestoredState-seed#[2B791F8AD696B655]) [    ] o.a.s.m.r.SolrJmxReporter Closing reporter [org.apache.solr.metrics.reporters.SolrJmxReporter@5a5ab6b8: rootName = solr_40655, domain = solr.node, service url = null, agent id = null] for registry solr.node / com.codahale.metrics.MetricRegistry@2057640b
   [junit4]   2> 2215610 INFO  (TEST-TriggerIntegrationTest.testEventFromRestoredState-seed#[2B791F8AD696B655]) [    ] o.a.s.m.SolrMetricManager Closing metric reporters for registry=solr.jvm, tag=null
   [junit4]   2> 2215610 INFO  (TEST-TriggerIntegrationTest.testEventFromRestoredState-seed#[2B791F8AD696B655]) [    ] o.a.s.m.r.SolrJmxReporter Closing reporter [org.apache.solr.metrics.reporters.SolrJmxReporter@645900e8: rootName = solr_40655, domain = solr.jvm, service url = null, agent id = null] for registry solr.jvm / com.codahale.metrics.MetricRegistry@640504bb
   [junit4]   2> 2215613 INFO  (TEST-TriggerIntegrationTest.testEventFromRestoredState-seed#[2B791F8AD696B655]) [    ] o.a.s.m.SolrMetricManager Closing metric reporters for registry=solr.jetty, tag=null
   [junit4]   2> 2215614 INFO  (TEST-TriggerIntegrationTest.testEventFromRestoredState-seed#[2B791F8AD696B655]) [    ] o.a.s.m.r.SolrJmxReporter Closing reporter [org.apache.solr.metrics.reporters.SolrJmxReporter@7396d0f6: rootName = solr_40655, domain = solr.jetty, service url = null, agent id = null] for registry solr.jetty / com.codahale.metrics.MetricRegistry@3ebddd14
   [junit4]   2> 2215614 INFO  (TEST-TriggerIntegrationTest.testEventFromRestoredState-seed#[2B791F8AD696B655]) [    ] o.a.s.c.ZkController Remove node as live in ZooKeeper:/live_nodes/127.0.0.1:40655_solr
   [junit4]   2> 2215615 INFO  (TEST-TriggerIntegrationTest.testEventFromRestoredState-seed#[2B791F8AD696B655]) [    ] o.a.s.m.SolrMetricManager Closing metric reporters for registry=solr.cluster, tag=null
   [junit4]   2> 2215615 INFO  (zkCallback-6190-thread-1-processing-n:127.0.0.1:40655_solr) [n:127.0.0.1:40655_solr    ] o.a.s.c.c.ZkStateReader Updated live nodes from ZooKeeper... (4) -> (3)
   [junit4]   2> 2215615 INFO  (zkCallback-6192-thread-1-processing-n:127.0.0.1:34059_solr) [n:127.0.0.1:34059_solr    ] o.a.s.c.c.ZkStateReader Updated live nodes from ZooKeeper... (4) -> (3)
   [junit4]   2> 2215615 INFO  (TEST-TriggerIntegrationTest.testEventFromRestoredState-seed#[2B791F8AD696B655]) [    ] o.a.s.c.TransientSolrCoreCacheDefault Allocating transient cache for 2147483647 transient cores
   [junit4]   2> 2215615 INFO  (zkCallback-6210-thread-1-processing-n:127.0.0.1:45889_solr) [n:127.0.0.1:45889_solr    ] o.a.s.c.c.ZkStateReader Updated live nodes from ZooKeeper... (4) -> (3)
   [junit4]   2> 2215615 INFO  (zkCallback-6202-thread-1) [    ] o.a.s.c.c.ZkStateReader Updated live nodes from ZooKeeper... (4) -> (3)
   [junit4]   2> 2215615 INFO  (zkCallback-6220-thread-1-processing-n:127.0.0.1:35231_solr) [n:127.0.0.1:35231_solr    ] o.a.s.c.c.ZkStateReader Updated live nodes from ZooKeeper... (4) -> (3)
   [junit4]   2> 2215615 INFO  (TEST-TriggerIntegrationTest.testEventFromRestoredState-seed#[2B791F8AD696B655]) [    ] o.a.s.c.Overseer Overseer (id=72072186010075141-127.0.0.1:40655_solr-n_0000000000) closing
   [junit4]   2> 2215615 INFO  (OverseerStateUpdate-72072186010075141-127.0.0.1:40655_solr-n_0000000000) [n:127.0.0.1:40655_solr    ] o.a.s.c.Overseer Overseer Loop exiting : 127.0.0.1:40655_solr
   [junit4]   2> 2215615 WARN  (OverseerAutoScalingTriggerThread-72072186010075141-127.0.0.1:40655_solr-n_0000000000) [n:127.0.0.1:40655_solr    ] o.a.s.c.a.OverseerTriggerThread OverseerTriggerThread woken up but we are closed, exiting.
   [junit4]   2> 2215615 DEBUG (TEST-TriggerIntegrationTest.testEventFromRestoredState-seed#[2B791F8AD696B655]) [    ] o.a.s.c.a.OverseerTriggerThread OverseerTriggerThread has been closed explicitly
   [junit4]   2> 2215617 INFO  (TEST-TriggerIntegrationTest.testEventFromRestoredState-seed#[2B791F8AD696B655]) [    ] o.e.j.s.h.ContextHandler Stopped o.e.j.s.ServletContextHandler@43547fb0{/solr,null,UNAVAILABLE}
   [junit4]   2> 2215617 INFO  (zkCallback-6192-thread-1-processing-n:127.0.0.1:34059_solr) [n:127.0.0.1:34059_solr    ] o.a.s.c.OverseerElectionContext I am going to be the leader 127.0.0.1:34059_solr
   [junit4]   2> 2215617 INFO  (TEST-TriggerIntegrationTest.testEventFromRestoredState-seed#[2B791F8AD696B655]) [    ] o.e.j.s.session Stopped scavenging
   [junit4]   2> 2215617 INFO  (zkCallback-6192-thread-1-processing-n:127.0.0.1:34059_solr) [n:127.0.0.1:34059_solr    ] o.a.s.c.Overseer Overseer (id=72072186010075142-127.0.0.1:34059_solr-n_0000000001) starting
   [junit4]   2> 2215619 DEBUG (OverseerAutoScalingTriggerThread-72072186010075142-127.0.0.1:34059_solr-n_0000000001) [n:127.0.0.1:34059_solr    ] o.a.s.c.a.OverseerTriggerThread Adding .autoAddReplicas trigger
   [junit4]   2> 2215620 DEBUG (OverseerAutoScalingTriggerThread-72072186010075142-127.0.0.1:34059_solr-n_0000000001) [n:127.0.0.1:34059_solr    ] o.a.s.c.a.OverseerTriggerThread Refreshing /autoscaling.json with znode version 4
   [junit4]   2> 2215620 DEBUG (OverseerAutoScalingTriggerThread-72072186010075142-127.0.0.1:34059_solr-n_0000000001) [n:127.0.0.1:34059_solr    ] o.a.s.c.a.NodeAddedTrigger Initial livenodes: [127.0.0.1:45889_solr, 127.0.0.1:35231_solr, 127.0.0.1:34059_solr]
   [junit4]   2> 2215620 DEBUG (OverseerAutoScalingTriggerThread-72072186010075142-127.0.0.1:34059_solr-n_0000000001) [n:127.0.0.1:34059_solr    ] o.a.s.c.a.NodeAddedTrigger NodeAddedTrigger node_added_triggerEFRS instantiated with properties: {event=nodeAdded, waitFor=10, actions=[{name=test, class=org.apache.solr.cloud.autoscaling.TriggerIntegrationTest$TestTriggerAction}], enabled=true}
   [junit4]   2> 2215620 DEBUG (OverseerAutoScalingTriggerThread-72072186010075142-127.0.0.1:34059_solr-n_0000000001) [n:127.0.0.1:34059_solr    ] o.a.s.c.a.NodeLostTrigger Initial livenodes: [127.0.0.1:45889_solr, 127.0.0.1:35231_solr, 127.0.0.1:34059_solr]
   [junit4]   2> 2215620 DEBUG (OverseerAutoScalingTriggerThread-72072186010075142-127.0.0.1:34059_solr-n_0000000001) [n:127.0.0.1:34059_solr    ] o.a.s.c.a.OverseerTriggerThread Current znodeVersion 4, lastZnodeVersion -1
   [junit4]   2> 2215620 DEBUG (OverseerAutoScalingTriggerThread-72072186010075142-127.0.0.1:34059_solr-n_0000000001) [n:127.0.0.1:34059_solr    ] o.a.s.c.a.OverseerTriggerThread Processed trigger updates upto znodeVersion 4
   [junit4]   2> 2215620 INFO  (OverseerAutoScalingTriggerThread-72072186010075142-127.0.0.1:34059_solr-n_0000000001) [n:127.0.0.1:34059_solr    ] o.a.s.c.a.TriggerIntegrationTest TestTriggerAction init
   [junit4]   2> 2215620 DEBUG (OverseerAutoScalingTriggerThread-72072186010075142-127.0.0.1:34059_solr-n_0000000001) [n:127.0.0.1:34059_solr    ] o.a.s.c.a.NodeAddedTrigger Adding node from marker path: 127.0.0.1:35231_solr
   [junit4]   2> 2215621 DEBUG (ScheduledTrigger-8790-thread-1) [n:127.0.0.1:34059_solr    ] o.a.s.c.a.NodeAddedTrigger Running NodeAddedTrigger node_added_triggerEFRS
   [junit4]   2> 2215621 DEBUG (ScheduledTrigger-8790-thread-1) [n:127.0.0.1:34059_solr    ] o.a.s.c.a.NodeAddedTrigger Found livenodes: 3
   [junit4]   2> 2215622 DEBUG (OverseerAutoScalingTriggerThread-72072186010075142-127.0.0.1:34059_solr-n_0000000001) [n:127.0.0.1:34059_solr    ] o.a.s.c.a.OverseerTriggerThread Current znodeVersion 4, lastZnodeVersion 4
   [junit4]   2> 2215622 DEBUG (ScheduledTrigger-8790-thread-1) [n:127.0.0.1:34059_solr    ] o.a.s.c.a.NodeLostTrigger Running NodeLostTrigger: .auto_add_replicas with currently live nodes: 3
   [junit4]   2> 2216622 DEBUG (ScheduledTrigger-8790-thread-2) [n:127.0.0.1:34059_solr    ] o.a.s.c.a.NodeAddedTrigger Running NodeAddedTrigger node_added_triggerEFRS
   [junit4]   2> 2216622 DEBUG (ScheduledTrigger-8790-thread-2) [n:127.0.0.1:34059_solr    ] o.a.s.c.a.NodeAddedTrigger Found livenodes: 3
   [junit4]   2> 2216622 DEBUG (ScheduledTrigger-8790-thread-3) [n:127.0.0.1:34059_solr    ] o.a.s.c.a.NodeLostTrigger Running NodeLostTrigger: .auto_add_replicas with currently live nodes: 3
   [junit4]   2> 2217622 DEBUG (ScheduledTrigger-8790-thread-2) [n:127.0.0.1:34059_solr    ] o.a.s.c.a.NodeAddedTrigger Running NodeAddedTrigger node_added_triggerEFRS
   [junit4]   2> 2217622 DEBUG (ScheduledTrigger-8790-thread-2) [n:127.0.0.1:34059_solr    ] o.a.s.c.a.NodeAddedTrigger Found livenodes: 3
   [junit4]   2> 2217622 DEBUG (ScheduledTrigger-8790-thread-4) [n:127.0.0.1:34059_solr    ] o.a.s.c.a.NodeLostTrigger Running NodeLostTrigger: .auto_add_replicas with currently live nodes: 3
   [junit4]   2> 2218623 DEBUG (ScheduledTrigger-8790-thread-2) [n:127.0.0.1:34059_solr    ] o.a.s.c.a.NodeAddedTrigger Running NodeAddedTrigger node_added_triggerEFRS
   [junit4]   2> 2218623 DEBUG (ScheduledTrigger-8790-thread-2) [n:127.0.0.1:34059_solr    ] o.a.s.c.a.NodeAddedTrigger Found livenodes: 3
   [junit4]   2> 2218623 DEBUG (ScheduledTrigger-8790-thread-3) [n:127.0.0.1:34059_solr    ] o.a.s.c.a.NodeLostTrigger Running NodeLostTrigger: .auto_add_replicas with currently live nodes: 3
   [junit4]   2> 2219623 DEBUG (ScheduledTrigger-8790-thread-2) [n:127.0.0.1:34059_solr    ] o.a.s.c.a.NodeAddedTrigger Running NodeAddedTrigger node_added_triggerEFRS
   [junit4]   2> 2219623 DEBUG (ScheduledTrigger-8790-thread-4) [n:127.0.0.1:34059_solr    ] o.a.s.c.a.NodeLostTrigger Running NodeLostTrigger: .auto_add_replicas with currently live nodes: 3
   [junit4]   2> 2219623 DEBUG (ScheduledTrigger-8790-thread-2) [n:127.0.0.1:34059_solr    ] o.a.s.c.a.NodeAddedTrigger Found livenodes: 3
   [junit4]   2> 2220623 DEBUG (ScheduledTrigger-8790-thread-4) [n:127.0.0.1:34059_solr    ] o.a.s.c.a.NodeLostTrigger Running NodeLostTrigger: .auto_add_replicas with currently live nodes: 3
   [junit4]   2> 2220623 DEBUG (ScheduledTrigger-8790-thread-1) [n:127.0.0.1:34059_solr    ] o.a.s.c.a.NodeAddedTrigger Running NodeAddedTrigger node_added_triggerEFRS
   [junit4]   2> 2220624 DEBUG (ScheduledTrigger-8790-thread-1) [n:127.0.0.1:34059_solr    ] o.a.s.c.a.NodeAddedTrigger Found livenodes: 3
   

[...truncated too long message...]

oseExecutor-8966-thread-1) [n:127.0.0.1:38933_solr c:collection1 s:shard1 r:core_node6 x:collection1_shard1_replica_n5] o.a.s.m.SolrMetricManager Closing metric reporters for registry=solr.collection.collection1.shard1.leader, tag=842939810
   [junit4]   2> 2380654 INFO  (coreCloseExecutor-8966-thread-2) [n:127.0.0.1:38933_solr c:collection1 s:shard1 r:core_node8 x:collection1_shard1_replica_n7] o.a.s.m.SolrMetricManager Closing metric reporters for registry=solr.collection.collection1.shard1.leader, tag=1528546331
   [junit4]   2> 2380656 INFO  (coreCloseExecutor-8965-thread-2) [n:127.0.0.1:41191_solr c:testMetricTrigger s:shard2 r:core_node4 x:testMetricTrigger_shard2_replica_n2] o.a.s.m.SolrMetricManager Closing metric reporters for registry=solr.collection.testMetricTrigger.shard2.leader, tag=1793187196
   [junit4]   2> 2380657 INFO  (zkCallback-6280-thread-4-processing-n:127.0.0.1:41191_solr) [n:127.0.0.1:41191_solr    ] o.a.s.c.OverseerElectionContext I am going to be the leader 127.0.0.1:41191_solr
   [junit4]   2> 2380657 INFO  (jetty-closer-6175-thread-4) [    ] o.e.j.s.h.ContextHandler Stopped o.e.j.s.ServletContextHandler@5eca4b35{/solr,null,UNAVAILABLE}
   [junit4]   2> 2380657 INFO  (jetty-closer-6175-thread-4) [    ] o.e.j.s.session Stopped scavenging
   [junit4]   2> 2380659 INFO  (jetty-closer-6175-thread-5) [    ] o.e.j.s.h.ContextHandler Stopped o.e.j.s.ServletContextHandler@5b595f38{/solr,null,UNAVAILABLE}
   [junit4]   2> 2380659 INFO  (jetty-closer-6175-thread-5) [    ] o.e.j.s.session Stopped scavenging
   [junit4]   2> 2382126 WARN  (zkCallback-6363-thread-2-processing-n:127.0.0.1:36507_solr) [n:127.0.0.1:36507_solr    ] o.a.s.c.c.ZkStateReader ZooKeeper watch triggered, but Solr cannot talk to ZK: [KeeperErrorCode = Session expired for /live_nodes]
   [junit4]   2> 2382127 INFO  (jetty-closer-6175-thread-11) [    ] o.e.j.s.h.ContextHandler Stopped o.e.j.s.ServletContextHandler@7485ad2{/solr,null,UNAVAILABLE}
   [junit4]   2> 2382127 INFO  (jetty-closer-6175-thread-11) [    ] o.e.j.s.session Stopped scavenging
   [junit4]   2> 2382128 ERROR (SUITE-TriggerIntegrationTest-seed#[2B791F8AD696B655]-worker) [    ] o.a.z.s.ZooKeeperServer ZKShutdownHandler is not registered, so ZooKeeper server won't take any action on ERROR or SHUTDOWN server state changes
   [junit4]   2> 2382128 INFO  (SUITE-TriggerIntegrationTest-seed#[2B791F8AD696B655]-worker) [    ] o.a.s.c.ZkTestServer connecting to 127.0.0.1:46059 46059
   [junit4]   2> 2387986 INFO  (Thread-5188) [    ] o.a.s.c.ZkTestServer connecting to 127.0.0.1:46059 46059
   [junit4]   2> 2387987 WARN  (Thread-5188) [    ] o.a.s.c.ZkTestServer Watch limit violations: 
   [junit4]   2> Maximum concurrent create/delete watches above limit:
   [junit4]   2> 
   [junit4]   2> 	22	/solr/aliases.json
   [junit4]   2> 	21	/solr/security.json
   [junit4]   2> 	18	/solr/collections/collection1/terms/shard1
   [junit4]   2> 	5	/solr/configs/conf
   [junit4]   2> 	2	/solr/collections/testMetricTrigger/terms/shard1
   [junit4]   2> 	2	/solr/collections/testMetricTrigger/terms/shard2
   [junit4]   2> 
   [junit4]   2> Maximum concurrent data watches above limit:
   [junit4]   2> 
   [junit4]   2> 	51	/solr/collections/collection1/state.json
   [junit4]   2> 	22	/solr/clusterprops.json
   [junit4]   2> 	22	/solr/clusterstate.json
   [junit4]   2> 	11	/solr/collections/testMetricTrigger/state.json
   [junit4]   2> 	6	/solr/autoscaling.json
   [junit4]   2> 	3	/solr/overseer_elect/election/72072186010075174-127.0.0.1:35119_solr-n_0000000011
   [junit4]   2> 	2	/solr/overseer_elect/election/72072186010075168-127.0.0.1:41191_solr-n_0000000009
   [junit4]   2> 	2	/solr/overseer_elect/election/72072186010075159-127.0.0.1:46121_solr-n_0000000006
   [junit4]   2> 	2	/solr/overseer_elect/election/72072186010075171-127.0.0.1:43041_solr-n_0000000010
   [junit4]   2> 	2	/solr/collections/collection1/leader_elect/shard1/election/72072186010075168-core_node3-n_0000000000
   [junit4]   2> 
   [junit4]   2> Maximum concurrent children watches above limit:
   [junit4]   2> 
   [junit4]   2> 	22	/solr/live_nodes
   [junit4]   2> 	22	/solr/collections
   [junit4]   2> 	6	/solr/overseer/queue-work
   [junit4]   2> 	6	/solr/autoscaling/events/.auto_add_replicas
   [junit4]   2> 	6	/solr/overseer/queue
   [junit4]   2> 	6	/solr/overseer/collection-queue-work
   [junit4]   2> 	2	/solr/autoscaling/events/node_lost_triggerMR
   [junit4]   2> 	2	/solr/autoscaling/events/node_added_triggerCTOOR
   [junit4]   2> 
   [junit4]   2> NOTE: leaving temporary files on disk at: /home/jenkins/workspace/Lucene-Solr-master-Linux/solr/build/solr-core/test/J1/temp/solr.cloud.autoscaling.TriggerIntegrationTest_2B791F8AD696B655-001
   [junit4]   2> NOTE: test params are: codec=Asserting(Lucene70): {id=PostingsFormat(name=Memory), x_s=BlockTreeOrds(blocksize=128)}, docValues:{_version_=DocValuesFormat(name=Direct)}, maxPointsInLeafNode=1721, maxMBSortInHeap=7.471940871929612, sim=Asserting(org.apache.lucene.search.similarities.AssertingSimilarity@1f5a08ec), locale=fy-NL, timezone=America/Dawson_Creek
   [junit4]   2> NOTE: Linux 4.13.0-32-generic amd64/Oracle Corporation 10-ea (64-bit)/cpus=8,threads=1,free=272031928,total=536870912
   [junit4]   2> NOTE: All tests run in this JVM: [TestFieldCacheSortRandom, TestShardHandlerFactory, SubstringBytesRefFilterTest, TestGraphMLResponseWriter, SolrMetricsIntegrationTest, TestCursorMarkWithoutUniqueKey, DOMUtilTest, CdcrBootstrapTest, BasicFunctionalityTest, SampleTest, TestDynamicLoading, TestNumericRangeQuery32, TestDistributedGrouping, TestPayloadScoreQParserPlugin, SuggestComponentTest, TestCollectionAPI, TestCollectionAPIs, SimplePostToolTest, PeerSyncTest, MissingSegmentRecoveryTest, HdfsBasicDistributedZk2Test, HdfsChaosMonkeySafeLeaderTest, TestReplicationHandler, DocumentBuilderTest, RuleEngineTest, TestConfigOverlay, SolrCLIZkUtilsTest, TestElisionMultitermQuery, TestLRUCache, TestImpersonationWithHadoopAuth, CdcrRequestHandlerTest, TestComputePlanAction, TestPointFields, TestLegacyFieldCache, TestConfigSets, DirectUpdateHandlerOptimizeTest, TestQueryUtils, TestLeaderElectionZkExpiry, TestTriggerIntegration, TestFuzzyAnalyzedSuggestions, JSONWriterTest, DocValuesMissingTest, TestTrieFacet, SolrIndexMetricsTest, TestReloadDeadlock, TestPullReplica, SpellCheckCollatorWithCollapseTest, TestStressInPlaceUpdates, SegmentsInfoRequestHandlerTest, ShardRoutingCustomTest, TestFieldCollectionResource, SignatureUpdateProcessorFactoryTest, ZkStateReaderTest, UpdateRequestProcessorFactoryTest, ZkFailoverTest, TestSystemIdResolver, SyncSliceTest, TestSchemaSimilarityResource, AnalyticsQueryTest, TestCharFilters, TestConfigReload, HLLSerializationTest, LeaderInitiatedRecoveryOnShardRestartTest, TestEmbeddedSolrServerAdminHandler, PreAnalyzedFieldManagedSchemaCloudTest, TestManagedSchema, TestReplicationHandlerBackup, TlogReplayBufferedWhileIndexingTest, TestPerFieldSimilarityWithDefaultOverride, DistributedMLTComponentTest, SolrCoreTest, OverseerTaskQueueTest, TestNestedDocsSort, ClassificationUpdateProcessorIntegrationTest, QueryParsingTest, TestCryptoKeys, TestComplexPhraseLeadingWildcard, HdfsCollectionsAPIDistributedZkTest, DocExpirationUpdateProcessorFactoryTest, TestZkChroot, TestStreamBody, TestUninvertingReader, TestFieldCache, BlockCacheTest, PrimitiveFieldTypeTest, MetricsHandlerTest, TestSolrConfigHandlerConcurrent, TestInitParams, TestSQLHandler, SuggesterTest, TestLocalFSCloudBackupRestore, ChaosMonkeySafeLeaderTest, DistributedFacetSimpleRefinementLongTailTest, TestHttpShardHandlerFactory, AddReplicaTest, TestLegacyNumericUtils, XsltUpdateRequestHandlerTest, BasicZkTest, RemoteQueryErrorTest, SuggesterFSTTest, CoreAdminRequestStatusTest, TestFoldingMultitermQuery, SliceStateTest, TestSubQueryTransformerCrossCore, TestManagedResourceStorage, TestReload, TestSolrCloudWithKerberosAlt, DirectSolrConnectionTest, TestSolr4Spatial, TestCustomDocTransformer, TestRandomRequestDistribution, FieldMutatingUpdateProcessorTest, LargeFieldTest, TestFieldSortValues, TestNoOpRegenerator, FileUtilsTest, RequestLoggingTest, TestCopyFieldCollectionResource, ChangedSchemaMergeTest, TestRecovery, TestFastLRUCache, TestRTGBase, TestMaxTokenLenTokenizer, AsyncCallRequestStatusResponseTest, TestCloudJSONFacetJoinDomain, HdfsWriteToMultipleCollectionsTest, HttpSolrCallGetCoreTest, TestSolrXml, OverseerTest, LeaderElectionIntegrationTest, ShardRoutingTest, ClusterStateUpdateTest, ZkSolrClientTest, TestFaceting, DistributedSpellCheckComponentTest, ZkControllerTest, TestStressReorder, TestStressVersions, TestCoreContainer, SimpleFacetsTest, StatsComponentTest, SpellCheckComponentTest, TestFunctionQuery, TestIndexSearcher, HighlighterTest, SoftAutoCommitTest, PrimUtilsTest, DateFieldTest, SpellingQueryConverterTest, ClusterStateTest, TestSolrJ, ZkNodePropsTest, SystemInfoHandlerTest, CircularListTest, CursorPagingTest, DistributedIntervalFacetingTest, TestSimpleTrackingShardHandler, TestTolerantSearch, TestEmbeddedSolrServerConstructors, TestJettySolrRunner, AssignBackwardCompatibilityTest, CloudExitableDirectoryReaderTest, ConcurrentCreateRoutedAliasTest, CreateCollectionCleanupTest, DeleteReplicaTest, DistribDocExpirationUpdateProcessorTest, HttpPartitionOnCommitTest, LIRRollingUpdatesTest, MoveReplicaHDFSFailoverTest, MoveReplicaTest, OverseerRolesTest, RecoveryAfterSoftCommitTest, SSLMigrationTest, SaslZkACLProviderTest, SolrCloudExampleTest, TestCloudInspectUtil, TestCloudPivotFacet, TestConfigSetsAPIZkFailure, TestDistribDocBasedVersion, TestDownShardTolerantSearch, TestLeaderElectionWithEmptyReplica, TestPullReplicaErrorHandling, TestStressCloudBlindAtomicUpdates, CollectionReloadTest, CollectionsAPIDistributedZkTest, AutoAddReplicasIntegrationTest, HttpTriggerListenerTest, NodeAddedTriggerTest, NodeLostTriggerTest, TestPolicyCloud, TriggerIntegrationTest]
   [junit4] Completed [619/774 (2!)] on J1 in 193.84s, 14 tests, 1 failure <<< FAILURES!

[...truncated 41379 lines...]

Mime
View raw message