lucene-dev mailing list archives

Site index · List index
Message view « Date » · « Thread »
Top « Date » · « Thread »
From Policeman Jenkins Server <jenk...@thetaphi.de>
Subject [JENKINS-EA] Lucene-Solr-7.x-Linux (64bit/jdk-10-ea+43) - Build # 1405 - Unstable!
Date Thu, 22 Feb 2018 07:20:24 GMT
Build: https://jenkins.thetaphi.de/job/Lucene-Solr-7.x-Linux/1405/
Java: 64bit/jdk-10-ea+43 -XX:-UseCompressedOops -XX:+UseSerialGC

8 tests failed.
FAILED:  junit.framework.TestSuite.org.apache.lucene.search.TestSearcherManager

Error Message:
Suite timeout exceeded (>= 7200000 msec).

Stack Trace:
java.lang.Exception: Suite timeout exceeded (>= 7200000 msec).
	at __randomizedtesting.SeedInfo.seed([C0F57B1E7E34975A]:0)


FAILED:  junit.framework.TestSuite.org.apache.lucene.search.TestSearcherManager

Error Message:
Captured an uncaught exception in thread: Thread[id=1652, name=Thread-1403, state=RUNNABLE, group=TGRP-TestSearcherManager]

Stack Trace:
com.carrotsearch.randomizedtesting.UncaughtExceptionError: Captured an uncaught exception in thread: Thread[id=1652, name=Thread-1403, state=RUNNABLE, group=TGRP-TestSearcherManager]
Caused by: org.apache.lucene.store.AlreadyClosedException: this IndexWriter is closed
	at __randomizedtesting.SeedInfo.seed([C0F57B1E7E34975A]:0)
	at org.apache.lucene.index.IndexWriter.ensureOpen(IndexWriter.java:897)
	at org.apache.lucene.index.IndexWriter.ensureOpen(IndexWriter.java:911)
	at org.apache.lucene.index.IndexWriter.updateDocument(IndexWriter.java:1725)
	at org.apache.lucene.index.IndexWriter.addDocument(IndexWriter.java:1464)
	at org.apache.lucene.search.TestSearcherManager$8.run(TestSearcherManager.java:574)
Caused by: java.nio.file.FileSystemException: /home/jenkins/workspace/Lucene-Solr-7.x-Linux/lucene/build/core/test/J1/temp/lucene.search.TestSearcherManager_C0F57B1E7E34975A-001/tempDir-001/_4b_TestBloomFilteredLucenePostings_0.tip: Too many open files
	at org.apache.lucene.mockfile.HandleLimitFS.onOpen(HandleLimitFS.java:48)
	at org.apache.lucene.mockfile.HandleTrackingFS.callOpenHook(HandleTrackingFS.java:81)
	at org.apache.lucene.mockfile.HandleTrackingFS.newOutputStream(HandleTrackingFS.java:160)
	at org.apache.lucene.mockfile.FilterFileSystemProvider.newOutputStream(FilterFileSystemProvider.java:197)
	at java.base/java.nio.file.Files.newOutputStream(Files.java:218)
	at org.apache.lucene.store.FSDirectory$FSIndexOutput.<init>(FSDirectory.java:413)
	at org.apache.lucene.store.FSDirectory$FSIndexOutput.<init>(FSDirectory.java:409)
	at org.apache.lucene.store.FSDirectory.createOutput(FSDirectory.java:253)
	at org.apache.lucene.store.MockDirectoryWrapper.createOutput(MockDirectoryWrapper.java:665)
	at org.apache.lucene.store.LockValidatingDirectoryWrapper.createOutput(LockValidatingDirectoryWrapper.java:44)
	at org.apache.lucene.store.TrackingDirectoryWrapper.createOutput(TrackingDirectoryWrapper.java:43)
	at org.apache.lucene.codecs.blocktree.BlockTreeTermsWriter.<init>(BlockTreeTermsWriter.java:277)
	at org.apache.lucene.codecs.lucene50.Lucene50PostingsFormat.fieldsConsumer(Lucene50PostingsFormat.java:427)
	at org.apache.lucene.codecs.bloom.BloomFilteringPostingsFormat.fieldsConsumer(BloomFilteringPostingsFormat.java:143)
	at org.apache.lucene.codecs.bloom.TestBloomFilteredLucenePostings.fieldsConsumer(TestBloomFilteredLucenePostings.java:65)
	at org.apache.lucene.codecs.perfield.PerFieldPostingsFormat$FieldsWriter.write(PerFieldPostingsFormat.java:138)
	at org.apache.lucene.index.FreqProxTermsWriter.flush(FreqProxTermsWriter.java:108)
	at org.apache.lucene.index.DefaultIndexingChain.flush(DefaultIndexingChain.java:162)
	at org.apache.lucene.index.DocumentsWriterPerThread.flush(DocumentsWriterPerThread.java:452)
	at org.apache.lucene.index.DocumentsWriter.doFlush(DocumentsWriter.java:557)
	at org.apache.lucene.index.DocumentsWriter.flushAllThreads(DocumentsWriter.java:673)
	at org.apache.lucene.index.IndexWriter.getReader(IndexWriter.java:453)
	at org.apache.lucene.index.StandardDirectoryReader.doOpenFromWriter(StandardDirectoryReader.java:293)
	at org.apache.lucene.index.StandardDirectoryReader.doOpenIfChanged(StandardDirectoryReader.java:268)
	at org.apache.lucene.index.StandardDirectoryReader.doOpenIfChanged(StandardDirectoryReader.java:258)
	at org.apache.lucene.index.DirectoryReader.openIfChanged(DirectoryReader.java:140)
	at org.apache.lucene.search.SearcherManager.refreshIfNeeded(SearcherManager.java:156)
	at org.apache.lucene.search.SearcherManager.refreshIfNeeded(SearcherManager.java:58)
	at org.apache.lucene.search.ReferenceManager.doMaybeRefresh(ReferenceManager.java:176)
	at org.apache.lucene.search.ReferenceManager.maybeRefreshBlocking(ReferenceManager.java:253)
	at org.apache.lucene.search.TestSearcherManager$10.run(TestSearcherManager.java:634)


FAILED:  junit.framework.TestSuite.org.apache.lucene.search.TestSearcherManager

Error Message:
Captured an uncaught exception in thread: Thread[id=1655, name=Thread-1406, state=RUNNABLE, group=TGRP-TestSearcherManager]

Stack Trace:
com.carrotsearch.randomizedtesting.UncaughtExceptionError: Captured an uncaught exception in thread: Thread[id=1655, name=Thread-1406, state=RUNNABLE, group=TGRP-TestSearcherManager]
Caused by: java.lang.RuntimeException: java.nio.file.FileSystemException: /home/jenkins/workspace/Lucene-Solr-7.x-Linux/lucene/build/core/test/J1/temp/lucene.search.TestSearcherManager_C0F57B1E7E34975A-001/tempDir-001/_4c_LuceneVarGapDocFreqInterval_0.doc: Too many open files
	at __randomizedtesting.SeedInfo.seed([C0F57B1E7E34975A]:0)
	at org.apache.lucene.search.TestSearcherManager$11.run(TestSearcherManager.java:676)
Caused by: java.nio.file.FileSystemException: /home/jenkins/workspace/Lucene-Solr-7.x-Linux/lucene/build/core/test/J1/temp/lucene.search.TestSearcherManager_C0F57B1E7E34975A-001/tempDir-001/_4c_LuceneVarGapDocFreqInterval_0.doc: Too many open files
	at org.apache.lucene.mockfile.HandleLimitFS.onOpen(HandleLimitFS.java:48)
	at org.apache.lucene.mockfile.HandleTrackingFS.callOpenHook(HandleTrackingFS.java:81)
	at org.apache.lucene.mockfile.HandleTrackingFS.newOutputStream(HandleTrackingFS.java:160)
	at org.apache.lucene.mockfile.FilterFileSystemProvider.newOutputStream(FilterFileSystemProvider.java:197)
	at java.base/java.nio.file.Files.newOutputStream(Files.java:218)
	at org.apache.lucene.store.FSDirectory$FSIndexOutput.<init>(FSDirectory.java:413)
	at org.apache.lucene.store.FSDirectory$FSIndexOutput.<init>(FSDirectory.java:409)
	at org.apache.lucene.store.FSDirectory.createOutput(FSDirectory.java:253)
	at org.apache.lucene.store.MockDirectoryWrapper.createOutput(MockDirectoryWrapper.java:665)
	at org.apache.lucene.store.LockValidatingDirectoryWrapper.createOutput(LockValidatingDirectoryWrapper.java:44)
	at org.apache.lucene.store.TrackingDirectoryWrapper.createOutput(TrackingDirectoryWrapper.java:43)
	at org.apache.lucene.codecs.lucene50.Lucene50PostingsWriter.<init>(Lucene50PostingsWriter.java:105)
	at org.apache.lucene.codecs.blockterms.LuceneVarGapDocFreqInterval.fieldsConsumer(LuceneVarGapDocFreqInterval.java:63)
	at org.apache.lucene.codecs.perfield.PerFieldPostingsFormat$FieldsWriter.write(PerFieldPostingsFormat.java:138)
	at org.apache.lucene.index.FreqProxTermsWriter.flush(FreqProxTermsWriter.java:108)
	at org.apache.lucene.index.DefaultIndexingChain.flush(DefaultIndexingChain.java:162)
	at org.apache.lucene.index.DocumentsWriterPerThread.flush(DocumentsWriterPerThread.java:452)
	at org.apache.lucene.index.DocumentsWriter.doFlush(DocumentsWriter.java:557)
	at org.apache.lucene.index.DocumentsWriter.flushAllThreads(DocumentsWriter.java:673)
	at org.apache.lucene.index.IndexWriter.getReader(IndexWriter.java:453)
	at org.apache.lucene.index.DirectoryReader.open(DirectoryReader.java:103)
	at org.apache.lucene.search.SearcherManager.<init>(SearcherManager.java:108)
	at org.apache.lucene.search.SearcherManager.<init>(SearcherManager.java:76)
	at org.apache.lucene.search.TestSearcherManager$11.run(TestSearcherManager.java:664)


FAILED:  junit.framework.TestSuite.org.apache.lucene.search.TestSearcherManager

Error Message:
Captured an uncaught exception in thread: Thread[id=1657, name=Lucene Merge Thread #1, state=RUNNABLE, group=TGRP-TestSearcherManager]

Stack Trace:
com.carrotsearch.randomizedtesting.UncaughtExceptionError: Captured an uncaught exception in thread: Thread[id=1657, name=Lucene Merge Thread #1, state=RUNNABLE, group=TGRP-TestSearcherManager]
Caused by: org.apache.lucene.index.MergePolicy$MergeException: java.lang.IllegalStateException: this writer hit an unrecoverable error; cannot complete merge
	at __randomizedtesting.SeedInfo.seed([C0F57B1E7E34975A]:0)
	at org.apache.lucene.index.ConcurrentMergeScheduler.handleMergeException(ConcurrentMergeScheduler.java:703)
	at org.apache.lucene.index.ConcurrentMergeScheduler$MergeThread.run(ConcurrentMergeScheduler.java:683)
Caused by: java.lang.IllegalStateException: this writer hit an unrecoverable error; cannot complete merge
	at org.apache.lucene.index.IndexWriter.commitMerge(IndexWriter.java:3890)
	at org.apache.lucene.index.IndexWriter.mergeMiddle(IndexWriter.java:4599)
	at org.apache.lucene.index.IndexWriter.merge(IndexWriter.java:4083)
	at org.apache.lucene.index.ConcurrentMergeScheduler.doMerge(ConcurrentMergeScheduler.java:624)
	at org.apache.lucene.index.ConcurrentMergeScheduler$MergeThread.run(ConcurrentMergeScheduler.java:661)
Caused by: java.nio.file.FileSystemException: /home/jenkins/workspace/Lucene-Solr-7.x-Linux/lucene/build/core/test/J1/temp/lucene.search.TestSearcherManager_C0F57B1E7E34975A-001/tempDir-001/_4b_TestBloomFilteredLucenePostings_0.tip: Too many open files
	at org.apache.lucene.mockfile.HandleLimitFS.onOpen(HandleLimitFS.java:48)
	at org.apache.lucene.mockfile.HandleTrackingFS.callOpenHook(HandleTrackingFS.java:81)
	at org.apache.lucene.mockfile.HandleTrackingFS.newOutputStream(HandleTrackingFS.java:160)
	at org.apache.lucene.mockfile.FilterFileSystemProvider.newOutputStream(FilterFileSystemProvider.java:197)
	at java.base/java.nio.file.Files.newOutputStream(Files.java:218)
	at org.apache.lucene.store.FSDirectory$FSIndexOutput.<init>(FSDirectory.java:413)
	at org.apache.lucene.store.FSDirectory$FSIndexOutput.<init>(FSDirectory.java:409)
	at org.apache.lucene.store.FSDirectory.createOutput(FSDirectory.java:253)
	at org.apache.lucene.store.MockDirectoryWrapper.createOutput(MockDirectoryWrapper.java:665)
	at org.apache.lucene.store.LockValidatingDirectoryWrapper.createOutput(LockValidatingDirectoryWrapper.java:44)
	at org.apache.lucene.store.TrackingDirectoryWrapper.createOutput(TrackingDirectoryWrapper.java:43)
	at org.apache.lucene.codecs.blocktree.BlockTreeTermsWriter.<init>(BlockTreeTermsWriter.java:277)
	at org.apache.lucene.codecs.lucene50.Lucene50PostingsFormat.fieldsConsumer(Lucene50PostingsFormat.java:427)
	at org.apache.lucene.codecs.bloom.BloomFilteringPostingsFormat.fieldsConsumer(BloomFilteringPostingsFormat.java:143)
	at org.apache.lucene.codecs.bloom.TestBloomFilteredLucenePostings.fieldsConsumer(TestBloomFilteredLucenePostings.java:65)
	at org.apache.lucene.codecs.perfield.PerFieldPostingsFormat$FieldsWriter.write(PerFieldPostingsFormat.java:138)
	at org.apache.lucene.index.FreqProxTermsWriter.flush(FreqProxTermsWriter.java:108)
	at org.apache.lucene.index.DefaultIndexingChain.flush(DefaultIndexingChain.java:162)
	at org.apache.lucene.index.DocumentsWriterPerThread.flush(DocumentsWriterPerThread.java:452)
	at org.apache.lucene.index.DocumentsWriter.doFlush(DocumentsWriter.java:557)
	at org.apache.lucene.index.DocumentsWriter.flushAllThreads(DocumentsWriter.java:673)
	at org.apache.lucene.index.IndexWriter.getReader(IndexWriter.java:453)
	at org.apache.lucene.index.StandardDirectoryReader.doOpenFromWriter(StandardDirectoryReader.java:293)
	at org.apache.lucene.index.StandardDirectoryReader.doOpenIfChanged(StandardDirectoryReader.java:268)
	at org.apache.lucene.index.StandardDirectoryReader.doOpenIfChanged(StandardDirectoryReader.java:258)
	at org.apache.lucene.index.DirectoryReader.openIfChanged(DirectoryReader.java:140)
	at org.apache.lucene.search.SearcherManager.refreshIfNeeded(SearcherManager.java:156)
	at org.apache.lucene.search.SearcherManager.refreshIfNeeded(SearcherManager.java:58)
	at org.apache.lucene.search.ReferenceManager.doMaybeRefresh(ReferenceManager.java:176)
	at org.apache.lucene.search.ReferenceManager.maybeRefreshBlocking(ReferenceManager.java:253)
	at org.apache.lucene.search.TestSearcherManager$10.run(TestSearcherManager.java:634)


FAILED:  junit.framework.TestSuite.org.apache.lucene.search.TestSearcherManager

Error Message:
Captured an uncaught exception in thread: Thread[id=1654, name=Thread-1405, state=RUNNABLE, group=TGRP-TestSearcherManager]

Stack Trace:
com.carrotsearch.randomizedtesting.UncaughtExceptionError: Captured an uncaught exception in thread: Thread[id=1654, name=Thread-1405, state=RUNNABLE, group=TGRP-TestSearcherManager]
Caused by: java.lang.RuntimeException: java.nio.file.FileSystemException: /home/jenkins/workspace/Lucene-Solr-7.x-Linux/lucene/build/core/test/J1/temp/lucene.search.TestSearcherManager_C0F57B1E7E34975A-001/tempDir-001/_4b_TestBloomFilteredLucenePostings_0.tip: Too many open files
	at __randomizedtesting.SeedInfo.seed([C0F57B1E7E34975A]:0)
	at org.apache.lucene.search.TestSearcherManager$10.run(TestSearcherManager.java:646)
Caused by: java.nio.file.FileSystemException: /home/jenkins/workspace/Lucene-Solr-7.x-Linux/lucene/build/core/test/J1/temp/lucene.search.TestSearcherManager_C0F57B1E7E34975A-001/tempDir-001/_4b_TestBloomFilteredLucenePostings_0.tip: Too many open files
	at org.apache.lucene.mockfile.HandleLimitFS.onOpen(HandleLimitFS.java:48)
	at org.apache.lucene.mockfile.HandleTrackingFS.callOpenHook(HandleTrackingFS.java:81)
	at org.apache.lucene.mockfile.HandleTrackingFS.newOutputStream(HandleTrackingFS.java:160)
	at org.apache.lucene.mockfile.FilterFileSystemProvider.newOutputStream(FilterFileSystemProvider.java:197)
	at java.base/java.nio.file.Files.newOutputStream(Files.java:218)
	at org.apache.lucene.store.FSDirectory$FSIndexOutput.<init>(FSDirectory.java:413)
	at org.apache.lucene.store.FSDirectory$FSIndexOutput.<init>(FSDirectory.java:409)
	at org.apache.lucene.store.FSDirectory.createOutput(FSDirectory.java:253)
	at org.apache.lucene.store.MockDirectoryWrapper.createOutput(MockDirectoryWrapper.java:665)
	at org.apache.lucene.store.LockValidatingDirectoryWrapper.createOutput(LockValidatingDirectoryWrapper.java:44)
	at org.apache.lucene.store.TrackingDirectoryWrapper.createOutput(TrackingDirectoryWrapper.java:43)
	at org.apache.lucene.codecs.blocktree.BlockTreeTermsWriter.<init>(BlockTreeTermsWriter.java:277)
	at org.apache.lucene.codecs.lucene50.Lucene50PostingsFormat.fieldsConsumer(Lucene50PostingsFormat.java:427)
	at org.apache.lucene.codecs.bloom.BloomFilteringPostingsFormat.fieldsConsumer(BloomFilteringPostingsFormat.java:143)
	at org.apache.lucene.codecs.bloom.TestBloomFilteredLucenePostings.fieldsConsumer(TestBloomFilteredLucenePostings.java:65)
	at org.apache.lucene.codecs.perfield.PerFieldPostingsFormat$FieldsWriter.write(PerFieldPostingsFormat.java:138)
	at org.apache.lucene.index.FreqProxTermsWriter.flush(FreqProxTermsWriter.java:108)
	at org.apache.lucene.index.DefaultIndexingChain.flush(DefaultIndexingChain.java:162)
	at org.apache.lucene.index.DocumentsWriterPerThread.flush(DocumentsWriterPerThread.java:452)
	at org.apache.lucene.index.DocumentsWriter.doFlush(DocumentsWriter.java:557)
	at org.apache.lucene.index.DocumentsWriter.flushAllThreads(DocumentsWriter.java:673)
	at org.apache.lucene.index.IndexWriter.getReader(IndexWriter.java:453)
	at org.apache.lucene.index.StandardDirectoryReader.doOpenFromWriter(StandardDirectoryReader.java:293)
	at org.apache.lucene.index.StandardDirectoryReader.doOpenIfChanged(StandardDirectoryReader.java:268)
	at org.apache.lucene.index.StandardDirectoryReader.doOpenIfChanged(StandardDirectoryReader.java:258)
	at org.apache.lucene.index.DirectoryReader.openIfChanged(DirectoryReader.java:140)
	at org.apache.lucene.search.SearcherManager.refreshIfNeeded(SearcherManager.java:156)
	at org.apache.lucene.search.SearcherManager.refreshIfNeeded(SearcherManager.java:58)
	at org.apache.lucene.search.ReferenceManager.doMaybeRefresh(ReferenceManager.java:176)
	at org.apache.lucene.search.ReferenceManager.maybeRefreshBlocking(ReferenceManager.java:253)
	at org.apache.lucene.search.TestSearcherManager$10.run(TestSearcherManager.java:634)


FAILED:  org.apache.lucene.search.TestSearcherManager.testConcurrentIndexCloseSearchAndRefresh

Error Message:
Test abandoned because suite timeout was reached.

Stack Trace:
java.lang.Exception: Test abandoned because suite timeout was reached.
	at __randomizedtesting.SeedInfo.seed([C0F57B1E7E34975A]:0)


FAILED:  org.apache.solr.cloud.ForceLeaderTest.testReplicasInLowerTerms

Error Message:
Doc with id=5 not found in http://127.0.0.1:33699/cuj/forceleader_lower_terms_collection due to: Path not found: /id; rsp={doc=null}

Stack Trace:
java.lang.AssertionError: Doc with id=5 not found in http://127.0.0.1:33699/cuj/forceleader_lower_terms_collection due to: Path not found: /id; rsp={doc=null}
	at __randomizedtesting.SeedInfo.seed([E76B740F915CC52B:695F544C51FB655F]:0)
	at org.junit.Assert.fail(Assert.java:93)
	at org.junit.Assert.assertTrue(Assert.java:43)
	at org.apache.solr.cloud.HttpPartitionTest.assertDocExists(HttpPartitionTest.java:699)
	at org.apache.solr.cloud.HttpPartitionTest.assertDocsExistInAllReplicas(HttpPartitionTest.java:644)
	at org.apache.solr.cloud.ForceLeaderTest.bringBackOldLeaderAndSendDoc(ForceLeaderTest.java:520)
	at org.apache.solr.cloud.ForceLeaderTest.testReplicasInLowerTerms(ForceLeaderTest.java:158)
	at java.base/jdk.internal.reflect.NativeMethodAccessorImpl.invoke0(Native Method)
	at java.base/jdk.internal.reflect.NativeMethodAccessorImpl.invoke(NativeMethodAccessorImpl.java:62)
	at java.base/jdk.internal.reflect.DelegatingMethodAccessorImpl.invoke(DelegatingMethodAccessorImpl.java:43)
	at java.base/java.lang.reflect.Method.invoke(Method.java:564)
	at com.carrotsearch.randomizedtesting.RandomizedRunner.invoke(RandomizedRunner.java:1737)
	at com.carrotsearch.randomizedtesting.RandomizedRunner$8.evaluate(RandomizedRunner.java:934)
	at com.carrotsearch.randomizedtesting.RandomizedRunner$9.evaluate(RandomizedRunner.java:970)
	at com.carrotsearch.randomizedtesting.RandomizedRunner$10.evaluate(RandomizedRunner.java:984)
	at org.apache.solr.BaseDistributedSearchTestCase$ShardsRepeatRule$ShardsFixedStatement.callStatement(BaseDistributedSearchTestCase.java:993)
	at org.apache.solr.BaseDistributedSearchTestCase$ShardsRepeatRule$ShardsStatement.evaluate(BaseDistributedSearchTestCase.java:968)
	at com.carrotsearch.randomizedtesting.rules.SystemPropertiesRestoreRule$1.evaluate(SystemPropertiesRestoreRule.java:57)
	at org.apache.lucene.util.TestRuleSetupTeardownChained$1.evaluate(TestRuleSetupTeardownChained.java:49)
	at org.apache.lucene.util.AbstractBeforeAfterRule$1.evaluate(AbstractBeforeAfterRule.java:45)
	at org.apache.lucene.util.TestRuleThreadAndTestName$1.evaluate(TestRuleThreadAndTestName.java:48)
	at org.apache.lucene.util.TestRuleIgnoreAfterMaxFailures$1.evaluate(TestRuleIgnoreAfterMaxFailures.java:64)
	at org.apache.lucene.util.TestRuleMarkFailure$1.evaluate(TestRuleMarkFailure.java:47)
	at com.carrotsearch.randomizedtesting.rules.StatementAdapter.evaluate(StatementAdapter.java:36)
	at com.carrotsearch.randomizedtesting.ThreadLeakControl$StatementRunner.run(ThreadLeakControl.java:368)
	at com.carrotsearch.randomizedtesting.ThreadLeakControl.forkTimeoutingTask(ThreadLeakControl.java:817)
	at com.carrotsearch.randomizedtesting.ThreadLeakControl$3.evaluate(ThreadLeakControl.java:468)
	at com.carrotsearch.randomizedtesting.RandomizedRunner.runSingleTest(RandomizedRunner.java:943)
	at com.carrotsearch.randomizedtesting.RandomizedRunner$5.evaluate(RandomizedRunner.java:829)
	at com.carrotsearch.randomizedtesting.RandomizedRunner$6.evaluate(RandomizedRunner.java:879)
	at com.carrotsearch.randomizedtesting.RandomizedRunner$7.evaluate(RandomizedRunner.java:890)
	at com.carrotsearch.randomizedtesting.rules.StatementAdapter.evaluate(StatementAdapter.java:36)
	at com.carrotsearch.randomizedtesting.rules.SystemPropertiesRestoreRule$1.evaluate(SystemPropertiesRestoreRule.java:57)
	at org.apache.lucene.util.AbstractBeforeAfterRule$1.evaluate(AbstractBeforeAfterRule.java:45)
	at com.carrotsearch.randomizedtesting.rules.StatementAdapter.evaluate(StatementAdapter.java:36)
	at org.apache.lucene.util.TestRuleStoreClassName$1.evaluate(TestRuleStoreClassName.java:41)
	at com.carrotsearch.randomizedtesting.rules.NoShadowingOrOverridesOnMethodsRule$1.evaluate(NoShadowingOrOverridesOnMethodsRule.java:40)
	at com.carrotsearch.randomizedtesting.rules.NoShadowingOrOverridesOnMethodsRule$1.evaluate(NoShadowingOrOverridesOnMethodsRule.java:40)
	at com.carrotsearch.randomizedtesting.rules.StatementAdapter.evaluate(StatementAdapter.java:36)
	at com.carrotsearch.randomizedtesting.rules.StatementAdapter.evaluate(StatementAdapter.java:36)
	at org.apache.lucene.util.TestRuleAssertionsRequired$1.evaluate(TestRuleAssertionsRequired.java:53)
	at org.apache.lucene.util.TestRuleMarkFailure$1.evaluate(TestRuleMarkFailure.java:47)
	at org.apache.lucene.util.TestRuleIgnoreAfterMaxFailures$1.evaluate(TestRuleIgnoreAfterMaxFailures.java:64)
	at org.apache.lucene.util.TestRuleIgnoreTestSuites$1.evaluate(TestRuleIgnoreTestSuites.java:54)
	at com.carrotsearch.randomizedtesting.rules.StatementAdapter.evaluate(StatementAdapter.java:36)
	at com.carrotsearch.randomizedtesting.ThreadLeakControl$StatementRunner.run(ThreadLeakControl.java:368)
	at java.base/java.lang.Thread.run(Thread.java:844)


FAILED:  org.apache.solr.cloud.MoveReplicaHDFSTest.testFailedMove

Error Message:
No live SolrServers available to handle this request:[https://127.0.0.1:34321/solr/MoveReplicaHDFSTest_failed_coll_true, https://127.0.0.1:44861/solr/MoveReplicaHDFSTest_failed_coll_true]

Stack Trace:
org.apache.solr.client.solrj.SolrServerException: No live SolrServers available to handle this request:[https://127.0.0.1:34321/solr/MoveReplicaHDFSTest_failed_coll_true, https://127.0.0.1:44861/solr/MoveReplicaHDFSTest_failed_coll_true]
	at __randomizedtesting.SeedInfo.seed([E76B740F915CC52B:4DA6A7FD268F10FB]:0)
	at org.apache.solr.client.solrj.impl.LBHttpSolrClient.request(LBHttpSolrClient.java:462)
	at org.apache.solr.client.solrj.impl.CloudSolrClient.sendRequest(CloudSolrClient.java:1104)
	at org.apache.solr.client.solrj.impl.CloudSolrClient.requestWithRetryOnStaleState(CloudSolrClient.java:884)
	at org.apache.solr.client.solrj.impl.CloudSolrClient.requestWithRetryOnStaleState(CloudSolrClient.java:991)
	at org.apache.solr.client.solrj.impl.CloudSolrClient.request(CloudSolrClient.java:817)
	at org.apache.solr.client.solrj.SolrRequest.process(SolrRequest.java:194)
	at org.apache.solr.client.solrj.SolrClient.query(SolrClient.java:942)
	at org.apache.solr.cloud.MoveReplicaTest.testFailedMove(MoveReplicaTest.java:306)
	at java.base/jdk.internal.reflect.NativeMethodAccessorImpl.invoke0(Native Method)
	at java.base/jdk.internal.reflect.NativeMethodAccessorImpl.invoke(NativeMethodAccessorImpl.java:62)
	at java.base/jdk.internal.reflect.DelegatingMethodAccessorImpl.invoke(DelegatingMethodAccessorImpl.java:43)
	at java.base/java.lang.reflect.Method.invoke(Method.java:564)
	at com.carrotsearch.randomizedtesting.RandomizedRunner.invoke(RandomizedRunner.java:1737)
	at com.carrotsearch.randomizedtesting.RandomizedRunner$8.evaluate(RandomizedRunner.java:934)
	at com.carrotsearch.randomizedtesting.RandomizedRunner$9.evaluate(RandomizedRunner.java:970)
	at com.carrotsearch.randomizedtesting.RandomizedRunner$10.evaluate(RandomizedRunner.java:984)
	at com.carrotsearch.randomizedtesting.rules.SystemPropertiesRestoreRule$1.evaluate(SystemPropertiesRestoreRule.java:57)
	at org.apache.lucene.util.TestRuleSetupTeardownChained$1.evaluate(TestRuleSetupTeardownChained.java:49)
	at org.apache.lucene.util.AbstractBeforeAfterRule$1.evaluate(AbstractBeforeAfterRule.java:45)
	at org.apache.lucene.util.TestRuleThreadAndTestName$1.evaluate(TestRuleThreadAndTestName.java:48)
	at org.apache.lucene.util.TestRuleIgnoreAfterMaxFailures$1.evaluate(TestRuleIgnoreAfterMaxFailures.java:64)
	at org.apache.lucene.util.TestRuleMarkFailure$1.evaluate(TestRuleMarkFailure.java:47)
	at com.carrotsearch.randomizedtesting.rules.StatementAdapter.evaluate(StatementAdapter.java:36)
	at com.carrotsearch.randomizedtesting.ThreadLeakControl$StatementRunner.run(ThreadLeakControl.java:368)
	at com.carrotsearch.randomizedtesting.ThreadLeakControl.forkTimeoutingTask(ThreadLeakControl.java:817)
	at com.carrotsearch.randomizedtesting.ThreadLeakControl$3.evaluate(ThreadLeakControl.java:468)
	at com.carrotsearch.randomizedtesting.RandomizedRunner.runSingleTest(RandomizedRunner.java:943)
	at com.carrotsearch.randomizedtesting.RandomizedRunner$5.evaluate(RandomizedRunner.java:829)
	at com.carrotsearch.randomizedtesting.RandomizedRunner$6.evaluate(RandomizedRunner.java:879)
	at com.carrotsearch.randomizedtesting.RandomizedRunner$7.evaluate(RandomizedRunner.java:890)
	at com.carrotsearch.randomizedtesting.rules.StatementAdapter.evaluate(StatementAdapter.java:36)
	at com.carrotsearch.randomizedtesting.rules.SystemPropertiesRestoreRule$1.evaluate(SystemPropertiesRestoreRule.java:57)
	at org.apache.lucene.util.AbstractBeforeAfterRule$1.evaluate(AbstractBeforeAfterRule.java:45)
	at com.carrotsearch.randomizedtesting.rules.StatementAdapter.evaluate(StatementAdapter.java:36)
	at org.apache.lucene.util.TestRuleStoreClassName$1.evaluate(TestRuleStoreClassName.java:41)
	at com.carrotsearch.randomizedtesting.rules.NoShadowingOrOverridesOnMethodsRule$1.evaluate(NoShadowingOrOverridesOnMethodsRule.java:40)
	at com.carrotsearch.randomizedtesting.rules.NoShadowingOrOverridesOnMethodsRule$1.evaluate(NoShadowingOrOverridesOnMethodsRule.java:40)
	at com.carrotsearch.randomizedtesting.rules.StatementAdapter.evaluate(StatementAdapter.java:36)
	at com.carrotsearch.randomizedtesting.rules.StatementAdapter.evaluate(StatementAdapter.java:36)
	at org.apache.lucene.util.TestRuleAssertionsRequired$1.evaluate(TestRuleAssertionsRequired.java:53)
	at org.apache.lucene.util.TestRuleMarkFailure$1.evaluate(TestRuleMarkFailure.java:47)
	at org.apache.lucene.util.TestRuleIgnoreAfterMaxFailures$1.evaluate(TestRuleIgnoreAfterMaxFailures.java:64)
	at org.apache.lucene.util.TestRuleIgnoreTestSuites$1.evaluate(TestRuleIgnoreTestSuites.java:54)
	at com.carrotsearch.randomizedtesting.rules.StatementAdapter.evaluate(StatementAdapter.java:36)
	at com.carrotsearch.randomizedtesting.ThreadLeakControl$StatementRunner.run(ThreadLeakControl.java:368)
	at java.base/java.lang.Thread.run(Thread.java:844)
Caused by: org.apache.solr.client.solrj.impl.HttpSolrClient$RemoteSolrException: Error from server at https://127.0.0.1:34321/solr/MoveReplicaHDFSTest_failed_coll_true: no servers hosting shard: shard1
	at org.apache.solr.client.solrj.impl.HttpSolrClient.executeMethod(HttpSolrClient.java:643)
	at org.apache.solr.client.solrj.impl.HttpSolrClient.request(HttpSolrClient.java:255)
	at org.apache.solr.client.solrj.impl.HttpSolrClient.request(HttpSolrClient.java:244)
	at org.apache.solr.client.solrj.impl.LBHttpSolrClient.doRequest(LBHttpSolrClient.java:483)
	at org.apache.solr.client.solrj.impl.LBHttpSolrClient.request(LBHttpSolrClient.java:436)
	... 45 more




Build Log:
[...truncated 1907 lines...]
   [junit4] Suite: org.apache.lucene.search.TestSearcherManager
   [junit4]   2> Feb 22, 2018 2:40:44 PM com.carrotsearch.randomizedtesting.RandomizedRunner$QueueUncaughtExceptionsHandler uncaughtException
   [junit4]   2> WARNING: Uncaught exception in thread: Thread[Thread-1403,5,TGRP-TestSearcherManager]
   [junit4]   2> org.apache.lucene.store.AlreadyClosedException: this IndexWriter is closed
   [junit4]   2> 	at __randomizedtesting.SeedInfo.seed([C0F57B1E7E34975A]:0)
   [junit4]   2> 	at org.apache.lucene.index.IndexWriter.ensureOpen(IndexWriter.java:897)
   [junit4]   2> 	at org.apache.lucene.index.IndexWriter.ensureOpen(IndexWriter.java:911)
   [junit4]   2> 	at org.apache.lucene.index.IndexWriter.updateDocument(IndexWriter.java:1725)
   [junit4]   2> 	at org.apache.lucene.index.IndexWriter.addDocument(IndexWriter.java:1464)
   [junit4]   2> 	at org.apache.lucene.search.TestSearcherManager$8.run(TestSearcherManager.java:574)
   [junit4]   2> Caused by: java.nio.file.FileSystemException: /home/jenkins/workspace/Lucene-Solr-7.x-Linux/lucene/build/core/test/J1/temp/lucene.search.TestSearcherManager_C0F57B1E7E34975A-001/tempDir-001/_4b_TestBloomFilteredLucenePostings_0.tip: Too many open files
   [junit4]   2> 	at org.apache.lucene.mockfile.HandleLimitFS.onOpen(HandleLimitFS.java:48)
   [junit4]   2> 	at org.apache.lucene.mockfile.HandleTrackingFS.callOpenHook(HandleTrackingFS.java:81)
   [junit4]   2> 	at org.apache.lucene.mockfile.HandleTrackingFS.newOutputStream(HandleTrackingFS.java:160)
   [junit4]   2> 	at org.apache.lucene.mockfile.FilterFileSystemProvider.newOutputStream(FilterFileSystemProvider.java:197)
   [junit4]   2> 	at java.base/java.nio.file.Files.newOutputStream(Files.java:218)
   [junit4]   2> 	at org.apache.lucene.store.FSDirectory$FSIndexOutput.<init>(FSDirectory.java:413)
   [junit4]   2> 	at org.apache.lucene.store.FSDirectory$FSIndexOutput.<init>(FSDirectory.java:409)
   [junit4]   2> 	at org.apache.lucene.store.FSDirectory.createOutput(FSDirectory.java:253)
   [junit4]   2> 	at org.apache.lucene.store.MockDirectoryWrapper.createOutput(MockDirectoryWrapper.java:665)
   [junit4]   2> 	at org.apache.lucene.store.LockValidatingDirectoryWrapper.createOutput(LockValidatingDirectoryWrapper.java:44)
   [junit4]   2> 	at org.apache.lucene.store.TrackingDirectoryWrapper.createOutput(TrackingDirectoryWrapper.java:43)
   [junit4]   2> 	at org.apache.lucene.codecs.blocktree.BlockTreeTermsWriter.<init>(BlockTreeTermsWriter.java:277)
   [junit4]   2> 	at org.apache.lucene.codecs.lucene50.Lucene50PostingsFormat.fieldsConsumer(Lucene50PostingsFormat.java:427)
   [junit4]   2> 	at org.apache.lucene.codecs.bloom.BloomFilteringPostingsFormat.fieldsConsumer(BloomFilteringPostingsFormat.java:143)
   [junit4]   2> 	at org.apache.lucene.codecs.bloom.TestBloomFilteredLucenePostings.fieldsConsumer(TestBloomFilteredLucenePostings.java:65)
   [junit4]   2> 	at org.apache.lucene.codecs.perfield.PerFieldPostingsFormat$FieldsWriter.write(PerFieldPostingsFormat.java:138)
   [junit4]   2> 	at org.apache.lucene.index.FreqProxTermsWriter.flush(FreqProxTermsWriter.java:108)
   [junit4]   2> 	at org.apache.lucene.index.DefaultIndexingChain.flush(DefaultIndexingChain.java:162)
   [junit4]   2> 	at org.apache.lucene.index.DocumentsWriterPerThread.flush(DocumentsWriterPerThread.java:452)
   [junit4]   2> 	at org.apache.lucene.index.DocumentsWriter.doFlush(DocumentsWriter.java:557)
   [junit4]   2> 	at org.apache.lucene.index.DocumentsWriter.flushAllThreads(DocumentsWriter.java:673)
   [junit4]   2> 	at org.apache.lucene.index.IndexWriter.getReader(IndexWriter.java:453)
   [junit4]   2> 	at org.apache.lucene.index.StandardDirectoryReader.doOpenFromWriter(StandardDirectoryReader.java:293)
   [junit4]   2> 	at org.apache.lucene.index.StandardDirectoryReader.doOpenIfChanged(StandardDirectoryReader.java:268)
   [junit4]   2> 	at org.apache.lucene.index.StandardDirectoryReader.doOpenIfChanged(StandardDirectoryReader.java:258)
   [junit4]   2> 	at org.apache.lucene.index.DirectoryReader.openIfChanged(DirectoryReader.java:140)
   [junit4]   2> 	at org.apache.lucene.search.SearcherManager.refreshIfNeeded(SearcherManager.java:156)
   [junit4]   2> 	at org.apache.lucene.search.SearcherManager.refreshIfNeeded(SearcherManager.java:58)
   [junit4]   2> 	at org.apache.lucene.search.ReferenceManager.doMaybeRefresh(ReferenceManager.java:176)
   [junit4]   2> 	at org.apache.lucene.search.ReferenceManager.maybeRefreshBlocking(ReferenceManager.java:253)
   [junit4]   2> 	at org.apache.lucene.search.TestSearcherManager$10.run(TestSearcherManager.java:634)
   [junit4]   2> 
   [junit4]   2> Feb 22, 2018 2:40:44 PM com.carrotsearch.randomizedtesting.RandomizedRunner$QueueUncaughtExceptionsHandler uncaughtException
   [junit4]   2> WARNING: Uncaught exception in thread: Thread[Thread-1406,5,TGRP-TestSearcherManager]
   [junit4]   2> java.lang.RuntimeException: java.nio.file.FileSystemException: /home/jenkins/workspace/Lucene-Solr-7.x-Linux/lucene/build/core/test/J1/temp/lucene.search.TestSearcherManager_C0F57B1E7E34975A-001/tempDir-001/_4c_LuceneVarGapDocFreqInterval_0.doc: Too many open files
   [junit4]   2> 	at __randomizedtesting.SeedInfo.seed([C0F57B1E7E34975A]:0)
   [junit4]   2> 	at org.apache.lucene.search.TestSearcherManager$11.run(TestSearcherManager.java:676)
   [junit4]   2> Caused by: java.nio.file.FileSystemException: /home/jenkins/workspace/Lucene-Solr-7.x-Linux/lucene/build/core/test/J1/temp/lucene.search.TestSearcherManager_C0F57B1E7E34975A-001/tempDir-001/_4c_LuceneVarGapDocFreqInterval_0.doc: Too many open files
   [junit4]   2> 	at org.apache.lucene.mockfile.HandleLimitFS.onOpen(HandleLimitFS.java:48)
   [junit4]   2> 	at org.apache.lucene.mockfile.HandleTrackingFS.callOpenHook(HandleTrackingFS.java:81)
   [junit4]   2> 	at org.apache.lucene.mockfile.HandleTrackingFS.newOutputStream(HandleTrackingFS.java:160)
   [junit4]   2> 	at org.apache.lucene.mockfile.FilterFileSystemProvider.newOutputStream(FilterFileSystemProvider.java:197)
   [junit4]   2> 	at java.base/java.nio.file.Files.newOutputStream(Files.java:218)
   [junit4]   2> 	at org.apache.lucene.store.FSDirectory$FSIndexOutput.<init>(FSDirectory.java:413)
   [junit4]   2> 	at org.apache.lucene.store.FSDirectory$FSIndexOutput.<init>(FSDirectory.java:409)
   [junit4]   2> 	at org.apache.lucene.store.FSDirectory.createOutput(FSDirectory.java:253)
   [junit4]   2> 	at org.apache.lucene.store.MockDirectoryWrapper.createOutput(MockDirectoryWrapper.java:665)
   [junit4]   2> 	at org.apache.lucene.store.LockValidatingDirectoryWrapper.createOutput(LockValidatingDirectoryWrapper.java:44)
   [junit4]   2> 	at org.apache.lucene.store.TrackingDirectoryWrapper.createOutput(TrackingDirectoryWrapper.java:43)
   [junit4]   2> 	at org.apache.lucene.codecs.lucene50.Lucene50PostingsWriter.<init>(Lucene50PostingsWriter.java:105)
   [junit4]   2> 	at org.apache.lucene.codecs.blockterms.LuceneVarGapDocFreqInterval.fieldsConsumer(LuceneVarGapDocFreqInterval.java:63)
   [junit4]   2> 	at org.apache.lucene.codecs.perfield.PerFieldPostingsFormat$FieldsWriter.write(PerFieldPostingsFormat.java:138)
   [junit4]   2> 	at org.apache.lucene.index.FreqProxTermsWriter.flush(FreqProxTermsWriter.java:108)
   [junit4]   2> 	at org.apache.lucene.index.DefaultIndexingChain.flush(DefaultIndexingChain.java:162)
   [junit4]   2> 	at org.apache.lucene.index.DocumentsWriterPerThread.flush(DocumentsWriterPerThread.java:452)
   [junit4]   2> 	at org.apache.lucene.index.DocumentsWriter.doFlush(DocumentsWriter.java:557)
   [junit4]   2> 	at org.apache.lucene.index.DocumentsWriter.flushAllThreads(DocumentsWriter.java:673)
   [junit4]   2> 	at org.apache.lucene.index.IndexWriter.getReader(IndexWriter.java:453)
   [junit4]   2> 	at org.apache.lucene.index.DirectoryReader.open(DirectoryReader.java:103)
   [junit4]   2> 	at org.apache.lucene.search.SearcherManager.<init>(SearcherManager.java:108)
   [junit4]   2> 	at org.apache.lucene.search.SearcherManager.<init>(SearcherManager.java:76)
   [junit4]   2> 	at org.apache.lucene.search.TestSearcherManager$11.run(TestSearcherManager.java:664)
   [junit4]   2> 
   [junit4]   2> Feb 22, 2018 2:40:44 PM com.carrotsearch.randomizedtesting.RandomizedRunner$QueueUncaughtExceptionsHandler uncaughtException
   [junit4]   2> WARNING: Uncaught exception in thread: Thread[Lucene Merge Thread #1,5,TGRP-TestSearcherManager]
   [junit4]   2> org.apache.lucene.index.MergePolicy$MergeException: java.lang.IllegalStateException: this writer hit an unrecoverable error; cannot complete merge
   [junit4]   2> 	at __randomizedtesting.SeedInfo.seed([C0F57B1E7E34975A]:0)
   [junit4]   2> 	at org.apache.lucene.index.ConcurrentMergeScheduler.handleMergeException(ConcurrentMergeScheduler.java:703)
   [junit4]   2> 	at org.apache.lucene.index.ConcurrentMergeScheduler$MergeThread.run(ConcurrentMergeScheduler.java:683)
   [junit4]   2> Caused by: java.lang.IllegalStateException: this writer hit an unrecoverable error; cannot complete merge
   [junit4]   2> 	at org.apache.lucene.index.IndexWriter.commitMerge(IndexWriter.java:3890)
   [junit4]   2> 	at org.apache.lucene.index.IndexWriter.mergeMiddle(IndexWriter.java:4599)
   [junit4]   2> 	at org.apache.lucene.index.IndexWriter.merge(IndexWriter.java:4083)
   [junit4]   2> 	at org.apache.lucene.index.ConcurrentMergeScheduler.doMerge(ConcurrentMergeScheduler.java:624)
   [junit4]   2> 	at org.apache.lucene.index.ConcurrentMergeScheduler$MergeThread.run(ConcurrentMergeScheduler.java:661)
   [junit4]   2> Caused by: java.nio.file.FileSystemException: /home/jenkins/workspace/Lucene-Solr-7.x-Linux/lucene/build/core/test/J1/temp/lucene.search.TestSearcherManager_C0F57B1E7E34975A-001/tempDir-001/_4b_TestBloomFilteredLucenePostings_0.tip: Too many open files
   [junit4]   2> 	at org.apache.lucene.mockfile.HandleLimitFS.onOpen(HandleLimitFS.java:48)
   [junit4]   2> 	at org.apache.lucene.mockfile.HandleTrackingFS.callOpenHook(HandleTrackingFS.java:81)
   [junit4]   2> 	at org.apache.lucene.mockfile.HandleTrackingFS.newOutputStream(HandleTrackingFS.java:160)
   [junit4]   2> 	at org.apache.lucene.mockfile.FilterFileSystemProvider.newOutputStream(FilterFileSystemProvider.java:197)
   [junit4]   2> 	at java.base/java.nio.file.Files.newOutputStream(Files.java:218)
   [junit4]   2> 	at org.apache.lucene.store.FSDirectory$FSIndexOutput.<init>(FSDirectory.java:413)
   [junit4]   2> 	at org.apache.lucene.store.FSDirectory$FSIndexOutput.<init>(FSDirectory.java:409)
   [junit4]   2> 	at org.apache.lucene.store.FSDirectory.createOutput(FSDirectory.java:253)
   [junit4]   2> 	at org.apache.lucene.store.MockDirectoryWrapper.createOutput(MockDirectoryWrapper.java:665)
   [junit4]   2> 	at org.apache.lucene.store.LockValidatingDirectoryWrapper.createOutput(LockValidatingDirectoryWrapper.java:44)
   [junit4]   2> 	at org.apache.lucene.store.TrackingDirectoryWrapper.createOutput(TrackingDirectoryWrapper.java:43)
   [junit4]   2> 	at org.apache.lucene.codecs.blocktree.BlockTreeTermsWriter.<init>(BlockTreeTermsWriter.java:277)
   [junit4]   2> 	at org.apache.lucene.codecs.lucene50.Lucene50PostingsFormat.fieldsConsumer(Lucene50PostingsFormat.java:427)
   [junit4]   2> 	at org.apache.lucene.codecs.bloom.BloomFilteringPostingsFormat.fieldsConsumer(BloomFilteringPostingsFormat.java:143)
   [junit4]   2> 	at org.apache.lucene.codecs.bloom.TestBloomFilteredLucenePostings.fieldsConsumer(TestBloomFilteredLucenePostings.java:65)
   [junit4]   2> 	at org.apache.lucene.codecs.perfield.PerFieldPostingsFormat$FieldsWriter.write(PerFieldPostingsFormat.java:138)
   [junit4]   2> 	at org.apache.lucene.index.FreqProxTermsWriter.flush(FreqProxTermsWriter.java:108)
   [junit4]   2> 	at org.apache.lucene.index.DefaultIndexingChain.flush(DefaultIndexingChain.java:162)
   [junit4]   2> 	at org.apache.lucene.index.DocumentsWriterPerThread.flush(DocumentsWriterPerThread.java:452)
   [junit4]   2> 	at org.apache.lucene.index.DocumentsWriter.doFlush(DocumentsWriter.java:557)
   [junit4]   2> 	at org.apache.lucene.index.DocumentsWriter.flushAllThreads(DocumentsWriter.java:673)
   [junit4]   2> 	at org.apache.lucene.index.IndexWriter.getReader(IndexWriter.java:453)
   [junit4]   2> 	at org.apache.lucene.index.StandardDirectoryReader.doOpenFromWriter(StandardDirectoryReader.java:293)
   [junit4]   2> 	at org.apache.lucene.index.StandardDirectoryReader.doOpenIfChanged(StandardDirectoryReader.java:268)
   [junit4]   2> 	at org.apache.lucene.index.StandardDirectoryReader.doOpenIfChanged(StandardDirectoryReader.java:258)
   [junit4]   2> 	at org.apache.lucene.index.DirectoryReader.openIfChanged(DirectoryReader.java:140)
   [junit4]   2> 	at org.apache.lucene.search.SearcherManager.refreshIfNeeded(SearcherManager.java:156)
   [junit4]   2> 	at org.apache.lucene.search.SearcherManager.refreshIfNeeded(SearcherManager.java:58)
   [junit4]   2> 	at org.apache.lucene.search.ReferenceManager.doMaybeRefresh(ReferenceManager.java:176)
   [junit4]   2> 	at org.apache.lucene.search.ReferenceManager.maybeRefreshBlocking(ReferenceManager.java:253)
   [junit4]   2> 	at org.apache.lucene.search.TestSearcherManager$10.run(TestSearcherManager.java:634)
   [junit4]   2> 
   [junit4]   2> Feb 22, 2018 2:40:44 PM com.carrotsearch.randomizedtesting.RandomizedRunner$QueueUncaughtExceptionsHandler uncaughtException
   [junit4]   2> WARNING: Uncaught exception in thread: Thread[Thread-1405,5,TGRP-TestSearcherManager]
   [junit4]   2> java.lang.RuntimeException: java.nio.file.FileSystemException: /home/jenkins/workspace/Lucene-Solr-7.x-Linux/lucene/build/core/test/J1/temp/lucene.search.TestSearcherManager_C0F57B1E7E34975A-001/tempDir-001/_4b_TestBloomFilteredLucenePostings_0.tip: Too many open files
   [junit4]   2> 	at __randomizedtesting.SeedInfo.seed([C0F57B1E7E34975A]:0)
   [junit4]   2> 	at org.apache.lucene.search.TestSearcherManager$10.run(TestSearcherManager.java:646)
   [junit4]   2> Caused by: java.nio.file.FileSystemException: /home/jenkins/workspace/Lucene-Solr-7.x-Linux/lucene/build/core/test/J1/temp/lucene.search.TestSearcherManager_C0F57B1E7E34975A-001/tempDir-001/_4b_TestBloomFilteredLucenePostings_0.tip: Too many open files
   [junit4]   2> 	at org.apache.lucene.mockfile.HandleLimitFS.onOpen(HandleLimitFS.java:48)
   [junit4]   2> 	at org.apache.lucene.mockfile.HandleTrackingFS.callOpenHook(HandleTrackingFS.java:81)
   [junit4]   2> 	at org.apache.lucene.mockfile.HandleTrackingFS.newOutputStream(HandleTrackingFS.java:160)
   [junit4]   2> 	at org.apache.lucene.mockfile.FilterFileSystemProvider.newOutputStream(FilterFileSystemProvider.java:197)
   [junit4]   2> 	at java.base/java.nio.file.Files.newOutputStream(Files.java:218)
   [junit4]   2> 	at org.apache.lucene.store.FSDirectory$FSIndexOutput.<init>(FSDirectory.java:413)
   [junit4]   2> 	at org.apache.lucene.store.FSDirectory$FSIndexOutput.<init>(FSDirectory.java:409)
   [junit4]   2> 	at org.apache.lucene.store.FSDirectory.createOutput(FSDirectory.java:253)
   [junit4]   2> 	at org.apache.lucene.store.MockDirectoryWrapper.createOutput(MockDirectoryWrapper.java:665)
   [junit4]   2> 	at org.apache.lucene.store.LockValidatingDirectoryWrapper.createOutput(LockValidatingDirectoryWrapper.java:44)
   [junit4]   2> 	at org.apache.lucene.store.TrackingDirectoryWrapper.createOutput(TrackingDirectoryWrapper.java:43)
   [junit4]   2> 	at org.apache.lucene.codecs.blocktree.BlockTreeTermsWriter.<init>(BlockTreeTermsWriter.java:277)
   [junit4]   2> 	at org.apache.lucene.codecs.lucene50.Lucene50PostingsFormat.fieldsConsumer(Lucene50PostingsFormat.java:427)
   [junit4]   2> 	at org.apache.lucene.codecs.bloom.BloomFilteringPostingsFormat.fieldsConsumer(BloomFilteringPostingsFormat.java:143)
   [junit4]   2> 	at org.apache.lucene.codecs.bloom.TestBloomFilteredLucenePostings.fieldsConsumer(TestBloomFilteredLucenePostings.java:65)
   [junit4]   2> 	at org.apache.lucene.codecs.perfield.PerFieldPostingsFormat$FieldsWriter.write(PerFieldPostingsFormat.java:138)
   [junit4]   2> 	at org.apache.lucene.index.FreqProxTermsWriter.flush(FreqProxTermsWriter.java:108)
   [junit4]   2> 	at org.apache.lucene.index.DefaultIndexingChain.flush(DefaultIndexingChain.java:162)
   [junit4]   2> 	at org.apache.lucene.index.DocumentsWriterPerThread.flush(DocumentsWriterPerThread.java:452)
   [junit4]   2> 	at org.apache.lucene.index.DocumentsWriter.doFlush(DocumentsWriter.java:557)
   [junit4]   2> 	at org.apache.lucene.index.DocumentsWriter.flushAllThreads(DocumentsWriter.java:673)
   [junit4]   2> 	at org.apache.lucene.index.IndexWriter.getReader(IndexWriter.java:453)
   [junit4]   2> 	at org.apache.lucene.index.StandardDirectoryReader.doOpenFromWriter(StandardDirectoryReader.java:293)
   [junit4]   2> 	at org.apache.lucene.index.StandardDirectoryReader.doOpenIfChanged(StandardDirectoryReader.java:268)
   [junit4]   2> 	at org.apache.lucene.index.StandardDirectoryReader.doOpenIfChanged(StandardDirectoryReader.java:258)
   [junit4]   2> 	at org.apache.lucene.index.DirectoryReader.openIfChanged(DirectoryReader.java:140)
   [junit4]   2> 	at org.apache.lucene.search.SearcherManager.refreshIfNeeded(SearcherManager.java:156)
   [junit4]   2> 	at org.apache.lucene.search.SearcherManager.refreshIfNeeded(SearcherManager.java:58)
   [junit4]   2> 	at org.apache.lucene.search.ReferenceManager.doMaybeRefresh(ReferenceManager.java:176)
   [junit4]   2> 	at org.apache.lucene.search.ReferenceManager.maybeRefreshBlocking(ReferenceManager.java:253)
   [junit4]   2> 	at org.apache.lucene.search.TestSearcherManager$10.run(TestSearcherManager.java:634)
   [junit4]   2> 
   [junit4]   2> Feb 22, 2018 4:40:39 PM com.carrotsearch.randomizedtesting.ThreadLeakControl$2 evaluate
   [junit4]   2> WARNING: Suite execution timed out: org.apache.lucene.search.TestSearcherManager
   [junit4]   2>    1) Thread[id=1653, name=Thread-1404, state=RUNNABLE, group=TGRP-TestSearcherManager]
   [junit4]   2>         at java.base@10/java.lang.Throwable.fillInStackTrace(Native Method)
   [junit4]   2>         at java.base@10/java.lang.Throwable.fillInStackTrace(Throwable.java:787)
   [junit4]   2>         at java.base@10/java.lang.Throwable.<init>(Throwable.java:270)
   [junit4]   2>         at java.base@10/java.lang.Exception.<init>(Exception.java:66)
   [junit4]   2>         at java.base@10/java.lang.RuntimeException.<init>(RuntimeException.java:62)
   [junit4]   2>         at java.base@10/java.lang.IllegalStateException.<init>(IllegalStateException.java:55)
   [junit4]   2>         at app//org.apache.lucene.store.AlreadyClosedException.<init>(AlreadyClosedException.java:26)
   [junit4]   2>         at app//org.apache.lucene.search.ReferenceManager.acquire(ReferenceManager.java:98)
   [junit4]   2>         at app//org.apache.lucene.search.TestSearcherManager$9.run(TestSearcherManager.java:605)
   [junit4]   2>    2) Thread[id=1, name=main, state=WAITING, group=main]
   [junit4]   2>         at java.base@10/java.lang.Object.wait(Native Method)
   [junit4]   2>         at java.base@10/java.lang.Thread.join(Thread.java:1353)
   [junit4]   2>         at java.base@10/java.lang.Thread.join(Thread.java:1427)
   [junit4]   2>         at app//com.carrotsearch.randomizedtesting.RandomizedRunner.runSuite(RandomizedRunner.java:636)
   [junit4]   2>         at app//com.carrotsearch.randomizedtesting.RandomizedRunner.run(RandomizedRunner.java:493)
   [junit4]   2>         at app//com.carrotsearch.ant.tasks.junit4.slave.SlaveMain.execute(SlaveMain.java:251)
   [junit4]   2>         at app//com.carrotsearch.ant.tasks.junit4.slave.SlaveMain.main(SlaveMain.java:368)
   [junit4]   2>         at app//com.carrotsearch.ant.tasks.junit4.slave.SlaveMainSafe.main(SlaveMainSafe.java:13)
   [junit4]   2>    3) Thread[id=1650, name=SUITE-TestSearcherManager-seed#[C0F57B1E7E34975A], state=RUNNABLE, group=TGRP-TestSearcherManager]
   [junit4]   2>         at java.base/java.lang.Thread.getStackTrace(Thread.java:1654)
   [junit4]   2>         at com.carrotsearch.randomizedtesting.ThreadLeakControl$4.run(ThreadLeakControl.java:696)
   [junit4]   2>         at com.carrotsearch.randomizedtesting.ThreadLeakControl$4.run(ThreadLeakControl.java:693)
   [junit4]   2>         at java.base/java.security.AccessController.doPrivileged(Native Method)
   [junit4]   2>         at com.carrotsearch.randomizedtesting.ThreadLeakControl.getStackTrace(ThreadLeakControl.java:693)
   [junit4]   2>         at com.carrotsearch.randomizedtesting.ThreadLeakControl.getThreadsWithTraces(ThreadLeakControl.java:709)
   [junit4]   2>         at com.carrotsearch.randomizedtesting.ThreadLeakControl.formatThreadStacksFull(ThreadLeakControl.java:689)
   [junit4]   2>         at com.carrotsearch.randomizedtesting.ThreadLeakControl.access$1000(ThreadLeakControl.java:65)
   [junit4]   2>         at com.carrotsearch.randomizedtesting.ThreadLeakControl$2.evaluate(ThreadLeakControl.java:415)
   [junit4]   2>         at com.carrotsearch.randomizedtesting.RandomizedRunner.runSuite(RandomizedRunner.java:705)
   [junit4]   2>         at com.carrotsearch.randomizedtesting.RandomizedRunner.access$200(RandomizedRunner.java:139)
   [junit4]   2>         at com.carrotsearch.randomizedtesting.RandomizedRunner$2.run(RandomizedRunner.java:626)
   [junit4]   2>    4) Thread[id=1651, name=TEST-TestSearcherManager.testConcurrentIndexCloseSearchAndRefresh-seed#[C0F57B1E7E34975A], state=WAITING, group=TGRP-TestSearcherManager]
   [junit4]   2>         at java.base@10/java.lang.Object.wait(Native Method)
   [junit4]   2>         at java.base@10/java.lang.Thread.join(Thread.java:1353)
   [junit4]   2>         at java.base@10/java.lang.Thread.join(Thread.java:1427)
   [junit4]   2>         at app//org.apache.lucene.search.TestSearcherManager.testConcurrentIndexCloseSearchAndRefresh(TestSearcherManager.java:687)
   [junit4]   2>         at java.base@10/jdk.internal.reflect.NativeMethodAccessorImpl.invoke0(Native Method)
   [junit4]   2>         at java.base@10/jdk.internal.reflect.NativeMethodAccessorImpl.invoke(NativeMethodAccessorImpl.java:62)
   [junit4]   2>         at java.base@10/jdk.internal.reflect.DelegatingMethodAccessorImpl.invoke(DelegatingMethodAccessorImpl.java:43)
   [junit4]   2>         at java.base@10/java.lang.reflect.Method.invoke(Method.java:564)
   [junit4]   2>         at app//com.carrotsearch.randomizedtesting.RandomizedRunner.invoke(RandomizedRunner.java:1737)
   [junit4]   2>         at app//com.carrotsearch.randomizedtesting.RandomizedRunner$8.evaluate(RandomizedRunner.java:934)
   [junit4]   2>         at app//com.carrotsearch.randomizedtesting.RandomizedRunner$9.evaluate(RandomizedRunner.java:970)
   [junit4]   2>         at app//com.carrotsearch.randomizedtesting.RandomizedRunner$10.evaluate(RandomizedRunner.java:984)
   [junit4]   2>         at app//org.apache.lucene.util.TestRuleSetupTeardownChained$1.evaluate(TestRuleSetupTeardownChained.java:49)
   [junit4]   2>         at app//org.apache.lucene.util.AbstractBeforeAfterRule$1.evaluate(AbstractBeforeAfterRule.java:45)
   [junit4]   2>         at app//org.apache.lucene.util.TestRuleThreadAndTestName$1.evaluate(TestRuleThreadAndTestName.java:48)
   [junit4]   2>         at app//org.apache.lucene.util.TestRuleIgnoreAfterMaxFailures$1.evaluate(TestRuleIgnoreAfterMaxFailures.java:64)
   [junit4]   2>         at app//org.apache.lucene.util.TestRuleMarkFailure$1.evaluate(TestRuleMarkFailure.java:47)
   [junit4]   2>         at app//com.carrotsearch.randomizedtesting.rules.StatementAdapter.evaluate(StatementAdapter.java:36)
   [junit4]   2>         at app//com.carrotsearch.randomizedtesting.ThreadLeakControl$StatementRunner.run(ThreadLeakControl.java:368)
   [junit4]   2>         at app//com.carrotsearch.randomizedtesting.ThreadLeakControl.forkTimeoutingTask(ThreadLeakControl.java:817)
   [junit4]   2>         at app//com.carrotsearch.randomizedtesting.ThreadLeakControl$3.evaluate(ThreadLeakControl.java:468)
   [junit4]   2>         at app//com.carrotsearch.randomizedtesting.RandomizedRunner.runSingleTest(RandomizedRunner.java:943)
   [junit4]   2>         at app//com.carrotsearch.randomizedtesting.RandomizedRunner$5.evaluate(RandomizedRunner.java:829)
   [junit4]   2>         at app//com.carrotsearch.randomizedtesting.RandomizedRunner$6.evaluate(RandomizedRunner.java:879)
   [junit4]   2>         at app//com.carrotsearch.randomizedtesting.RandomizedRunner$7.evaluate(RandomizedRunner.java:890)
   [junit4]   2>         at app//org.apache.lucene.util.AbstractBeforeAfterRule$1.evaluate(AbstractBeforeAfterRule.java:45)
   [junit4]   2>         at app//com.carrotsearch.randomizedtesting.rules.StatementAdapter.evaluate(StatementAdapter.java:36)
   [junit4]   2>         at app//org.apache.lucene.util.TestRuleStoreClassName$1.evaluate(TestRuleStoreClassName.java:41)
   [junit4]   2>         at app//com.carrotsearch.randomizedtesting.rules.NoShadowingOrOverridesOnMethodsRule$1.evaluate(NoShadowingOrOverridesOnMethodsRule.java:40)
   [junit4]   2>         at app//com.carrotsearch.randomizedtesting.rules.NoShadowingOrOverridesOnMethodsRule$1.evaluate(NoShadowingOrOverridesOnMethodsRule.java:40)
   [junit4]   2>         at app//com.carrotsearch.randomizedtesting.rules.StatementAdapter.evaluate(StatementAdapter.java:36)
   [junit4]   2>         at app//com.carrotsearch.randomizedtesting.rules.StatementAdapter.evaluate(StatementAdapter.java:36)
   [junit4]   2>         at app//org.apache.lucene.util.TestRuleAssertionsRequired$1.evaluate(TestRuleAssertionsRequired.java:53)
   [junit4]   2>         at app//org.apache.lucene.util.TestRuleMarkFailure$1.evaluate(TestRuleMarkFailure.java:47)
   [junit4]   2>         at app//org.apache.lucene.util.TestRuleIgnoreAfterMaxFailures$1.evaluate(TestRuleIgnoreAfterMaxFailures.java:64)
   [junit4]   2>         at app//org.apache.lucene.util.TestRuleIgnoreTestSuites$1.evaluate(TestRuleIgnoreTestSuites.java:54)
   [junit4]   2>         at app//com.carrotsearch.randomizedtesting.rules.StatementAdapter.evaluate(StatementAdapter.java:36)
   [junit4]   2>         at app//com.carrotsearch.randomizedtesting.ThreadLeakControl$StatementRunner.run(ThreadLeakControl.java:368)
   [junit4]   2>         at java.base@10/java.lang.Thread.run(Thread.java:844)
   [junit4]   2>    5) Thread[id=12, name=JUnit4-serializer-daemon, state=TIMED_WAITING, group=main]
   [junit4]   2>         at java.base@10/java.lang.Thread.sleep(Native Method)
   [junit4]   2>         at app//com.carrotsearch.ant.tasks.junit4.events.Serializer$1.run(Serializer.java:50)
   [junit4]   2> NOTE: reproduce with: ant test  -Dtestcase=TestSearcherManager -Dtests.method=testConcurrentIndexCloseSearchAndRefresh -Dtests.seed=C0F57B1E7E34975A -Dtests.multiplier=3 -Dtests.slow=true -Dtests.locale=en-ZM -Dtests.timezone=Australia/NSW -Dtests.asserts=true -Dtests.file.encoding=UTF-8
   [junit4] ERROR   7200s J1 | TestSearcherManager.testConcurrentIndexCloseSearchAndRefresh <<<
   [junit4]    > Throwable #1: java.lang.Exception: Test abandoned because suite timeout was reached.
   [junit4]    > 	at __randomizedtesting.SeedInfo.seed([C0F57B1E7E34975A]:0)
   [junit4]   2> Feb 22, 2018 4:40:39 PM com.carrotsearch.randomizedtesting.ThreadLeakControl checkThreadLeaks
   [junit4]   2> WARNING: Will linger awaiting termination of 2 leaked thread(s).
   [junit4]   2> Feb 22, 2018 4:40:59 PM com.carrotsearch.randomizedtesting.ThreadLeakControl checkThreadLeaks
   [junit4]   2> SEVERE: 2 threads leaked from SUITE scope at org.apache.lucene.search.TestSearcherManager: 
   [junit4]   2>    1) Thread[id=1653, name=Thread-1404, state=RUNNABLE, group=TGRP-TestSearcherManager]
   [junit4]   2>         at java.base@10/java.lang.Throwable.fillInStackTrace(Native Method)
   [junit4]   2>         at java.base@10/java.lang.Throwable.fillInStackTrace(Throwable.java:787)
   [junit4]   2>         at java.base@10/java.lang.Throwable.<init>(Throwable.java:270)
   [junit4]   2>         at java.base@10/java.lang.Exception.<init>(Exception.java:66)
   [junit4]   2>         at java.base@10/java.lang.RuntimeException.<init>(RuntimeException.java:62)
   [junit4]   2>         at java.base@10/java.lang.IllegalStateException.<init>(IllegalStateException.java:55)
   [junit4]   2>         at app//org.apache.lucene.store.AlreadyClosedException.<init>(AlreadyClosedException.java:26)
   [junit4]   2>         at app//org.apache.lucene.search.ReferenceManager.acquire(ReferenceManager.java:98)
   [junit4]   2>         at app//org.apache.lucene.search.TestSearcherManager$9.run(TestSearcherManager.java:605)
   [junit4]   2>    2) Thread[id=1651, name=TEST-TestSearcherManager.testConcurrentIndexCloseSearchAndRefresh-seed#[C0F57B1E7E34975A], state=WAITING, group=TGRP-TestSearcherManager]
   [junit4]   2>         at java.base@10/java.lang.Object.wait(Native Method)
   [junit4]   2>         at java.base@10/java.lang.Thread.join(Thread.java:1353)
   [junit4]   2>         at java.base@10/java.lang.Thread.join(Thread.java:1427)
   [junit4]   2>         at app//org.apache.lucene.search.TestSearcherManager.testConcurrentIndexCloseSearchAndRefresh(TestSearcherManager.java:687)
   [junit4]   2>         at java.base@10/jdk.internal.reflect.NativeMethodAccessorImpl.invoke0(Native Method)
   [junit4]   2>         at java.base@10/jdk.internal.reflect.NativeMethodAccessorImpl.invoke(NativeMethodAccessorImpl.java:62)
   [junit4]   2>         at java.base@10/jdk.internal.reflect.DelegatingMethodAccessorImpl.invoke(DelegatingMethodAccessorImpl.java:43)
   [junit4]   2>         at java.base@10/java.lang.reflect.Method.invoke(Method.java:564)
   [junit4]   2>         at app//com.carrotsearch.randomizedtesting.RandomizedRunner.invoke(RandomizedRunner.java:1737)
   [junit4]   2>         at app//com.carrotsearch.randomizedtesting.RandomizedRunner$8.evaluate(RandomizedRunner.java:934)
   [junit4]   2>         at app//com.carrotsearch.randomizedtesting.RandomizedRunner$9.evaluate(RandomizedRunner.java:970)
   [junit4]   2>         at app//com.carrotsearch.randomizedtesting.RandomizedRunner$10.evaluate(RandomizedRunner.java:984)
   [junit4]   2>         at app//org.apache.lucene.util.TestRuleSetupTeardownChained$1.evaluate(TestRuleSetupTeardownChained.java:49)
   [junit4]   2>         at app//org.apache.lucene.util.AbstractBeforeAfterRule$1.evaluate(AbstractBeforeAfterRule.java:45)
   [junit4]   2>         at app//org.apache.lucene.util.TestRuleThreadAndTestName$1.evaluate(TestRuleThreadAndTestName.java:48)
   [junit4]   2>         at app//org.apache.lucene.util.TestRuleIgnoreAfterMaxFailures$1.evaluate(TestRuleIgnoreAfterMaxFailures.java:64)
   [junit4]   2>         at app//org.apache.lucene.util.TestRuleMarkFailure$1.evaluate(TestRuleMarkFailure.java:47)
   [junit4]   2>         at app//com.carrotsearch.randomizedtesting.rules.StatementAdapter.evaluate(StatementAdapter.java:36)
   [junit4]   2>         at app//com.carrotsearch.randomizedtesting.ThreadLeakControl$StatementRunner.run(ThreadLeakControl.java:368)
   [junit4]   2>         at app//com.carrotsearch.randomizedtesting.ThreadLeakControl.forkTimeoutingTask(ThreadLeakControl.java:817)
   [junit4]   2>         at app//com.carrotsearch.randomizedtesting.ThreadLeakControl$3.evaluate(ThreadLeakControl.java:468)
   [junit4]   2>         at app//com.carrotsearch.randomizedtesting.RandomizedRunner.runSingleTest(RandomizedRunner.java:943)
   [junit4]   2>         at app//com.carrotsearch.randomizedtesting.RandomizedRunner$5.evaluate(RandomizedRunner.java:829)
   [junit4]   2>         at app//com.carrotsearch.randomizedtesting.RandomizedRunner$6.evaluate(RandomizedRunner.java:879)
   [junit4]   2>         at app//com.carrotsearch.randomizedtesting.RandomizedRunner$7.evaluate(RandomizedRunner.java:890)
   [junit4]   2>         at app//org.apache.lucene.util.AbstractBeforeAfterRule$1.evaluate(AbstractBeforeAfterRule.java:45)
   [junit4]   2>         at app//com.carrotsearch.randomizedtesting.rules.StatementAdapter.evaluate(StatementAdapter.java:36)
   [junit4]   2>         at app//org.apache.lucene.util.TestRuleStoreClassName$1.evaluate(TestRuleStoreClassName.java:41)
   [junit4]   2>         at app//com.carrotsearch.randomizedtesting.rules.NoShadowingOrOverridesOnMethodsRule$1.evaluate(NoShadowingOrOverridesOnMethodsRule.java:40)
   [junit4]   2>         at app//com.carrotsearch.randomizedtesting.rules.NoShadowingOrOverridesOnMethodsRule$1.evaluate(NoShadowingOrOverridesOnMethodsRule.java:40)
   [junit4]   2>         at app//com.carrotsearch.randomizedtesting.rules.StatementAdapter.evaluate(StatementAdapter.java:36)
   [junit4]   2>         at app//com.carrotsearch.randomizedtesting.rules.StatementAdapter.evaluate(StatementAdapter.java:36)
   [junit4]   2>         at app//org.apache.lucene.util.TestRuleAssertionsRequired$1.evaluate(TestRuleAssertionsRequired.java:53)
   [junit4]   2>         at app//org.apache.lucene.util.TestRuleMarkFailure$1.evaluate(TestRuleMarkFailure.java:47)
   [junit4]   2>         at app//org.apache.lucene.util.TestRuleIgnoreAfterMaxFailures$1.evaluate(TestRuleIgnoreAfterMaxFailures.java:64)
   [junit4]   2>         at app//org.apache.lucene.util.TestRuleIgnoreTestSuites$1.evaluate(TestRuleIgnoreTestSuites.java:54)
   [junit4]   2>         at app//com.carrotsearch.randomizedtesting.rules.StatementAdapter.evaluate(StatementAdapter.java:36)
   [junit4]   2>         at app//com.carrotsearch.randomizedtesting.ThreadLeakControl$StatementRunner.run(ThreadLeakControl.java:368)
   [junit4]   2>         at java.base@10/java.lang.Thread.run(Thread.java:844)
   [junit4]   2> Feb 22, 2018 4:40:59 PM com.carrotsearch.randomizedtesting.ThreadLeakControl tryToInterruptAll
   [junit4]   2> INFO: Starting to interrupt leaked threads:
   [junit4]   2>    1) Thread[id=1653, name=Thread-1404, state=RUNNABLE, group=TGRP-TestSearcherManager]
   [junit4]   2>    2) Thread[id=1651, name=TEST-TestSearcherManager.testConcurrentIndexCloseSearchAndRefresh-seed#[C0F57B1E7E34975A], state=WAITING, group=TGRP-TestSearcherManager]
   [junit4]   2> NOTE: leaving temporary files on disk at: /home/jenkins/workspace/Lucene-Solr-7.x-Linux/lucene/build/core/test/J1/temp/lucene.search.TestSearcherManager_C0F57B1E7E34975A-001
   [junit4]   2> Feb 22, 2018 5:41:02 AM com.carrotsearch.randomizedtesting.ThreadLeakControl tryToInterruptAll
   [junit4]   2> SEVERE: There are still zombie threads that couldn't be terminated:
   [junit4]   2>    1) Thread[id=1653, name=Thread-1404, state=RUNNABLE, group=TGRP-TestSearcherManager]
   [junit4]   2>         at java.base@10/java.lang.Throwable.fillInStackTrace(Native Method)
   [junit4]   2>         at java.base@10/java.lang.Throwable.fillInStackTrace(Throwable.java:787)
   [junit4]   2>         at java.base@10/java.lang.Throwable.<init>(Throwable.java:270)
   [junit4]   2>         at java.base@10/java.lang.Exception.<init>(Exception.java:66)
   [junit4]   2>         at java.base@10/java.lang.RuntimeException.<init>(RuntimeException.java:62)
   [junit4]   2>         at java.base@10/java.lang.IllegalStateException.<init>(IllegalStateException.java:55)
   [junit4]   2>         at app//org.apache.lucene.store.AlreadyClosedException.<init>(AlreadyClosedException.java:26)
   [junit4]   2>         at app//org.apache.lucene.search.ReferenceManager.acquire(ReferenceManager.java:98)
   [junit4]   2>         at app//org.apache.lucene.search.TestSearcherManager$9.run(TestSearcherManager.java:605)
   [junit4]   2> NOTE: test params are: codec=Asserting(Lucene70): {date=Lucene50(blocksize=128), docid=PostingsFormat(name=LuceneVarGapDocFreqInterval), titleTokenized=TestBloomFilteredLucenePostings(BloomFilteringPostingsFormat(Lucene50(blocksize=128))), body=Lucene50(blocksize=128), title=PostingsFormat(name=LuceneFixedGap)}, docValues:{date=DocValuesFormat(name=Lucene70), docid_intDV=DocValuesFormat(name=Lucene70), docid_int=DocValuesFormat(name=Lucene70), docid=DocValuesFormat(name=Asserting), titleTokenized=DocValuesFormat(name=Lucene70), title=DocValuesFormat(name=Asserting), body=DocValuesFormat(name=Lucene70), titleDV=DocValuesFormat(name=Asserting)}, maxPointsInLeafNode=1298, maxMBSortInHeap=7.2334610269356165, sim=RandomSimilarity(queryNorm=true): {titleTokenized=DFR I(F)BZ(0.3), body=DFR I(n)B2}, locale=en-ZM, timezone=Australia/NSW
   [junit4]   2> NOTE: Linux 4.13.0-32-generic amd64/Oracle Corporation 10 (64-bit)/cpus=8,threads=2,free=315184368,total=518979584
   [junit4]   2> NOTE: All tests run in this JVM: [TestMathUtil, TestFieldValueQuery, TestIndexReaderClose, TestConcurrentMergeScheduler, TestTimeLimitingCollector, TestByteSlices, TestBooleanQuery, TestCheckIndex, TestAddIndexes, TestTermsEnum2, TestIndexWriterMaxDocs, TestSortRandom, TestTopFieldCollectorEarlyTermination, TestSloppyMath, TestMultiPhraseEnum, TestDoubleRange, TestToken, TestNorms, TestMutablePointsReaderUtils, TestCrash, Test2BPostings, TestSpanContainQuery, TestSortedSetSortField, TestNGramPhraseQuery, TestDirectory, TestSameScoresWithThreads, TestComplexExplanations, TestFileSwitchDirectory, TestAtomicUpdate, TestParallelTermEnum, TestRecyclingByteBlockAllocator, TestVersion, Test2BBKDPoints, TestMergeSchedulerExternal, TestDeterminism, TestLucene60FieldInfoFormat, TestCharArraySet, TestBinaryDocValuesUpdates, TestBM25Similarity, TestStressNRT, TestFastDecompressionMode, TestPhraseQuery, TestDocValuesQueries, TestPrefixInBooleanQuery, TestCodecHoldsOpenFiles, TestBooleanOr, TestRAMDirectory, TestIndexFileDeleter, TestPhrasePrefixQuery, TestReadOnlyIndex, TestIndexWriterUnicode, TestNormsFieldExistsQuery, TestSortRescorer, TestMultiDocValues, TestMmapDirectory, TestFilterIterator, TestFSTs, TestAutomatonQueryUnicode, TestRadixSelector, TestFilterLeafReader, TestCustomNorms, Test2BPositions, TestDoc, Test2BTerms, TestStringHelper, TestLevenshteinAutomata, TestLogMergePolicy, TestSpanOrQuery, TestIndexWriterThreadsToSegments, TestLucene50StoredFieldsFormat, TestIntArrayDocIdSet, Test2BDocs, TestDocsWithFieldSet, TestReusableStringReader, TestPrefixRandom, TestGraphTokenizers, Test2BPoints, TestCodecUtil, TestPerFieldDocValuesFormat, TestIndexWriterReader, TestIndexWriterMerging, TestBytesStore, TestPackedInts, TestSearcherManager]
   [junit4]   2> NOTE: reproduce with: ant test  -Dtestcase=TestSearcherManager -Dtests.seed=C0F57B1E7E34975A -Dtests.multiplier=3 -Dtests.slow=true -Dtests.locale=en-ZM -Dtests.timezone=Australia/NSW -Dtests.asserts=true -Dtests.file.encoding=UTF-8
   [junit4] ERROR   0.00s J1 | TestSearcherManager (suite) <<<
   [junit4]    > Throwable #1: java.lang.Exception: Suite timeout exceeded (>= 7200000 msec).
   [junit4]    > 	at __randomizedtesting.SeedInfo.seed([C0F57B1E7E34975A]:0)Throwable #2: com.carrotsearch.randomizedtesting.UncaughtExceptionError: Captured an uncaught exception in thread: Thread[id=1652, name=Thread-1403, state=RUNNABLE, group=TGRP-TestSearcherManager]
   [junit4]    > Caused by: org.apache.lucene.store.AlreadyClosedException: this IndexWriter is closed
   [junit4]    > 	at __randomizedtesting.SeedInfo.seed([C0F57B1E7E34975A]:0)
   [junit4]    > 	at org.apache.lucene.index.IndexWriter.ensureOpen(IndexWriter.java:897)
   [junit4]    > 	at org.apache.lucene.index.IndexWriter.ensureOpen(IndexWriter.java:911)
   [junit4]    > 	at org.apache.lucene.index.IndexWriter.updateDocument(IndexWriter.java:1725)
   [junit4]    > 	at org.apache.lucene.index.IndexWriter.addDocument(IndexWriter.java:1464)
   [junit4]    > 	at org.apache.lucene.search.TestSearcherManager$8.run(TestSearcherManager.java:574)
   [junit4]    > Caused by: java.nio.file.FileSystemException: /home/jenkins/workspace/Lucene-Solr-7.x-Linux/lucene/build/core/test/J1/temp/lucene.search.TestSearcherManager_C0F57B1E7E34975A-001/tempDir-001/_4b_TestBloomFilteredLucenePostings_0.tip: Too many open files
   [junit4]    > 	at org.apache.lucene.mockfile.HandleLimitFS.onOpen(HandleLimitFS.java:48)
   [junit4]    > 	at org.apache.lucene.mockfile.HandleTrackingFS.callOpenHook(HandleTrackingFS.java:81)
   [junit4]    > 	at org.apache.lucene.mockfile.HandleTrackingFS.newOutputStream(HandleTrackingFS.java:160)
   [junit4]    > 	at org.apache.lucene.mockfile.FilterFileSystemProvider.newOutputStream(FilterFileSystemProvider.java:197)
   [junit4]    > 	at java.base/java.nio.file.Files.newOutputStream(Files.java:218)
   [junit4]    > 	at org.apache.lucene.store.FSDirectory$FSIndexOutput.<init>(FSDirectory.java:413)
   [junit4]    > 	at org.apache.lucene.store.FSDirectory$FSIndexOutput.<init>(FSDirectory.java:409)
   [junit4]    > 	at org.apache.lucene.store.FSDirectory.createOutput(FSDirectory.java:253)
   [junit4]    > 	at org.apache.lucene.store.MockDirectoryWrapper.createOutput(MockDirectoryWrapper.java:665)
   [junit4]    > 	at org.apache.lucene.store.LockValidatingDirectoryWrapper.createOutput(LockValidatingDirectoryWrapper.java:44)
   [junit4]    > 	at org.apache.lucene.store.TrackingDirectoryWrapper.createOutput(TrackingDirectoryWrapper.java:43)
   [junit4]    > 	at org.apache.lucene.codecs.blocktree.BlockTreeTermsWriter.<init>(BlockTreeTermsWriter.java:277)
   [junit4]    > 	at org.apache.lucene.codecs.lucene50.Lucene50PostingsFormat.fieldsConsumer(Lucene50PostingsFormat.java:427)
   [junit4]    > 	at org.apache.lucene.codecs.bloom.BloomFilteringPostingsFormat.fieldsConsumer(BloomFilteringPostingsFormat.java:143)
   [junit4]    > 	at org.apache.lucene.codecs.bloom.TestBloomFilteredLucenePostings.fieldsConsumer(TestBloomFilteredLucenePostings.java:65)
   [junit4]    > 	at org.apache.lucene.codecs.perfield.PerFieldPostingsFormat$FieldsWriter.write(PerFieldPostingsFormat.java:138)
   [junit4]    > 	at org.apache.lucene.index.FreqProxTermsWriter.flush(FreqProxTermsWriter.java:108)
   [junit4]    > 	at org.apache.lucene.index.DefaultIndexingChain.flush(DefaultIndexingChain.java:162)
   [junit4]    > 	at org.apache.lucene.index.DocumentsWriterPerThread.flush(DocumentsWriterPerThread.java:452)
   [junit4]    > 	at org.apache.lucene.index.DocumentsWriter.doFlush(DocumentsWriter.java:557)
   [junit4]    > 	at org.apache.lucene.index.DocumentsWriter.flushAllThreads(DocumentsWriter.java:673)
   [junit4]    > 	at org.apache.lucene.index.IndexWriter.getReader(IndexWriter.java:453)
   [junit4]    > 	at org.apache.lucene.index.StandardDirectoryReader.doOpenFromWriter(StandardDirectoryReader.java:293)
   [junit4]    > 	at org.apache.lucene.index.StandardDirectoryReader.doOpenIfChanged(StandardDirectoryReader.java:268)
   [junit4]    > 	at org.apache.lucene.index.StandardDirectoryReader.doOpenIfChanged(StandardDirectoryReader.java:258)
   [junit4]    > 	at org.apache.lucene.index.DirectoryReader.openIfChanged(DirectoryReader.java:140)
   [junit4]    > 	at org.apache.lucene.search.SearcherManager.refreshIfNeeded(SearcherManager.java:156)
   [junit4]    > 	at org.apache.lucene.search.SearcherManager.refreshIfNeeded(SearcherManager.java:58)
   [junit4]    > 	at org.apache.lucene.search.ReferenceManager.doMaybeRefresh(ReferenceManager.java:176)
   [junit4]    > 	at org.apache.lucene.search.ReferenceManager.maybeRefreshBlocking(ReferenceManager.java:253)
   [junit4]    > 	at org.apache.lucene.search.TestSearcherManager$10.run(TestSearcherManager.java:634)Throwable #3: com.carrotsearch.randomizedtesting.UncaughtExceptionError: Captured an uncaught exception in thread: Thread[id=1655, name=Thread-1406, state=RUNNABLE, group=TGRP-TestSearcherManager]
   [junit4]    > Caused by: java.lang.RuntimeException: java.nio.file.FileSystemException: /home/jenkins/workspace/Lucene-Solr-7.x-Linux/lucene/build/core/test/J1/temp/lucene.search.TestSearcherManager_C0F57B1E7E34975A-001/tempDir-001/_4c_LuceneVarGapDocFreqInterval_0.doc: Too many open files
   [junit4]    > 	at __randomizedtesting.SeedInfo.seed([C0F57B1E7E34975A]:0)
   [junit4]    > 	at org.apache.lucene.search.TestSearcherManager$11.run(TestSearcherManager.java:676)
   [junit4]    > Caused by: java.nio.file.FileSystemException: /home/jenkins/workspace/Lucene-Solr-7.x-Linux/lucene/build/core/test/J1/temp/lucene.search.TestSearcherManager_C0F57B1E7E34975A-001/tempDir-001/_4c_LuceneVarGapDocFreqInterval_0.doc: Too many open files
   [junit4]    > 	at org.apache.lucene.mockfile.HandleLimitFS.onOpen(HandleLimitFS.java:48)
   [junit4]    > 	at org.apache.lucene.mockfile.HandleTrackingFS.callOpenHook(HandleTrackingFS.java:81)
   [junit4]    > 	at org.apache.lucene.mockfile.HandleTrackingFS.newOutputStream(HandleTrackingFS.java:160)
   [junit4]    > 	at org.apache.lucene.mockfile.FilterFileSystemProvider.newOutputStream(FilterFileSystemProvider.java:197)
   [junit4]    > 	at java.base/java.nio.file.Files.newOutputStream(Files.java:218)
   [junit4]    > 	at org.apache.lucene.store.FSDirectory$FSIndexOutput.<init>(FSDirectory.java:413)
   [junit4]    > 	at org.apache.lucene.store.FSDirectory$FSIndexOutput.<init>(FSDirectory.java:409)
   [junit4]    > 	at org.apache.lucene.store.FSDirectory.createOutput(FSDirectory.java:253)
   [junit4]    > 	at org.apache.lucene.store.MockDirectoryWrapper.createOutput(MockDirectoryWrapper.java:665)
   [junit4]    > 	at org.apache.lucene.store.LockValidatingDirectoryWrapper.createOutput(LockValidatingDirectoryWrapper.java:44)
   [junit4]    > 	at org.apache.lucene.store.TrackingDirectoryWrapper.createOutput(TrackingDirectoryWrapper.java:43)
   [junit4]    > 	at org.apache.lucene.codecs.lucene50.Lucene50PostingsWriter.<init>(Lucene50PostingsWriter.java:105)
   [junit4]    > 	at org.apache.lucene.codecs.blockterms.LuceneVarGapDocFreqInterval.fieldsConsumer(LuceneVarGapDocFreqInterval.java:63)
   [junit4]    > 	at org.apache.lucene.codecs.perfield.PerFieldPostingsFormat$FieldsWriter.write(PerFieldPostingsFormat.java:138)
   [junit4]    > 	at org.apache.lucene.index.FreqProxTermsWriter.flush(FreqProxTermsWriter.java:108)
   [junit4]    > 	at org.apache.lucene.index.DefaultIndexingChain.flush(DefaultIndexingChain.java:162)
   [junit4]    > 	at org.apache.lucene.index.DocumentsWriterPerThread.flush(DocumentsWriterPerThread.java:452)
   [junit4]    > 	at org.apache.lucene.index.DocumentsWriter.doFlush(DocumentsWriter.java:557)
   [junit4]    > 	at org.apache.lucene.index.DocumentsWriter.flushAllThreads(DocumentsWriter.java:673)
   [junit4]    > 	at org.apache.lucene.index.IndexWriter.getReader(IndexWriter.java:453)
   [junit4]    > 	at org.apache.lucene.index.DirectoryReader.open(DirectoryReader.java:103)
   [junit4]    > 	at org.apache.lucene.search.SearcherManager.<init>(SearcherManager.java:108)
   [junit4]    > 	at org.apache.lucene.search.SearcherManager.<init>(SearcherManager.java:76)
   [junit4]    > 	at org.apache.lucene.search.TestSearcherManager$11.run(TestSearcherManager.java:664)Throwable #4: com.carrotsearch.randomizedtesting.UncaughtExceptionError: Captured an uncaught exception in thread: Thread[id=1657, name=Lucene Merge Thread #1, state=RUNNABLE, group=TGRP-TestSearcherManager]
   [junit4]    > Caused by: org.apache.lucene.index.MergePolicy$MergeException: java.lang.IllegalStateException: this writer hit an unrecoverable error; cannot complete merge
   [junit4]    > 	at __randomizedtesting.SeedInfo.seed([C0F57B1E7E34975A]:0)
   [junit4]    > 	at org.apache.lucene.index.ConcurrentMergeScheduler.handleMergeException(ConcurrentMergeScheduler.java:703)
   [junit4]    > 	at org.apache.lucene.index.ConcurrentMergeScheduler$MergeThread.run(ConcurrentMergeScheduler.java:683)
   [junit4]    > Caused by: java.lang.IllegalStateException: this writer hit an unrecoverable error; cannot complete merge
   [junit4]    > 	at org.apache.lucene.index.IndexWriter.commitMerge(IndexWriter.java:3890)
   [junit4]    > 	at org.apache.lucene.index.IndexWriter.mergeMiddle(IndexWriter.java:4599)
   [junit4]    > 	at org.apache.lucene.index.IndexWriter.merge(IndexWriter.java:4083)
   [junit4]    > 	at org.apache.lucene.index.ConcurrentMergeScheduler.doMerge(ConcurrentMergeScheduler.java:624)
   [junit4]    > 	at org.apache.lucene.index.ConcurrentMergeScheduler$MergeThread.run(ConcurrentMergeScheduler.java:661)
   [junit4]    > Caused by: java.nio.file.FileSystemException: /home/jenkins/workspace/Lucene-Solr-7.x-Linux/lucene/build/core/test/J1/temp/lucene.search.TestSearcherManager_C0F57B1E7E34975A-001/tempDir-001/_4b_TestBloomFilteredLucenePostings_0.tip: Too many open files
   [junit4]    > 	at org.apache.lucene.mockfile.HandleLimitFS.onOpen(HandleLimitFS.java:48)
   [junit4]    > 	at org.apache.lucene.mockfile.HandleTrackingFS.callOpenHook(HandleTrackingFS.java:81)
   [junit4]    > 	at org.apache.lucene.mockfile.HandleTrackingFS.newOutputStream(HandleTrackingFS.java:160)
   [junit4]    > 	at org.apache.lucene.mockfile.FilterFileSystemProvider.newOutputStream(FilterFileSystemProvider.java:197)
   [junit4]    > 	at java.base/java.nio.file.Files.newOutputStream(Files.java:218)
   [junit4]    > 	at org.apache.lucene.store.FSDirectory$FSIndexOutput.<init>(FSDirectory.java:413)
   [junit4]    > 	at org.apache.lucene.store.FSDirectory$FSIndexOutput.<init>(FSDirectory.java:409)
   [junit4]    > 	at org.apache.lucene.store.FSDirectory.createOutput(FSDirectory.java:253)
   [junit4]    > 	at org.apache.lucene.store.MockDirectoryWrapper.createOutput(MockDirectoryWrapper.java:665)
   [junit4]    > 	at org.apache.lucene.store.LockValidatingDirectoryWrapper.createOutput(LockValidatingDirectoryWrapper.java:44)
   [junit4]    > 	at org.apache.lucene.store.TrackingDirectoryWrapper.createOutput(TrackingDirectoryWrapper.java:43)
   [junit4]    > 	at org.apache.lucene.codecs.blocktree.BlockTreeTermsWriter.<init>(BlockTreeTermsWriter.java:277)
   [junit4]    > 	at org.apache.lucene.codecs.lucene50.Lucene50PostingsFormat.fieldsConsumer(Lucene50PostingsFormat.java:427)
   [junit4]    > 	at org.apache.lucene.codecs.bloom.BloomFilteringPostingsFormat.fieldsConsumer(BloomFilteringPostingsFormat.java:143)
   [junit4]    > 	at org.apache.lucene.codecs.bloom.TestBloomFilteredLucenePostings.fieldsConsumer(TestBloomFilteredLucenePostings.java:65)
   [junit4]    > 	at org.apache.lucene.codecs.perfield.PerFieldPostingsFormat$FieldsWriter.write(PerFieldPostingsFormat.java:138)
   [junit4]    > 	at org.apache.lucene.index.FreqProxTermsWriter.flush(FreqProxTermsWriter.java:108)
   [junit4]    > 	at org.apache.lucene.index.DefaultIndexingChain.flush(DefaultIndexingChain.java:162)
   [junit4]    > 	at org.apache.lucene.index.DocumentsWriterPerThread.flush(DocumentsWriterPerThread.java:452)
   [junit4]    > 	at org.apache.lucene.index.DocumentsWriter.doFlush(DocumentsWriter.java:557)
   [junit4]    > 	at org.apache.lucene.index.DocumentsWriter.flushAllThreads(DocumentsWriter.java:673)
   [junit4]    > 	at org.apache.lucene.index.IndexWriter.getReader(IndexWriter.java:453)
   [junit4]    > 	at org.apache.lucene.index.StandardDirectoryReader.doOpenFromWriter(StandardDirectoryReader.java:293)
   [junit4]    > 	at org.apache.lucene.index.StandardDirectoryReader.doOpenIfChanged(StandardDirectoryReader.java:268)
   [junit4]    > 	at org.apache.lucene.index.StandardDirectoryReader.doOpenIfChanged(StandardDirectoryReader.java:258)
   [junit4]    > 	at org.apache.lucene.index.DirectoryReader.openIfChanged(DirectoryReader.java:140)
   [junit4]    > 	at org.apache.lucene.search.SearcherManager.refreshIfNeeded(SearcherManager.java:156)
   [junit4]    > 	at org.apache.lucene.search.SearcherManager.refreshIfNeeded(SearcherManager.java:58)
   [junit4]    > 	at org.apache.lucene.search.ReferenceManager.doMaybeRefresh(ReferenceManager.java:176)
   [junit4]    > 	at org.apache.lucene.search.ReferenceManager.maybeRefreshBlocking(ReferenceManager.java:253)
   [junit4]    > 	at org.apache.lucene.search.TestSearcherManager$10.run(TestSearcherManager.java:634)Throwable #5: com.carrotsearch.randomizedtesting.UncaughtExceptionError: Captured an uncaught exception in thread: Thread[id=1654, name=Thread-1405, state=RUNNABLE, group=TGRP-TestSearcherManager]
   [junit4]    > Caused by: java.lang.RuntimeException: java.nio.file.FileSystemException: /home/jenkins/workspace/Lucene-Solr-7.x-Linux/lucene/build/core/test/J1/temp/lucene.search.TestSearcherManager_C0F57B1E7E34975A-001/tempDir-001/_4b_TestBloomFilteredLucenePostings_0.tip: Too many open files
   [junit4]    > 	at __randomizedtesting.SeedInfo.seed([C0F57B1E7E34975A]:0)
   [junit4]    > 	at org.apache.lucene.search.TestSearcherManager$10.run(TestSearcherManager.java:646)
   [junit4]    > Caused by: java.nio.file.FileSystemException: /home/jenkins/workspace/Lucene-Solr-7.x-Linux/lucene/build/core/test/J1/temp/lucene.search.TestSearcherManager_C0F57B1E7E34975A-001/tempDir-001/_4b_TestBloomFilteredLucenePostings_0.tip: Too many open files
   [junit4]    > 	at org.apache.lucene.mockfile.HandleLimitFS.onOpen(HandleLimitFS.java:48)
   [junit4]    > 	at org.apache.lucene.mockfile.HandleTrackingFS.callOpenHook(HandleTrackingFS.java:81)
   [junit4]    > 	at org.apache.lucene.mockfile.HandleTrackingFS.newOutputStream(HandleTrackingFS.java:160)
   [junit4]    > 	at org.apache.lucene.mockfile.FilterFileSystemProvider.newOutputStream(FilterFileSystemProvider.java:197)
   [junit4]    > 	at java.base/java.nio.file.Files.newOutputStream(Files.java:218)
   [junit4]    > 	at org.apache.lucene.store.FSDirectory$FSIndexOutput.<init>(FSDirectory.java:413)
   [junit4]    > 	at org.apache.lucene.store.FSDirectory$FSIndexOutput.<init>(FSDirectory.java:409)
   [junit4]    > 	at org.apache.lucene.store.FSDirectory.createOutput(FSDirectory.java:253)
   [junit4]    > 	at org.apache.lucene.store.MockDirectoryWrapper.createOutput(MockDirectoryWrapper.java:665)
   [junit4]    > 	at org.apache.lucene.store.LockValidatingDirectoryWrapper.createOutput(LockValidatingDirectoryWrapper.java:44)
   [junit4]    > 	at org.apache.lucene.store.TrackingDirectoryWrapper.createOutput(TrackingDirectoryWrapper.java:43)
   [junit4]    > 	at org.apache.lucene.codecs.blocktree.BlockTreeTermsWriter.<init>(BlockTreeTermsWriter.java:277)
   [junit4]    > 	at org.apache.lucene.codecs.lucene50.Lucene50PostingsFormat.fieldsConsumer(Lucene50PostingsFormat.java:427)
   [junit4]    > 	at org.apache.lucene.codecs.bloom.BloomFilteringPostingsFormat.fieldsConsumer(BloomFilteringPostingsFormat.java:143)
   [junit4]    > 	at org.apache.lucene.codecs.bloom.TestBloomFilteredLucenePostings.fieldsConsumer(TestBloomFilteredLucenePostings.java:65)
   [junit4]    > 	at org.apache.lucene.codecs.perfield.PerFieldPostingsFormat$FieldsWriter.write(PerFieldPostingsFormat.java:138)
   [junit4]    > 	at org.apache.lucene.index.FreqProxTermsWriter.flush(FreqProxTermsWriter.java:108)
   [junit4]    > 	at org.apache.lucene.index.DefaultIndexingChain.flush(DefaultIndexingChain.java:162)
   [junit4]    > 	at org.apache.lucene.index.DocumentsWriterPerThread.flush(DocumentsWriterPerThread.java:452)
   [junit4]    > 	at org.apache.lucene.index.DocumentsWriter.doFlush(DocumentsWriter.java:557)
   [junit4]    > 	at org.apache.lucene.index.DocumentsWriter.flushAllThreads(DocumentsWriter.java:673)
   [junit4]    > 	at org.apache.lucene.index.IndexWriter.getReader(IndexWriter.java:453)
   [junit4]    > 	at org.apache.lucene.index.StandardDirectoryReader.doOpenFromWriter(StandardDirectoryReader.java:293)
   [junit4]    > 	at org.apache.lucene.index.StandardDirectoryReader.doOpenIfChanged(StandardDirectoryReader.java:268)
   [junit4]    > 	at org.apache.lucene.index.StandardDirectoryReader.doOpenIfChanged(StandardDirectoryReader.java:258)
   [junit4]    > 	at org.apache.lucene.index.DirectoryReader.openIfChanged(DirectoryReader.java:140)
   [junit4]    > 	at org.apache.lucene.search.SearcherManager.refreshIfNeeded(SearcherManager.java:156)
   [junit4]    > 	at org.apache.lucene.search.SearcherManager.refreshIfNeeded(SearcherManager.java:58)
   [junit4]    > 	at org.apache.lucene.search.ReferenceManager.doMaybeRefresh(ReferenceManager.java:176)
   [junit4]    > 	at org.apache.lucene.search.ReferenceManager.maybeRefreshBlocking(ReferenceManager.java:253)
   [junit4]    > 	at org.apache.lucene.search.TestSearcherManager$10.run(TestSearcherManager.java:634)
   [junit4] Completed [466/466 (1!)] on J1 in 7223.06s, 3 tests, 6 errors <<< FAILURES!

[...truncated 12163 lines...]
   [junit4] Suite: org.apache.solr.cloud.ForceLeaderTest
   [junit4]   2> 2189735 INFO  (SUITE-ForceLeaderTest-seed#[E76B740F915CC52B]-worker) [    ] o.a.s.SolrTestCaseJ4 SecureRandom sanity checks: test.solr.allowed.securerandom=null & java.security.egd=file:/dev/./urandom
   [junit4]   2> Creating dataDir: /home/jenkins/workspace/Lucene-Solr-7.x-Linux/solr/build/solr-core/test/J2/temp/solr.cloud.ForceLeaderTest_E76B740F915CC52B-001/init-core-data-001
   [junit4]   2> 2189735 WARN  (SUITE-ForceLeaderTest-seed#[E76B740F915CC52B]-worker) [    ] o.a.s.SolrTestCaseJ4 startTrackingSearchers: numOpens=38 numCloses=38
   [junit4]   2> 2189735 INFO  (SUITE-ForceLeaderTest-seed#[E76B740F915CC52B]-worker) [    ] o.a.s.SolrTestCaseJ4 Using PointFields (NUMERIC_POINTS_SYSPROP=true) w/NUMERIC_DOCVALUES_SYSPROP=true
   [junit4]   2> 2189736 INFO  (SUITE-ForceLeaderTest-seed#[E76B740F915CC52B]-worker) [    ] o.a.s.SolrTestCaseJ4 Randomized ssl (false) and clientAuth (false) via: @org.apache.solr.SolrTestCaseJ4$SuppressSSL(bugUrl="https://issues.apache.org/jira/browse/SOLR-5776")
   [junit4]   2> 2189736 INFO  (SUITE-ForceLeaderTest-seed#[E76B740F915CC52B]-worker) [    ] o.a.s.BaseDistributedSearchTestCase Setting hostContext system property: /cuj/
   [junit4]   2> 2189737 INFO  (TEST-ForceLeaderTest.testLastPublishedStateIsActive-seed#[E76B740F915CC52B]) [    ] o.a.s.c.ZkTestServer STARTING ZK TEST SERVER
   [junit4]   2> 2189737 INFO  (Thread-3616) [    ] o.a.s.c.ZkTestServer client port:0.0.0.0/0.0.0.0:0
   [junit4]   2> 2189737 INFO  (Thread-3616) [    ] o.a.s.c.ZkTestServer Starting server
   [junit4]   2> 2189738 ERROR (Thread-3616) [    ] o.a.z.s.ZooKeeperServer ZKShutdownHandler is not registered, so ZooKeeper server won't take any action on ERROR or SHUTDOWN server state changes
   [junit4]   2> 2189837 INFO  (TEST-ForceLeaderTest.testLastPublishedStateIsActive-seed#[E76B740F915CC52B]) [    ] o.a.s.c.ZkTestServer start zk server on port:41249
   [junit4]   2> 2189838 INFO  (zkConnectionManagerCallback-8117-thread-1) [    ] o.a.s.c.c.ConnectionManager zkClient has connected
   [junit4]   2> 2189840 INFO  (zkConnectionManagerCallback-8119-thread-1) [    ] o.a.s.c.c.ConnectionManager zkClient has connected
   [junit4]   2> 2189842 INFO  (TEST-ForceLeaderTest.testLastPublishedStateIsActive-seed#[E76B740F915CC52B]) [    ] o.a.s.c.AbstractZkTestCase put /home/jenkins/workspace/Lucene-Solr-7.x-Linux/solr/core/src/test-files/solr/collection1/conf/solrconfig-tlog.xml to /configs/conf1/solrconfig.xml
   [junit4]   2> 2189843 INFO  (TEST-ForceLeaderTest.testLastPublishedStateIsActive-seed#[E76B740F915CC52B]) [    ] o.a.s.c.AbstractZkTestCase put /home/jenkins/workspace/Lucene-Solr-7.x-Linux/solr/core/src/test-files/solr/collection1/conf/schema.xml to /configs/conf1/schema.xml
   [junit4]   2> 2189843 INFO  (TEST-ForceLeaderTest.testLastPublishedStateIsActive-seed#[E76B740F915CC52B]) [    ] o.a.s.c.AbstractZkTestCase put /home/jenkins/workspace/Lucene-Solr-7.x-Linux/solr/core/src/test-files/solr/collection1/conf/solrconfig.snippet.randomindexconfig.xml to /configs/conf1/solrconfig.snippet.randomindexconfig.xml
   [junit4]   2> 2189844 INFO  (TEST-ForceLeaderTest.testLastPublishedStateIsActive-seed#[E76B740F915CC52B]) [    ] o.a.s.c.AbstractZkTestCase put /home/jenkins/workspace/Lucene-Solr-7.x-Linux/solr/core/src/test-files/solr/collection1/conf/stopwords.txt to /configs/conf1/stopwords.txt
   [junit4]   2> 2189844 INFO  (TEST-ForceLeaderTest.testLastPublishedStateIsActive-seed#[E76B740F915CC52B]) [    ] o.a.s.c.AbstractZkTestCase put /home/jenkins/workspace/Lucene-Solr-7.x-Linux/solr/core/src/test-files/solr/collection1/conf/protwords.txt to /configs/conf1/protwords.txt
   [junit4]   2> 2189844 INFO  (TEST-ForceLeaderTest.testLastPublishedStateIsActive-seed#[E76B740F915CC52B]) [    ] o.a.s.c.AbstractZkTestCase put /home/jenkins/workspace/Lucene-Solr-7.x-Linux/solr/core/src/test-files/solr/collection1/conf/currency.xml to /configs/conf1/currency.xml
   [junit4]   2> 2189845 INFO  (TEST-ForceLeaderTest.testLastPublishedStateIsActive-seed#[E76B740F915CC52B]) [    ] o.a.s.c.AbstractZkTestCase put /home/jenkins/workspace/Lucene-Solr-7.x-Linux/solr/core/src/test-files/solr/collection1/conf/enumsConfig.xml to /configs/conf1/enumsConfig.xml
   [junit4]   2> 2189845 INFO  (TEST-ForceLeaderTest.testLastPublishedStateIsActive-seed#[E76B740F915CC52B]) [    ] o.a.s.c.AbstractZkTestCase put /home/jenkins/workspace/Lucene-Solr-7.x-Linux/solr/core/src/test-files/solr/collection1/conf/open-exchange-rates.json to /configs/conf1/open-exchange-rates.json
   [junit4]   2> 2189845 INFO  (TEST-ForceLeaderTest.testLastPublishedStateIsActive-seed#[E76B740F915CC52B]) [    ] o.a.s.c.AbstractZkTestCase put /home/jenkins/workspace/Lucene-Solr-7.x-Linux/solr/core/src/test-files/solr/collection1/conf/mapping-ISOLatin1Accent.txt to /configs/conf1/mapping-ISOLatin1Accent.txt
   [junit4]   2> 2189846 INFO  (TEST-ForceLeaderTest.testLastPublishedStateIsActive-seed#[E76B740F915CC52B]) [    ] o.a.s.c.AbstractZkTestCase put /home/jenkins/workspace/Lucene-Solr-7.x-Linux/solr/core/src/test-files/solr/collection1/conf/old_synonyms.txt to /configs/conf1/old_synonyms.txt
   [junit4]   2> 2189846 INFO  (TEST-ForceLeaderTest.testLastPublishedStateIsActive-seed#[E76B740F915CC52B]) [    ] o.a.s.c.AbstractZkTestCase put /home/jenkins/workspace/Lucene-Solr-7.x-Linux/solr/core/src/test-files/solr/collection1/conf/synonyms.txt to /configs/conf1/synonyms.txt
   [junit4]   2> 2189847 INFO  (TEST-ForceLeaderTest.testLastPublishedStateIsActive-seed#[E76B740F915CC52B]) [    ] o.a.s.c.AbstractFullDistribZkTestBase Will use TLOG replicas unless explicitly asked otherwise
   [junit4]   2> 2189926 INFO  (TEST-ForceLeaderTest.testLastPublishedStateIsActive-seed#[E76B740F915CC52B]) [    ] o.e.j.s.Server jetty-9.4.8.v20171121, build timestamp: 2017-11-21T22:27:37+01:00, git hash: 82b8fb23f757335bb3329d540ce37a2a2615f0a8
   [junit4]   2> 2189926 INFO  (TEST-ForceLeaderTest.testLastPublishedStateIsActive-seed#[E76B740F915CC52B]) [    ] o.e.j.s.session DefaultSessionIdManager workerName=node0
   [junit4]   2> 2189926 INFO  (TEST-ForceLeaderTest.testLastPublishedStateIsActive-seed#[E76B740F915CC52B]) [    ] o.e.j.s.session No SessionScavenger set, using defaults
   [junit4]   2> 2189926 INFO  (TEST-ForceLeaderTest.testLastPublishedStateIsActive-seed#[E76B740F915CC52B]) [    ] o.e.j.s.session Scavenging every 660000ms
   [junit4]   2> 2189927 INFO  (TEST-ForceLeaderTest.testLastPublishedStateIsActive-seed#[E76B740F915CC52B]) [    ] o.e.j.s.h.ContextHandler Started o.e.j.s.ServletContextHandler@53b0ae1{/cuj,null,AVAILABLE}
   [junit4]   2> 2189927 INFO  (TEST-ForceLeaderT

[...truncated too long message...]

52B-001/tempDir-002/hdfsBaseDir/data/data2/]]  heartbeating to localhost.localdomain/127.0.0.1:40553) [    ] o.a.h.h.s.d.IncrementalBlockReportManager IncrementalBlockReportManager interrupted
   [junit4]   2> 2356049 WARN  (DataNode: [[[DISK]file:/home/jenkins/workspace/Lucene-Solr-7.x-Linux/solr/build/solr-core/test/J1/temp/solr.cloud.MoveReplicaHDFSTest_E76B740F915CC52B-001/tempDir-002/hdfsBaseDir/data/data1/, [DISK]file:/home/jenkins/workspace/Lucene-Solr-7.x-Linux/solr/build/solr-core/test/J1/temp/solr.cloud.MoveReplicaHDFSTest_E76B740F915CC52B-001/tempDir-002/hdfsBaseDir/data/data2/]]  heartbeating to localhost.localdomain/127.0.0.1:40553) [    ] o.a.h.h.s.d.DataNode Ending block pool service for: Block pool BP-621460230-88.99.242.108-1519281299830 (Datanode Uuid 51201c21-4a19-4a7a-b403-c2454f3d9ce5) service to localhost.localdomain/127.0.0.1:40553
   [junit4]   2> 2356053 INFO  (SUITE-MoveReplicaHDFSTest-seed#[E76B740F915CC52B]-worker) [    ] o.m.log Stopped HttpServer2$SelectChannelConnectorWithSafeStartup@localhost.localdomain:0
   [junit4]   2> 2356161 INFO  (SUITE-MoveReplicaHDFSTest-seed#[E76B740F915CC52B]-worker) [    ] o.a.s.c.ZkTestServer connecting to 127.0.0.1:46677 46677
   [junit4]   2> NOTE: leaving temporary files on disk at: /home/jenkins/workspace/Lucene-Solr-7.x-Linux/solr/build/solr-core/test/J1/temp/solr.cloud.MoveReplicaHDFSTest_E76B740F915CC52B-001
   [junit4]   2> Feb 22, 2018 6:36:18 AM com.carrotsearch.randomizedtesting.ThreadLeakControl checkThreadLeaks
   [junit4]   2> WARNING: Will linger awaiting termination of 66 leaked thread(s).
   [junit4]   2> NOTE: test params are: codec=CheapBastard, sim=RandomSimilarity(queryNorm=false): {}, locale=fr-TD, timezone=Europe/Vatican
   [junit4]   2> NOTE: Linux 4.13.0-32-generic amd64/Oracle Corporation 10 (64-bit)/cpus=8,threads=2,free=122465352,total=518979584
   [junit4]   2> NOTE: All tests run in this JVM: [SystemInfoHandlerTest, SortByFunctionTest, TestConfigOverlay, TestUninvertingReader, SolrShardReporterTest, TestRandomRequestDistribution, CollectionStateFormat2Test, TestFuzzyAnalyzedSuggestions, TestRecovery, TestUseDocValuesAsStored, HttpTriggerListenerTest, AutoscalingHistoryHandlerTest, SpellCheckCollatorWithCollapseTest, EnumFieldTest, DeleteNodeTest, TestElisionMultitermQuery, OverriddenZkACLAndCredentialsProvidersTest, TestSubQueryTransformerDistrib, TestPayloadScoreQParserPlugin, TestLegacyTerms, TestDistribIDF, TestDistributedStatsComponentCardinality, HttpSolrCallGetCoreTest, TestEmbeddedSolrServerAdminHandler, HdfsBasicDistributedZk2Test, FieldMutatingUpdateProcessorTest, NodeLostTriggerTest, TestRuleBasedAuthorizationPlugin, ResourceLoaderTest, TlogReplayBufferedWhileIndexingTest, TestImpersonationWithHadoopAuth, ZkFailoverTest, TestCloudSearcherWarming, SuggesterTest, SolrJmxReporterTest, TestDirectoryFactory, TestSolrIndexConfig, TestConfigsApi, LeaderFailoverAfterPartitionTest, TestCloudDeleteByQuery, TestSystemIdResolver, TestCoreBackup, TestGenericDistributedQueue, DeleteStatusTest, CoreSorterTest, CdcrRequestHandlerTest, TestSchemaNameResource, DistributedQueryComponentOptimizationTest, FastVectorHighlighterTest, MetricUtilsTest, TestSearchPerf, TestSolrConfigHandler, AsyncCallRequestStatusResponseTest, HdfsChaosMonkeySafeLeaderTest, TestMaxTokenLenTokenizer, AlternateDirectoryTest, TestSQLHandlerNonCloud, HighlighterMaxOffsetTest, TestExportWriter, SolrCoreTest, TestJavabinTupleStreamParser, TestTrie, SolrInfoBeanTest, TestSolrJ, TestLRUCache, ZkStateReaderTest, TestComputePlanAction, TestMacroExpander, PrimitiveFieldTypeTest, ChaosMonkeySafeLeaderTest, TestSweetSpotSimilarityFactory, AutoAddReplicasIntegrationTest, TestCollectionAPI, TestPartialUpdateDeduplication, MoveReplicaHDFSFailoverTest, TestConfigSets, TestSurroundQueryParser, TestSystemCollAutoCreate, TestStressRecovery, DirectSolrConnectionTest, SchemaApiFailureTest, TestReloadAndDeleteDocs, TestFileDictionaryLookup, TestChildDocTransformer, SoftAutoCommitTest, JvmMetricsTest, TestJettySolrRunner, HLLSerializationTest, HighlighterTest, TestReloadDeadlock, DistributedFacetPivotSmallTest, CollectionsAPIDistributedZkTest, TestDeleteCollectionOnDownNodes, TestHashQParserPlugin, BadComponentTest, TestRawTransformer, TestStressVersions, IndexSchemaTest, TestSchemaManager, HttpPartitionTest, TestLegacyField, CreateRoutedAliasTest, BitVectorTest, HdfsDirectoryFactoryTest, SolrGangliaReporterTest, SimplePostToolTest, TestClassicSimilarityFactory, HdfsCollectionsAPIDistributedZkTest, PropertiesRequestHandlerTest, TestInfoStreamLogging, CdcrBootstrapTest, DistributedIntervalFacetingTest, RuleEngineTest, QueryParsingTest, ScriptEngineTest, DistributedMLTComponentTest, PeerSyncReplicationTest, SOLR749Test, TermsComponentTest, TestConfigSetsAPIExclusivity, TestMinMaxOnMultiValuedField, DistributedDebugComponentTest, SaslZkACLProviderTest, CdcrUpdateLogTest, TestReload, OpenCloseCoreStressTest, OverseerTest, ShardRoutingTest, BasicZkTest, FullSolrCloudDistribCmdsTest, ZkSolrClientTest, TestDistributedGrouping, TermVectorComponentDistributedTest, ZkControllerTest, SimpleFacetsTest, StatsComponentTest, QueryElevationComponentTest, PeerSyncTest, TestFunctionQuery, BasicFunctionalityTest, TestLazyCores, ShowFileRequestHandlerTest, SignatureUpdateProcessorFactoryTest, SolrRequestParserTest, TestFoldingMultitermQuery, SuggesterTSTTest, TestStressLucene, SuggesterWFSTTest, TestCSVLoader, PolyFieldTest, NoCacheHeaderTest, SchemaVersionSpecificBehaviorTest, TestUpdate, TestWordDelimiterFilterFactory, DirectUpdateHandlerOptimizeTest, XsltUpdateRequestHandlerTest, CacheHeaderTest, DisMaxRequestHandlerTest, TestWriterPerf, TestReversedWildcardFilterFactory, TestQueryTypes, RequestHandlersTest, TestValueSourceCache, RequiredFieldsTest, RegexBoostProcessorTest, TestCollationField, UpdateRequestProcessorFactoryTest, TestAnalyzedSuggestions, JsonLoaderTest, CSVRequestHandlerTest, TestQuerySenderListener, UpdateParamsTest, TestQuerySenderNoQuery, CopyFieldTest, ResponseLogComponentTest, TestMergePolicyConfig, SampleTest, NumericFieldsTest, MinimalSchemaTest, OutputWriterTest, ExternalFileFieldSortTest, TestSolrCoreProperties, TestPostingsSolrHighlighter, NotRequiredUniqueKeyTest, TestCharFilters, TestXIncludeConfig, TestDFRSimilarityFactory, TestPerFieldSimilarity, TestLMDirichletSimilarityFactory, TestIBSimilarityFactory, TestBM25SimilarityFactory, TimeZoneUtilsTest, OpenExchangeRatesOrgProviderTest, TestFastLRUCache, DateMathParserTest, PrimUtilsTest, DateFieldTest, DOMUtilTest, RAMDirectoryFactoryTest, ZkNodePropsTest, SliceStateTest, UUIDFieldTest, FileUtilsTest, TestRTGBase, TestCursorMarkWithoutUniqueKey, TestHighlightDedupGrouping, TestSimpleTrackingShardHandler, TestLuceneIndexBackCompat, AssignBackwardCompatibilityTest, ChaosMonkeySafeLeaderWithPullReplicasTest, CreateCollectionCleanupTest, DeleteReplicaTest, DistribJoinFromCollectionTest, HttpPartitionOnCommitTest, LeaderInitiatedRecoveryOnShardRestartTest, LegacyCloudClusterPropTest, MigrateRouteKeyTest, MoveReplicaHDFSTest]
   [junit4] Completed [546/777 (2!)] on J1 in 85.99s, 4 tests, 1 error <<< FAILURES!

[...truncated 42082 lines...]
[repro] Jenkins log URL: file:///tmp/tmp.UJ02Dqn9SH

[repro] Revision: 6d712c5e4b2fc8f4ac6dfec2eac4a17386c978f0

[repro] Repro line:  ant test  -Dtestcase=TestSearcherManager -Dtests.method=testConcurrentIndexCloseSearchAndRefresh -Dtests.seed=C0F57B1E7E34975A -Dtests.multiplier=3 -Dtests.slow=true -Dtests.locale=en-ZM -Dtests.timezone=Australia/NSW -Dtests.asserts=true -Dtests.file.encoding=UTF-8

[repro] Repro line:  ant test  -Dtestcase=TestSearcherManager -Dtests.seed=C0F57B1E7E34975A -Dtests.multiplier=3 -Dtests.slow=true -Dtests.locale=en-ZM -Dtests.timezone=Australia/NSW -Dtests.asserts=true -Dtests.file.encoding=UTF-8

[repro] Repro line:  ant test  -Dtestcase=ForceLeaderTest -Dtests.method=testReplicasInLowerTerms -Dtests.seed=E76B740F915CC52B -Dtests.multiplier=3 -Dtests.slow=true -Dtests.locale=fr-YT -Dtests.timezone=Pacific/Pago_Pago -Dtests.asserts=true -Dtests.file.encoding=ISO-8859-1

[repro] Repro line:  ant test  -Dtestcase=MoveReplicaHDFSTest -Dtests.method=testFailedMove -Dtests.seed=E76B740F915CC52B -Dtests.multiplier=3 -Dtests.slow=true -Dtests.locale=fr-TD -Dtests.timezone=Europe/Vatican -Dtests.asserts=true -Dtests.file.encoding=ISO-8859-1

[repro] git rev-parse --abbrev-ref HEAD
[repro] git rev-parse HEAD
[repro] Initial local git branch/revision: 6d712c5e4b2fc8f4ac6dfec2eac4a17386c978f0
[repro] git checkout 6d712c5e4b2fc8f4ac6dfec2eac4a17386c978f0

[...truncated 1 lines...]
[repro] git merge --ff-only

[...truncated 1 lines...]
[repro] ant clean

[...truncated 6 lines...]
[repro] Test suites by module:
[repro]    solr/core
[repro]       MoveReplicaHDFSTest
[repro]       ForceLeaderTest
[repro]    lucene/core
[repro]       TestSearcherManager
[repro] ant compile-test

[...truncated 3315 lines...]
[repro] ant test-nocompile -Dtests.dups=5 -Dtests.maxfailures=10 -Dtests.class="*.MoveReplicaHDFSTest|*.ForceLeaderTest" -Dtests.showOutput=onerror -Dtests.seed=E76B740F915CC52B -Dtests.multiplier=3 -Dtests.slow=true -Dtests.locale=fr-TD -Dtests.timezone=Europe/Vatican -Dtests.asserts=true -Dtests.file.encoding=ISO-8859-1

[...truncated 125 lines...]
[repro] ant compile-test

[...truncated 88 lines...]
[repro] ant test-nocompile -Dtests.dups=5 -Dtests.maxfailures=5 -Dtests.class="*.TestSearcherManager" -Dtests.showOutput=onerror -Dtests.seed=C0F57B1E7E34975A -Dtests.multiplier=3 -Dtests.slow=true -Dtests.locale=en-ZM -Dtests.timezone=Australia/NSW -Dtests.asserts=true -Dtests.file.encoding=UTF-8

[...truncated 126 lines...]
[repro] Failures:
[repro]   0/5 failed: org.apache.lucene.search.TestSearcherManager
[repro]   0/5 failed: org.apache.solr.cloud.ForceLeaderTest
[repro]   0/5 failed: org.apache.solr.cloud.MoveReplicaHDFSTest
[repro] git checkout 6d712c5e4b2fc8f4ac6dfec2eac4a17386c978f0

[...truncated 1 lines...]
[repro] Exiting with code 0

[...truncated 41 lines...]

Mime
View raw message