lucene-dev mailing list archives

Site index · List index
Message view « Date » · « Thread »
Top « Date » · « Thread »
From Policeman Jenkins Server <jenk...@thetaphi.de>
Subject [JENKINS] Lucene-Solr-master-Solaris (64bit/jdk1.8.0) - Build # 1655 - Still Unstable!
Date Thu, 01 Feb 2018 13:47:50 GMT
Build: https://jenkins.thetaphi.de/job/Lucene-Solr-master-Solaris/1655/
Java: 64bit/jdk1.8.0 -XX:-UseCompressedOops -XX:+UseSerialGC

1 tests failed.
FAILED:  junit.framework.TestSuite.org.apache.solr.cloud.TestSolrCloudWithSecureImpersonation

Error Message:
2 threads leaked from SUITE scope at org.apache.solr.cloud.TestSolrCloudWithSecureImpersonation:     1) Thread[id=12357, name=jetty-launcher-1977-thread-2-EventThread, state=TIMED_WAITING, group=TGRP-TestSolrCloudWithSecureImpersonation]         at sun.misc.Unsafe.park(Native Method)         at java.util.concurrent.locks.LockSupport.parkNanos(LockSupport.java:215)         at java.util.concurrent.locks.AbstractQueuedSynchronizer.doAcquireSharedNanos(AbstractQueuedSynchronizer.java:1037)         at java.util.concurrent.locks.AbstractQueuedSynchronizer.tryAcquireSharedNanos(AbstractQueuedSynchronizer.java:1328)         at java.util.concurrent.CountDownLatch.await(CountDownLatch.java:277)         at org.apache.curator.CuratorZookeeperClient.internalBlockUntilConnectedOrTimedOut(CuratorZookeeperClient.java:323)         at org.apache.curator.RetryLoop.callWithRetry(RetryLoop.java:105)         at org.apache.curator.framework.imps.GetDataBuilderImpl.pathInForeground(GetDataBuilderImpl.java:288)         at org.apache.curator.framework.imps.GetDataBuilderImpl.forPath(GetDataBuilderImpl.java:279)         at org.apache.curator.framework.imps.GetDataBuilderImpl.forPath(GetDataBuilderImpl.java:41)         at org.apache.curator.framework.recipes.shared.SharedValue.readValue(SharedValue.java:244)         at org.apache.curator.framework.recipes.shared.SharedValue.access$100(SharedValue.java:44)         at org.apache.curator.framework.recipes.shared.SharedValue$1.process(SharedValue.java:61)         at org.apache.curator.framework.imps.NamespaceWatcher.process(NamespaceWatcher.java:67)         at org.apache.zookeeper.ClientCnxn$EventThread.processEvent(ClientCnxn.java:531)         at org.apache.zookeeper.ClientCnxn$EventThread.run(ClientCnxn.java:506)    2) Thread[id=12352, name=jetty-launcher-1977-thread-1-EventThread, state=TIMED_WAITING, group=TGRP-TestSolrCloudWithSecureImpersonation]         at sun.misc.Unsafe.park(Native Method)         at java.util.concurrent.locks.LockSupport.parkNanos(LockSupport.java:215)         at java.util.concurrent.locks.AbstractQueuedSynchronizer.doAcquireSharedNanos(AbstractQueuedSynchronizer.java:1037)         at java.util.concurrent.locks.AbstractQueuedSynchronizer.tryAcquireSharedNanos(AbstractQueuedSynchronizer.java:1328)         at java.util.concurrent.CountDownLatch.await(CountDownLatch.java:277)         at org.apache.curator.CuratorZookeeperClient.internalBlockUntilConnectedOrTimedOut(CuratorZookeeperClient.java:323)         at org.apache.curator.RetryLoop.callWithRetry(RetryLoop.java:105)         at org.apache.curator.framework.imps.GetDataBuilderImpl.pathInForeground(GetDataBuilderImpl.java:288)         at org.apache.curator.framework.imps.GetDataBuilderImpl.forPath(GetDataBuilderImpl.java:279)         at org.apache.curator.framework.imps.GetDataBuilderImpl.forPath(GetDataBuilderImpl.java:41)         at org.apache.curator.framework.recipes.shared.SharedValue.readValue(SharedValue.java:244)         at org.apache.curator.framework.recipes.shared.SharedValue.access$100(SharedValue.java:44)         at org.apache.curator.framework.recipes.shared.SharedValue$1.process(SharedValue.java:61)         at org.apache.curator.framework.imps.NamespaceWatcher.process(NamespaceWatcher.java:67)         at org.apache.zookeeper.ClientCnxn$EventThread.processEvent(ClientCnxn.java:531)         at org.apache.zookeeper.ClientCnxn$EventThread.run(ClientCnxn.java:506)

Stack Trace:
com.carrotsearch.randomizedtesting.ThreadLeakError: 2 threads leaked from SUITE scope at org.apache.solr.cloud.TestSolrCloudWithSecureImpersonation: 
   1) Thread[id=12357, name=jetty-launcher-1977-thread-2-EventThread, state=TIMED_WAITING, group=TGRP-TestSolrCloudWithSecureImpersonation]
        at sun.misc.Unsafe.park(Native Method)
        at java.util.concurrent.locks.LockSupport.parkNanos(LockSupport.java:215)
        at java.util.concurrent.locks.AbstractQueuedSynchronizer.doAcquireSharedNanos(AbstractQueuedSynchronizer.java:1037)
        at java.util.concurrent.locks.AbstractQueuedSynchronizer.tryAcquireSharedNanos(AbstractQueuedSynchronizer.java:1328)
        at java.util.concurrent.CountDownLatch.await(CountDownLatch.java:277)
        at org.apache.curator.CuratorZookeeperClient.internalBlockUntilConnectedOrTimedOut(CuratorZookeeperClient.java:323)
        at org.apache.curator.RetryLoop.callWithRetry(RetryLoop.java:105)
        at org.apache.curator.framework.imps.GetDataBuilderImpl.pathInForeground(GetDataBuilderImpl.java:288)
        at org.apache.curator.framework.imps.GetDataBuilderImpl.forPath(GetDataBuilderImpl.java:279)
        at org.apache.curator.framework.imps.GetDataBuilderImpl.forPath(GetDataBuilderImpl.java:41)
        at org.apache.curator.framework.recipes.shared.SharedValue.readValue(SharedValue.java:244)
        at org.apache.curator.framework.recipes.shared.SharedValue.access$100(SharedValue.java:44)
        at org.apache.curator.framework.recipes.shared.SharedValue$1.process(SharedValue.java:61)
        at org.apache.curator.framework.imps.NamespaceWatcher.process(NamespaceWatcher.java:67)
        at org.apache.zookeeper.ClientCnxn$EventThread.processEvent(ClientCnxn.java:531)
        at org.apache.zookeeper.ClientCnxn$EventThread.run(ClientCnxn.java:506)
   2) Thread[id=12352, name=jetty-launcher-1977-thread-1-EventThread, state=TIMED_WAITING, group=TGRP-TestSolrCloudWithSecureImpersonation]
        at sun.misc.Unsafe.park(Native Method)
        at java.util.concurrent.locks.LockSupport.parkNanos(LockSupport.java:215)
        at java.util.concurrent.locks.AbstractQueuedSynchronizer.doAcquireSharedNanos(AbstractQueuedSynchronizer.java:1037)
        at java.util.concurrent.locks.AbstractQueuedSynchronizer.tryAcquireSharedNanos(AbstractQueuedSynchronizer.java:1328)
        at java.util.concurrent.CountDownLatch.await(CountDownLatch.java:277)
        at org.apache.curator.CuratorZookeeperClient.internalBlockUntilConnectedOrTimedOut(CuratorZookeeperClient.java:323)
        at org.apache.curator.RetryLoop.callWithRetry(RetryLoop.java:105)
        at org.apache.curator.framework.imps.GetDataBuilderImpl.pathInForeground(GetDataBuilderImpl.java:288)
        at org.apache.curator.framework.imps.GetDataBuilderImpl.forPath(GetDataBuilderImpl.java:279)
        at org.apache.curator.framework.imps.GetDataBuilderImpl.forPath(GetDataBuilderImpl.java:41)
        at org.apache.curator.framework.recipes.shared.SharedValue.readValue(SharedValue.java:244)
        at org.apache.curator.framework.recipes.shared.SharedValue.access$100(SharedValue.java:44)
        at org.apache.curator.framework.recipes.shared.SharedValue$1.process(SharedValue.java:61)
        at org.apache.curator.framework.imps.NamespaceWatcher.process(NamespaceWatcher.java:67)
        at org.apache.zookeeper.ClientCnxn$EventThread.processEvent(ClientCnxn.java:531)
        at org.apache.zookeeper.ClientCnxn$EventThread.run(ClientCnxn.java:506)
	at __randomizedtesting.SeedInfo.seed([9135ED1CEA3F5160]:0)




Build Log:
[...truncated 12043 lines...]
   [junit4] Suite: org.apache.solr.cloud.TestSolrCloudWithSecureImpersonation
   [junit4]   2> 1157701 INFO  (SUITE-TestSolrCloudWithSecureImpersonation-seed#[9135ED1CEA3F5160]-worker) [    ] o.a.s.SolrTestCaseJ4 SecureRandom sanity checks: test.solr.allowed.securerandom=null & java.security.egd=file:/dev/./urandom
   [junit4]   2> Creating dataDir: /export/home/jenkins/workspace/Lucene-Solr-master-Solaris/solr/build/solr-core/test/J1/temp/solr.cloud.TestSolrCloudWithSecureImpersonation_9135ED1CEA3F5160-001/init-core-data-001
   [junit4]   2> 1157731 WARN  (SUITE-TestSolrCloudWithSecureImpersonation-seed#[9135ED1CEA3F5160]-worker) [    ] o.a.s.SolrTestCaseJ4 startTrackingSearchers: numOpens=1 numCloses=1
   [junit4]   2> 1157731 INFO  (SUITE-TestSolrCloudWithSecureImpersonation-seed#[9135ED1CEA3F5160]-worker) [    ] o.a.s.SolrTestCaseJ4 Using PointFields (NUMERIC_POINTS_SYSPROP=true) w/NUMERIC_DOCVALUES_SYSPROP=true
   [junit4]   2> 1157733 INFO  (SUITE-TestSolrCloudWithSecureImpersonation-seed#[9135ED1CEA3F5160]-worker) [    ] o.a.s.SolrTestCaseJ4 Randomized ssl (false) and clientAuth (false) via: @org.apache.solr.util.RandomizeSSL(reason=, value=NaN, ssl=NaN, clientAuth=NaN)
   [junit4]   2> 1157902 INFO  (SUITE-TestSolrCloudWithSecureImpersonation-seed#[9135ED1CEA3F5160]-worker) [    ] o.a.s.c.MiniSolrCloudCluster Starting cluster of 2 servers in /export/home/jenkins/workspace/Lucene-Solr-master-Solaris/solr/build/solr-core/test/J1/temp/solr.cloud.TestSolrCloudWithSecureImpersonation_9135ED1CEA3F5160-001/tempDir-001
   [junit4]   2> 1157902 INFO  (SUITE-TestSolrCloudWithSecureImpersonation-seed#[9135ED1CEA3F5160]-worker) [    ] o.a.s.c.ZkTestServer STARTING ZK TEST SERVER
   [junit4]   2> 1157903 INFO  (Thread-5805) [    ] o.a.s.c.ZkTestServer client port:0.0.0.0/0.0.0.0:0
   [junit4]   2> 1157903 INFO  (Thread-5805) [    ] o.a.s.c.ZkTestServer Starting server
   [junit4]   2> 1157910 ERROR (Thread-5805) [    ] o.a.z.s.ZooKeeperServer ZKShutdownHandler is not registered, so ZooKeeper server won't take any action on ERROR or SHUTDOWN server state changes
   [junit4]   2> 1158003 INFO  (SUITE-TestSolrCloudWithSecureImpersonation-seed#[9135ED1CEA3F5160]-worker) [    ] o.a.s.c.ZkTestServer start zk server on port:58506
   [junit4]   2> 1158017 INFO  (zkConnectionManagerCallback-1980-thread-1) [    ] o.a.s.c.c.ConnectionManager zkClient has connected
   [junit4]   2> 1158031 INFO  (jetty-launcher-1977-thread-1) [    ] o.e.j.s.Server jetty-9.4.8.v20171121, build timestamp: 2017-11-21T17:27:37-04:00, git hash: 82b8fb23f757335bb3329d540ce37a2a2615f0a8
   [junit4]   2> 1158033 INFO  (jetty-launcher-1977-thread-1) [    ] o.e.j.s.session DefaultSessionIdManager workerName=node0
   [junit4]   2> 1158033 INFO  (jetty-launcher-1977-thread-1) [    ] o.e.j.s.session No SessionScavenger set, using defaults
   [junit4]   2> 1158033 INFO  (jetty-launcher-1977-thread-1) [    ] o.e.j.s.session Scavenging every 660000ms
   [junit4]   2> 1158036 INFO  (jetty-launcher-1977-thread-1) [    ] o.e.j.s.h.ContextHandler Started o.e.j.s.ServletContextHandler@59353eae{/solr,null,AVAILABLE}
   [junit4]   2> 1158037 INFO  (jetty-launcher-1977-thread-1) [    ] o.e.j.s.AbstractConnector Started ServerConnector@7f83e19e{HTTP/1.1,[http/1.1]}{127.0.0.1:59765}
   [junit4]   2> 1158037 INFO  (jetty-launcher-1977-thread-1) [    ] o.e.j.s.Server Started @1161337ms
   [junit4]   2> 1158037 INFO  (jetty-launcher-1977-thread-1) [    ] o.a.s.c.s.e.JettySolrRunner Jetty properties: {hostContext=/solr, hostPort=59765}
   [junit4]   2> 1158037 ERROR (jetty-launcher-1977-thread-1) [    ] o.a.s.u.StartupLoggingUtils Missing Java Option solr.log.dir. Logging may be missing or incomplete.
   [junit4]   2> 1158037 INFO  (jetty-launcher-1977-thread-1) [    ] o.a.s.s.SolrDispatchFilter  ___      _       Welcome to Apache Solr? version 8.0.0
   [junit4]   2> 1158037 INFO  (jetty-launcher-1977-thread-1) [    ] o.a.s.s.SolrDispatchFilter / __| ___| |_ _   Starting in cloud mode on port null
   [junit4]   2> 1158037 INFO  (jetty-launcher-1977-thread-1) [    ] o.a.s.s.SolrDispatchFilter \__ \/ _ \ | '_|  Install dir: null
   [junit4]   2> 1158037 INFO  (jetty-launcher-1977-thread-1) [    ] o.a.s.s.SolrDispatchFilter |___/\___/_|_|    Start time: 2018-02-01T12:14:51.778Z
   [junit4]   2> 1158036 INFO  (jetty-launcher-1977-thread-2) [    ] o.e.j.s.Server jetty-9.4.8.v20171121, build timestamp: 2017-11-21T17:27:37-04:00, git hash: 82b8fb23f757335bb3329d540ce37a2a2615f0a8
   [junit4]   2> 1158040 INFO  (jetty-launcher-1977-thread-2) [    ] o.e.j.s.session DefaultSessionIdManager workerName=node0
   [junit4]   2> 1158040 INFO  (jetty-launcher-1977-thread-2) [    ] o.e.j.s.session No SessionScavenger set, using defaults
   [junit4]   2> 1158040 INFO  (jetty-launcher-1977-thread-2) [    ] o.e.j.s.session Scavenging every 600000ms
   [junit4]   2> 1158040 INFO  (jetty-launcher-1977-thread-2) [    ] o.e.j.s.h.ContextHandler Started o.e.j.s.ServletContextHandler@56895767{/solr,null,AVAILABLE}
   [junit4]   2> 1158041 INFO  (jetty-launcher-1977-thread-2) [    ] o.e.j.s.AbstractConnector Started ServerConnector@38712084{HTTP/1.1,[http/1.1]}{127.0.0.1:48706}
   [junit4]   2> 1158041 INFO  (jetty-launcher-1977-thread-2) [    ] o.e.j.s.Server Started @1161341ms
   [junit4]   2> 1158041 INFO  (jetty-launcher-1977-thread-2) [    ] o.a.s.c.s.e.JettySolrRunner Jetty properties: {hostContext=/solr, hostPort=48706}
   [junit4]   2> 1158041 ERROR (jetty-launcher-1977-thread-2) [    ] o.a.s.u.StartupLoggingUtils Missing Java Option solr.log.dir. Logging may be missing or incomplete.
   [junit4]   2> 1158041 INFO  (jetty-launcher-1977-thread-2) [    ] o.a.s.s.SolrDispatchFilter  ___      _       Welcome to Apache Solr? version 8.0.0
   [junit4]   2> 1158041 INFO  (jetty-launcher-1977-thread-2) [    ] o.a.s.s.SolrDispatchFilter / __| ___| |_ _   Starting in cloud mode on port null
   [junit4]   2> 1158041 INFO  (jetty-launcher-1977-thread-2) [    ] o.a.s.s.SolrDispatchFilter \__ \/ _ \ | '_|  Install dir: null
   [junit4]   2> 1158041 INFO  (jetty-launcher-1977-thread-2) [    ] o.a.s.s.SolrDispatchFilter |___/\___/_|_|    Start time: 2018-02-01T12:14:51.782Z
   [junit4]   2> 1158052 INFO  (zkConnectionManagerCallback-1982-thread-1) [    ] o.a.s.c.c.ConnectionManager zkClient has connected
   [junit4]   2> 1158052 INFO  (zkConnectionManagerCallback-1984-thread-1) [    ] o.a.s.c.c.ConnectionManager zkClient has connected
   [junit4]   2> 1158056 INFO  (jetty-launcher-1977-thread-2) [    ] o.a.s.s.SolrDispatchFilter solr.xml found in ZooKeeper. Loading...
   [junit4]   2> 1158062 INFO  (jetty-launcher-1977-thread-1) [    ] o.a.s.s.SolrDispatchFilter solr.xml found in ZooKeeper. Loading...
   [junit4]   2> 1158067 INFO  (jetty-launcher-1977-thread-2) [    ] o.a.s.c.ZkContainer Zookeeper client=127.0.0.1:58506/solr
   [junit4]   2> 1158079 INFO  (jetty-launcher-1977-thread-1) [    ] o.a.s.c.ZkContainer Zookeeper client=127.0.0.1:58506/solr
   [junit4]   2> 1158095 INFO  (zkConnectionManagerCallback-1988-thread-1) [    ] o.a.s.c.c.ConnectionManager zkClient has connected
   [junit4]   2> 1158102 INFO  (zkConnectionManagerCallback-1992-thread-1) [    ] o.a.s.c.c.ConnectionManager zkClient has connected
   [junit4]   2> 1158111 INFO  (zkConnectionManagerCallback-1996-thread-1-processing-n:127.0.0.1:48706_solr) [n:127.0.0.1:48706_solr    ] o.a.s.c.c.ConnectionManager zkClient has connected
   [junit4]   2> 1158122 INFO  (zkConnectionManagerCallback-1994-thread-1-processing-n:127.0.0.1:59765_solr) [n:127.0.0.1:59765_solr    ] o.a.s.c.c.ConnectionManager zkClient has connected
   [junit4]   2> 1158151 INFO  (jetty-launcher-1977-thread-1) [n:127.0.0.1:59765_solr    ] o.a.s.c.Overseer Overseer (id=null) closing
   [junit4]   2> 1158152 INFO  (jetty-launcher-1977-thread-1) [n:127.0.0.1:59765_solr    ] o.a.s.c.OverseerElectionContext I am going to be the leader 127.0.0.1:59765_solr
   [junit4]   2> 1158152 INFO  (jetty-launcher-1977-thread-1) [n:127.0.0.1:59765_solr    ] o.a.s.c.Overseer Overseer (id=72123289957826565-127.0.0.1:59765_solr-n_0000000000) starting
   [junit4]   2> 1158172 INFO  (jetty-launcher-1977-thread-1) [n:127.0.0.1:59765_solr    ] o.a.s.c.ZkController Register node as live in ZooKeeper:/live_nodes/127.0.0.1:59765_solr
   [junit4]   2> 1158231 INFO  (zkCallback-1993-thread-1-processing-n:127.0.0.1:59765_solr) [n:127.0.0.1:59765_solr    ] o.a.s.c.c.ZkStateReader Updated live nodes from ZooKeeper... (0) -> (1)
   [junit4]   2> 1158296 INFO  (jetty-launcher-1977-thread-1) [n:127.0.0.1:59765_solr    ] o.a.s.c.CoreContainer Initializing authentication plugin: org.apache.solr.security.HttpParamDelegationTokenPlugin
   [junit4]   2> 1158297 INFO  (jetty-launcher-1977-thread-2) [n:127.0.0.1:48706_solr    ] o.a.s.c.c.ZkStateReader Updated live nodes from ZooKeeper... (0) -> (1)
   [junit4]   2> 1158300 INFO  (jetty-launcher-1977-thread-2) [n:127.0.0.1:48706_solr    ] o.a.s.c.Overseer Overseer (id=null) closing
   [junit4]   2> 1158303 INFO  (jetty-launcher-1977-thread-2) [n:127.0.0.1:48706_solr    ] o.a.s.c.ZkController Register node as live in ZooKeeper:/live_nodes/127.0.0.1:48706_solr
   [junit4]   2> 1158303 WARN  (jetty-launcher-1977-thread-1) [n:127.0.0.1:59765_solr    ] o.a.s.c.s.i.Krb5HttpClientBuilder org.apache.solr.client.solrj.impl.Krb5HttpClientBuilder is configured without specifying system property 'java.security.auth.login.config'
   [junit4]   2> 1158310 INFO  (jetty-launcher-1977-thread-1) [n:127.0.0.1:59765_solr    ] o.a.s.s.KerberosPlugin Params: {solr.kerberos.impersonator.user.noGroups.hosts=*, solr.kerberos.impersonator.user.bogusGroup.groups=__some_bogus_group, token.valid=30, cookie.domain=127.0.0.1, solr.kerberos.impersonator.user.anyHostAnyUser.groups=*, solr.kerberos.impersonator.user.bogusGroup.hosts=*, solr.kerberos.impersonator.user.anyHostAnyUser.hosts=*, token.validity=36000, solr.kerberos.impersonator.user.noHosts.groups=*, type=kerberos, solr.kerberos.impersonator.user.localHostAnyGroup.groups=*, delegation-token.token-kind=solr-dt, solr.kerberos.impersonator.user.wrongHost.hosts=1.1.1.1.1.1, cookie.path=/, zk-dt-secret-manager.znodeWorkingPath=solr/security/zkdtsm, solr.kerberos.impersonator.user.localHostAnyGroup.hosts=serv1-vm3,localhost,127.0.0.1, signer.secret.provider.zookeeper.path=/token, solr.kerberos.impersonator.user.anyHostUsersGroup.groups=staff, zk-dt-secret-manager.enable=true, solr.kerberos.impersonator.user.wrongHost.groups=*, kerberos.name.rules=DEFAULT, signer.secret.provider=zookeeper, solr.kerberos.impersonator.user.anyHostUsersGroup.hosts=*}
   [junit4]   2> 1158321 INFO  (zkCallback-1993-thread-2-processing-n:127.0.0.1:59765_solr) [n:127.0.0.1:59765_solr    ] o.a.s.c.c.ZkStateReader Updated live nodes from ZooKeeper... (1) -> (2)
   [junit4]   2> 1158406 INFO  (zkCallback-1995-thread-1-processing-n:127.0.0.1:48706_solr) [n:127.0.0.1:48706_solr    ] o.a.s.c.c.ZkStateReader Updated live nodes from ZooKeeper... (1) -> (2)
   [junit4]   2> 1158444 INFO  (jetty-launcher-1977-thread-1) [n:127.0.0.1:59765_solr    ] o.a.c.f.i.CuratorFrameworkImpl Starting
   [junit4]   2> 1158505 INFO  (jetty-launcher-1977-thread-1-EventThread) [n:127.0.0.1:59765_solr    ] o.a.c.f.s.ConnectionStateManager State change: CONNECTED
   [junit4]   2> 1158568 INFO  (jetty-launcher-1977-thread-2) [n:127.0.0.1:48706_solr    ] o.a.s.c.CoreContainer Initializing authentication plugin: org.apache.solr.security.HttpParamDelegationTokenPlugin
   [junit4]   2> 1158575 WARN  (jetty-launcher-1977-thread-2) [n:127.0.0.1:48706_solr    ] o.a.s.c.s.i.Krb5HttpClientBuilder org.apache.solr.client.solrj.impl.Krb5HttpClientBuilder is configured without specifying system property 'java.security.auth.login.config'
   [junit4]   2> 1158630 INFO  (jetty-launcher-1977-thread-2) [n:127.0.0.1:48706_solr    ] o.a.s.s.KerberosPlugin Params: {solr.kerberos.impersonator.user.noGroups.hosts=*, solr.kerberos.impersonator.user.bogusGroup.groups=__some_bogus_group, token.valid=30, cookie.domain=127.0.0.1, solr.kerberos.impersonator.user.anyHostAnyUser.groups=*, solr.kerberos.impersonator.user.bogusGroup.hosts=*, solr.kerberos.impersonator.user.anyHostAnyUser.hosts=*, token.validity=36000, solr.kerberos.impersonator.user.noHosts.groups=*, type=kerberos, solr.kerberos.impersonator.user.localHostAnyGroup.groups=*, delegation-token.token-kind=solr-dt, solr.kerberos.impersonator.user.wrongHost.hosts=1.1.1.1.1.1, cookie.path=/, zk-dt-secret-manager.znodeWorkingPath=solr/security/zkdtsm, solr.kerberos.impersonator.user.localHostAnyGroup.hosts=serv1-vm3,localhost,127.0.0.1, signer.secret.provider.zookeeper.path=/token, solr.kerberos.impersonator.user.anyHostUsersGroup.groups=staff, zk-dt-secret-manager.enable=true, solr.kerberos.impersonator.user.wrongHost.groups=*, kerberos.name.rules=DEFAULT, signer.secret.provider=zookeeper, solr.kerberos.impersonator.user.anyHostUsersGroup.hosts=*}
   [junit4]   2> 1158645 INFO  (jetty-launcher-1977-thread-2) [n:127.0.0.1:48706_solr    ] o.a.c.f.i.CuratorFrameworkImpl Starting
   [junit4]   2> 1158680 INFO  (jetty-launcher-1977-thread-2-EventThread) [n:127.0.0.1:48706_solr    ] o.a.c.f.s.ConnectionStateManager State change: CONNECTED
   [junit4]   2> 1158916 WARN  (jetty-launcher-1977-thread-2) [n:127.0.0.1:48706_solr    ] o.a.s.c.s.i.Krb5HttpClientBuilder org.apache.solr.client.solrj.impl.Krb5HttpClientBuilder is configured without specifying system property 'java.security.auth.login.config'
   [junit4]   2> 1158936 WARN  (jetty-launcher-1977-thread-1) [n:127.0.0.1:59765_solr    ] o.a.s.c.s.i.Krb5HttpClientBuilder org.apache.solr.client.solrj.impl.Krb5HttpClientBuilder is configured without specifying system property 'java.security.auth.login.config'
   [junit4]   2> 1159005 INFO  (jetty-launcher-1977-thread-2) [n:127.0.0.1:48706_solr    ] o.a.s.m.r.SolrJmxReporter JMX monitoring for 'solr_48706.solr.node' (registry 'solr.node') enabled at server: com.sun.jmx.mbeanserver.JmxMBeanServer@1b3ca7b
   [junit4]   2> 1159021 INFO  (jetty-launcher-1977-thread-1) [n:127.0.0.1:59765_solr    ] o.a.s.m.r.SolrJmxReporter JMX monitoring for 'solr_59765.solr.node' (registry 'solr.node') enabled at server: com.sun.jmx.mbeanserver.JmxMBeanServer@1b3ca7b
   [junit4]   2> 1159022 INFO  (jetty-launcher-1977-thread-2) [n:127.0.0.1:48706_solr    ] o.a.s.m.r.SolrJmxReporter JMX monitoring for 'solr_48706.solr.jvm' (registry 'solr.jvm') enabled at server: com.sun.jmx.mbeanserver.JmxMBeanServer@1b3ca7b
   [junit4]   2> 1159022 INFO  (jetty-launcher-1977-thread-2) [n:127.0.0.1:48706_solr    ] o.a.s.m.r.SolrJmxReporter JMX monitoring for 'solr_48706.solr.jetty' (registry 'solr.jetty') enabled at server: com.sun.jmx.mbeanserver.JmxMBeanServer@1b3ca7b
   [junit4]   2> 1159023 INFO  (jetty-launcher-1977-thread-2) [n:127.0.0.1:48706_solr    ] o.a.s.c.CorePropertiesLocator Found 0 core definitions underneath /export/home/jenkins/workspace/Lucene-Solr-master-Solaris/solr/build/solr-core/test/J1/temp/solr.cloud.TestSolrCloudWithSecureImpersonation_9135ED1CEA3F5160-001/tempDir-001/node2/.
   [junit4]   2> 1159032 INFO  (jetty-launcher-1977-thread-1) [n:127.0.0.1:59765_solr    ] o.a.s.m.r.SolrJmxReporter JMX monitoring for 'solr_59765.solr.jvm' (registry 'solr.jvm') enabled at server: com.sun.jmx.mbeanserver.JmxMBeanServer@1b3ca7b
   [junit4]   2> 1159032 INFO  (jetty-launcher-1977-thread-1) [n:127.0.0.1:59765_solr    ] o.a.s.m.r.SolrJmxReporter JMX monitoring for 'solr_59765.solr.jetty' (registry 'solr.jetty') enabled at server: com.sun.jmx.mbeanserver.JmxMBeanServer@1b3ca7b
   [junit4]   2> 1159033 INFO  (jetty-launcher-1977-thread-1) [n:127.0.0.1:59765_solr    ] o.a.s.c.CorePropertiesLocator Found 0 core definitions underneath /export/home/jenkins/workspace/Lucene-Solr-master-Solaris/solr/build/solr-core/test/J1/temp/solr.cloud.TestSolrCloudWithSecureImpersonation_9135ED1CEA3F5160-001/tempDir-001/node1/.
   [junit4]   2> 1159066 INFO  (zkConnectionManagerCallback-2002-thread-1) [    ] o.a.s.c.c.ConnectionManager zkClient has connected
   [junit4]   2> 1159092 INFO  (TEST-TestSolrCloudWithSecureImpersonation.testProxyInvalidProxyUser-seed#[9135ED1CEA3F5160]) [    ] o.a.s.SolrTestCaseJ4 ###Starting testProxyInvalidProxyUser
   [junit4]   2> 1159129 WARN  (TEST-TestSolrCloudWithSecureImpersonation.testProxyInvalidProxyUser-seed#[9135ED1CEA3F5160]) [    ] o.a.h.c.p.ResponseProcessCookies Invalid cookie header: "Set-Cookie: hadoop.auth="u=bar&p=bar&t=test&e=1517523292845&s=wlmIA1qpJB95PLMqXoee3faJQfs="; Path=/; Domain=127.0.0.1; Expires=  ., 01- . .-2561 22:14:52 GMT; HttpOnly". Invalid 'expires' attribute: ., 01- . .-2561 22:14:52 GMT
   [junit4]   2> 1159129 INFO  (TEST-TestSolrCloudWithSecureImpersonation.testProxyInvalidProxyUser-seed#[9135ED1CEA3F5160]) [    ] o.a.s.SolrTestCaseJ4 ###Ending testProxyInvalidProxyUser
   [junit4]   2> 1159150 INFO  (TEST-TestSolrCloudWithSecureImpersonation.testProxyNullProxyUser-seed#[9135ED1CEA3F5160]) [    ] o.a.s.SolrTestCaseJ4 ###Starting testProxyNullProxyUser
   [junit4]   2> 1159151 INFO  (qtp1510026401-12314) [    ] o.a.s.s.SolrDispatchFilter Error authenticating
   [junit4]   2> java.lang.IllegalArgumentException: userName is NULL, empty or contains a '&'
   [junit4]   2> 	at org.apache.hadoop.security.authentication.util.AuthToken.checkForIllegalArgument(AuthToken.java:87)
   [junit4]   2> 	at org.apache.hadoop.security.authentication.util.AuthToken.<init>(AuthToken.java:70)
   [junit4]   2> 	at org.apache.hadoop.security.authentication.server.AuthenticationToken.<init>(AuthenticationToken.java:58)
   [junit4]   2> 	at org.apache.solr.security.HttpParamDelegationTokenPlugin$HttpParamDelegationTokenAuthenticationHandler$HttpParamAuthenticationHandler.authenticate(HttpParamDelegationTokenPlugin.java:213)
   [junit4]   2> 	at org.apache.hadoop.security.token.delegation.web.DelegationTokenAuthenticationHandler.authenticate(DelegationTokenAuthenticationHandler.java:348)
   [junit4]   2> 	at org.apache.solr.security.RequestContinuesRecorderAuthenticationHandler.authenticate(RequestContinuesRecorderAuthenticationHandler.java:69)
   [junit4]   2> 	at org.apache.hadoop.security.authentication.server.AuthenticationFilter.doFilter(AuthenticationFilter.java:518)
   [junit4]   2> 	at org.apache.solr.security.DelegationTokenKerberosFilter.doFilter(DelegationTokenKerberosFilter.java:134)
   [junit4]   2> 	at org.apache.solr.security.HttpParamDelegationTokenPlugin$HttpParamToRequestFilter.doFilter(HttpParamDelegationTokenPlugin.java:245)
   [junit4]   2> 	at org.apache.solr.security.KerberosPlugin.doAuthenticate(KerberosPlugin.java:243)
   [junit4]   2> 	at org.apache.solr.servlet.SolrDispatchFilter.authenticateRequest(SolrDispatchFilter.java:449)
   [junit4]   2> 	at org.apache.solr.servlet.SolrDispatchFilter.doFilter(SolrDispatchFilter.java:349)
   [junit4]   2> 	at org.apache.solr.servlet.SolrDispatchFilter.doFilter(SolrDispatchFilter.java:326)
   [junit4]   2> 	at org.eclipse.jetty.servlet.ServletHandler$CachedChain.doFilter(ServletHandler.java:1637)
   [junit4]   2> 	at org.apache.solr.client.solrj.embedded.JettySolrRunner$DebugFilter.doFilter(JettySolrRunner.java:139)
   [junit4]   2> 	at org.eclipse.jetty.servlet.ServletHandler$CachedChain.doFilter(ServletHandler.java:1637)
   [junit4]   2> 	at org.eclipse.jetty.servlet.ServletHandler.doHandle(ServletHandler.java:533)
   [junit4]   2> 	at org.eclipse.jetty.server.handler.ScopedHandler.nextHandle(ScopedHandler.java:188)
   [junit4]   2> 	at org.eclipse.jetty.server.session.SessionHandler.doHandle(SessionHandler.java:1595)
   [junit4]   2> 	at org.eclipse.jetty.server.handler.ScopedHandler.nextHandle(ScopedHandler.java:188)
   [junit4]   2> 	at org.eclipse.jetty.server.handler.ContextHandler.doHandle(ContextHandler.java:1253)
   [junit4]   2> 	at org.eclipse.jetty.server.handler.ScopedHandler.nextScope(ScopedHandler.java:168)
   [junit4]   2> 	at org.eclipse.jetty.servlet.ServletHandler.doScope(ServletHandler.java:473)
   [junit4]   2> 	at org.eclipse.jetty.server.session.SessionHandler.doScope(SessionHandler.java:1564)
   [junit4]   2> 	at org.eclipse.jetty.server.handler.ScopedHandler.nextScope(ScopedHandler.java:166)
   [junit4]   2> 	at org.eclipse.jetty.server.handler.ContextHandler.doScope(ContextHandler.java:1155)
   [junit4]   2> 	at org.eclipse.jetty.server.handler.ScopedHandler.handle(ScopedHandler.java:141)
   [junit4]   2> 	at org.eclipse.jetty.server.handler.gzip.GzipHandler.handle(GzipHandler.java:527)
   [junit4]   2> 	at org.eclipse.jetty.server.handler.HandlerWrapper.handle(HandlerWrapper.java:132)
   [junit4]   2> 	at org.eclipse.jetty.server.Server.handle(Server.java:530)
   [junit4]   2> 	at org.eclipse.jetty.server.HttpChannel.handle(HttpChannel.java:347)
   [junit4]   2> 	at org.eclipse.jetty.server.HttpConnection.onFillable(HttpConnection.java:256)
   [junit4]   2> 	at org.eclipse.jetty.io.AbstractConnection$ReadCallback.succeeded(AbstractConnection.java:279)
   [junit4]   2> 	at org.eclipse.jetty.io.FillInterest.fillable(FillInterest.java:102)
   [junit4]   2> 	at org.eclipse.jetty.io.ChannelEndPoint$2.run(ChannelEndPoint.java:124)
   [junit4]   2> 	at org.eclipse.jetty.util.thread.strategy.EatWhatYouKill.doProduce(EatWhatYouKill.java:247)
   [junit4]   2> 	at org.eclipse.jetty.util.thread.strategy.EatWhatYouKill.produce(EatWhatYouKill.java:140)
   [junit4]   2> 	at org.eclipse.jetty.util.thread.strategy.EatWhatYouKill.run(EatWhatYouKill.java:131)
   [junit4]   2> 	at org.eclipse.jetty.util.thread.ReservedThreadExecutor$ReservedThread.run(ReservedThreadExecutor.java:382)
   [junit4]   2> 	at org.eclipse.jetty.util.thread.QueuedThreadPool.runJob(QueuedThreadPool.java:708)
   [junit4]   2> 	at org.eclipse.jetty.util.thread.QueuedThreadPool$2.run(QueuedThreadPool.java:626)
   [junit4]   2> 	at java.lang.Thread.run(Thread.java:748)
   [junit4]   2> 1159151 WARN  (qtp1510026401-12314) [    ] o.e.j.s.HttpChannel /solr/admin/collections
   [junit4]   2> org.apache.solr.common.SolrException: Error during request authentication, 
   [junit4]   2> 	at org.apache.solr.servlet.SolrDispatchFilter.authenticateRequest(SolrDispatchFilter.java:455)
   [junit4]   2> 	at org.apache.solr.servlet.SolrDispatchFilter.doFilter(SolrDispatchFilter.java:349)
   [junit4]   2> 	at org.apache.solr.servlet.SolrDispatchFilter.doFilter(SolrDispatchFilter.java:326)
   [junit4]   2> 	at org.eclipse.jetty.servlet.ServletHandler$CachedChain.doFilter(ServletHandler.java:1637)
   [junit4]   2> 	at org.apache.solr.client.solrj.embedded.JettySolrRunner$DebugFilter.doFilter(JettySolrRunner.java:139)
   [junit4]   2> 	at org.eclipse.jetty.servlet.ServletHandler$CachedChain.doFilter(ServletHandler.java:1637)
   [junit4]   2> 	at org.eclipse.jetty.servlet.ServletHandler.doHandle(ServletHandler.java:533)
   [junit4]   2> 	at org.eclipse.jetty.server.handler.ScopedHandler.nextHandle(ScopedHandler.java:188)
   [junit4]   2> 	at org.eclipse.jetty.server.session.SessionHandler.doHandle(SessionHandler.java:1595)
   [junit4]   2> 	at org.eclipse.jetty.server.handler.ScopedHandler.nextHandle(ScopedHandler.java:188)
   [junit4]   2> 	at org.eclipse.jetty.server.handler.ContextHandler.doHandle(ContextHandler.java:1253)
   [junit4]   2> 	at org.eclipse.jetty.server.handler.ScopedHandler.nextScope(ScopedHandler.java:168)
   [junit4]   2> 	at org.eclipse.jetty.servlet.ServletHandler.doScope(ServletHandler.java:473)
   [junit4]   2> 	at org.eclipse.jetty.server.session.SessionHandler.doScope(SessionHandler.java:1564)
   [junit4]   2> 	at org.eclipse.jetty.server.handler.ScopedHandler.nextScope(ScopedHandler.java:166)
   [junit4]   2> 	at org.eclipse.jetty.server.handler.ContextHandler.doScope(ContextHandler.java:1155)
   [junit4]   2> 	at org.eclipse.jetty.server.handler.ScopedHandler.handle(ScopedHandler.java:141)
   [junit4]   2> 	at org.eclipse.jetty.server.handler.gzip.GzipHandler.handle(GzipHandler.java:527)
   [junit4]   2> 	at org.eclipse.jetty.server.handler.HandlerWrapper.handle(HandlerWrapper.java:132)
   [junit4]   2> 	at org.eclipse.jetty.server.Server.handle(Server.java:530)
   [junit4]   2> 	at org.eclipse.jetty.server.HttpChannel.handle(HttpChannel.java:347)
   [junit4]   2> 	at org.eclipse.jetty.server.HttpConnection.onFillable(HttpConnection.java:256)
   [junit4]   2> 	at org.eclipse.jetty.io.AbstractConnection$ReadCallback.succeeded(AbstractConnection.java:279)
   [junit4]   2> 	at org.eclipse.jetty.io.FillInterest.fillable(FillInterest.java:102)
   [junit4]   2> 	at org.eclipse.jetty.io.ChannelEndPoint$2.run(ChannelEndPoint.java:124)
   [junit4]   2> 	at org.eclipse.jetty.util.thread.strategy.EatWhatYouKill.doProduce(EatWhatYouKill.java:247)
   [junit4]   2> 	at org.eclipse.jetty.util.thread.strategy.EatWhatYouKill.produce(EatWhatYouKill.java:140)
   [junit4]   2> 	at org.eclipse.jetty.util.thread.strategy.EatWhatYouKill.run(EatWhatYouKill.java:131)
   [junit4]   2> 	at org.eclipse.jetty.util.thread.ReservedThreadExecutor$ReservedThread.run(ReservedThreadExecutor.java:382)
   [junit4]   2> 	at org.eclipse.jetty.util.thread.QueuedThreadPool.runJob(QueuedThreadPool.java:708)
   [junit4]   2> 	at org.eclipse.jetty.util.thread.QueuedThreadPool$2.run(QueuedThreadPool.java:626)
   [junit4]   2> 	at java.lang.Thread.run(Thread.java:748)
   [junit4]   2> Caused by: java.lang.IllegalArgumentException: userName is NULL, empty or contains a '&'
   [junit4]   2> 	at org.apache.hadoop.security.authentication.util.AuthToken.checkForIllegalArgument(AuthToken.java:87)
   [junit4]   2> 	at org.apache.hadoop.security.authentication.util.AuthToken.<init>(AuthToken.java:70)
   [junit4]   2> 	at org.apache.hadoop.security.authentication.server.AuthenticationToken.<init>(AuthenticationToken.java:58)
   [junit4]   2> 	at org.apache.solr.security.HttpParamDelegationTokenPlugin$HttpParamDelegationTokenAuthenticationHandler$HttpParamAuthenticationHandler.authenticate(HttpParamDelegationTokenPlugin.java:213)
   [junit4]   2> 	at org.apache.hadoop.security.token.delegation.web.DelegationTokenAuthenticationHandler.authenticate(DelegationTokenAuthenticationHandler.java:348)
   [junit4]   2> 	at org.apache.solr.security.RequestContinuesRecorderAuthenticationHandler.authenticate(RequestContinuesRecorderAuthenticationHandler.java:69)
   [junit4]   2> 	at org.apache.hadoop.security.authentication.server.AuthenticationFilter.doFilter(AuthenticationFilter.java:518)
   [junit4]   2> 	at org.apache.solr.security.DelegationTokenKerberosFilter.doFilter(DelegationTokenKerberosFilter.java:134)
   [junit4]   2> 	at org.apache.solr.security.HttpParamDelegationTokenPlugin$HttpParamToRequestFilter.doFilter(HttpParamDelegationTokenPlugin.java:245)
   [junit4]   2> 	at org.apache.solr.security.KerberosPlugin.doAuthenticate(KerberosPlugin.java:243)
   [junit4]   2> 	at org.apache.solr.servlet.SolrDispatchFilter.authenticateRequest(SolrDispatchFilter.java:449)
   [junit4]   2> 	... 31 more
   [junit4]   2> 1159153 INFO  (TEST-TestSolrCloudWithSecureImpersonation.testProxyNullProxyUser-seed#[9135ED1CEA3F5160]) [    ] o.a.s.SolrTestCaseJ4 ###Ending testProxyNullProxyUser
   [junit4]   2> 1159178 INFO  (TEST-TestSolrCloudWithSecureImpersonation.testProxyNoConfigHosts-seed#[9135ED1CEA3F5160]) [    ] o.a.s.SolrTestCaseJ4 ###Starting testProxyNoConfigHosts
   [junit4]   2> 1159186 WARN  (TEST-TestSolrCloudWithSecureImpersonation.testProxyNoConfigHosts-seed#[9135ED1CEA3F5160]) [    ] o.a.h.c.p.ResponseProcessCookies Invalid cookie header: "Set-Cookie: hadoop.auth="u=noHosts&p=noHosts&t=test&e=1517523292922&s=ViQD5c7BGjSeo3/Hf8Mu0IAvmkw="; Path=/; Domain=127.0.0.1; Expires=  ., 01- . .-2561 22:14:52 GMT; HttpOnly". Invalid 'expires' attribute: ., 01- . .-2561 22:14:52 GMT
   [junit4]   2> 1159186 INFO  (TEST-TestSolrCloudWithSecureImpersonation.testProxyNoConfigHosts-seed#[9135ED1CEA3F5160]) [    ] o.a.s.SolrTestCaseJ4 ###Ending testProxyNoConfigHosts
   [junit4]   2> 1159217 INFO  (TEST-TestSolrCloudWithSecureImpersonation.testProxyWrongHost-seed#[9135ED1CEA3F5160]) [    ] o.a.s.SolrTestCaseJ4 ###Starting testProxyWrongHost
   [junit4]   2> 1159263 WARN  (TEST-TestSolrCloudWithSecureImpersonation.testProxyWrongHost-seed#[9135ED1CEA3F5160]) [    ] o.a.h.c.p.ResponseProcessCookies Invalid cookie header: "Set-Cookie: hadoop.auth="u=wrongHost&p=wrongHost&t=test&e=1517523292959&s=lPXMbDtXZNNDWGSJ+xngyt44Ac8="; Path=/; Domain=127.0.0.1; Expires=  ., 01- . .-2561 22:14:52 GMT; HttpOnly". Invalid 'expires' attribute: ., 01- . .-2561 22:14:52 GMT
   [junit4]   2> 1159264 INFO  (TEST-TestSolrCloudWithSecureImpersonation.testProxyWrongHost-seed#[9135ED1CEA3F5160]) [    ] o.a.s.SolrTestCaseJ4 ###Ending testProxyWrongHost
   [junit4]   2> 1159307 INFO  (TEST-TestSolrCloudWithSecureImpersonation.testProxyNoConfigGroups-seed#[9135ED1CEA3F5160]) [    ] o.a.s.SolrTestCaseJ4 ###Starting testProxyNoConfigGroups
   [junit4]   2> 1159309 WARN  (TEST-TestSolrCloudWithSecureImpersonation.testProxyNoConfigGroups-seed#[9135ED1CEA3F5160]) [    ] o.a.h.c.p.ResponseProcessCookies Invalid cookie header: "Set-Cookie: hadoop.auth="u=noGroups&p=noGroups&t=test&e=1517523293048&s=Raz3o+0VV6+lLE7/O1DGIHoRVxg="; Path=/; Domain=127.0.0.1; Expires=  ., 01- . .-2561 22:14:53 GMT; HttpOnly". Invalid 'expires' attribute: ., 01- . .-2561 22:14:53 GMT
   [junit4]   2> 1159309 INFO  (TEST-TestSolrCloudWithSecureImpersonation.testProxyNoConfigGroups-seed#[9135ED1CEA3F5160]) [    ] o.a.s.SolrTestCaseJ4 ###Ending testProxyNoConfigGroups
   [junit4]   2> 1159337 INFO  (TEST-TestSolrCloudWithSecureImpersonation.testProxyInvalidRemote-seed#[9135ED1CEA3F5160]) [    ] o.a.s.SolrTestCaseJ4 ###Starting testProxyInvalidRemote
   [junit4]   2> 1159343 WARN  (TEST-TestSolrCloudWithSecureImpersonation.testProxyInvalidRemote-seed#[9135ED1CEA3F5160]) [    ] o.a.h.c.p.ResponseProcessCookies Invalid cookie header: "Set-Cookie: hadoop.auth="u=localHostAnyGroup&p=localHostAnyGroup&t=test&e=1517523293078&s=448Iw+VI2dBTk5ZDV7R2R7L9Ago="; Path=/; Domain=127.0.0.1; Expires=  ., 01- . .-2561 22:14:53 GMT; HttpOnly". Invalid 'expires' attribute: ., 01- . .-2561 22:14:53 GMT
   [junit4]   2> 1159344 INFO  (TEST-TestSolrCloudWithSecureImpersonation.testProxyInvalidRemote-seed#[9135ED1CEA3F5160]) [    ] o.a.s.SolrTestCaseJ4 ###Ending testProxyInvalidRemote
   [junit4]   2> 1159370 INFO  (TEST-TestSolrCloudWithSecureImpersonation.testProxyValidateAnyHostAnyUser-seed#[9135ED1CEA3F5160]) [    ] o.a.s.SolrTestCaseJ4 ###Starting testProxyValidateAnyHostAnyUser
   [junit4]   2> 1159404 INFO  (qtp1510026401-12316) [n:127.0.0.1:48706_solr    ] o.a.s.h.a.CollectionsHandler Invoked Collection Action :list with params doAs=bar&action=LIST&wt=javabin&version=2 and sendToOCPQueue=true
   [junit4]   2> 1159404 INFO  (qtp1510026401-12316) [n:127.0.0.1:48706_solr    ] o.a.s.s.HttpSolrCall [admin] webapp=null path=/admin/collections params={doAs=bar&action=LIST&wt=javabin&version=2} status=0 QTime=0
   [junit4]   2> 1159405 WARN  (TEST-TestSolrCloudWithSecureImpersonation.testProxyValidateAnyHostAnyUser-seed#[9135ED1CEA3F5160]) [    ] o.a.h.c.p.ResponseProcessCookies Invalid cookie header: "Set-Cookie: hadoop.auth="u=anyHostAnyUser&p=anyHostAnyUser&t=test&e=1517523293140&s=Za1FbHEFetrx/WMwa4o0iz+wDks="; Path=/; Domain=127.0.0.1; Expires=  ., 01- . .-2561 22:14:53 GMT; HttpOnly". Invalid 'expires' attribute: ., 01- . .-2561 22:14:53 GMT
   [junit4]   2> 1159405 INFO  (TEST-TestSolrCloudWithSecureImpersonation.testProxyValidateAnyHostAnyUser-seed#[9135ED1CEA3F5160]) [    ] o.a.s.SolrTestCaseJ4 ###Ending testProxyValidateAnyHostAnyUser
   [junit4]   2> 1159491 INFO  (TEST-TestSolrCloudWithSecureImpersonation.testProxyValidateGroup-seed#[9135ED1CEA3F5160]) [    ] o.a.s.SolrTestCaseJ4 ###Starting testProxyValidateGroup
   [junit4]   2> 1159558 INFO  (qtp1510026401-12314) [n:127.0.0.1:48706_solr    ] o.a.s.h.a.CollectionsHandler Invoked Collection Action :list with params doAs=jenkins&action=LIST&wt=javabin&version=2 and sendToOCPQueue=true
   [junit4]   2> 1159559 INFO  (qtp1510026401-12314) [n:127.0.0.1:48706_solr    ] o.a.s.s.HttpSolrCall [admin] webapp=null path=/admin/collections params={doAs=jenkins&action=LIST&wt=javabin&version=2} status=0 QTime=0
   [junit4]   2> 1159559 WARN  (TEST-TestSolrCloudWithSecureImpersonation.testProxyValidateGroup-seed#[9135ED1CEA3F5160]) [    ] o.a.h.c.p.ResponseProcessCookies Invalid cookie header: "Set-Cookie: hadoop.auth="u=anyHostUsersGroup&p=anyHostUsersGroup&t=test&e=1517523293233&s=TYDD3Dx5UkA/PYRga0k2i1kv3JQ="; Path=/; Domain=127.0.0.1; Expires=  ., 01- . .-2561 22:14:53 GMT; HttpOnly". Invalid 'expires' attribute: ., 01- . .-2561 22:14:53 GMT
   [junit4]   2> 1159559 INFO  (TEST-TestSolrCloudWithSecureImpersonation.testProxyValidateGroup-seed#[9135ED1CEA3F5160]) [    ] o.a.s.SolrTestCaseJ4 ###Ending testProxyValidateGroup
   [junit4]   2> 1159622 INFO  (TEST-TestSolrCloudWithSecureImpersonation.testProxyValidateHost-seed#[9135ED1CEA3F5160]) [    ] o.a.s.SolrTestCaseJ4 ###Starting testProxyValidateHost
   [junit4]   2> 1159627 INFO  (qtp1510026401-12316) [n:127.0.0.1:48706_solr    ] o.a.s.h.a.CollectionsHandler Invoked Collection Action :list with params doAs=bar&action=LIST&wt=javabin&version=2 and sendToOCPQueue=true
   [junit4]   2> 1159627 INFO  (qtp1510026401-12316) [n:127.0.0.1:48706_solr    ] o.a.s.s.HttpSolrCall [admin] webapp=null path=/admin/collections params={doAs=bar&action=LIST&wt=javabin&version=2} status=0 QTime=0
   [junit4]   2> 1159628 WARN  (TEST-TestSolrCloudWithSecureImpersonation.testProxyValidateHost-seed#[9135ED1CEA3F5160]) [    ] o.a.h.c.p.ResponseProcessCookies Invalid cookie header: "Set-Cookie: hadoop.auth="u=localHostAnyGroup&p=localHostAnyGroup&t=test&e=1517523293368&s=AZCvXEhqDJbuoc97v+lAmECmmWg="; Path=/; Domain=127.0.0.1; Expires=  ., 01- . .-2561 22:14:53 GMT; HttpOnly". Invalid 'expires' attribute: ., 01- . .-2561 22:14:53 GMT
   [junit4]   2> 1159628 INFO  (TEST-TestSolrCloudWithSecureImpersonation.testProxyValidateHost-seed#[9135ED1CEA3F5160]) [    ] o.a.s.SolrTestCaseJ4 ###Ending testProxyValidateHost
   [junit4]   2> 1159669 INFO  (TEST-TestSolrCloudWithSecureImpersonation.testProxyInvalidGroup-seed#[9135ED1CEA3F5160]) [    ] o.a.s.SolrTestCaseJ4 ###Starting testProxyInvalidGroup
   [junit4]   2> 1159775 WARN  (qtp1510026401-12314) [n:127.0.0.1:48706_solr    ] o.a.h.s.ShellBasedUnixGroupsMapping got exception trying to get groups for user bar: id: invalid user name: "bar"
   [junit4]   2> id: invalid user name: "bar"
   [junit4]   2> 
   [junit4]   2> 1159777 WARN  (TEST-TestSolrCloudWithSecureImpersonation.testProxyInvalidGroup-seed#[9135ED1CEA3F5160]) [    ] o.a.h.c.p.ResponseProcessCookies Invalid cookie header: "Set-Cookie: hadoop.auth="u=bogusGroup&p=bogusGroup&t=test&e=1517523293410&s=Oii8J93CSzyB5ps9pGIw5t4dKNI="; Path=/; Domain=127.0.0.1; Expires=  ., 01- . .-2561 22:14:53 GMT; HttpOnly". Invalid 'expires' attribute: ., 01- . .-2561 22:14:53 GMT
   [junit4]   2> 1159778 INFO  (TEST-TestSolrCloudWithSecureImpersonation.testProxyInvalidGroup-seed#[9135ED1CEA3F5160]) [    ] o.a.s.SolrTestCaseJ4 ###Ending testProxyInvalidGroup
   [junit4]   2> 1159875 INFO  (TEST-TestSolrCloudWithSecureImpersonation.testForwarding-seed#[9135ED1CEA3F5160]) [    ] o.a.s.SolrTestCaseJ4 ###Starting testForwarding
   [junit4]   2> 1159880 INFO  (zkConnectionManagerCallback-2005-thread-1) [    ] o.a.s.c.c.ConnectionManager zkClient has connected
   [junit4]   2> 1161111 INFO  (zkConnectionManagerCallback-2008-thread-1) [    ] o.a.s.c.c.ConnectionManager zkClient has connected
   [junit4]   2> 1161114 INFO  (TEST-TestSolrCloudWithSecureImpersonation.testForwarding-seed#[9135ED1CEA3F5160]) [    ] o.a.s.c.c.ZkStateReader Updated live nodes from ZooKeeper... (0) -> (2)
   [junit4]   2> 1161116 INFO  (TEST-TestSolrCloudWithSecureImpersonation.testForwarding-seed#[9135ED1CEA3F5160]) [    ] o.a.s.c.s.i.ZkClientClusterStateProvider Cluster at 127.0.0.1:58506/solr ready
   [junit4]   2> 1161118 INFO  (qtp1510026401-12314) [n:127.0.0.1:48706_solr    ] o.a.s.h.a.CollectionsHandler Invoked Collection Action :create with params pullReplicas=0&replicationFactor=1&collection.configName=conf1&maxShardsPerNode=1&name=forwardingCollection&nrtReplicas=1&action=CREATE&numShards=1&tlogReplicas=0&wt=javabin&version=2 and sendToOCPQueue=true
   [junit4]   2> 1161132 INFO  (OverseerThreadFactory-2966-thread-1-processing-n:127.0.0.1:59765_solr) [n:127.0.0.1:59765_solr    ] o.a.s.c.a.c.CreateCollectionCmd Create collection forwardingCollection
   [junit4]   2> 1161267 INFO  (OverseerStateUpdate-72123289957826565-127.0.0.1:59765_solr-n_0000000000) [n:127.0.0.1:59765_solr    ] o.a.s.c.o.SliceMutator createReplica() {
   [junit4]   2>   "operation":"ADDREPLICA",
   [junit4]   2>   "collection":"forwardingCollection",
   [junit4]   2>   "shard":"shard1",
   [junit4]   2>   "core":"forwardingCollection_shard1_replica_n1",
   [junit4]   2>   "state":"down",
   [junit4]   2>   "base_url":"http://127.0.0.1:59765/solr",
   [junit4]   2>   "type":"NRT",
   [junit4]   2>   "waitForFinalState":"false"} 
   [junit4]   2> 1161480 INFO  (qtp1690636625-12302) [n:127.0.0.1:59765_solr    ] o.a.s.h.a.CoreAdminOperation core create command qt=/admin/cores&coreNodeName=core_node2&collection.configName=conf1&newCollection=true&name=forwardingCollection_shard1_replica_n1&action=CREATE&numShards=1&collection=forwardingCollection&shard=shard1&wt=javabin&version=2&replicaType=NRT
   [junit4]   2> 1161480 INFO  (qtp1690636625-12302) [n:127.0.0.1:59765_solr    ] o.a.s.c.TransientSolrCoreCacheDefault Allocating transient cache for 2147483647 transient cores
   [junit4]   2> 1161600 INFO  (zkCallback-1993-thread-1-processing-n:127.0.0.1:59765_solr) [n:127.0.0.1:59765_solr    ] o.a.s.c.c.ZkStateReader A cluster state change: [WatchedEvent state:SyncConnected type:NodeDataChanged path:/collections/forwardingCollection/state.json] for collection [forwardingCollection] has occurred - updating... (live nodes size: [2])
   [junit4]   2> 1161600 INFO  (zkCallback-1993-thread-2-processing-n:127.0.0.1:59765_solr) [n:127.0.0.1:59765_solr    ] o.a.s.c.c.ZkStateReader A cluster state change: [WatchedEvent state:SyncConnected type:NodeDataChanged path:/collections/forwardingCollection/state.json] for collection [forwardingCollection] has occurred - updating... (live nodes size: [2])
   [junit4]   2> 1162570 INFO  (qtp1690636625-12302) [n:127.0.0.1:59765_solr c:forwardingCollection s:shard1 r:core_node2 x:forwardingCollection_shard1_replica_n1] o.a.s.c.SolrConfig Using Lucene MatchVersion: 8.0.0
   [junit4]   2> 1162603 INFO  (qtp1690636625-12302) [n:127.0.0.1:59765_solr c:forwardingCollection s:shard1 r:core_node2 x:forwardingCollection_shard1_replica_n1] o.a.s.s.IndexSchema [forwardingCollection_shard1_replica_n1] Schema name=test
   [junit4]   2> 1162924 INFO  (qtp1690636625-12302) [n:127.0.0.1:59765_solr c:forwardingCollection s:shard1 r:core_node2 x:forwardingCollection_shard1_replica_n1] o.a.s.s.IndexSchema Loaded schema test/1.0 with uniqueid field id
   [junit4]   2> 1163033 INFO  (qtp1690636625-12302) [n:127.0.0.1:59765_solr c:forwardingCollection s:shard1 r:core_node2 x:forwardingCollection_shard1_replica_n1] o.a.s.c.CoreContainer Creating SolrCore 'forwardingCollection_shard1_replica_n1' using configuration from collection forwardingCollection, trusted=true
   [junit4]   2> 1163046 INFO  (qtp1690636625-12302) [n:127.0.0.1:59765_solr c:forwardingCollection s:shard1 r:core_node2 x:forwardingCollection_shard1_replica_n1] o.a.s.m.r.SolrJmxReporter JMX monitoring for 'solr_59765.solr.core.forwardingCollection.shard1.replica_n1' (registry 'solr.core.forwardingCollection.shard1.replica_n1') enabled at server: com.sun.jmx.mbeanserver.JmxMBeanServer@1b3ca7b
   [junit4]   2> 1163047 INFO  (qtp1690636625-12302) [n:127.0.0.1:59765_solr c:forwardingCollection s:shard1 r:core_node2 x:forwardingCollection_shard1_replica_n1] o.a.s.c.SolrCore solr.RecoveryStrategy.Builder
   [junit4]   2> 1163048 INFO  (qtp1690636625-12302) [n:127.0.0.1:59765_solr c:forwardingCollection s:shard1 r:core_node2 x:forwardingCollection_shard1_replica_n1] o.a.s.c.SolrCore [[forwardingCollection_shard1_replica_n1] ] Opening new SolrCore at [/export/home/jenkins/workspace/Lucene-Solr-master-Solaris/solr/build/solr-core/test/J1/temp/solr.cloud.TestSolrCloudWithSecureImpersonation_9135ED1CEA3F5160-001/tempDir-001/node1/forwardingCollection_shard1_replica_n1], dataDir=[/export/home/jenkins/workspace/Lucene-Solr-master-Solaris/solr/build/solr-core/test/J1/temp/solr.cloud.TestSolrCloudWithSecureImpersonation_9135ED1CEA3F5160-001/tempDir-001/node1/./forwardingCollection_shard1_replica_n1/data/]
   [junit4]   2> 1163055 INFO  (qtp1690636625-12302) [n:127.0.0.1:59765_solr c:forwardingCollection s:shard1 r:core_node2 x:forwardingCollection_shard1_replica_n1] o.a.s.u.RandomMergePolicy RandomMergePolicy wrapping class org.apache.lucene.index.TieredMergePolicy: [TieredMergePolicy: maxMergeAtOnce=36, maxMergeAtOnceExplicit=27, maxMergedSegmentMB=36.3662109375, floorSegmentMB=1.49609375, forceMergeDeletesPctAllowed=26.031912151890648, segmentsPerTier=14.0, maxCFSSegmentSizeMB=8.796093022207999E12, noCFSRatio=0.7928370962293599
   [junit4]   2> 1163180 INFO  (qtp1690636625-12302) [n:127.0.0.1:59765_solr c:forwardingCollection s:shard1 r:core_node2 x:forwardingCollection_shard1_replica_n1] o.a.s.u.UpdateHandler Using UpdateLog implementation: org.apache.solr.update.UpdateLog
   [junit4]   2> 1163181 INFO  (qtp1690636625-12302) [n:127.0.0.1:59765_solr c:forwardingCollection s:shard1 r:core_node2 x:forwardingCollection_shard1_replica_n1] o.a.s.u.UpdateLog Initializing UpdateLog: dataDir= defaultSyncLevel=FLUSH numRecordsToKeep=100 maxNumLogsToKeep=10 numVersionBuckets=65536
   [junit4]   2> 1163182 INFO  (qtp1690636625-12302) [n:127.0.0.1:59765_solr c:forwardingCollection s:shard1 r:core_node2 x:forwardingCollection_shard1_replica_n1] o.a.s.u.CommitTracker Hard AutoCommit: disabled
   [junit4]   2> 1163182 INFO  (qtp1690636625-12302) [n:127.0.0.1:59765_solr c:forwardingCollection s:shard1 r:core_node2 x:forwardingCollection_shard1_replica_n1] o.a.s.u.CommitTracker Soft AutoCommit: disabled
   [junit4]   2> 1163183 INFO  (qtp1690636625-12302) [n:127.0.0.1:59765_solr c:forwardingCollection s:shard1 r:core_node2 x:forwardingCollection_shard1_replica_n1] o.a.s.u.RandomMergePolicy RandomMergePolicy wrapping class org.apache.lucene.index.LogDocMergePolicy: [LogDocMergePolicy: minMergeSize=1000, mergeFactor=27, maxMergeSize=9223372036854775807, maxMergeSizeForForcedMerge=9223372036854775807, calibrateSizeByDeletes=true, maxMergeDocs=2147483647, maxCFSSegmentSizeMB=8.796093022207999E12, noCFSRatio=0.3630109340176154]
   [junit4]   2> 1163184 INFO  (qtp1690636625-12302) [n:127.0.0.1:59765_solr c:forwardingCollection s:shard1 r:core_node2 x:forwardingCollection_shard1_replica_n1] o.a.s.s.SolrIndexSearcher Opening [Searcher@3066f72b[forwardingCollection_shard1_replica_n1] main]
   [junit4]   2> 1163189 INFO  (qtp1690636625-12302) [n:127.0.0.1:59765_solr c:forwardingCollection s:shard1 r:core_node2 x:forwardingCollection_shard1_replica_n1] o.a.s.h.c.SpellCheckComponent Initializing spell checkers
   [junit4]   2> 1163197 INFO  (qtp1690636625-12302) [n:127.0.0.1:59765_solr c:forwardingCollection s:shard1 r:core_node2 x:forwardingCollection_shard1_replica_n1] o.a.s.s.DirectSolrSpellChecker init: {name=direct,classname=DirectSolrSpellChecker,field=lowerfilt,minQueryLength=3}
   [junit4]   2> 1163217 INFO  (qtp1690636625-12302) [n:127.0.0.1:59765_solr c:forwardingCollection s:shard1 r:core_node2 x:forwardingCollection_shard1_replica_n1] o.a.s.h.ReplicationHandler Commits will be reserved for 10000ms.
   [junit4]   2> 1163217 INFO  (qtp1690636625-12302) [n:127.0.0.1:59765_solr c:forwardingCollection s:shard1 r:core_node2 x:forwardingCollection_shard1_replica_n1] o.a.s.u.UpdateLog Could not find max version in index or recent updates, using new clock 1591200759895031808
   [junit4]   2> 1163219 INFO  (searcherExecutor-2971-thread-1-processing-n:127.0.0.1:59765_solr x:forwardingCollection_shard1_replica_n1 s:shard1 c:forwardingCollection r:core_node2) [n:127.0.0.1:59765_solr c:forwardingCollection s:shard1 r:core_node2 x:forwardingCollection_shard1_replica_n1] o.a.s.h.c.SpellCheckComponent Loading spell index for spellchecker: default
   [junit4]   2> 1163223 INFO  (searcherExecutor-2971-thread-1-processing-n:127.0.0.1:59765_solr x:forwardingCollection_shard1_replica_n1 s:shard1 c:forwardingCollection r:core_node2) [n:127.0.0.1:59765_solr c:forwardingCollection s:shard1 r:core_node2 x:forwardingCollection_shard1_replica_n1] o.a.s.h.c.SpellCheckComponent Loading spell index for spellchecker: direct
   [junit4]   2> 1163225 INFO  (searcherExecutor-2971-thread-1-processing-n:127.0.0.1:59765_solr x:forwardingCollection_shard1_replica_n1 s:shard1 c:forwardingCollection r:core_node2) [n:127.0.0.1:59765_solr c:forwardingCollection s:shard1 r:core_node2 x:forwardingCollection_shard1_replica_n1] o.a.s.h.c.SpellCheckComponent Loading spell index for spellchecker: wordbreak
   [junit4]   2> 1163225 INFO  (searcherExecutor-2971-thread-1-processing-n:127.0.0.1:59765_solr x:forwardingCollection_shard1_replica_n1 s:shard1 c:forwardingCollection r:core_node2) [n:127.0.0.1:59765_solr c:forwardingCollection s:shard1 r:core_node2 x:forwardingCollection_shard1_replica_n1] o.a.s.h.c.SpellCheckComponent Loading spell index for spellchecker: multipleFields
   [junit4]   2> 1163228 INFO  (searcherExecutor-2971-thread-1-processing-n:127.0.0.1:59765_solr x:forwardingCollection_shard1_replica_n1 s:shard1 c:forwardingCollection r:core_node2) [n:127.0.0.1:59765_solr c:forwardingCollection s:shard1 r:core_node2 x:forwardingCollection_shard1_replica_n1] o.a.s.h.c.SpellCheckComponent Loading spell index for spellchecker: jarowinkler
   [junit4]   2> 1163231 INFO  (searcherExecutor-2971-thread-1-processing-n:127.0.0.1:59765_solr x:forwardingCollection_shard1_replica_n1 s:shard1 c:forwardingCollection r:core_node2) [n:127.0.0.1:59765_solr c:forwardingCollection s:shard1 r:core_node2 x:forwardingCollection_shard1_replica_n1] o.a.s.h.c.SpellCheckComponent Loading spell index for spellchecker: external
   [junit4]   2> 1163232 INFO  (qtp1690636625-12302) [n:127.0.0.1:59765_solr c:forwardingCollection s:shard1 r:core_node2 x:forwardingCollection_shard1_replica_n1] o.a.s.c.ShardLeaderElectionContext Enough replicas found to continue.
   [junit4]   2> 1163232 INFO  (qtp1690636625-12302) [n:127.0.0.1:59765_solr c:forwardingCollection s:shard1 r:core_node2 x:forwardingCollection_shard1_replica_n1] o.a.s.c.ShardLeaderElectionContext I may be the new leader - try and sync
   [junit4]   2> 1163232 INFO  (qtp1690636625-12302) [n:127.0.0.1:59765_solr c:forwardingCollection s:shard1 r:core_node2 x:forwardingCollection_shard1_replica_n1] o.a.s.c.SyncStrategy Sync replicas to http://127.0.0.1:59765/solr/forwardingCollection_shard1_replica_n1/
   [junit4]   2> 1163232 INFO  (qtp1690636625-12302) [n:127.0.0.1:59765_solr c:forwardingCollection s:shard1 r:core_node2 x:forwardingCollection_shard1_replica_n1] o.a.s.c.SyncStrategy Sync Success - now sync replicas to me
   [junit4]   2> 1163232 INFO  (qtp1690636625-12302) [n:127.0.0.1:59765_solr c:forwardingCollection s:shard1 r:core_node2 x:forwardingCollection_shard1_replica_n1] o.a.s.c.SyncStrategy http://127.0.0.1:59765/solr/forwardingCollection_shard1_replica_n1/ has no replicas
   [junit4]   2> 1163232 INFO  (qtp1690636625-12302) [n:127.0.0.1:59765_solr c:forwardingCollection s:shard1 r:core_node2 x:forwardingCollection_shard1_replica_n1] o.a.s.c.ShardLeaderElectionContext Found all replicas participating in election, clear LIR
   [junit4]   2> 1163232 INFO  (searcherExecutor-2971-thread-1-processing-n:127.0.0.1:59765_solr x:forwardingCollection_shard1_replica_n1 s:shard1 c:forwardingCollection r:core_node2) [n:127.0.0.1:59765_solr c:forwardingCollection s:shard1 r:core_node2 x:forwardingCollection_shard1_replica_n1] o.a.s.h.c.SpellCheckComponent Loading spell index for spellchecker: freq
   [junit4]   2> 1163235 INFO  (searcherExecutor-2971-thread-1-processing-n:127.0.0.1:59765_solr x:forwardingCollection_shard1_replica_n1 s:shard1 c:forwardingCollection r:core_node2) [n:127.0.0.1:59765_solr c:forwardingCollection s:shard1 r:core_node2 x:forwardingCollection_shard1_replica_n1] o.a.s.h.c.SpellCheckComponent Loading spell index for spellchecker: fqcn
   [junit4]   2> 1163237 INFO  (qtp1690636625-12302) [n:127.0.0.1:59765_solr c:forwardingCollection s:shard1 r:core_node2 x:forwardingCollection_shard1_replica_n1] o.a.s.c.ShardLeaderElectionContext I am the new leader: http://127.0.0.1:59765/solr/forwardingCollection_shard1_replica_n1/ shard1
   [junit4]   2> 1163238 INFO  (searcherExecutor-2971-thread-1-processing-n:127.0.0.1:59765_solr x:forwardingCollection_shard1_replica_n1 s:shard1 c:forwardingCollection r:core_node2) [n:127.0.0.1:59765_solr c:forwardingCollection s:shard1 r:core_node2 x:forwardingCollection_shard1_replica_n1] o.a.s.h.c.SpellCheckComponent Loading spell index for spellchecker: perDict
   [junit4]   2> 1163239 INFO  (searcherExecutor-2971-thread-1-processing-n:127.0.0.1:59765_solr x:forwardingCollection_shard1_replica_n1 s:shard1 c:forwardingCollection r:core_node2) [n:127.0.0.1:59765_solr c:forwardingCollection s:shard1 r:core_node2 x:forwardingCollection_shard1_replica_n1] o.a.s.c.SolrCore [forwardingCollection_shard1_replica_n1] Registered new searcher Searcher@3066f72b[forwardingCollection_shard1_replica_n1] main{ExitableDirectoryReader(UninvertingDirectoryReader())}
   [junit4]   2> 1163342 INFO  (zkCallback-1993-thread-2-processing-n:127.0.0.1:59765_solr) [n:127.0.0.1:59765_solr    ] o.a.s.c.c.ZkStateReader A cluster state change: [WatchedEvent state:SyncConnected type:NodeDataChanged path:/collections/forwardingCollection/state.json] for collection [forwardingCollection] has occurred - updating... (live nodes size: [2])
   [junit4]   2> 1163342 INFO  (zkCallback-1993-thread-1-processing-n:127.0.0.1:59765_solr) [n:127.0.0.1:59765_solr    ] o.a.s.c.c.ZkStateReader A cluster state change: [WatchedEvent state:SyncConnected type:NodeDataChanged path:/collections/forwardingCollection/state.json] for collection [forwardingCollection] has occurred - updating... (live nodes size: [2])
   [junit4]   2> 1163389 INFO  (qtp1690636625-12302) [n:127.0.0.1:59765_solr c:forwardingCollection s:shard1 r:core_node2 x:forwardingCollection_shard1_replica_n1] o.a.s.c.ZkController I am the leader, no recovery necessary
   [junit4]   2> 1163392 INFO  (qtp1690636625-12302) [n:127.0.0.1:59765_solr c:forwardingCollection s:shard1 r:core_node2 x:forwardingCollection_shard1_replica_n1] o.a.s.s.HttpSolrCall [admin] webapp=null path=/admin/cores params={qt=/admin/cores&coreNodeName=core_node2&collection.configName=conf1&newCollection=true&name=forwardingCollection_shard1_replica_n1&action=CREATE&numShards=1&collection=forwardingCollection&shard=shard1&wt=javabin&version=2&replicaType=NRT} status=0 QTime=1913
   [junit4]   2> 1163392 WARN  (httpShardExecutor-2962-thread-1-processing-n:127.0.0.1:59765_solr [http:////127.0.0.1:59765//solr] http:////127.0.0.1:59765//solr) [n:127.0.0.1:59765_solr    ] o.a.h.c.p.ResponseProcessCookies Invalid cookie header: "Set-Cookie: hadoop.auth="u=$&p=$&t=test&e=1517523295220&s=39NWGwUeGGVz6c9DlyMPifxhoso="; Path=/; Domain=127.0.0.1; Expires=  ., 01- . .-2561 22:14:55 GMT; HttpOnly". Invalid 'expires' attribute: ., 01- . .-2561 22:14:55 GMT
   [junit4]   2> 1163396 INFO  (qtp1510026401-12314) [n:127.0.0.1:48706_solr    ] o.a.s.h.a.CollectionsHandler Wait for new collection to be active for at most 30 seconds. Check all shard replicas
   [junit4]   2> 1163493 INFO  (zkCallback-1993-thread-1-processing-n:127.0.0.1:59765_solr) [n:127.0.0.1:59765_solr    ] o.a.s.c.c.ZkStateReader A cluster state change: [WatchedEvent state:SyncConnected type:NodeDataChanged path:/collections/forwardingCollection/state.json] for collection [forwardingCollection] has occurred - updating... (live nodes size: [2])
   [junit4]   2> 1163493 INFO  (zkCallback-1993-thread-2-processing-n:127.0.0.1:59765_solr) [n:127.0.0.1:59765_solr    ] o.a.s.c.c.ZkStateReader A cluster state change: [WatchedEvent state:SyncConnected type:NodeDataChanged path:/collections/forwardingCollection/state.json] for collection [forwardingCollection] has occurred - updating... (live nodes size: [2])
   [junit4]   2> 1164401 INFO  (qtp1510026401-12314) [n:127.0.0.1:48706_solr    ] o.a.s.s.HttpSolrCall [admin] webapp=null path=/admin/collections params={pullReplicas=0&replicationFactor=1&collection.configName=conf1&maxShardsPerNode=1&name=forwardingCollection&nrtReplicas=1&action=CREATE&numShards=1&tlogReplicas=0&wt=javabin&version=2} status=0 QTime=3283
   [junit4]   2> 1164401 WARN  (TEST-TestSolrCloudWithSecureImpersonation.testForwarding-seed#[9135ED1CEA3F5160]) [    ] o.a.h.c.p.ResponseProcessCookies Invalid cookie header: "Set-Cookie: hadoop.auth="u=user&p=user&t=test&e=1517523294859&s=VmWp8nb92cu3fLshGMm6ftD3ex0="; Path=/; Domain=127.0.0.1; Expires=  ., 01- . .-2561 22:14:54 GMT; HttpOnly". Invalid 'expires' attribute: ., 01- . .-2561 22:14:54 GMT
   [junit4]   2> 1164402 INFO  (TEST-TestSolrCloudWithSecureImpersonation.testForwarding-seed#[9135ED1CEA3F5160]) [    ] o.a.s.c.AbstractDistribZkTestBase Wait for recoveries to finish - collection: forwardingCollection failOnTimeout:true timeout (sec):100
   [junit4]   2> 1164405 INFO  (TEST-TestSolrCloudWithSecureImpersonation.testForwarding-seed#[9135ED1CEA3F5160]) [    ] o.a.s.c.AbstractDistribZkTestBase Recoveries finished - collection: forwardingCollection
   [junit4]   2> 1164409 INFO  (qtp1510026401-12314) [n:127.0.0.1:48706_solr    ] o.a.s.c.TransientSolrCoreCacheDefault Allocating transient cache for 2147483647 transient cores
   [junit4]   2> 1164417 INFO  (qtp1690636625-12303) [n:127.0.0.1:59765_solr c:forwardingCollection s:shard1 r:core_node2 x:forwardingCollection_shard1_replica_n1] o.a.s.c.S.Request [forwardingCollection_shard1_replica_n1]  webapp=/solr path=/select params={q=*:*&wt=javabin&version=2} hits=0 status=0 QTime=0
   [junit4]   2> 1164417 WARN  (qtp1510026401-12314) [n:127.0.0.1:48706_solr    ] o.a.h.c.p.ResponseProcessCookies Invalid cookie header: "Set-Cookie: hadoop.auth="u=$&p=$&t=test&e=1517523298152&s=9s832qHAqXWs/XqAs+703gS4FJQ="; Path=/; Domain=127.0.0.1; Expires=  ., 01- . .-2561 22:14:58 GMT; HttpOnly". Invalid 'expires' attribute: ., 01- . .-2561 22:14:58 GMT
   [junit4]   2> 1164418 WARN  (TEST-TestSolrCloudWithSecureImpersonation.testForwarding-seed#[9135ED1CEA3F5160]) [    ] o.a.h.c.p.ResponseProcessCookies Invalid cookie header: "Set-Cookie: hadoop.auth="u=user&p=user&t=test&e=1517523298149&s=2NJFAPBa1pBdTYySR1N1zvpDJ2I="; Path=/; Domain=127.0.0.1; Expires=  ., 01- . .-2561 22:14:58 GMT; HttpOnly". Invalid 'expires' attribute: ., 01- . .-2561 22:14:58 GMT
   [junit4]   2> 1164418 WARN  (TEST-TestSolrCloudWithSecureImpersonation.testForwarding-seed#[9135ED1CEA3F5160]) [    ] o.a.h.c.p.ResponseProcessCookies Invalid cookie header: "Set-Cookie: hadoop.auth="u=$&p=$&t=test&e=1517523298152&s=9s832qHAqXWs/XqAs+703gS4FJQ="; Path=/; Domain=127.0.0.1; Expires=  ., 01- . .-2561 22:14:58 GMT; HttpOnly". Invalid 'expires' attribute: ., 01- . .-2561 22:14:58 GMT
   [junit4]   2> 1164427 INFO  (qtp1690636625-12303) [n:127.0.0.1:59765_solr c:forwardingCollection s:shard1 r:core_node2 x:forwardingCollection_shard1_replica_n1] o.a.s.c.S.Request [forwardingCollection_shard1_replica_n1]  webapp=/solr path=/select params={q=*:*&wt=javabin&version=2} hits=0 status=0 QTime=0
   [junit4]   2> 1164428 WARN  (TEST-TestSolrCloudWithSecureImpersonation.testForwarding-seed#[9135ED1CEA3F5160]) [    ] o.a.h.c.p.ResponseProcessCookies Invalid cookie header: "Set-Cookie: hadoop.auth="u=user&p=user&t=test&e=1517523298167&s=OXmbY54MVsIIFfPSuWifvjpWxZ8="; Path=/; Domain=127.0.0.1; Expires=  ., 01- . .-2561 22:14:58 GMT; HttpOnly". Invalid 'expires' attribute: ., 01- . .-2561 22:14:58 GMT
   [junit4]   2> 1164428 INFO  (TEST-TestSolrCloudWithSecureImpersonation.testForwarding-seed#[9135ED1CEA3F5160]) [    ] o.a.s.SolrTestCaseJ4 ###Ending testForwarding
   [junit4]   2> 1164590 INFO  (TEST-TestSolrCloudWithSecureImpersonation.testProxyUnknownRemote-seed#[9135ED1CEA3F5160]) [    ] o.a.s.SolrTestCaseJ4 ###Starting testProxyUnknownRemote
   [junit4]   2> 1176197 WARN  (jetty-launcher-1977-thread-1-SendThread(127.0.0.1:58506)) [n:127.0.0.1:59765_solr    ] o.a.z.ClientCnxn Client session timed out, have not heard from server in 17250ms for sessionid 0x1003bc005f80007
   [junit4]   2> 1176198 WARN  (NIOServerCxn.Factory:0.0.0.0/0.0.0.0:0) [    ] o.a.z.s.NIOServerCnxn Unable to read additional data from client sessionid 0x1003bc005f80007, likely client has closed socket
   [junit4]   2> 1176199 WARN  (TEST-TestSolrCloudWithSecureImpersonation.testProxyUnknownRemote-seed#[9135ED1CEA3F5160]) [    ] o.a.h.c.p.ResponseProcessCookies Invalid cookie header: "Set-Cookie: hadoop.auth="u=localHostAnyGroup&p=localHostAnyGroup&t=test&e=1517523298338&s=H2SCqzomrgolYODZTJzCp3MUzMs="; Path=/; Domain=127.0.0.1; Expires=  ., 01- . .-2561 22:14:58 GMT; HttpOnly". Invalid 'expires' attribute: ., 01- . .-2561 22:14:58 GMT
   [junit4]   2> 1176199 INFO  (TEST-TestSolrCloudWithSecureImpersonation.testProxyUnknownRemote-seed#[9135ED1CEA3F5160]) [    ] o.a.s.SolrTestCaseJ4 ###Ending testProxyUnknownRemote
   [junit4]   2> 1176198 WARN  (jetty-launcher-1977-thread-2-SendThread(127.0.0.1:58506)) [n:127.0.0.1:48706_solr    ] o.a.z.ClientCnxn Client session timed out, have not heard from server in 17252ms for sessionid 0x1003bc005f80008
   [junit4]   2> 1176203 INFO  (OverseerCollectionConfigSetProcessor-72123289957826565-127.0.0.1:59765_solr-n_0000000000) [n:127.0.0.1:59765_solr    ] o.a.s.c.OverseerTaskQueue Response ZK path: /overseer/collection-queue-work/qnr-0000000000 doesn't exist.  Requestor may have disconnected from ZooKeeper
   [junit4]   2> 1176204 WARN  (NIOServerCxn.Factory:0.0.0.0/0.0.0.0:0) [    ] o.a.z.s.NIOServerCnxn Unable to read additional data from client sessionid 0x1003bc005f80008, likely client has closed socket
   [junit4]   2> 1176305 WARN  (zkConnectionManagerCallback-2008-thread-1) [    ] o.a.s.c.c.ConnectionManager Watcher org.apache.solr.common.cloud.ConnectionManager@235f94e name: ZooKeeperConnection Watcher:127.0.0.1:58506/solr got event WatchedEvent state:Disconnected type:None path:null path: null type: None
   [junit4]   2> 1176305 WARN  (zkConnectionManagerCallback-2008-thread-1) [    ] o.a.s.c.c.ConnectionManager zkClient has disconnected
   [junit4]   2> 1176309 INFO  (jetty-closer-1978-thread-1) [    ] o.e.j.s.AbstractConnector Stopped ServerConnector@38712084{HTTP/1.1,[http/1.1]}{127.0.0.1:0}
   [junit4]   2> 1176335 INFO  (jetty-closer-1978-thread-1) [    ] o.a.s.c.CoreContainer Shutting down CoreContainer instance=1988954940
   [junit4]   2> 1176336 INFO  (jetty-closer-1978-thread-1) [    ] o.a.s.m.SolrMetricManager Closing metric reporters for registry=solr.node, tag=null
   [junit4]   2> 1176337 INFO  (jetty-closer-1978-thread-2) [    ] o.e.j.s.AbstractConnector Stopped ServerConnector@7f83e19e{HTTP/1.1,[http/1.1]}{127.0.0.1:0}
   [junit4]   2> 1176346 INFO  (jetty-closer-1978-thread-1) [    ] o.a.s.m.r.SolrJmxReporter Closing reporter [org.apache.solr.metrics.reporters.SolrJmxReporter@78ce18b4: rootName = solr_48706, domain = solr.node, service url = null, agent id = null] for registry solr.node / com.codahale.metrics.MetricRegistry@6bf6a8b9
   [junit4]   2> 1176362 INFO  (jetty-closer-1978-thread-1) [    ] o.a.s.m.SolrMetricManager Closing metric reporters for registry=solr.jvm, tag=null
   [junit4]   2> 1176362 INFO  (jetty-closer-1978-thread-1) [    ] o.a.s.m.r.SolrJmxReporter Closing reporter [org.apache.solr.metrics.reporters.SolrJmxReporter@61f9287f: rootName = solr_48706, domain = solr.jvm, service url = null, agent id = null] for registry solr.jvm / com.codahale.metrics.MetricRegistry@4c374267
   [junit4]   2> 1176366 INFO  (jetty-closer-1978-thread-1) [    ] o.a.s.m.SolrMetricManager Closing metric reporters for registry=solr.jetty, tag=null
   [junit4]   2> 1176366 INFO  (jetty-closer-1978-thread-1) [    ] o.a.s.m.r.SolrJmxReporter Closing reporter [org.apache.solr.metrics.reporters.SolrJmxReporter@29607302: rootName = solr_48706, domain = solr.jetty, service url = null, agent id = null] for registry solr.jetty / com.codahale.metrics.MetricRegistry@1db7b2e9
   [junit4]   2> 1176369 INFO  (jetty-closer-1978-thread-2) [    ] o.a.s.c.CoreContainer Shutting down CoreContainer instance=668678898
   [junit4]   2> 1176369 INFO  (jetty-closer-1978-thread-2) [    ] o.a.s.m.SolrMetricManager Closing metric reporters for registry=solr.node, tag=null
   [junit4]   2> 1176369 INFO  (jetty-closer-1978-thread-2) [    ] o.a.s.m.r.SolrJmxReporter Closing reporter [org.apache.solr.metrics.reporters.SolrJmxReporter@48de1f35: rootName = solr_59765, domain = solr.node, service url = null, agent id = null] for registry solr.node / com.codahale.metrics.MetricRegistry@54f64cc
   [junit4]   2> 1176373 INFO  (jetty-closer-1978-thread-2) [    ] o.a.s.m.SolrMetricManager Closing metric reporters for registry=solr.jvm, tag=null
   [junit4]   2> 1176373 INFO  (jetty-closer-1978-thread-2) [    ] o.a.s.m.r.SolrJmxReporter Closing reporter [org.apache.solr.metrics.reporters.SolrJmxReporter@6a271906: rootName = solr_59765, domain = solr.jvm, service url = null, agent id = null] for registry solr.jvm / com.codahale.metrics.MetricRegistry@4c374267
   [junit4]   2> 1176376 INFO  (jetty-closer-1978-thread-2) [    ] o.a.s.m.SolrMetricManager Closing metric reporters for registry=solr.jetty, tag=null
   [junit4]   2> 1176377 INFO  (jetty-closer-1978-thread-2) [    ] o.a.s.m.r.SolrJmxReporter Closing reporter [org.apache.solr.metrics.reporters.SolrJmxReporter@2f47e850: rootName = solr_59765, domain = solr.jetty, service url = null, agent id = null] for registry solr.jetty / com.codahale.metrics.MetricRegistry@1db7b2e9
   [junit4]   2> 1176379 INFO  (jetty-closer-1978-thread-2) [    ] o.a.s.c.ZkController Remove node as live in ZooKeeper:/live_nodes/127.0.0.1:59765_solr
   [junit4]   2> 1176379 INFO  (jetty-closer-1978-thread-1) [    ] o.a.s.c.ZkController Remove node as live in ZooKeeper:/live_nodes/127.0.0.1:48706_solr
   [junit4]   2> 1176380 INFO  (jetty-closer-1978-thread-2) [    ] o.a.s.m.SolrMetricManager Closing metric reporters for registry=solr.cluster, tag=null
   [junit4]   2> 1176380 INFO  (zkCallback-1993-thread-1-processing-n:127.0.0.1:59765_solr) [n:127.0.0.1:59765_solr    ] o.a.s.c.c.ZkStateReader Updated live nodes from ZooKeeper... (2) -> (1)
   [junit4]   2> 1176385 INFO  (coreCloseExecutor-2976-thread-1) [n:127.0.0.1:59765_solr c:forwardingCollection s:shard1 r:core_node2 x:forwardingCollection_shard1_replica_n1] o.a.s.c.SolrCore [forwardingCollection_shard1_replica_n1]  CLOSING SolrCore org.apache.solr.core.SolrCore@49be8b41
   [junit4]   2> 1176385 INFO  (coreCloseExecutor-2976-thread-1) [n:127.0.0.1:59765_solr c:forwardingCollection s:shard1 r:core_node2 x:forwardingCollection_shard1_replica_n1] o.a.s.m.SolrMetricManager Closing metric reporters for registry=solr.core.forwardingCollection.shard1.replica_n1, tag=1237224257
   [junit4]   2> 1176385 INFO  (coreCloseExecutor-2976-thread-1) [n:127.0.0.1:59765_solr c:forwardingCollection s:shard1 r:core_node2 x:forwardingCollection_shard1_replica_n1] o.a.s.m.r.SolrJmxReporter Closing reporter [org.apache.solr.metrics.reporters.SolrJmxReporter@287339b4: rootName = solr_59765, domain = solr.core.forwardingCollection.shard1.replica_n1, service url = null, agent id = null] for registry solr.core.forwardingCollection.shard1.replica_n1 / com.codahale.metrics.MetricRegistry@5f6e7f37
   [junit4]   2> 1176385 INFO  (zkCallback-1995-thread-1-processing-n:127.0.0.1:48706_solr) [n:127.0.0.1:48706_solr    ] o.a.s.c.c.ZkStateReader Updated live nodes from ZooKeeper... (2) -> (1)
   [junit4]   2> 1176388 INFO  (jetty-closer-1978-thread-1) [    ] o.a.s.m.SolrMetricManager Closing metric reporters for registry=solr.cluster, tag=null
   [junit4]   2> 1176392 ERROR (Thread[Thread-5822,5,TGRP-TestSolrCloudWithSecureImpersonation]) [n:127.0.0.1:48706_solr    ] o.a.h.s.t.d.AbstractDelegationTokenSecretManager ExpiredTokenRemover received java.lang.InterruptedException: sleep interrupted
   [junit4]   2> 1176403 INFO  (zkCallback-1993-thread-3-processing-n:127.0.0.1:59765_solr) [n:127.0.0.1:59765_solr    ] o.a.s.c.c.ZkStateReader A cluster state change: [WatchedEvent state:SyncConnected type:NodeDataChanged path:/collections/forwardingCollection/state.json] for collection [forwardingCollection] has occurred - updating... (live nodes size: [1])
   [junit4]   2> 1176404 INFO  (zkCallback-1993-thread-1-processing-n:127.0.0.1:59765_solr) [n:127.0.0.1:59765_solr    ] o.a.s.c.c.ZkStateReader Updated live nodes from ZooKeeper... (1) -> (0)
   [junit4]   2> 1176404 INFO  (zkCallback-1993-thread-2-processing-n:127.0.0.1:59765_solr) [n:127.0.0.1:59765_solr    ] o.a.s.c.c.ZkStateReader A cluster state change: [WatchedEvent state:SyncConnected type:NodeDataChanged path:/collections/forwardingCollection/state.json] for collection [forwardingCollection] has occurred - updating... (live nodes size: [0])
   [junit4]   2> 1176423 INFO  (coreCloseExecutor-2976-thread-1) [n:127.0.0.1:59765_solr c:forwardingCollection s:shard1 r:core_node2 x:forwardingCollection_shard1_replica_n1] o.a.s.m.SolrMetricManager Closing metric reporters for registry=solr.collection.forwardingCollection.shard1.leader, tag=1237224257
   [junit4]   2> 1176436 INFO  (jetty-closer-1978-thread-2) [    ] o.a.s.c.Overseer Overseer (id=72123289957826565-127.0.0.1:59765_solr-n_0000000000) closing
   [junit4]   2> 1176436 INFO  (OverseerStateUpdate-72123289957826565-127.0.0.1:59765_solr-n_0000000000) [n:127.0.0.1:59765_solr    ] o.a.s.c.Overseer Overseer Loop exiting : 127.0.0.1:59765_solr
   [junit4]   2> 1176439 WARN  (OverseerAutoScalingTriggerThread-72123289957826565-127.0.0.1:59765_solr-n_0000000000) [n:127.0.0.1:59765_solr    ] o.a.s.c.a.OverseerTriggerThread OverseerTriggerThread woken up but we are closed, exiting.
   [junit4]   2> 1176444 ERROR (Thread[Thread-5824,5,TGRP-TestSolrCloudWithSecureImpersonation]) [n:127.0.0.1:59765_solr    ] o.a.h.s.t.d.AbstractDelegationTokenSecretManager ExpiredTokenRemover received java.lang.InterruptedException: sleep interrupted
   [junit4]   2> 1177232 INFO  (jetty-closer-1978-thread-2) [    ] o.e.j.s.h.ContextHandler Stopped o.e.j.s.ServletContextHandler@59353eae{/solr,null,UNAVAILABLE}
   [junit4]   2> 1177233 INFO  (jetty-closer-1978-thread-2) [    ] o.e.j.s.session Stopped scavenging
   [junit4]   2> 1177414 INFO  (jetty-closer-1978-thread-1) [    ] o.e.j.s.h.ContextHandler Stopped o.e.j.s.ServletContextHandler@56895767{/solr,null,UNAVAILABLE}
   [junit4]   2> 1177416 INFO  (jetty-closer-1978-thread-1) [    ] o.e.j.s.session Stopped scavenging
   [junit4]   2> 1177420 ERROR (SUITE-TestSolrCloudWithSecureImpersonation-seed#[9135ED1CEA3F5160]-worker) [    ] o.a.z.s.ZooKeeperServer ZKShutdownHandler is not registered, so ZooKeeper server won't take any action on ERROR or SHUTDOWN server state changes
   [junit4]   2> 1177422 INFO  (SUITE-TestSolrCloudWithSecureImpersonation-seed#[9135ED1CEA3F5160]-worker) [    ] o.a.s.c.ZkTestServer connecting to 127.0.0.1:58506 58506
   [junit4]   2> 1179083 INFO  (Thread-5805) [    ] o.a.s.c.ZkTestServer connecting to 127.0.0.1:58506 58506
   [junit4]   2> 1179083 WARN  (Thread-5805) [    ] o.a.s.c.ZkTestServer Watch limit violations: 
   [junit4]   2> Maximum concurrent create/delete watches above limit:
   [junit4]   2> 
   [junit4]   2> 	3	/solr/aliases.json
   [junit4]   2> 	3	/solr/clusterprops.json
   [junit4]   2> 	2	/solr/security.json
   [junit4]   2> 	2	/solr/collections/forwardingCollection/terms/shard1
   [junit4]   2> 
   [junit4]   2> Maximum concurrent data watches above limit:
   [junit4]   2> 
   [junit4]   2> 	6	/solr/collections/forwardingCollection/state.json
   [junit4]   2> 	3	/solr/clusterstate.json
   [junit4]   2> 	2	/solr/security/zkdtsm/ZKDTSMRoot/ZKDTSMKeyIdRoot
   [junit4]   2> 	2	/solr/security/zkdtsm/ZKDTSMRoot/ZKDTSMMasterKeyRoot/DK_1
   [junit4]   2> 	2	/solr/security/zkdtsm/ZKDTSMRoot/ZKDTSMMasterKeyRoot/DK_3
   [junit4]   2> 	2	/solr/security/zkdtsm/ZKDTSMRoot/ZKDTSMMasterKeyRoot/DK_2
   [junit4]   2> 	2	/solr/security/zkdtsm/ZKDTSMRoot/ZKDTSMMasterKeyRoot/DK_4
   [junit4]   2> 	2	/solr/security/zkdtsm/ZKDTSMRoot/ZKDTSMSeqNumRoot
   [junit4]   2> 
   [junit4]   2> Maximum concurrent children watches above limit:
   [junit4]   2> 
   [junit4]   2> 	3	/solr/live_nodes
   [junit4]   2> 	3	/solr/collections
   [junit4]   2> 	2	/solr/security/zkdtsm/ZKDTSMRoot/ZKDTSMMasterKeyRoot
   [junit4]   2> 	2	/solr/security/zkdtsm/ZKDTSMRoot/ZKDTSMTokensRoot
   [junit4]   2> 
   [junit4]   2> 1179179 INFO  (SUITE-TestSolrCloudWithSecureImpersonation-seed#[9135ED1CEA3F5160]-worker) [    ] o.a.s.SolrTestCaseJ4 ------------------------------------------------------- Done waiting for tracked resources to be released
   [junit4]   2> Feb 01, 2018 12:15:12 PM com.carrotsearch.randomizedtesting.ThreadLeakControl checkThreadLeaks
   [junit4]   2> WARNING: Will linger awaiting termination of 2 leaked thread(s).
   [junit4]   2> Feb 01, 2018 12:15:33 PM com.carrotsearch.randomizedtesting.ThreadLeakControl checkThreadLeaks
   [junit4]   2> SEVERE: 2 threads leaked from SUITE scope at org.apache.solr.cloud.TestSolrCloudWithSecureImpersonation: 
   [junit4]   2>    1) Thread[id=12357, name=jetty-launcher-1977-thread-2-EventThread, state=TIMED_WAITING, group=TGRP-TestSolrCloudWithSecureImpersonation]
   [junit4]   2>         at sun.misc.Unsafe.park(Native Method)
   [junit4]   2>         at java.util.concurrent.locks.LockSupport.parkNanos(LockSupport.java:215)
   [junit4]   2>         at java.util.concurrent.locks.AbstractQueuedSynchronizer.doAcquireSharedNanos(AbstractQueuedSynchronizer.java:1037)
   [junit4]   2>         at java.util.concurrent.locks.AbstractQueuedSynchronizer.tryAcquireSharedNanos(AbstractQueuedSynchronizer.java:1328)
   [junit4]   2>         at java.util.concurrent.CountDownLatch.await(CountDownLatch.java:277)
   [junit4]   2>         at org.apache.curator.CuratorZookeeperClient.internalBlockUntilConnectedOrTimedOut(CuratorZookeeperClient.java:323)
   [junit4]   2>         at org.apache.curator.RetryLoop.callWithRetry(RetryLoop.java:105)
   [junit4]   2>         at org.apache.curator.framework.imps.GetDataBuilderImpl.pathInForeground(GetDataBuilderImpl.java:288)
   [junit4]   2>         at org.apache.curator.framework.imps.GetDataBuilderImpl.forPath(GetDataBuilderImpl.java:279)
   [junit4]   2>         at org.apache.curator.framework.imps.GetDataBuilderImpl.forPath(GetDataBuilderImpl.java:41)
   [junit4]   2>         at org.apache.curator.framework.recipes.shared.SharedValue.readValue(SharedValue.java:244)
   [junit4]   2>         at org.apache.curator.framework.recipes.shared.SharedValue.access$100(SharedValue.java:44)
   [junit4]   2>         at org.apache.curator.framework.recipes.shared.SharedValue$1.process(SharedValue.java:61)
   [junit4]   2>         at org.apache.curator.framework.imps.NamespaceWatcher.process(NamespaceWatcher.java:67)
   [junit4]   2>         at org.apache.zookeeper.ClientCnxn$EventThread.processEvent(ClientCnxn.java:531)
   [junit4]   2>         at org.apache.zookeeper.ClientCnxn$EventThread.run(ClientCnxn.java:506)
   [junit4]   2>    2) Thread[id=12352, name=jetty-launcher-1977-thread-1-EventThread, state=TIMED_WAITING, group=TGRP-TestSolrCloudWithSecureImpersonation]
   [junit4]   2>         at sun.misc.Unsafe.park(Native Method)
   [junit4]   2>         at java.util.concurrent.locks.LockSupport.parkNanos(LockSupport.java:215)
   [junit4]   2>         at java.util.concurrent.locks.AbstractQueuedSynchronizer.doAcquireSharedNanos(AbstractQueuedSynchronizer.java:1037)
   [junit4]   2>         at java.util.concurrent.locks.AbstractQueuedSynchronizer.tryAcquireSharedNanos(AbstractQueuedSynchronizer.java:1328)
   [junit4]   2>         at java.util.concurrent.CountDownLatch.await(CountDownLatch.java:277)
   [junit4]   2>         at org.apache.curator.CuratorZookeeperClient.internalBlockUntilConnectedOrTimedOut(CuratorZookeeperClient.java:323)
   [junit4]   2>         at org.apache.curator.RetryLoop.callWithRetry(RetryLoop.java:105)
   [junit4]   2>         at org.apache.curator.framework.imps.GetDataBuilderImpl.pathInForeground(GetDataBuilderImpl.java:288)
   [junit4]   2>         at org.apache.curator.framework.imps.GetDataBuilderImpl.forPath(GetDataBuilderImpl.java:279)
   [junit4]   2>         at org.apache.curator.framework.imps.GetDataBuilderImpl.forPath(GetDataBuilderImpl.java:41)
   [junit4]   2>         at org.apache.curator.framework.recipes.shared.SharedValue.readValue(SharedValue.java:244)
   [junit4]   2>         at org.apache.curator.framework.recipes.shared.SharedValue.access$100(SharedValue.java:44)
   [junit4]   2>         at org.apache.curator.framework.recipes.shared.SharedValue$1.process(SharedValue.java:61)
   [junit4]   2>         at org.apache.curator.framework.imps.NamespaceWatcher.process(NamespaceWatcher.java:67)
   [junit4]   2>         at org.apache.zookeeper.ClientCnxn$EventThread.processEvent(ClientCnxn.java:531)
   [junit4]   2>         at org.apache.zookeeper.ClientCnxn$EventThread.run(ClientCnxn.java:506)
   [junit4]   2> Feb 01, 2018 12:15:33 PM com.carrotsearch.randomizedtesting.ThreadLeakControl tryToInterruptAll
   [junit4]   2> INFO: Starting to interrupt leaked threads:
   [junit4]   2>    1) Thread[id=12357, name=jetty-launcher-1977-thread-2-EventThread, state=TIMED_WAITING, group=TGRP-TestSolrCloudWithSecureImpersonation]
   [junit4]   2>    2) Thread[id=12352, name=jetty-launcher-1977-thread-1-EventThread, state=TIMED_WAITING, group=TGRP-TestSolrCloudWithSecureImpersonation]
   [junit4]   2> 1199362 ERROR (jetty-launcher-1977-thread-1-EventThread) [n:127.0.0.1:59765_solr    ] o.a.c.f.i.CuratorFrameworkImpl Watcher exception
   [junit4]   2> java.lang.InterruptedException
   [junit4]   2> 	at java.util.concurrent.locks.AbstractQueuedSynchronizer.doAcquireSharedNanos(AbstractQueuedSynchronizer.java:1039)
   [junit4]   2> 	at java.util.concurrent.locks.AbstractQueuedSynchronizer.tryAcquireSharedNanos(AbstractQueuedSynchronizer.java:1328)
   [junit4]   2> 	at java.util.concurrent.CountDownLatch.await(CountDownLatch.java:277)
   [junit4]   2> 	at org.apache.curator.CuratorZookeeperClient.internalBlockUntilConnectedOrTimedOut(CuratorZookeeperClient.java:323)
   [junit4]   2> 	at org.apache.curator.RetryLoop.callWithRetry(RetryLoop.java:105)
   [junit4]   2> 	at org.apache.curator.framework.imps.GetDataBuilderImpl.pathInForeground(GetDataBuilderImpl.java:288)
   [junit4]   2> 	at org.apache.curator.framework.imps.GetDataBuilderImpl.forPath(GetDataBuilderImpl.java:279)
   [junit4]   2> 	at org.apache.curator.framework.imps.GetDataBuilderImpl.forPath(GetDataBuilderImpl.java:41)
   [junit4]   2> 	at org.apache.curator.framework.recipes.shared.SharedValue.readValue(SharedValue.java:244)
   [junit4]   2> 	at org.apache.curator.framework.recipes.shared.SharedValue.access$100(SharedValue.java:44)
   [junit4]   2> 	at org.apache.curator.framework.recipes.shared.SharedValue$1.process(SharedValue.java:61)
   [junit4]   2> 	at org.apache.curator.framework.imps.NamespaceWatcher.process(NamespaceWatcher.java:67)
   [junit4]   2> 	at org.apache.zookeeper.ClientCnxn$EventThread.processEvent(ClientCnxn.java:531)
   [junit4]   2> 	at org.apache.zookeeper.ClientCnxn$EventThread.run(ClientCnxn.java:506)
   [junit4]   2> 1199362 ERROR (jetty-launcher-1977-thread-2-EventThread) [n:127.0.0.1:48706_solr    ] o.a.c.f.i.CuratorFrameworkImpl Watcher exception
   [junit4]   2> java.lang.InterruptedException
   [junit4]   2> 	at java.util.concurrent.locks.AbstractQueuedSynchronizer.doAcquireSharedNanos(AbstractQueuedSynchronizer.java:1039)
   [junit4]   2> 	at java.util.concurrent.locks.AbstractQueuedSynchronizer.tryAcquireSharedNanos(AbstractQueuedSynchronizer.java:1328)
   [junit4]   2> 	at java.util.concurrent.CountDownLatch.await(CountDownLatch.java:277)
   [junit4]   2> 	at org.apache.curator.CuratorZookeeperClient.internalBlockUntilConnectedOrTimedOut(CuratorZookeeperClient.java:323)
   [junit4]   2> 	at org.apache.curator.RetryLoop.callWithRetry(RetryLoop.java:105)
   [junit4]   2> 	at org.apache.curator.framework.imps.GetDataBuilderImpl.pathInForeground(GetDataBuilderImpl.java:288)
   [junit4]   2> 	at org.apache.curator.framework.imps.GetDataBuilderImpl.forPath(GetDataBuilderImpl.java:279)
   [junit4]   2> 	at org.apache.curator.framework.imps.GetDataBuilderImpl.forPath(GetDataBuilderImpl.java:41)
   [junit4]   2> 	at org.apache.curator.framework.recipes.shared.SharedValue.readValue(SharedValue.java:244)
   [junit4]   2> 	at org.apache.curator.framework.recipes.shared.SharedValue.access$100(SharedValue.java:44)
   [junit4]   2> 	at org.apache.curator.framework.recipes.shared.SharedValue$1.process(SharedValue.java:61)
   [junit4]   2> 	at org.apache.curator.framework.imps.NamespaceWatcher.process(NamespaceWatcher.java:67)
   [junit4]   2> 	at org.apache.zookeeper.ClientCnxn$EventThread.processEvent(ClientCnxn.java:531)
   [junit4]   2> 	at org.apache.zookeeper.ClientCnxn$EventThread.run(ClientCnxn.java:506)
   [junit4]   2> Feb 01, 2018 12:15:33 PM com.carrotsearch.randomizedtesting.ThreadLeakControl tryToInterruptAll
   [junit4]   2> INFO: All leaked threads terminated.
   [junit4]   2> NOTE: test params are: codec=CheapBastard, sim=Asserting(org.apache.lucene.search.similarities.AssertingSimilarity@6715ea67), locale=th-TH, timezone=Iran
   [junit4]   2> NOTE: SunOS 5.11 amd64/Oracle Corporation 1.8.0_152 (64-bit)/cpus=3,threads=1,free=118689056,total=516947968
   [junit4]   2> NOTE: All tests run in this JVM: [TestSolrConfigHandlerConcurrent, CollectionStateFormat2Test, TestCSVLoader, PeerSyncTest, TestDocTermOrds, SpellPossibilityIteratorTest, LargeFieldTest, TestConfigSetsAPI, TestMacroExpander, CheckHdfsIndexTest, NodeLostTriggerTest, ReplaceNodeNoTargetTest, JavabinLoaderTest, UpdateLogTest, TestSizeLimitedDistributedMap, SolrXmlInZkTest, TestConfigOverlay, TestExportWriter, TestMiniSolrCloudClusterSSL, TestHashQParserPlugin, ReturnFieldsTest, CoreAdminHandlerTest, TestRecoveryHdfs, PropertiesRequestHandlerTest, ChaosMonkeyNothingIsSafeTest, TestSortByMinMaxFunction, TestSolrQueryParser, SolrShardReporterTest, UtilsToolTest, TestAnalyzeInfixSuggestions, TestSolrCLIRunExample, TestCrossCoreJoin, HdfsBasicDistributedZk2Test, TestStressReorder, TestSolrDeletionPolicy2, MultiThreadedOCPTest, DocValuesTest, BooleanFieldTest, TestIntervalFaceting, AnalysisErrorHandlingTest, LoggingHandlerTest, LeaderFailureAfterFreshStartTest, TestManagedResourceStorage, RecoveryAfterSoftCommitTest, TestJettySolrRunner, TestDownShardTolerantSearch, TemplateUpdateProcessorTest, DocValuesMultiTest, RegexBoostProcessorTest, TestDeleteCollectionOnDownNodes, TestClusterStateMutator, TestUninvertingReader, TestFieldCacheSortRandom, DistributedSpellCheckComponentTest, TestMissingGroups, DebugComponentTest, DeleteLastCustomShardedReplicaTest, LegacyCloudClusterPropTest, TestRequestStatusCollectionAPI, TestRuleBasedAuthorizationPlugin, BasicAuthStandaloneTest, DistributedFacetPivotLargeTest, TestBlobHandler, ConjunctionSolrSpellCheckerTest, BaseCdcrDistributedZkTest, TestSearcherReuse, TestConfigSetProperties, MissingSegmentRecoveryTest, XsltUpdateRequestHandlerTest, CSVRequestHandlerTest, TestLuceneMatchVersion, TestSolrCloudWithSecureImpersonation]
   [junit4]   2> NOTE: reproduce with: ant test  -Dtestcase=TestSolrCloudWithSecureImpersonation -Dtests.seed=9135ED1CEA3F5160 -Dtests.slow=true -Dtests.locale=th-TH -Dtests.timezone=Iran -Dtests.asserts=true -Dtests.file.encoding=US-ASCII
   [junit4] ERROR   0.00s J1 | TestSolrCloudWithSecureImpersonation (suite) <<<
   [junit4]    > Throwable #1: com.carrotsearch.randomizedtesting.ThreadLeakError: 2 threads leaked from SUITE scope at org.apache.solr.cloud.TestSolrCloudWithSecureImpersonation: 
   [junit4]    >    1) Thread[id=12357, name=jetty-launcher-1977-thread-2-EventThread, state=TIMED_WAITING, group=TGRP-TestSolrCloudWithSecureImpersonation]
   [junit4]    >         at sun.misc.Unsafe.park(Native Method)
   [junit4]    >         at java.util.concurrent.locks.LockSupport.parkNanos(LockSupport.java:215)
   [junit4]    >         at java.util.concurrent.locks.AbstractQueuedSynchronizer.doAcquireSharedNanos(AbstractQueuedSynchronizer.java:1037)
   [junit4]    >         at java.util.concurrent.locks.AbstractQueuedSynchronizer.tryAcquireSharedNanos(AbstractQueuedSynchronizer.java:1328)
   [junit4]    >         at java.util.concurrent.CountDownLatch.await(CountDownLatch.java:277)
   [junit4]    >         at org.apache.curator.CuratorZookeeperClient.internalBlockUntilConnectedOrTimedOut(CuratorZookeeperClient.java:323)
   [junit4]    >         at org.apache.curator.RetryLoop.callWithRetry(RetryLoop.java:105)
   [junit4]    >         at org.apache.curator.framework.imps.GetDataBuilderImpl.pathInForeground(GetDataBuilderImpl.java:288)
   [junit4]    >         at org.apache.curator.framework.imps.GetDataBuilderImpl.forPath(GetDataBuilderImpl.java:279)
   [junit4]    >         at org.apache.curator.framework.imps.GetDataBuilderImpl.forPath(GetDataBuilderImpl.java:41)
   [junit4]    >         at org.apache.curator.framework.recipes.shared.SharedValue.readValue(SharedValue.java:244)
   [junit4]    >         at org.apache.curator.framework.recipes.shared.SharedValue.access$100(SharedValue.java:44)
   [junit4]    >         at org.apache.curator.framework.recipes.shared.SharedValue$1.process(SharedValue.java:61)
   [junit4]    >         at org.apache.curator.framework.imps.NamespaceWatcher.process(NamespaceWatcher.java:67)
   [junit4]    >         at org.apache.zookeeper.ClientCnxn$EventThread.processEvent(ClientCnxn.java:531)
   [junit4]    >         at org.apache.zookeeper.ClientCnxn$EventThread.run(ClientCnxn.java:506)
   [junit4]    >    2) Thread[id=12352, name=jetty-launcher-1977-thread-1-EventThread, state=TIMED_WAITING, group=TGRP-TestSolrCloudWithSecureImpersonation]
   [junit4]    >         at sun.misc.Unsafe.park(Native Method)
   [junit4]    >         at java.util.concurrent.locks.LockSupport.parkNanos(LockSupport.java:215)
   [junit4]    >         at java.util.concurrent.locks.AbstractQueuedSynchronizer.doAcquireSharedNanos(AbstractQueuedSynchronizer.java:1037)
   [junit4]    >         at java.util.concurrent.locks.AbstractQueuedSynchronizer.tryAcquireSharedNanos(AbstractQueuedSynchronizer.java:1328)
   [junit4]    >         at java.util.concurrent.CountDownLatch.await(CountDownLatch.java:277)
   [junit4]    >         at org.apache.curator.CuratorZookeeperClient.internalBlockUntilConnectedOrTimedOut(CuratorZookeeperClient.java:323)
   [junit4]    >         at org.apache.curator.RetryLoop.callWithRetry(RetryLoop.java:105)
   [junit4]    >         at org.apache.curator.framework.imps.GetDataBuilderImpl.pathInForeground(GetDataBuilderImpl.java:288)
   [junit4]    >         at org.apache.curator.framework.imps.GetDataBuilderImpl.forPath(GetDataBuilderImpl.java:279)
   [junit4]    >         at org.apache.curator.framework.imps.GetDataBuilderImpl.forPath(GetDataBuilderImpl.java:41)
   [junit4]    >         at org.apache.curator.framework.recipes.shared.SharedValue.readValue(SharedValue.java:244)
   [junit4]    >         at org.apache.curator.framework.recipes.shared.SharedValue.access$100(SharedValue.java:44)
   [junit4]    >         at org.apache.curator.framework.recipes.shared.SharedValue$1.process(SharedValue.java:61)
   [junit4]    >         at org.apache.curator.framework.imps.NamespaceWatcher.process(NamespaceWatcher.java:67)
   [junit4]    >         at org.apache.zookeeper.ClientCnxn$EventThread.processEvent(ClientCnxn.java:531)
   [junit4]    >         at org.apache.zookeeper.ClientCnxn$EventThread.run(ClientCnxn.java:506)
   [junit4]    > 	at __randomizedtesting.SeedInfo.seed([9135ED1CEA3F5160]:0)
   [junit4] Completed [145/774 (1!)] on J1 in 41.71s, 12 tests, 1 error <<< FAILURES!

[...truncated 50272 lines...]

Mime
View raw message