lucene-dev mailing list archives

Site index · List index
Message view « Date » · « Thread »
Top « Date » · « Thread »
From Apache Jenkins Server <jenk...@builds.apache.org>
Subject [JENKINS] Lucene-Solr-Tests-master - Build # 2386 - Still Unstable
Date Tue, 27 Feb 2018 16:46:34 GMT
Build: https://builds.apache.org/job/Lucene-Solr-Tests-master/2386/

9 tests failed.
FAILED:  org.apache.solr.cloud.TestAuthenticationFramework.testBasics

Error Message:
Error from server at http://127.0.0.1:59533/solr/testcollection_shard1_replica_n2: Expected mime type application/octet-stream but got text/html. <html> <head> <meta http-equiv="Content-Type" content="text/html;charset=utf-8"/> <title>Error 404 Can not find: /solr/testcollection_shard1_replica_n2/update</title> </head> <body><h2>HTTP ERROR 404</h2> <p>Problem accessing /solr/testcollection_shard1_replica_n2/update. Reason: <pre>    Can not find: /solr/testcollection_shard1_replica_n2/update</pre></p><hr><a href="http://eclipse.org/jetty">Powered by Jetty:// 9.4.8.v20171121</a><hr/>  </body> </html> 

Stack Trace:
org.apache.solr.client.solrj.impl.CloudSolrClient$RouteException: Error from server at http://127.0.0.1:59533/solr/testcollection_shard1_replica_n2: Expected mime type application/octet-stream but got text/html. <html>
<head>
<meta http-equiv="Content-Type" content="text/html;charset=utf-8"/>
<title>Error 404 Can not find: /solr/testcollection_shard1_replica_n2/update</title>
</head>
<body><h2>HTTP ERROR 404</h2>
<p>Problem accessing /solr/testcollection_shard1_replica_n2/update. Reason:
<pre>    Can not find: /solr/testcollection_shard1_replica_n2/update</pre></p><hr><a href="http://eclipse.org/jetty">Powered by Jetty:// 9.4.8.v20171121</a><hr/>

</body>
</html>

	at __randomizedtesting.SeedInfo.seed([B199F550DA2D3A63:8C415B7CE2C36413]:0)
	at org.apache.solr.client.solrj.impl.CloudSolrClient.directUpdate(CloudSolrClient.java:550)
	at org.apache.solr.client.solrj.impl.CloudSolrClient.sendRequest(CloudSolrClient.java:1013)
	at org.apache.solr.client.solrj.impl.CloudSolrClient.requestWithRetryOnStaleState(CloudSolrClient.java:884)
	at org.apache.solr.client.solrj.impl.CloudSolrClient.requestWithRetryOnStaleState(CloudSolrClient.java:946)
	at org.apache.solr.client.solrj.impl.CloudSolrClient.requestWithRetryOnStaleState(CloudSolrClient.java:946)
	at org.apache.solr.client.solrj.impl.CloudSolrClient.requestWithRetryOnStaleState(CloudSolrClient.java:946)
	at org.apache.solr.client.solrj.impl.CloudSolrClient.requestWithRetryOnStaleState(CloudSolrClient.java:946)
	at org.apache.solr.client.solrj.impl.CloudSolrClient.requestWithRetryOnStaleState(CloudSolrClient.java:946)
	at org.apache.solr.client.solrj.impl.CloudSolrClient.request(CloudSolrClient.java:817)
	at org.apache.solr.client.solrj.SolrRequest.process(SolrRequest.java:194)
	at org.apache.solr.client.solrj.request.UpdateRequest.commit(UpdateRequest.java:233)
	at org.apache.solr.cloud.TestAuthenticationFramework.collectionCreateSearchDeleteTwice(TestAuthenticationFramework.java:127)
	at org.apache.solr.cloud.TestAuthenticationFramework.testBasics(TestAuthenticationFramework.java:75)
	at sun.reflect.NativeMethodAccessorImpl.invoke0(Native Method)
	at sun.reflect.NativeMethodAccessorImpl.invoke(NativeMethodAccessorImpl.java:62)
	at sun.reflect.DelegatingMethodAccessorImpl.invoke(DelegatingMethodAccessorImpl.java:43)
	at java.lang.reflect.Method.invoke(Method.java:498)
	at com.carrotsearch.randomizedtesting.RandomizedRunner.invoke(RandomizedRunner.java:1737)
	at com.carrotsearch.randomizedtesting.RandomizedRunner$8.evaluate(RandomizedRunner.java:934)
	at com.carrotsearch.randomizedtesting.RandomizedRunner$9.evaluate(RandomizedRunner.java:970)
	at com.carrotsearch.randomizedtesting.RandomizedRunner$10.evaluate(RandomizedRunner.java:984)
	at com.carrotsearch.randomizedtesting.rules.SystemPropertiesRestoreRule$1.evaluate(SystemPropertiesRestoreRule.java:57)
	at org.apache.lucene.util.TestRuleSetupTeardownChained$1.evaluate(TestRuleSetupTeardownChained.java:49)
	at org.apache.lucene.util.AbstractBeforeAfterRule$1.evaluate(AbstractBeforeAfterRule.java:45)
	at org.apache.lucene.util.TestRuleThreadAndTestName$1.evaluate(TestRuleThreadAndTestName.java:48)
	at org.apache.lucene.util.TestRuleIgnoreAfterMaxFailures$1.evaluate(TestRuleIgnoreAfterMaxFailures.java:64)
	at org.apache.lucene.util.TestRuleMarkFailure$1.evaluate(TestRuleMarkFailure.java:47)
	at com.carrotsearch.randomizedtesting.rules.StatementAdapter.evaluate(StatementAdapter.java:36)
	at com.carrotsearch.randomizedtesting.ThreadLeakControl$StatementRunner.run(ThreadLeakControl.java:368)
	at com.carrotsearch.randomizedtesting.ThreadLeakControl.forkTimeoutingTask(ThreadLeakControl.java:817)
	at com.carrotsearch.randomizedtesting.ThreadLeakControl$3.evaluate(ThreadLeakControl.java:468)
	at com.carrotsearch.randomizedtesting.RandomizedRunner.runSingleTest(RandomizedRunner.java:943)
	at com.carrotsearch.randomizedtesting.RandomizedRunner$5.evaluate(RandomizedRunner.java:829)
	at com.carrotsearch.randomizedtesting.RandomizedRunner$6.evaluate(RandomizedRunner.java:879)
	at com.carrotsearch.randomizedtesting.RandomizedRunner$7.evaluate(RandomizedRunner.java:890)
	at com.carrotsearch.randomizedtesting.rules.StatementAdapter.evaluate(StatementAdapter.java:36)
	at com.carrotsearch.randomizedtesting.rules.SystemPropertiesRestoreRule$1.evaluate(SystemPropertiesRestoreRule.java:57)
	at org.apache.lucene.util.AbstractBeforeAfterRule$1.evaluate(AbstractBeforeAfterRule.java:45)
	at com.carrotsearch.randomizedtesting.rules.StatementAdapter.evaluate(StatementAdapter.java:36)
	at org.apache.lucene.util.TestRuleStoreClassName$1.evaluate(TestRuleStoreClassName.java:41)
	at com.carrotsearch.randomizedtesting.rules.NoShadowingOrOverridesOnMethodsRule$1.evaluate(NoShadowingOrOverridesOnMethodsRule.java:40)
	at com.carrotsearch.randomizedtesting.rules.NoShadowingOrOverridesOnMethodsRule$1.evaluate(NoShadowingOrOverridesOnMethodsRule.java:40)
	at com.carrotsearch.randomizedtesting.rules.StatementAdapter.evaluate(StatementAdapter.java:36)
	at com.carrotsearch.randomizedtesting.rules.StatementAdapter.evaluate(StatementAdapter.java:36)
	at com.carrotsearch.randomizedtesting.rules.StatementAdapter.evaluate(StatementAdapter.java:36)
	at org.apache.lucene.util.TestRuleAssertionsRequired$1.evaluate(TestRuleAssertionsRequired.java:53)
	at org.apache.lucene.util.TestRuleMarkFailure$1.evaluate(TestRuleMarkFailure.java:47)
	at org.apache.lucene.util.TestRuleIgnoreAfterMaxFailures$1.evaluate(TestRuleIgnoreAfterMaxFailures.java:64)
	at org.apache.lucene.util.TestRuleIgnoreTestSuites$1.evaluate(TestRuleIgnoreTestSuites.java:54)
	at com.carrotsearch.randomizedtesting.rules.StatementAdapter.evaluate(StatementAdapter.java:36)
	at com.carrotsearch.randomizedtesting.ThreadLeakControl$StatementRunner.run(ThreadLeakControl.java:368)
	at java.lang.Thread.run(Thread.java:748)
Caused by: org.apache.solr.client.solrj.impl.HttpSolrClient$RemoteSolrException: Error from server at http://127.0.0.1:59533/solr/testcollection_shard1_replica_n2: Expected mime type application/octet-stream but got text/html. <html>
<head>
<meta http-equiv="Content-Type" content="text/html;charset=utf-8"/>
<title>Error 404 Can not find: /solr/testcollection_shard1_replica_n2/update</title>
</head>
<body><h2>HTTP ERROR 404</h2>
<p>Problem accessing /solr/testcollection_shard1_replica_n2/update. Reason:
<pre>    Can not find: /solr/testcollection_shard1_replica_n2/update</pre></p><hr><a href="http://eclipse.org/jetty">Powered by Jetty:// 9.4.8.v20171121</a><hr/>

</body>
</html>

	at org.apache.solr.client.solrj.impl.HttpSolrClient.executeMethod(HttpSolrClient.java:607)
	at org.apache.solr.client.solrj.impl.HttpSolrClient.request(HttpSolrClient.java:255)
	at org.apache.solr.client.solrj.impl.HttpSolrClient.request(HttpSolrClient.java:244)
	at org.apache.solr.client.solrj.impl.LBHttpSolrClient.doRequest(LBHttpSolrClient.java:483)
	at org.apache.solr.client.solrj.impl.LBHttpSolrClient.request(LBHttpSolrClient.java:413)
	at org.apache.solr.client.solrj.impl.CloudSolrClient.lambda$directUpdate$0(CloudSolrClient.java:527)
	at java.util.concurrent.FutureTask.run(FutureTask.java:266)
	at org.apache.solr.common.util.ExecutorUtil$MDCAwareThreadPoolExecutor.lambda$execute$0(ExecutorUtil.java:188)
	at java.util.concurrent.ThreadPoolExecutor.runWorker(ThreadPoolExecutor.java:1149)
	at java.util.concurrent.ThreadPoolExecutor$Worker.run(ThreadPoolExecutor.java:624)
	... 1 more


FAILED:  org.apache.solr.cloud.TestUtilizeNode.test

Error Message:
no replica should be present in  127.0.0.1:37350_solr

Stack Trace:
java.lang.AssertionError: no replica should be present in  127.0.0.1:37350_solr
	at __randomizedtesting.SeedInfo.seed([B199F550DA2D3A63:39CDCA8A74D1579B]:0)
	at org.junit.Assert.fail(Assert.java:93)
	at org.junit.Assert.assertTrue(Assert.java:43)
	at org.apache.solr.cloud.TestUtilizeNode.test(TestUtilizeNode.java:100)
	at sun.reflect.NativeMethodAccessorImpl.invoke0(Native Method)
	at sun.reflect.NativeMethodAccessorImpl.invoke(NativeMethodAccessorImpl.java:62)
	at sun.reflect.DelegatingMethodAccessorImpl.invoke(DelegatingMethodAccessorImpl.java:43)
	at java.lang.reflect.Method.invoke(Method.java:498)
	at com.carrotsearch.randomizedtesting.RandomizedRunner.invoke(RandomizedRunner.java:1737)
	at com.carrotsearch.randomizedtesting.RandomizedRunner$8.evaluate(RandomizedRunner.java:934)
	at com.carrotsearch.randomizedtesting.RandomizedRunner$9.evaluate(RandomizedRunner.java:970)
	at com.carrotsearch.randomizedtesting.RandomizedRunner$10.evaluate(RandomizedRunner.java:984)
	at com.carrotsearch.randomizedtesting.rules.SystemPropertiesRestoreRule$1.evaluate(SystemPropertiesRestoreRule.java:57)
	at org.apache.lucene.util.TestRuleSetupTeardownChained$1.evaluate(TestRuleSetupTeardownChained.java:49)
	at org.apache.lucene.util.AbstractBeforeAfterRule$1.evaluate(AbstractBeforeAfterRule.java:45)
	at org.apache.lucene.util.TestRuleThreadAndTestName$1.evaluate(TestRuleThreadAndTestName.java:48)
	at org.apache.lucene.util.TestRuleIgnoreAfterMaxFailures$1.evaluate(TestRuleIgnoreAfterMaxFailures.java:64)
	at org.apache.lucene.util.TestRuleMarkFailure$1.evaluate(TestRuleMarkFailure.java:47)
	at com.carrotsearch.randomizedtesting.rules.StatementAdapter.evaluate(StatementAdapter.java:36)
	at com.carrotsearch.randomizedtesting.ThreadLeakControl$StatementRunner.run(ThreadLeakControl.java:368)
	at com.carrotsearch.randomizedtesting.ThreadLeakControl.forkTimeoutingTask(ThreadLeakControl.java:817)
	at com.carrotsearch.randomizedtesting.ThreadLeakControl$3.evaluate(ThreadLeakControl.java:468)
	at com.carrotsearch.randomizedtesting.RandomizedRunner.runSingleTest(RandomizedRunner.java:943)
	at com.carrotsearch.randomizedtesting.RandomizedRunner$5.evaluate(RandomizedRunner.java:829)
	at com.carrotsearch.randomizedtesting.RandomizedRunner$6.evaluate(RandomizedRunner.java:879)
	at com.carrotsearch.randomizedtesting.RandomizedRunner$7.evaluate(RandomizedRunner.java:890)
	at com.carrotsearch.randomizedtesting.rules.StatementAdapter.evaluate(StatementAdapter.java:36)
	at com.carrotsearch.randomizedtesting.rules.SystemPropertiesRestoreRule$1.evaluate(SystemPropertiesRestoreRule.java:57)
	at org.apache.lucene.util.AbstractBeforeAfterRule$1.evaluate(AbstractBeforeAfterRule.java:45)
	at com.carrotsearch.randomizedtesting.rules.StatementAdapter.evaluate(StatementAdapter.java:36)
	at org.apache.lucene.util.TestRuleStoreClassName$1.evaluate(TestRuleStoreClassName.java:41)
	at com.carrotsearch.randomizedtesting.rules.NoShadowingOrOverridesOnMethodsRule$1.evaluate(NoShadowingOrOverridesOnMethodsRule.java:40)
	at com.carrotsearch.randomizedtesting.rules.NoShadowingOrOverridesOnMethodsRule$1.evaluate(NoShadowingOrOverridesOnMethodsRule.java:40)
	at com.carrotsearch.randomizedtesting.rules.StatementAdapter.evaluate(StatementAdapter.java:36)
	at com.carrotsearch.randomizedtesting.rules.StatementAdapter.evaluate(StatementAdapter.java:36)
	at com.carrotsearch.randomizedtesting.rules.StatementAdapter.evaluate(StatementAdapter.java:36)
	at org.apache.lucene.util.TestRuleAssertionsRequired$1.evaluate(TestRuleAssertionsRequired.java:53)
	at org.apache.lucene.util.TestRuleMarkFailure$1.evaluate(TestRuleMarkFailure.java:47)
	at org.apache.lucene.util.TestRuleIgnoreAfterMaxFailures$1.evaluate(TestRuleIgnoreAfterMaxFailures.java:64)
	at org.apache.lucene.util.TestRuleIgnoreTestSuites$1.evaluate(TestRuleIgnoreTestSuites.java:54)
	at com.carrotsearch.randomizedtesting.rules.StatementAdapter.evaluate(StatementAdapter.java:36)
	at com.carrotsearch.randomizedtesting.ThreadLeakControl$StatementRunner.run(ThreadLeakControl.java:368)
	at java.lang.Thread.run(Thread.java:748)


FAILED:  junit.framework.TestSuite.org.apache.solr.cloud.SSLMigrationTest

Error Message:
ObjectTracker found 2 object(s) that were not released!!! [InternalHttpClient, InternalHttpClient] org.apache.solr.common.util.ObjectReleaseTracker$ObjectTrackerException: org.apache.http.impl.client.InternalHttpClient  at org.apache.solr.common.util.ObjectReleaseTracker.track(ObjectReleaseTracker.java:42)  at org.apache.solr.client.solrj.impl.HttpClientUtil.createClient(HttpClientUtil.java:289)  at org.apache.solr.client.solrj.impl.HttpClientUtil.createClient(HttpClientUtil.java:298)  at org.apache.solr.client.solrj.impl.HttpClientUtil.createClient(HttpClientUtil.java:236)  at org.apache.solr.client.solrj.impl.HttpClientUtil.createClient(HttpClientUtil.java:223)  at org.apache.solr.client.solrj.impl.LBHttpSolrClient.constructClient(LBHttpSolrClient.java:292)  at org.apache.solr.client.solrj.impl.LBHttpSolrClient.<init>(LBHttpSolrClient.java:270)  at org.apache.solr.client.solrj.impl.LBHttpSolrClient$Builder.build(LBHttpSolrClient.java:967)  at org.apache.solr.SolrTestCaseJ4.getLBHttpSolrClient(SolrTestCaseJ4.java:2473)  at org.apache.solr.cloud.SSLMigrationTest.setUrlScheme(SSLMigrationTest.java:132)  at org.apache.solr.cloud.SSLMigrationTest.testMigrateSSL(SSLMigrationTest.java:66)  at org.apache.solr.cloud.SSLMigrationTest.test(SSLMigrationTest.java:61)  at sun.reflect.NativeMethodAccessorImpl.invoke0(Native Method)  at sun.reflect.NativeMethodAccessorImpl.invoke(NativeMethodAccessorImpl.java:62)  at sun.reflect.DelegatingMethodAccessorImpl.invoke(DelegatingMethodAccessorImpl.java:43)  at java.lang.reflect.Method.invoke(Method.java:498)  at com.carrotsearch.randomizedtesting.RandomizedRunner.invoke(RandomizedRunner.java:1737)  at com.carrotsearch.randomizedtesting.RandomizedRunner$8.evaluate(RandomizedRunner.java:934)  at com.carrotsearch.randomizedtesting.RandomizedRunner$9.evaluate(RandomizedRunner.java:970)  at com.carrotsearch.randomizedtesting.RandomizedRunner$10.evaluate(RandomizedRunner.java:984)  at org.apache.solr.BaseDistributedSearchTestCase$ShardsRepeatRule$ShardsFixedStatement.callStatement(BaseDistributedSearchTestCase.java:993)  at org.apache.solr.BaseDistributedSearchTestCase$ShardsRepeatRule$ShardsStatement.evaluate(BaseDistributedSearchTestCase.java:968)  at com.carrotsearch.randomizedtesting.rules.SystemPropertiesRestoreRule$1.evaluate(SystemPropertiesRestoreRule.java:57)  at org.apache.lucene.util.TestRuleSetupTeardownChained$1.evaluate(TestRuleSetupTeardownChained.java:49)  at org.apache.lucene.util.AbstractBeforeAfterRule$1.evaluate(AbstractBeforeAfterRule.java:45)  at org.apache.lucene.util.TestRuleThreadAndTestName$1.evaluate(TestRuleThreadAndTestName.java:48)  at org.apache.lucene.util.TestRuleIgnoreAfterMaxFailures$1.evaluate(TestRuleIgnoreAfterMaxFailures.java:64)  at org.apache.lucene.util.TestRuleMarkFailure$1.evaluate(TestRuleMarkFailure.java:47)  at com.carrotsearch.randomizedtesting.rules.StatementAdapter.evaluate(StatementAdapter.java:36)  at com.carrotsearch.randomizedtesting.ThreadLeakControl$StatementRunner.run(ThreadLeakControl.java:368)  at com.carrotsearch.randomizedtesting.ThreadLeakControl.forkTimeoutingTask(ThreadLeakControl.java:817)  at com.carrotsearch.randomizedtesting.ThreadLeakControl$3.evaluate(ThreadLeakControl.java:468)  at com.carrotsearch.randomizedtesting.RandomizedRunner.runSingleTest(RandomizedRunner.java:943)  at com.carrotsearch.randomizedtesting.RandomizedRunner$5.evaluate(RandomizedRunner.java:829)  at com.carrotsearch.randomizedtesting.RandomizedRunner$6.evaluate(RandomizedRunner.java:879)  at com.carrotsearch.randomizedtesting.RandomizedRunner$7.evaluate(RandomizedRunner.java:890)  at com.carrotsearch.randomizedtesting.rules.StatementAdapter.evaluate(StatementAdapter.java:36)  at com.carrotsearch.randomizedtesting.rules.SystemPropertiesRestoreRule$1.evaluate(SystemPropertiesRestoreRule.java:57)  at org.apache.lucene.util.AbstractBeforeAfterRule$1.evaluate(AbstractBeforeAfterRule.java:45)  at com.carrotsearch.randomizedtesting.rules.StatementAdapter.evaluate(StatementAdapter.java:36)  at org.apache.lucene.util.TestRuleStoreClassName$1.evaluate(TestRuleStoreClassName.java:41)  at com.carrotsearch.randomizedtesting.rules.NoShadowingOrOverridesOnMethodsRule$1.evaluate(NoShadowingOrOverridesOnMethodsRule.java:40)  at com.carrotsearch.randomizedtesting.rules.NoShadowingOrOverridesOnMethodsRule$1.evaluate(NoShadowingOrOverridesOnMethodsRule.java:40)  at com.carrotsearch.randomizedtesting.rules.StatementAdapter.evaluate(StatementAdapter.java:36)  at com.carrotsearch.randomizedtesting.rules.StatementAdapter.evaluate(StatementAdapter.java:36)  at com.carrotsearch.randomizedtesting.rules.StatementAdapter.evaluate(StatementAdapter.java:36)  at org.apache.lucene.util.TestRuleAssertionsRequired$1.evaluate(TestRuleAssertionsRequired.java:53)  at org.apache.lucene.util.TestRuleMarkFailure$1.evaluate(TestRuleMarkFailure.java:47)  at org.apache.lucene.util.TestRuleIgnoreAfterMaxFailures$1.evaluate(TestRuleIgnoreAfterMaxFailures.java:64)  at org.apache.lucene.util.TestRuleIgnoreTestSuites$1.evaluate(TestRuleIgnoreTestSuites.java:54)  at com.carrotsearch.randomizedtesting.rules.StatementAdapter.evaluate(StatementAdapter.java:36)  at com.carrotsearch.randomizedtesting.ThreadLeakControl$StatementRunner.run(ThreadLeakControl.java:368)  at java.lang.Thread.run(Thread.java:748)  org.apache.solr.common.util.ObjectReleaseTracker$ObjectTrackerException: org.apache.http.impl.client.InternalHttpClient  at org.apache.solr.common.util.ObjectReleaseTracker.track(ObjectReleaseTracker.java:42)  at org.apache.solr.client.solrj.impl.HttpClientUtil.createClient(HttpClientUtil.java:289)  at org.apache.solr.client.solrj.impl.HttpClientUtil.createClient(HttpClientUtil.java:298)  at org.apache.solr.client.solrj.impl.HttpClientUtil.createClient(HttpClientUtil.java:236)  at org.apache.solr.client.solrj.impl.HttpClientUtil.createClient(HttpClientUtil.java:223)  at org.apache.solr.client.solrj.impl.LBHttpSolrClient.constructClient(LBHttpSolrClient.java:292)  at org.apache.solr.client.solrj.impl.LBHttpSolrClient.<init>(LBHttpSolrClient.java:270)  at org.apache.solr.client.solrj.impl.LBHttpSolrClient$Builder.build(LBHttpSolrClient.java:967)  at org.apache.solr.SolrTestCaseJ4.getLBHttpSolrClient(SolrTestCaseJ4.java:2473)  at org.apache.solr.cloud.SSLMigrationTest.setUrlScheme(SSLMigrationTest.java:132)  at org.apache.solr.cloud.SSLMigrationTest.testMigrateSSL(SSLMigrationTest.java:66)  at org.apache.solr.cloud.SSLMigrationTest.test(SSLMigrationTest.java:60)  at sun.reflect.NativeMethodAccessorImpl.invoke0(Native Method)  at sun.reflect.NativeMethodAccessorImpl.invoke(NativeMethodAccessorImpl.java:62)  at sun.reflect.DelegatingMethodAccessorImpl.invoke(DelegatingMethodAccessorImpl.java:43)  at java.lang.reflect.Method.invoke(Method.java:498)  at com.carrotsearch.randomizedtesting.RandomizedRunner.invoke(RandomizedRunner.java:1737)  at com.carrotsearch.randomizedtesting.RandomizedRunner$8.evaluate(RandomizedRunner.java:934)  at com.carrotsearch.randomizedtesting.RandomizedRunner$9.evaluate(RandomizedRunner.java:970)  at com.carrotsearch.randomizedtesting.RandomizedRunner$10.evaluate(RandomizedRunner.java:984)  at org.apache.solr.BaseDistributedSearchTestCase$ShardsRepeatRule$ShardsFixedStatement.callStatement(BaseDistributedSearchTestCase.java:993)  at org.apache.solr.BaseDistributedSearchTestCase$ShardsRepeatRule$ShardsStatement.evaluate(BaseDistributedSearchTestCase.java:968)  at com.carrotsearch.randomizedtesting.rules.SystemPropertiesRestoreRule$1.evaluate(SystemPropertiesRestoreRule.java:57)  at org.apache.lucene.util.TestRuleSetupTeardownChained$1.evaluate(TestRuleSetupTeardownChained.java:49)  at org.apache.lucene.util.AbstractBeforeAfterRule$1.evaluate(AbstractBeforeAfterRule.java:45)  at org.apache.lucene.util.TestRuleThreadAndTestName$1.evaluate(TestRuleThreadAndTestName.java:48)  at org.apache.lucene.util.TestRuleIgnoreAfterMaxFailures$1.evaluate(TestRuleIgnoreAfterMaxFailures.java:64)  at org.apache.lucene.util.TestRuleMarkFailure$1.evaluate(TestRuleMarkFailure.java:47)  at com.carrotsearch.randomizedtesting.rules.StatementAdapter.evaluate(StatementAdapter.java:36)  at com.carrotsearch.randomizedtesting.ThreadLeakControl$StatementRunner.run(ThreadLeakControl.java:368)  at com.carrotsearch.randomizedtesting.ThreadLeakControl.forkTimeoutingTask(ThreadLeakControl.java:817)  at com.carrotsearch.randomizedtesting.ThreadLeakControl$3.evaluate(ThreadLeakControl.java:468)  at com.carrotsearch.randomizedtesting.RandomizedRunner.runSingleTest(RandomizedRunner.java:943)  at com.carrotsearch.randomizedtesting.RandomizedRunner$5.evaluate(RandomizedRunner.java:829)  at com.carrotsearch.randomizedtesting.RandomizedRunner$6.evaluate(RandomizedRunner.java:879)  at com.carrotsearch.randomizedtesting.RandomizedRunner$7.evaluate(RandomizedRunner.java:890)  at com.carrotsearch.randomizedtesting.rules.StatementAdapter.evaluate(StatementAdapter.java:36)  at com.carrotsearch.randomizedtesting.rules.SystemPropertiesRestoreRule$1.evaluate(SystemPropertiesRestoreRule.java:57)  at org.apache.lucene.util.AbstractBeforeAfterRule$1.evaluate(AbstractBeforeAfterRule.java:45)  at com.carrotsearch.randomizedtesting.rules.StatementAdapter.evaluate(StatementAdapter.java:36)  at org.apache.lucene.util.TestRuleStoreClassName$1.evaluate(TestRuleStoreClassName.java:41)  at com.carrotsearch.randomizedtesting.rules.NoShadowingOrOverridesOnMethodsRule$1.evaluate(NoShadowingOrOverridesOnMethodsRule.java:40)  at com.carrotsearch.randomizedtesting.rules.NoShadowingOrOverridesOnMethodsRule$1.evaluate(NoShadowingOrOverridesOnMethodsRule.java:40)  at com.carrotsearch.randomizedtesting.rules.StatementAdapter.evaluate(StatementAdapter.java:36)  at com.carrotsearch.randomizedtesting.rules.StatementAdapter.evaluate(StatementAdapter.java:36)  at com.carrotsearch.randomizedtesting.rules.StatementAdapter.evaluate(StatementAdapter.java:36)  at org.apache.lucene.util.TestRuleAssertionsRequired$1.evaluate(TestRuleAssertionsRequired.java:53)  at org.apache.lucene.util.TestRuleMarkFailure$1.evaluate(TestRuleMarkFailure.java:47)  at org.apache.lucene.util.TestRuleIgnoreAfterMaxFailures$1.evaluate(TestRuleIgnoreAfterMaxFailures.java:64)  at org.apache.lucene.util.TestRuleIgnoreTestSuites$1.evaluate(TestRuleIgnoreTestSuites.java:54)  at com.carrotsearch.randomizedtesting.rules.StatementAdapter.evaluate(StatementAdapter.java:36)  at com.carrotsearch.randomizedtesting.ThreadLeakControl$StatementRunner.run(ThreadLeakControl.java:368)  at java.lang.Thread.run(Thread.java:748)  

Stack Trace:
java.lang.AssertionError: ObjectTracker found 2 object(s) that were not released!!! [InternalHttpClient, InternalHttpClient]
org.apache.solr.common.util.ObjectReleaseTracker$ObjectTrackerException: org.apache.http.impl.client.InternalHttpClient
	at org.apache.solr.common.util.ObjectReleaseTracker.track(ObjectReleaseTracker.java:42)
	at org.apache.solr.client.solrj.impl.HttpClientUtil.createClient(HttpClientUtil.java:289)
	at org.apache.solr.client.solrj.impl.HttpClientUtil.createClient(HttpClientUtil.java:298)
	at org.apache.solr.client.solrj.impl.HttpClientUtil.createClient(HttpClientUtil.java:236)
	at org.apache.solr.client.solrj.impl.HttpClientUtil.createClient(HttpClientUtil.java:223)
	at org.apache.solr.client.solrj.impl.LBHttpSolrClient.constructClient(LBHttpSolrClient.java:292)
	at org.apache.solr.client.solrj.impl.LBHttpSolrClient.<init>(LBHttpSolrClient.java:270)
	at org.apache.solr.client.solrj.impl.LBHttpSolrClient$Builder.build(LBHttpSolrClient.java:967)
	at org.apache.solr.SolrTestCaseJ4.getLBHttpSolrClient(SolrTestCaseJ4.java:2473)
	at org.apache.solr.cloud.SSLMigrationTest.setUrlScheme(SSLMigrationTest.java:132)
	at org.apache.solr.cloud.SSLMigrationTest.testMigrateSSL(SSLMigrationTest.java:66)
	at org.apache.solr.cloud.SSLMigrationTest.test(SSLMigrationTest.java:61)
	at sun.reflect.NativeMethodAccessorImpl.invoke0(Native Method)
	at sun.reflect.NativeMethodAccessorImpl.invoke(NativeMethodAccessorImpl.java:62)
	at sun.reflect.DelegatingMethodAccessorImpl.invoke(DelegatingMethodAccessorImpl.java:43)
	at java.lang.reflect.Method.invoke(Method.java:498)
	at com.carrotsearch.randomizedtesting.RandomizedRunner.invoke(RandomizedRunner.java:1737)
	at com.carrotsearch.randomizedtesting.RandomizedRunner$8.evaluate(RandomizedRunner.java:934)
	at com.carrotsearch.randomizedtesting.RandomizedRunner$9.evaluate(RandomizedRunner.java:970)
	at com.carrotsearch.randomizedtesting.RandomizedRunner$10.evaluate(RandomizedRunner.java:984)
	at org.apache.solr.BaseDistributedSearchTestCase$ShardsRepeatRule$ShardsFixedStatement.callStatement(BaseDistributedSearchTestCase.java:993)
	at org.apache.solr.BaseDistributedSearchTestCase$ShardsRepeatRule$ShardsStatement.evaluate(BaseDistributedSearchTestCase.java:968)
	at com.carrotsearch.randomizedtesting.rules.SystemPropertiesRestoreRule$1.evaluate(SystemPropertiesRestoreRule.java:57)
	at org.apache.lucene.util.TestRuleSetupTeardownChained$1.evaluate(TestRuleSetupTeardownChained.java:49)
	at org.apache.lucene.util.AbstractBeforeAfterRule$1.evaluate(AbstractBeforeAfterRule.java:45)
	at org.apache.lucene.util.TestRuleThreadAndTestName$1.evaluate(TestRuleThreadAndTestName.java:48)
	at org.apache.lucene.util.TestRuleIgnoreAfterMaxFailures$1.evaluate(TestRuleIgnoreAfterMaxFailures.java:64)
	at org.apache.lucene.util.TestRuleMarkFailure$1.evaluate(TestRuleMarkFailure.java:47)
	at com.carrotsearch.randomizedtesting.rules.StatementAdapter.evaluate(StatementAdapter.java:36)
	at com.carrotsearch.randomizedtesting.ThreadLeakControl$StatementRunner.run(ThreadLeakControl.java:368)
	at com.carrotsearch.randomizedtesting.ThreadLeakControl.forkTimeoutingTask(ThreadLeakControl.java:817)
	at com.carrotsearch.randomizedtesting.ThreadLeakControl$3.evaluate(ThreadLeakControl.java:468)
	at com.carrotsearch.randomizedtesting.RandomizedRunner.runSingleTest(RandomizedRunner.java:943)
	at com.carrotsearch.randomizedtesting.RandomizedRunner$5.evaluate(RandomizedRunner.java:829)
	at com.carrotsearch.randomizedtesting.RandomizedRunner$6.evaluate(RandomizedRunner.java:879)
	at com.carrotsearch.randomizedtesting.RandomizedRunner$7.evaluate(RandomizedRunner.java:890)
	at com.carrotsearch.randomizedtesting.rules.StatementAdapter.evaluate(StatementAdapter.java:36)
	at com.carrotsearch.randomizedtesting.rules.SystemPropertiesRestoreRule$1.evaluate(SystemPropertiesRestoreRule.java:57)
	at org.apache.lucene.util.AbstractBeforeAfterRule$1.evaluate(AbstractBeforeAfterRule.java:45)
	at com.carrotsearch.randomizedtesting.rules.StatementAdapter.evaluate(StatementAdapter.java:36)
	at org.apache.lucene.util.TestRuleStoreClassName$1.evaluate(TestRuleStoreClassName.java:41)
	at com.carrotsearch.randomizedtesting.rules.NoShadowingOrOverridesOnMethodsRule$1.evaluate(NoShadowingOrOverridesOnMethodsRule.java:40)
	at com.carrotsearch.randomizedtesting.rules.NoShadowingOrOverridesOnMethodsRule$1.evaluate(NoShadowingOrOverridesOnMethodsRule.java:40)
	at com.carrotsearch.randomizedtesting.rules.StatementAdapter.evaluate(StatementAdapter.java:36)
	at com.carrotsearch.randomizedtesting.rules.StatementAdapter.evaluate(StatementAdapter.java:36)
	at com.carrotsearch.randomizedtesting.rules.StatementAdapter.evaluate(StatementAdapter.java:36)
	at org.apache.lucene.util.TestRuleAssertionsRequired$1.evaluate(TestRuleAssertionsRequired.java:53)
	at org.apache.lucene.util.TestRuleMarkFailure$1.evaluate(TestRuleMarkFailure.java:47)
	at org.apache.lucene.util.TestRuleIgnoreAfterMaxFailures$1.evaluate(TestRuleIgnoreAfterMaxFailures.java:64)
	at org.apache.lucene.util.TestRuleIgnoreTestSuites$1.evaluate(TestRuleIgnoreTestSuites.java:54)
	at com.carrotsearch.randomizedtesting.rules.StatementAdapter.evaluate(StatementAdapter.java:36)
	at com.carrotsearch.randomizedtesting.ThreadLeakControl$StatementRunner.run(ThreadLeakControl.java:368)
	at java.lang.Thread.run(Thread.java:748)

org.apache.solr.common.util.ObjectReleaseTracker$ObjectTrackerException: org.apache.http.impl.client.InternalHttpClient
	at org.apache.solr.common.util.ObjectReleaseTracker.track(ObjectReleaseTracker.java:42)
	at org.apache.solr.client.solrj.impl.HttpClientUtil.createClient(HttpClientUtil.java:289)
	at org.apache.solr.client.solrj.impl.HttpClientUtil.createClient(HttpClientUtil.java:298)
	at org.apache.solr.client.solrj.impl.HttpClientUtil.createClient(HttpClientUtil.java:236)
	at org.apache.solr.client.solrj.impl.HttpClientUtil.createClient(HttpClientUtil.java:223)
	at org.apache.solr.client.solrj.impl.LBHttpSolrClient.constructClient(LBHttpSolrClient.java:292)
	at org.apache.solr.client.solrj.impl.LBHttpSolrClient.<init>(LBHttpSolrClient.java:270)
	at org.apache.solr.client.solrj.impl.LBHttpSolrClient$Builder.build(LBHttpSolrClient.java:967)
	at org.apache.solr.SolrTestCaseJ4.getLBHttpSolrClient(SolrTestCaseJ4.java:2473)
	at org.apache.solr.cloud.SSLMigrationTest.setUrlScheme(SSLMigrationTest.java:132)
	at org.apache.solr.cloud.SSLMigrationTest.testMigrateSSL(SSLMigrationTest.java:66)
	at org.apache.solr.cloud.SSLMigrationTest.test(SSLMigrationTest.java:60)
	at sun.reflect.NativeMethodAccessorImpl.invoke0(Native Method)
	at sun.reflect.NativeMethodAccessorImpl.invoke(NativeMethodAccessorImpl.java:62)
	at sun.reflect.DelegatingMethodAccessorImpl.invoke(DelegatingMethodAccessorImpl.java:43)
	at java.lang.reflect.Method.invoke(Method.java:498)
	at com.carrotsearch.randomizedtesting.RandomizedRunner.invoke(RandomizedRunner.java:1737)
	at com.carrotsearch.randomizedtesting.RandomizedRunner$8.evaluate(RandomizedRunner.java:934)
	at com.carrotsearch.randomizedtesting.RandomizedRunner$9.evaluate(RandomizedRunner.java:970)
	at com.carrotsearch.randomizedtesting.RandomizedRunner$10.evaluate(RandomizedRunner.java:984)
	at org.apache.solr.BaseDistributedSearchTestCase$ShardsRepeatRule$ShardsFixedStatement.callStatement(BaseDistributedSearchTestCase.java:993)
	at org.apache.solr.BaseDistributedSearchTestCase$ShardsRepeatRule$ShardsStatement.evaluate(BaseDistributedSearchTestCase.java:968)
	at com.carrotsearch.randomizedtesting.rules.SystemPropertiesRestoreRule$1.evaluate(SystemPropertiesRestoreRule.java:57)
	at org.apache.lucene.util.TestRuleSetupTeardownChained$1.evaluate(TestRuleSetupTeardownChained.java:49)
	at org.apache.lucene.util.AbstractBeforeAfterRule$1.evaluate(AbstractBeforeAfterRule.java:45)
	at org.apache.lucene.util.TestRuleThreadAndTestName$1.evaluate(TestRuleThreadAndTestName.java:48)
	at org.apache.lucene.util.TestRuleIgnoreAfterMaxFailures$1.evaluate(TestRuleIgnoreAfterMaxFailures.java:64)
	at org.apache.lucene.util.TestRuleMarkFailure$1.evaluate(TestRuleMarkFailure.java:47)
	at com.carrotsearch.randomizedtesting.rules.StatementAdapter.evaluate(StatementAdapter.java:36)
	at com.carrotsearch.randomizedtesting.ThreadLeakControl$StatementRunner.run(ThreadLeakControl.java:368)
	at com.carrotsearch.randomizedtesting.ThreadLeakControl.forkTimeoutingTask(ThreadLeakControl.java:817)
	at com.carrotsearch.randomizedtesting.ThreadLeakControl$3.evaluate(ThreadLeakControl.java:468)
	at com.carrotsearch.randomizedtesting.RandomizedRunner.runSingleTest(RandomizedRunner.java:943)
	at com.carrotsearch.randomizedtesting.RandomizedRunner$5.evaluate(RandomizedRunner.java:829)
	at com.carrotsearch.randomizedtesting.RandomizedRunner$6.evaluate(RandomizedRunner.java:879)
	at com.carrotsearch.randomizedtesting.RandomizedRunner$7.evaluate(RandomizedRunner.java:890)
	at com.carrotsearch.randomizedtesting.rules.StatementAdapter.evaluate(StatementAdapter.java:36)
	at com.carrotsearch.randomizedtesting.rules.SystemPropertiesRestoreRule$1.evaluate(SystemPropertiesRestoreRule.java:57)
	at org.apache.lucene.util.AbstractBeforeAfterRule$1.evaluate(AbstractBeforeAfterRule.java:45)
	at com.carrotsearch.randomizedtesting.rules.StatementAdapter.evaluate(StatementAdapter.java:36)
	at org.apache.lucene.util.TestRuleStoreClassName$1.evaluate(TestRuleStoreClassName.java:41)
	at com.carrotsearch.randomizedtesting.rules.NoShadowingOrOverridesOnMethodsRule$1.evaluate(NoShadowingOrOverridesOnMethodsRule.java:40)
	at com.carrotsearch.randomizedtesting.rules.NoShadowingOrOverridesOnMethodsRule$1.evaluate(NoShadowingOrOverridesOnMethodsRule.java:40)
	at com.carrotsearch.randomizedtesting.rules.StatementAdapter.evaluate(StatementAdapter.java:36)
	at com.carrotsearch.randomizedtesting.rules.StatementAdapter.evaluate(StatementAdapter.java:36)
	at com.carrotsearch.randomizedtesting.rules.StatementAdapter.evaluate(StatementAdapter.java:36)
	at org.apache.lucene.util.TestRuleAssertionsRequired$1.evaluate(TestRuleAssertionsRequired.java:53)
	at org.apache.lucene.util.TestRuleMarkFailure$1.evaluate(TestRuleMarkFailure.java:47)
	at org.apache.lucene.util.TestRuleIgnoreAfterMaxFailures$1.evaluate(TestRuleIgnoreAfterMaxFailures.java:64)
	at org.apache.lucene.util.TestRuleIgnoreTestSuites$1.evaluate(TestRuleIgnoreTestSuites.java:54)
	at com.carrotsearch.randomizedtesting.rules.StatementAdapter.evaluate(StatementAdapter.java:36)
	at com.carrotsearch.randomizedtesting.ThreadLeakControl$StatementRunner.run(ThreadLeakControl.java:368)
	at java.lang.Thread.run(Thread.java:748)


	at __randomizedtesting.SeedInfo.seed([B199F550DA2D3A63]:0)
	at org.junit.Assert.fail(Assert.java:93)
	at org.junit.Assert.assertTrue(Assert.java:43)
	at org.junit.Assert.assertNull(Assert.java:551)
	at org.apache.solr.SolrTestCaseJ4.teardownTestCases(SolrTestCaseJ4.java:297)
	at sun.reflect.GeneratedMethodAccessor137.invoke(Unknown Source)
	at sun.reflect.DelegatingMethodAccessorImpl.invoke(DelegatingMethodAccessorImpl.java:43)
	at java.lang.reflect.Method.invoke(Method.java:498)
	at com.carrotsearch.randomizedtesting.RandomizedRunner.invoke(RandomizedRunner.java:1737)
	at com.carrotsearch.randomizedtesting.RandomizedRunner$7.evaluate(RandomizedRunner.java:897)
	at com.carrotsearch.randomizedtesting.rules.StatementAdapter.evaluate(StatementAdapter.java:36)
	at com.carrotsearch.randomizedtesting.rules.SystemPropertiesRestoreRule$1.evaluate(SystemPropertiesRestoreRule.java:57)
	at org.apache.lucene.util.AbstractBeforeAfterRule$1.evaluate(AbstractBeforeAfterRule.java:45)
	at com.carrotsearch.randomizedtesting.rules.StatementAdapter.evaluate(StatementAdapter.java:36)
	at org.apache.lucene.util.TestRuleStoreClassName$1.evaluate(TestRuleStoreClassName.java:41)
	at com.carrotsearch.randomizedtesting.rules.NoShadowingOrOverridesOnMethodsRule$1.evaluate(NoShadowingOrOverridesOnMethodsRule.java:40)
	at com.carrotsearch.randomizedtesting.rules.NoShadowingOrOverridesOnMethodsRule$1.evaluate(NoShadowingOrOverridesOnMethodsRule.java:40)
	at com.carrotsearch.randomizedtesting.rules.StatementAdapter.evaluate(StatementAdapter.java:36)
	at com.carrotsearch.randomizedtesting.rules.StatementAdapter.evaluate(StatementAdapter.java:36)
	at com.carrotsearch.randomizedtesting.rules.StatementAdapter.evaluate(StatementAdapter.java:36)
	at org.apache.lucene.util.TestRuleAssertionsRequired$1.evaluate(TestRuleAssertionsRequired.java:53)
	at org.apache.lucene.util.TestRuleMarkFailure$1.evaluate(TestRuleMarkFailure.java:47)
	at org.apache.lucene.util.TestRuleIgnoreAfterMaxFailures$1.evaluate(TestRuleIgnoreAfterMaxFailures.java:64)
	at org.apache.lucene.util.TestRuleIgnoreTestSuites$1.evaluate(TestRuleIgnoreTestSuites.java:54)
	at com.carrotsearch.randomizedtesting.rules.StatementAdapter.evaluate(StatementAdapter.java:36)
	at com.carrotsearch.randomizedtesting.ThreadLeakControl$StatementRunner.run(ThreadLeakControl.java:368)
	at java.lang.Thread.run(Thread.java:748)


FAILED:  junit.framework.TestSuite.org.apache.solr.cloud.SSLMigrationTest

Error Message:
2 threads leaked from SUITE scope at org.apache.solr.cloud.SSLMigrationTest:     1) Thread[id=20554, name=Connection evictor, state=TIMED_WAITING, group=TGRP-SSLMigrationTest]         at java.lang.Thread.sleep(Native Method)         at org.apache.http.impl.client.IdleConnectionEvictor$1.run(IdleConnectionEvictor.java:66)         at java.lang.Thread.run(Thread.java:748)    2) Thread[id=20694, name=Connection evictor, state=TIMED_WAITING, group=TGRP-SSLMigrationTest]         at java.lang.Thread.sleep(Native Method)         at org.apache.http.impl.client.IdleConnectionEvictor$1.run(IdleConnectionEvictor.java:66)         at java.lang.Thread.run(Thread.java:748)

Stack Trace:
com.carrotsearch.randomizedtesting.ThreadLeakError: 2 threads leaked from SUITE scope at org.apache.solr.cloud.SSLMigrationTest: 
   1) Thread[id=20554, name=Connection evictor, state=TIMED_WAITING, group=TGRP-SSLMigrationTest]
        at java.lang.Thread.sleep(Native Method)
        at org.apache.http.impl.client.IdleConnectionEvictor$1.run(IdleConnectionEvictor.java:66)
        at java.lang.Thread.run(Thread.java:748)
   2) Thread[id=20694, name=Connection evictor, state=TIMED_WAITING, group=TGRP-SSLMigrationTest]
        at java.lang.Thread.sleep(Native Method)
        at org.apache.http.impl.client.IdleConnectionEvictor$1.run(IdleConnectionEvictor.java:66)
        at java.lang.Thread.run(Thread.java:748)
	at __randomizedtesting.SeedInfo.seed([B199F550DA2D3A63]:0)


FAILED:  org.apache.solr.ltr.TestLTRReRankingPipeline.testDifferentTopN

Error Message:
expected:<1.0> but was:<0.0>

Stack Trace:
java.lang.AssertionError: expected:<1.0> but was:<0.0>
	at __randomizedtesting.SeedInfo.seed([B4FF1E3DB83E88C7:455E6C6D8D854255]:0)
	at org.junit.Assert.fail(Assert.java:93)
	at org.junit.Assert.failNotEquals(Assert.java:647)
	at org.junit.Assert.assertEquals(Assert.java:443)
	at org.junit.Assert.assertEquals(Assert.java:512)
	at org.apache.solr.ltr.TestLTRReRankingPipeline.testDifferentTopN(TestLTRReRankingPipeline.java:256)
	at sun.reflect.NativeMethodAccessorImpl.invoke0(Native Method)
	at sun.reflect.NativeMethodAccessorImpl.invoke(NativeMethodAccessorImpl.java:62)
	at sun.reflect.DelegatingMethodAccessorImpl.invoke(DelegatingMethodAccessorImpl.java:43)
	at java.lang.reflect.Method.invoke(Method.java:498)
	at com.carrotsearch.randomizedtesting.RandomizedRunner.invoke(RandomizedRunner.java:1737)
	at com.carrotsearch.randomizedtesting.RandomizedRunner$8.evaluate(RandomizedRunner.java:934)
	at com.carrotsearch.randomizedtesting.RandomizedRunner$9.evaluate(RandomizedRunner.java:970)
	at com.carrotsearch.randomizedtesting.RandomizedRunner$10.evaluate(RandomizedRunner.java:984)
	at org.apache.lucene.util.TestRuleSetupTeardownChained$1.evaluate(TestRuleSetupTeardownChained.java:49)
	at org.apache.lucene.util.AbstractBeforeAfterRule$1.evaluate(AbstractBeforeAfterRule.java:45)
	at org.apache.lucene.util.TestRuleThreadAndTestName$1.evaluate(TestRuleThreadAndTestName.java:48)
	at org.apache.lucene.util.TestRuleIgnoreAfterMaxFailures$1.evaluate(TestRuleIgnoreAfterMaxFailures.java:64)
	at org.apache.lucene.util.TestRuleMarkFailure$1.evaluate(TestRuleMarkFailure.java:47)
	at com.carrotsearch.randomizedtesting.rules.StatementAdapter.evaluate(StatementAdapter.java:36)
	at com.carrotsearch.randomizedtesting.ThreadLeakControl$StatementRunner.run(ThreadLeakControl.java:368)
	at com.carrotsearch.randomizedtesting.ThreadLeakControl.forkTimeoutingTask(ThreadLeakControl.java:817)
	at com.carrotsearch.randomizedtesting.ThreadLeakControl$3.evaluate(ThreadLeakControl.java:468)
	at com.carrotsearch.randomizedtesting.RandomizedRunner.runSingleTest(RandomizedRunner.java:943)
	at com.carrotsearch.randomizedtesting.RandomizedRunner$5.evaluate(RandomizedRunner.java:829)
	at com.carrotsearch.randomizedtesting.RandomizedRunner$6.evaluate(RandomizedRunner.java:879)
	at com.carrotsearch.randomizedtesting.RandomizedRunner$7.evaluate(RandomizedRunner.java:890)
	at org.apache.lucene.util.AbstractBeforeAfterRule$1.evaluate(AbstractBeforeAfterRule.java:45)
	at com.carrotsearch.randomizedtesting.rules.StatementAdapter.evaluate(StatementAdapter.java:36)
	at org.apache.lucene.util.TestRuleStoreClassName$1.evaluate(TestRuleStoreClassName.java:41)
	at com.carrotsearch.randomizedtesting.rules.NoShadowingOrOverridesOnMethodsRule$1.evaluate(NoShadowingOrOverridesOnMethodsRule.java:40)
	at com.carrotsearch.randomizedtesting.rules.NoShadowingOrOverridesOnMethodsRule$1.evaluate(NoShadowingOrOverridesOnMethodsRule.java:40)
	at com.carrotsearch.randomizedtesting.rules.StatementAdapter.evaluate(StatementAdapter.java:36)
	at com.carrotsearch.randomizedtesting.rules.StatementAdapter.evaluate(StatementAdapter.java:36)
	at com.carrotsearch.randomizedtesting.rules.StatementAdapter.evaluate(StatementAdapter.java:36)
	at org.apache.lucene.util.TestRuleAssertionsRequired$1.evaluate(TestRuleAssertionsRequired.java:53)
	at org.apache.lucene.util.TestRuleMarkFailure$1.evaluate(TestRuleMarkFailure.java:47)
	at org.apache.lucene.util.TestRuleIgnoreAfterMaxFailures$1.evaluate(TestRuleIgnoreAfterMaxFailures.java:64)
	at org.apache.lucene.util.TestRuleIgnoreTestSuites$1.evaluate(TestRuleIgnoreTestSuites.java:54)
	at com.carrotsearch.randomizedtesting.rules.StatementAdapter.evaluate(StatementAdapter.java:36)
	at com.carrotsearch.randomizedtesting.ThreadLeakControl$StatementRunner.run(ThreadLeakControl.java:368)
	at java.lang.Thread.run(Thread.java:748)


FAILED:  org.apache.solr.cloud.ZkControllerTest.testPublishAndWaitForDownStates

Error Message:
The ZkController.publishAndWaitForDownStates should have timed out but it didn't

Stack Trace:
java.lang.AssertionError: The ZkController.publishAndWaitForDownStates should have timed out but it didn't
	at __randomizedtesting.SeedInfo.seed([B199F550DA2D3A63:969699BC7BBA755C]:0)
	at org.junit.Assert.fail(Assert.java:93)
	at org.junit.Assert.assertTrue(Assert.java:43)
	at org.apache.solr.cloud.ZkControllerTest.testPublishAndWaitForDownStates(ZkControllerTest.java:306)
	at sun.reflect.NativeMethodAccessorImpl.invoke0(Native Method)
	at sun.reflect.NativeMethodAccessorImpl.invoke(NativeMethodAccessorImpl.java:62)
	at sun.reflect.DelegatingMethodAccessorImpl.invoke(DelegatingMethodAccessorImpl.java:43)
	at java.lang.reflect.Method.invoke(Method.java:498)
	at com.carrotsearch.randomizedtesting.RandomizedRunner.invoke(RandomizedRunner.java:1737)
	at com.carrotsearch.randomizedtesting.RandomizedRunner$8.evaluate(RandomizedRunner.java:934)
	at com.carrotsearch.randomizedtesting.RandomizedRunner$9.evaluate(RandomizedRunner.java:970)
	at com.carrotsearch.randomizedtesting.RandomizedRunner$10.evaluate(RandomizedRunner.java:984)
	at com.carrotsearch.randomizedtesting.rules.SystemPropertiesRestoreRule$1.evaluate(SystemPropertiesRestoreRule.java:57)
	at org.apache.lucene.util.TestRuleSetupTeardownChained$1.evaluate(TestRuleSetupTeardownChained.java:49)
	at org.apache.lucene.util.AbstractBeforeAfterRule$1.evaluate(AbstractBeforeAfterRule.java:45)
	at org.apache.lucene.util.TestRuleThreadAndTestName$1.evaluate(TestRuleThreadAndTestName.java:48)
	at org.apache.lucene.util.TestRuleIgnoreAfterMaxFailures$1.evaluate(TestRuleIgnoreAfterMaxFailures.java:64)
	at org.apache.lucene.util.TestRuleMarkFailure$1.evaluate(TestRuleMarkFailure.java:47)
	at com.carrotsearch.randomizedtesting.rules.StatementAdapter.evaluate(StatementAdapter.java:36)
	at com.carrotsearch.randomizedtesting.ThreadLeakControl$StatementRunner.run(ThreadLeakControl.java:368)
	at com.carrotsearch.randomizedtesting.ThreadLeakControl.forkTimeoutingTask(ThreadLeakControl.java:817)
	at com.carrotsearch.randomizedtesting.ThreadLeakControl$3.evaluate(ThreadLeakControl.java:468)
	at com.carrotsearch.randomizedtesting.RandomizedRunner.runSingleTest(RandomizedRunner.java:943)
	at com.carrotsearch.randomizedtesting.RandomizedRunner$5.evaluate(RandomizedRunner.java:829)
	at com.carrotsearch.randomizedtesting.RandomizedRunner$6.evaluate(RandomizedRunner.java:879)
	at com.carrotsearch.randomizedtesting.RandomizedRunner$7.evaluate(RandomizedRunner.java:890)
	at com.carrotsearch.randomizedtesting.rules.StatementAdapter.evaluate(StatementAdapter.java:36)
	at com.carrotsearch.randomizedtesting.rules.SystemPropertiesRestoreRule$1.evaluate(SystemPropertiesRestoreRule.java:57)
	at org.apache.lucene.util.AbstractBeforeAfterRule$1.evaluate(AbstractBeforeAfterRule.java:45)
	at com.carrotsearch.randomizedtesting.rules.StatementAdapter.evaluate(StatementAdapter.java:36)
	at org.apache.lucene.util.TestRuleStoreClassName$1.evaluate(TestRuleStoreClassName.java:41)
	at com.carrotsearch.randomizedtesting.rules.NoShadowingOrOverridesOnMethodsRule$1.evaluate(NoShadowingOrOverridesOnMethodsRule.java:40)
	at com.carrotsearch.randomizedtesting.rules.NoShadowingOrOverridesOnMethodsRule$1.evaluate(NoShadowingOrOverridesOnMethodsRule.java:40)
	at com.carrotsearch.randomizedtesting.rules.StatementAdapter.evaluate(StatementAdapter.java:36)
	at com.carrotsearch.randomizedtesting.rules.StatementAdapter.evaluate(StatementAdapter.java:36)
	at com.carrotsearch.randomizedtesting.rules.StatementAdapter.evaluate(StatementAdapter.java:36)
	at org.apache.lucene.util.TestRuleAssertionsRequired$1.evaluate(TestRuleAssertionsRequired.java:53)
	at org.apache.lucene.util.TestRuleMarkFailure$1.evaluate(TestRuleMarkFailure.java:47)
	at org.apache.lucene.util.TestRuleIgnoreAfterMaxFailures$1.evaluate(TestRuleIgnoreAfterMaxFailures.java:64)
	at org.apache.lucene.util.TestRuleIgnoreTestSuites$1.evaluate(TestRuleIgnoreTestSuites.java:54)
	at com.carrotsearch.randomizedtesting.rules.StatementAdapter.evaluate(StatementAdapter.java:36)
	at com.carrotsearch.randomizedtesting.ThreadLeakControl$StatementRunner.run(ThreadLeakControl.java:368)
	at java.lang.Thread.run(Thread.java:748)


FAILED:  org.apache.solr.core.TestJmxIntegration.testJmxOnCoreReload

Error Message:
Number of registered MBeans is not the same as info registry size expected:<107> but was:<0>

Stack Trace:
java.lang.AssertionError: Number of registered MBeans is not the same as info registry size expected:<107> but was:<0>
	at __randomizedtesting.SeedInfo.seed([B199F550DA2D3A63:B3202E3CA96EE6AE]:0)
	at org.junit.Assert.fail(Assert.java:93)
	at org.junit.Assert.failNotEquals(Assert.java:647)
	at org.junit.Assert.assertEquals(Assert.java:128)
	at org.junit.Assert.assertEquals(Assert.java:472)
	at org.apache.solr.core.TestJmxIntegration.testJmxOnCoreReload(TestJmxIntegration.java:180)
	at sun.reflect.NativeMethodAccessorImpl.invoke0(Native Method)
	at sun.reflect.NativeMethodAccessorImpl.invoke(NativeMethodAccessorImpl.java:62)
	at sun.reflect.DelegatingMethodAccessorImpl.invoke(DelegatingMethodAccessorImpl.java:43)
	at java.lang.reflect.Method.invoke(Method.java:498)
	at com.carrotsearch.randomizedtesting.RandomizedRunner.invoke(RandomizedRunner.java:1737)
	at com.carrotsearch.randomizedtesting.RandomizedRunner$8.evaluate(RandomizedRunner.java:934)
	at com.carrotsearch.randomizedtesting.RandomizedRunner$9.evaluate(RandomizedRunner.java:970)
	at com.carrotsearch.randomizedtesting.RandomizedRunner$10.evaluate(RandomizedRunner.java:984)
	at com.carrotsearch.randomizedtesting.rules.SystemPropertiesRestoreRule$1.evaluate(SystemPropertiesRestoreRule.java:57)
	at org.apache.lucene.util.TestRuleSetupTeardownChained$1.evaluate(TestRuleSetupTeardownChained.java:49)
	at org.apache.lucene.util.AbstractBeforeAfterRule$1.evaluate(AbstractBeforeAfterRule.java:45)
	at org.apache.lucene.util.TestRuleThreadAndTestName$1.evaluate(TestRuleThreadAndTestName.java:48)
	at org.apache.lucene.util.TestRuleIgnoreAfterMaxFailures$1.evaluate(TestRuleIgnoreAfterMaxFailures.java:64)
	at org.apache.lucene.util.TestRuleMarkFailure$1.evaluate(TestRuleMarkFailure.java:47)
	at com.carrotsearch.randomizedtesting.rules.StatementAdapter.evaluate(StatementAdapter.java:36)
	at com.carrotsearch.randomizedtesting.ThreadLeakControl$StatementRunner.run(ThreadLeakControl.java:368)
	at com.carrotsearch.randomizedtesting.ThreadLeakControl.forkTimeoutingTask(ThreadLeakControl.java:817)
	at com.carrotsearch.randomizedtesting.ThreadLeakControl$3.evaluate(ThreadLeakControl.java:468)
	at com.carrotsearch.randomizedtesting.RandomizedRunner.runSingleTest(RandomizedRunner.java:943)
	at com.carrotsearch.randomizedtesting.RandomizedRunner$5.evaluate(RandomizedRunner.java:829)
	at com.carrotsearch.randomizedtesting.RandomizedRunner$6.evaluate(RandomizedRunner.java:879)
	at com.carrotsearch.randomizedtesting.RandomizedRunner$7.evaluate(RandomizedRunner.java:890)
	at com.carrotsearch.randomizedtesting.rules.StatementAdapter.evaluate(StatementAdapter.java:36)
	at com.carrotsearch.randomizedtesting.rules.SystemPropertiesRestoreRule$1.evaluate(SystemPropertiesRestoreRule.java:57)
	at org.apache.lucene.util.AbstractBeforeAfterRule$1.evaluate(AbstractBeforeAfterRule.java:45)
	at com.carrotsearch.randomizedtesting.rules.StatementAdapter.evaluate(StatementAdapter.java:36)
	at org.apache.lucene.util.TestRuleStoreClassName$1.evaluate(TestRuleStoreClassName.java:41)
	at com.carrotsearch.randomizedtesting.rules.NoShadowingOrOverridesOnMethodsRule$1.evaluate(NoShadowingOrOverridesOnMethodsRule.java:40)
	at com.carrotsearch.randomizedtesting.rules.NoShadowingOrOverridesOnMethodsRule$1.evaluate(NoShadowingOrOverridesOnMethodsRule.java:40)
	at com.carrotsearch.randomizedtesting.rules.StatementAdapter.evaluate(StatementAdapter.java:36)
	at com.carrotsearch.randomizedtesting.rules.StatementAdapter.evaluate(StatementAdapter.java:36)
	at com.carrotsearch.randomizedtesting.rules.StatementAdapter.evaluate(StatementAdapter.java:36)
	at org.apache.lucene.util.TestRuleAssertionsRequired$1.evaluate(TestRuleAssertionsRequired.java:53)
	at org.apache.lucene.util.TestRuleMarkFailure$1.evaluate(TestRuleMarkFailure.java:47)
	at org.apache.lucene.util.TestRuleIgnoreAfterMaxFailures$1.evaluate(TestRuleIgnoreAfterMaxFailures.java:64)
	at org.apache.lucene.util.TestRuleIgnoreTestSuites$1.evaluate(TestRuleIgnoreTestSuites.java:54)
	at com.carrotsearch.randomizedtesting.rules.StatementAdapter.evaluate(StatementAdapter.java:36)
	at com.carrotsearch.randomizedtesting.ThreadLeakControl$StatementRunner.run(ThreadLeakControl.java:368)
	at java.lang.Thread.run(Thread.java:748)


FAILED:  org.apache.solr.handler.TestReplicationHandler.doTestIndexFetchOnMasterRestart

Error Message:
IOException occured when talking to server at: http://127.0.0.1:35104/solr/collection1

Stack Trace:
org.apache.solr.client.solrj.SolrServerException: IOException occured when talking to server at: http://127.0.0.1:35104/solr/collection1
	at __randomizedtesting.SeedInfo.seed([B199F550DA2D3A63:696E31B471F6F83F]:0)
	at org.apache.solr.client.solrj.impl.HttpSolrClient.executeMethod(HttpSolrClient.java:657)
	at org.apache.solr.client.solrj.impl.HttpSolrClient.request(HttpSolrClient.java:255)
	at org.apache.solr.client.solrj.impl.HttpSolrClient.request(HttpSolrClient.java:244)
	at org.apache.solr.client.solrj.SolrRequest.process(SolrRequest.java:194)
	at org.apache.solr.client.solrj.SolrClient.add(SolrClient.java:173)
	at org.apache.solr.client.solrj.SolrClient.add(SolrClient.java:138)
	at org.apache.solr.client.solrj.SolrClient.add(SolrClient.java:152)
	at org.apache.solr.handler.TestReplicationHandler.index(TestReplicationHandler.java:180)
	at org.apache.solr.handler.TestReplicationHandler.doTestIndexFetchOnMasterRestart(TestReplicationHandler.java:643)
	at sun.reflect.NativeMethodAccessorImpl.invoke0(Native Method)
	at sun.reflect.NativeMethodAccessorImpl.invoke(NativeMethodAccessorImpl.java:62)
	at sun.reflect.DelegatingMethodAccessorImpl.invoke(DelegatingMethodAccessorImpl.java:43)
	at java.lang.reflect.Method.invoke(Method.java:498)
	at com.carrotsearch.randomizedtesting.RandomizedRunner.invoke(RandomizedRunner.java:1737)
	at com.carrotsearch.randomizedtesting.RandomizedRunner$8.evaluate(RandomizedRunner.java:934)
	at com.carrotsearch.randomizedtesting.RandomizedRunner$9.evaluate(RandomizedRunner.java:970)
	at com.carrotsearch.randomizedtesting.RandomizedRunner$10.evaluate(RandomizedRunner.java:984)
	at com.carrotsearch.randomizedtesting.rules.SystemPropertiesRestoreRule$1.evaluate(SystemPropertiesRestoreRule.java:57)
	at org.apache.lucene.util.TestRuleSetupTeardownChained$1.evaluate(TestRuleSetupTeardownChained.java:49)
	at org.apache.lucene.util.AbstractBeforeAfterRule$1.evaluate(AbstractBeforeAfterRule.java:45)
	at org.apache.lucene.util.TestRuleThreadAndTestName$1.evaluate(TestRuleThreadAndTestName.java:48)
	at org.apache.lucene.util.TestRuleIgnoreAfterMaxFailures$1.evaluate(TestRuleIgnoreAfterMaxFailures.java:64)
	at org.apache.lucene.util.TestRuleMarkFailure$1.evaluate(TestRuleMarkFailure.java:47)
	at com.carrotsearch.randomizedtesting.rules.StatementAdapter.evaluate(StatementAdapter.java:36)
	at com.carrotsearch.randomizedtesting.ThreadLeakControl$StatementRunner.run(ThreadLeakControl.java:368)
	at com.carrotsearch.randomizedtesting.ThreadLeakControl.forkTimeoutingTask(ThreadLeakControl.java:817)
	at com.carrotsearch.randomizedtesting.ThreadLeakControl$3.evaluate(ThreadLeakControl.java:468)
	at com.carrotsearch.randomizedtesting.RandomizedRunner.runSingleTest(RandomizedRunner.java:943)
	at com.carrotsearch.randomizedtesting.RandomizedRunner$5.evaluate(RandomizedRunner.java:829)
	at com.carrotsearch.randomizedtesting.RandomizedRunner$6.evaluate(RandomizedRunner.java:879)
	at com.carrotsearch.randomizedtesting.RandomizedRunner$7.evaluate(RandomizedRunner.java:890)
	at com.carrotsearch.randomizedtesting.rules.StatementAdapter.evaluate(StatementAdapter.java:36)
	at com.carrotsearch.randomizedtesting.rules.SystemPropertiesRestoreRule$1.evaluate(SystemPropertiesRestoreRule.java:57)
	at org.apache.lucene.util.AbstractBeforeAfterRule$1.evaluate(AbstractBeforeAfterRule.java:45)
	at com.carrotsearch.randomizedtesting.rules.StatementAdapter.evaluate(StatementAdapter.java:36)
	at org.apache.lucene.util.TestRuleStoreClassName$1.evaluate(TestRuleStoreClassName.java:41)
	at com.carrotsearch.randomizedtesting.rules.NoShadowingOrOverridesOnMethodsRule$1.evaluate(NoShadowingOrOverridesOnMethodsRule.java:40)
	at com.carrotsearch.randomizedtesting.rules.NoShadowingOrOverridesOnMethodsRule$1.evaluate(NoShadowingOrOverridesOnMethodsRule.java:40)
	at com.carrotsearch.randomizedtesting.rules.StatementAdapter.evaluate(StatementAdapter.java:36)
	at com.carrotsearch.randomizedtesting.rules.StatementAdapter.evaluate(StatementAdapter.java:36)
	at com.carrotsearch.randomizedtesting.rules.StatementAdapter.evaluate(StatementAdapter.java:36)
	at org.apache.lucene.util.TestRuleAssertionsRequired$1.evaluate(TestRuleAssertionsRequired.java:53)
	at org.apache.lucene.util.TestRuleMarkFailure$1.evaluate(TestRuleMarkFailure.java:47)
	at org.apache.lucene.util.TestRuleIgnoreAfterMaxFailures$1.evaluate(TestRuleIgnoreAfterMaxFailures.java:64)
	at org.apache.lucene.util.TestRuleIgnoreTestSuites$1.evaluate(TestRuleIgnoreTestSuites.java:54)
	at com.carrotsearch.randomizedtesting.rules.StatementAdapter.evaluate(StatementAdapter.java:36)
	at com.carrotsearch.randomizedtesting.ThreadLeakControl$StatementRunner.run(ThreadLeakControl.java:368)
	at java.lang.Thread.run(Thread.java:748)
Caused by: org.apache.http.NoHttpResponseException: 127.0.0.1:35104 failed to respond
	at org.apache.http.impl.conn.DefaultHttpResponseParser.parseHead(DefaultHttpResponseParser.java:141)
	at org.apache.http.impl.conn.DefaultHttpResponseParser.parseHead(DefaultHttpResponseParser.java:56)
	at org.apache.http.impl.io.AbstractMessageParser.parse(AbstractMessageParser.java:259)
	at org.apache.http.impl.DefaultBHttpClientConnection.receiveResponseHeader(DefaultBHttpClientConnection.java:163)
	at org.apache.http.impl.conn.CPoolProxy.receiveResponseHeader(CPoolProxy.java:165)
	at org.apache.http.protocol.HttpRequestExecutor.doReceiveResponse(HttpRequestExecutor.java:273)
	at org.apache.http.protocol.HttpRequestExecutor.execute(HttpRequestExecutor.java:125)
	at org.apache.http.impl.execchain.MainClientExec.execute(MainClientExec.java:272)
	at org.apache.http.impl.execchain.ProtocolExec.execute(ProtocolExec.java:185)
	at org.apache.http.impl.execchain.RetryExec.execute(RetryExec.java:89)
	at org.apache.http.impl.execchain.RedirectExec.execute(RedirectExec.java:111)
	at org.apache.http.impl.client.InternalHttpClient.doExecute(InternalHttpClient.java:185)
	at org.apache.http.impl.client.CloseableHttpClient.execute(CloseableHttpClient.java:83)
	at org.apache.http.impl.client.CloseableHttpClient.execute(CloseableHttpClient.java:56)
	at org.apache.solr.client.solrj.impl.HttpSolrClient.executeMethod(HttpSolrClient.java:542)
	... 47 more


FAILED:  org.apache.solr.update.processor.AtomicUpdateProcessorFactoryTest.testMultipleThreads

Error Message:
Exception during query

Stack Trace:
java.lang.RuntimeException: Exception during query
	at __randomizedtesting.SeedInfo.seed([B199F550DA2D3A63:9DAB82DD56E94CE7]:0)
	at org.apache.solr.SolrTestCaseJ4.assertQ(SolrTestCaseJ4.java:904)
	at org.apache.solr.update.processor.AtomicUpdateProcessorFactoryTest.testMultipleThreads(AtomicUpdateProcessorFactoryTest.java:260)
	at sun.reflect.NativeMethodAccessorImpl.invoke0(Native Method)
	at sun.reflect.NativeMethodAccessorImpl.invoke(NativeMethodAccessorImpl.java:62)
	at sun.reflect.DelegatingMethodAccessorImpl.invoke(DelegatingMethodAccessorImpl.java:43)
	at java.lang.reflect.Method.invoke(Method.java:498)
	at com.carrotsearch.randomizedtesting.RandomizedRunner.invoke(RandomizedRunner.java:1737)
	at com.carrotsearch.randomizedtesting.RandomizedRunner$8.evaluate(RandomizedRunner.java:934)
	at com.carrotsearch.randomizedtesting.RandomizedRunner$9.evaluate(RandomizedRunner.java:970)
	at com.carrotsearch.randomizedtesting.RandomizedRunner$10.evaluate(RandomizedRunner.java:984)
	at com.carrotsearch.randomizedtesting.rules.SystemPropertiesRestoreRule$1.evaluate(SystemPropertiesRestoreRule.java:57)
	at org.apache.lucene.util.TestRuleSetupTeardownChained$1.evaluate(TestRuleSetupTeardownChained.java:49)
	at org.apache.lucene.util.AbstractBeforeAfterRule$1.evaluate(AbstractBeforeAfterRule.java:45)
	at org.apache.lucene.util.TestRuleThreadAndTestName$1.evaluate(TestRuleThreadAndTestName.java:48)
	at org.apache.lucene.util.TestRuleIgnoreAfterMaxFailures$1.evaluate(TestRuleIgnoreAfterMaxFailures.java:64)
	at org.apache.lucene.util.TestRuleMarkFailure$1.evaluate(TestRuleMarkFailure.java:47)
	at com.carrotsearch.randomizedtesting.rules.StatementAdapter.evaluate(StatementAdapter.java:36)
	at com.carrotsearch.randomizedtesting.ThreadLeakControl$StatementRunner.run(ThreadLeakControl.java:368)
	at com.carrotsearch.randomizedtesting.ThreadLeakControl.forkTimeoutingTask(ThreadLeakControl.java:817)
	at com.carrotsearch.randomizedtesting.ThreadLeakControl$3.evaluate(ThreadLeakControl.java:468)
	at com.carrotsearch.randomizedtesting.RandomizedRunner.runSingleTest(RandomizedRunner.java:943)
	at com.carrotsearch.randomizedtesting.RandomizedRunner$5.evaluate(RandomizedRunner.java:829)
	at com.carrotsearch.randomizedtesting.RandomizedRunner$6.evaluate(RandomizedRunner.java:879)
	at com.carrotsearch.randomizedtesting.RandomizedRunner$7.evaluate(RandomizedRunner.java:890)
	at com.carrotsearch.randomizedtesting.rules.StatementAdapter.evaluate(StatementAdapter.java:36)
	at com.carrotsearch.randomizedtesting.rules.SystemPropertiesRestoreRule$1.evaluate(SystemPropertiesRestoreRule.java:57)
	at org.apache.lucene.util.AbstractBeforeAfterRule$1.evaluate(AbstractBeforeAfterRule.java:45)
	at com.carrotsearch.randomizedtesting.rules.StatementAdapter.evaluate(StatementAdapter.java:36)
	at org.apache.lucene.util.TestRuleStoreClassName$1.evaluate(TestRuleStoreClassName.java:41)
	at com.carrotsearch.randomizedtesting.rules.NoShadowingOrOverridesOnMethodsRule$1.evaluate(NoShadowingOrOverridesOnMethodsRule.java:40)
	at com.carrotsearch.randomizedtesting.rules.NoShadowingOrOverridesOnMethodsRule$1.evaluate(NoShadowingOrOverridesOnMethodsRule.java:40)
	at com.carrotsearch.randomizedtesting.rules.StatementAdapter.evaluate(StatementAdapter.java:36)
	at com.carrotsearch.randomizedtesting.rules.StatementAdapter.evaluate(StatementAdapter.java:36)
	at com.carrotsearch.randomizedtesting.rules.StatementAdapter.evaluate(StatementAdapter.java:36)
	at org.apache.lucene.util.TestRuleAssertionsRequired$1.evaluate(TestRuleAssertionsRequired.java:53)
	at org.apache.lucene.util.TestRuleMarkFailure$1.evaluate(TestRuleMarkFailure.java:47)
	at org.apache.lucene.util.TestRuleIgnoreAfterMaxFailures$1.evaluate(TestRuleIgnoreAfterMaxFailures.java:64)
	at org.apache.lucene.util.TestRuleIgnoreTestSuites$1.evaluate(TestRuleIgnoreTestSuites.java:54)
	at com.carrotsearch.randomizedtesting.rules.StatementAdapter.evaluate(StatementAdapter.java:36)
	at com.carrotsearch.randomizedtesting.ThreadLeakControl$StatementRunner.run(ThreadLeakControl.java:368)
	at java.lang.Thread.run(Thread.java:748)
Caused by: java.lang.RuntimeException: REQUEST FAILED: xpath=//result[@numFound=1]
	xml response was: <?xml version="1.0" encoding="UTF-8"?>
<response>
<lst name="responseHeader"><int name="status">0</int><int name="QTime">0</int></lst><result name="response" numFound="0" start="0"></result>
</response>

	request was:q=int_i:18&wt=xml
	at org.apache.solr.SolrTestCaseJ4.assertQ(SolrTestCaseJ4.java:897)
	... 40 more




Build Log:
[...truncated 12358 lines...]
   [junit4] Suite: org.apache.solr.cloud.TestAuthenticationFramework
   [junit4]   2> Creating dataDir: /x1/jenkins/jenkins-slave/workspace/Lucene-Solr-Tests-master/solr/build/solr-core/test/J1/temp/solr.cloud.TestAuthenticationFramework_B199F550DA2D3A63-001/init-core-data-001
   [junit4]   2> 257813 WARN  (SUITE-TestAuthenticationFramework-seed#[B199F550DA2D3A63]-worker) [    ] o.a.s.SolrTestCaseJ4 startTrackingSearchers: numOpens=4 numCloses=4
   [junit4]   2> 257814 INFO  (SUITE-TestAuthenticationFramework-seed#[B199F550DA2D3A63]-worker) [    ] o.a.s.SolrTestCaseJ4 Using PointFields (NUMERIC_POINTS_SYSPROP=true) w/NUMERIC_DOCVALUES_SYSPROP=true
   [junit4]   2> 257815 INFO  (SUITE-TestAuthenticationFramework-seed#[B199F550DA2D3A63]-worker) [    ] o.a.s.SolrTestCaseJ4 Randomized ssl (false) and clientAuth (false) via: @org.apache.solr.util.RandomizeSSL(reason=, ssl=NaN, value=NaN, clientAuth=NaN)
   [junit4]   2> 257815 INFO  (SUITE-TestAuthenticationFramework-seed#[B199F550DA2D3A63]-worker) [    ] o.a.s.SolrTestCaseJ4 SecureRandom sanity checks: test.solr.allowed.securerandom=null & java.security.egd=file:/dev/./urandom
   [junit4]   2> 257818 INFO  (TEST-TestAuthenticationFramework.testBasics-seed#[B199F550DA2D3A63]) [    ] o.a.s.c.MiniSolrCloudCluster Starting cluster of 2 servers in /x1/jenkins/jenkins-slave/workspace/Lucene-Solr-Tests-master/solr/build/solr-core/test/J1/temp/solr.cloud.TestAuthenticationFramework_B199F550DA2D3A63-001/tempDir-001
   [junit4]   2> 257818 INFO  (TEST-TestAuthenticationFramework.testBasics-seed#[B199F550DA2D3A63]) [    ] o.a.s.c.ZkTestServer STARTING ZK TEST SERVER
   [junit4]   2> 257818 INFO  (Thread-676) [    ] o.a.s.c.ZkTestServer client port:0.0.0.0/0.0.0.0:0
   [junit4]   2> 257818 INFO  (Thread-676) [    ] o.a.s.c.ZkTestServer Starting server
   [junit4]   2> 257819 ERROR (Thread-676) [    ] o.a.z.s.ZooKeeperServer ZKShutdownHandler is not registered, so ZooKeeper server won't take any action on ERROR or SHUTDOWN server state changes
   [junit4]   2> 257918 INFO  (TEST-TestAuthenticationFramework.testBasics-seed#[B199F550DA2D3A63]) [    ] o.a.s.c.ZkTestServer start zk server on port:48983
   [junit4]   2> 257920 INFO  (zkConnectionManagerCallback-544-thread-1) [    ] o.a.s.c.c.ConnectionManager zkClient has connected
   [junit4]   2> 257923 INFO  (jetty-launcher-541-thread-1) [    ] o.e.j.s.Server jetty-9.4.8.v20171121, build timestamp: 2017-11-21T19:27:37-02:00, git hash: 82b8fb23f757335bb3329d540ce37a2a2615f0a8
   [junit4]   2> 257923 INFO  (jetty-launcher-541-thread-2) [    ] o.e.j.s.Server jetty-9.4.8.v20171121, build timestamp: 2017-11-21T19:27:37-02:00, git hash: 82b8fb23f757335bb3329d540ce37a2a2615f0a8
   [junit4]   2> 257924 INFO  (jetty-launcher-541-thread-1) [    ] o.e.j.s.session DefaultSessionIdManager workerName=node0
   [junit4]   2> 257924 INFO  (jetty-launcher-541-thread-1) [    ] o.e.j.s.session No SessionScavenger set, using defaults
   [junit4]   2> 257924 INFO  (jetty-launcher-541-thread-1) [    ] o.e.j.s.session Scavenging every 660000ms
   [junit4]   2> 257924 INFO  (jetty-launcher-541-thread-2) [    ] o.e.j.s.session DefaultSessionIdManager workerName=node0
   [junit4]   2> 257924 INFO  (jetty-launcher-541-thread-2) [    ] o.e.j.s.session No SessionScavenger set, using defaults
   [junit4]   2> 257924 INFO  (jetty-launcher-541-thread-2) [    ] o.e.j.s.session Scavenging every 660000ms
   [junit4]   2> 257924 INFO  (jetty-launcher-541-thread-1) [    ] o.e.j.s.h.ContextHandler Started o.e.j.s.ServletContextHandler@7f21f2a{/solr,null,AVAILABLE}
   [junit4]   2> 257924 INFO  (jetty-launcher-541-thread-2) [    ] o.e.j.s.h.ContextHandler Started o.e.j.s.ServletContextHandler@5e901e00{/solr,null,AVAILABLE}
   [junit4]   2> 257927 INFO  (jetty-launcher-541-thread-1) [    ] o.e.j.s.AbstractConnector Started ServerConnector@62c241d9{HTTP/1.1,[http/1.1]}{127.0.0.1:56548}
   [junit4]   2> 257927 INFO  (jetty-launcher-541-thread-2) [    ] o.e.j.s.AbstractConnector Started ServerConnector@7d0a0532{HTTP/1.1,[http/1.1]}{127.0.0.1:59533}
   [junit4]   2> 257927 INFO  (jetty-launcher-541-thread-1) [    ] o.e.j.s.Server Started @260162ms
   [junit4]   2> 257927 INFO  (jetty-launcher-541-thread-2) [    ] o.e.j.s.Server Started @260162ms
   [junit4]   2> 257927 INFO  (jetty-launcher-541-thread-1) [    ] o.a.s.c.s.e.JettySolrRunner Jetty properties: {hostContext=/solr, hostPort=56548}
   [junit4]   2> 257927 INFO  (jetty-launcher-541-thread-2) [    ] o.a.s.c.s.e.JettySolrRunner Jetty properties: {hostContext=/solr, hostPort=59533}
   [junit4]   2> 257927 ERROR (jetty-launcher-541-thread-1) [    ] o.a.s.u.StartupLoggingUtils Missing Java Option solr.log.dir. Logging may be missing or incomplete.
   [junit4]   2> 257927 ERROR (jetty-launcher-541-thread-2) [    ] o.a.s.u.StartupLoggingUtils Missing Java Option solr.log.dir. Logging may be missing or incomplete.
   [junit4]   2> 257927 INFO  (jetty-launcher-541-thread-1) [    ] o.a.s.s.SolrDispatchFilter  ___      _       Welcome to Apache Solr™ version 8.0.0
   [junit4]   2> 257927 INFO  (jetty-launcher-541-thread-2) [    ] o.a.s.s.SolrDispatchFilter  ___      _       Welcome to Apache Solr™ version 8.0.0
   [junit4]   2> 257927 INFO  (jetty-launcher-541-thread-1) [    ] o.a.s.s.SolrDispatchFilter / __| ___| |_ _   Starting in cloud mode on port null
   [junit4]   2> 257927 INFO  (jetty-launcher-541-thread-2) [    ] o.a.s.s.SolrDispatchFilter / __| ___| |_ _   Starting in cloud mode on port null
   [junit4]   2> 257927 INFO  (jetty-launcher-541-thread-1) [    ] o.a.s.s.SolrDispatchFilter \__ \/ _ \ | '_|  Install dir: null
   [junit4]   2> 257927 INFO  (jetty-launcher-541-thread-2) [    ] o.a.s.s.SolrDispatchFilter \__ \/ _ \ | '_|  Install dir: null
   [junit4]   2> 257927 INFO  (jetty-launcher-541-thread-1) [    ] o.a.s.s.SolrDispatchFilter |___/\___/_|_|    Start time: 2018-02-27T15:44:42.001Z
   [junit4]   2> 257927 INFO  (jetty-launcher-541-thread-2) [    ] o.a.s.s.SolrDispatchFilter |___/\___/_|_|    Start time: 2018-02-27T15:44:42.001Z
   [junit4]   2> 257929 INFO  (zkConnectionManagerCallback-548-thread-1) [    ] o.a.s.c.c.ConnectionManager zkClient has connected
   [junit4]   2> 257929 INFO  (jetty-launcher-541-thread-2) [    ] o.a.s.s.SolrDispatchFilter solr.xml found in ZooKeeper. Loading...
   [junit4]   2> 257934 INFO  (zkConnectionManagerCallback-547-thread-1) [    ] o.a.s.c.c.ConnectionManager zkClient has connected
   [junit4]   2> 257935 INFO  (jetty-launcher-541-thread-1) [    ] o.a.s.s.SolrDispatchFilter solr.xml found in ZooKeeper. Loading...
   [junit4]   2> 257939 INFO  (jetty-launcher-541-thread-2) [    ] o.a.s.c.ZkContainer Zookeeper client=127.0.0.1:48983/solr
   [junit4]   2> 257942 INFO  (jetty-launcher-541-thread-1) [    ] o.a.s.c.ZkContainer Zookeeper client=127.0.0.1:48983/solr
   [junit4]   2> 257943 INFO  (zkConnectionManagerCallback-552-thread-1) [    ] o.a.s.c.c.ConnectionManager zkClient has connected
   [junit4]   2> 257944 INFO  (zkConnectionManagerCallback-556-thread-1) [    ] o.a.s.c.c.ConnectionManager zkClient has connected
   [junit4]   2> 257946 INFO  (zkConnectionManagerCallback-558-thread-1-processing-n:127.0.0.1:59533_solr) [n:127.0.0.1:59533_solr    ] o.a.s.c.c.ConnectionManager zkClient has connected
   [junit4]   2> 257947 INFO  (zkConnectionManagerCallback-560-thread-1-processing-n:127.0.0.1:56548_solr) [n:127.0.0.1:56548_solr    ] o.a.s.c.c.ConnectionManager zkClient has connected
   [junit4]   2> 258023 INFO  (jetty-launcher-541-thread-2) [n:127.0.0.1:59533_solr    ] o.a.s.c.Overseer Overseer (id=null) closing
   [junit4]   2> 258024 INFO  (jetty-launcher-541-thread-2) [n:127.0.0.1:59533_solr    ] o.a.s.c.OverseerElectionContext I am going to be the leader 127.0.0.1:59533_solr
   [junit4]   2> 258025 INFO  (jetty-launcher-541-thread-2) [n:127.0.0.1:59533_solr    ] o.a.s.c.Overseer Overseer (id=73368195258646533-127.0.0.1:59533_solr-n_0000000000) starting
   [junit4]   2> 258026 INFO  (jetty-launcher-541-thread-1) [n:127.0.0.1:56548_solr    ] o.a.s.c.Overseer Overseer (id=null) closing
   [junit4]   2> 258027 INFO  (jetty-launcher-541-thread-1) [n:127.0.0.1:56548_solr    ] o.a.s.c.ZkController Register node as live in ZooKeeper:/live_nodes/127.0.0.1:56548_solr
   [junit4]   2> 258038 INFO  (zkCallback-557-thread-1-processing-n:127.0.0.1:59533_solr) [n:127.0.0.1:59533_solr    ] o.a.s.c.c.ZkStateReader Updated live nodes from ZooKeeper... (0) -> (1)
   [junit4]   2> 258039 INFO  (zkCallback-559-thread-1-processing-n:127.0.0.1:56548_solr) [n:127.0.0.1:56548_solr    ] o.a.s.c.c.ZkStateReader Updated live nodes from ZooKeeper... (0) -> (1)
   [junit4]   2> 258043 INFO  (jetty-launcher-541-thread-2) [n:127.0.0.1:59533_solr    ] o.a.s.c.ZkController Register node as live in ZooKeeper:/live_nodes/127.0.0.1:59533_solr
   [junit4]   2> 258045 INFO  (zkCallback-559-thread-1-processing-n:127.0.0.1:56548_solr) [n:127.0.0.1:56548_solr    ] o.a.s.c.c.ZkStateReader Updated live nodes from ZooKeeper... (1) -> (2)
   [junit4]   2> 258045 INFO  (zkCallback-557-thread-1-processing-n:127.0.0.1:59533_solr) [n:127.0.0.1:59533_solr    ] o.a.s.c.c.ZkStateReader Updated live nodes from ZooKeeper... (1) -> (2)
   [junit4]   2> 258080 INFO  (jetty-launcher-541-thread-2) [n:127.0.0.1:59533_solr    ] o.a.s.c.CoreContainer Initializing authentication plugin: org.apache.solr.cloud.TestAuthenticationFramework$MockAuthenticationPlugin
   [junit4]   2> 258081 INFO  (jetty-launcher-541-thread-1) [n:127.0.0.1:56548_solr    ] o.a.s.c.CoreContainer Initializing authentication plugin: org.apache.solr.cloud.TestAuthenticationFramework$MockAuthenticationPlugin
   [junit4]   2> 258116 INFO  (jetty-launcher-541-thread-2) [n:127.0.0.1:59533_solr    ] o.a.s.m.r.SolrJmxReporter JMX monitoring for 'solr_59533.solr.node' (registry 'solr.node') enabled at server: com.sun.jmx.mbeanserver.JmxMBeanServer@7d806005
   [junit4]   2> 258117 INFO  (jetty-launcher-541-thread-1) [n:127.0.0.1:56548_solr    ] o.a.s.m.r.SolrJmxReporter JMX monitoring for 'solr_56548.solr.node' (registry 'solr.node') enabled at server: com.sun.jmx.mbeanserver.JmxMBeanServer@7d806005
   [junit4]   2> 258131 INFO  (jetty-launcher-541-thread-2) [n:127.0.0.1:59533_solr    ] o.a.s.m.r.SolrJmxReporter JMX monitoring for 'solr_59533.solr.jvm' (registry 'solr.jvm') enabled at server: com.sun.jmx.mbeanserver.JmxMBeanServer@7d806005
   [junit4]   2> 258132 INFO  (jetty-launcher-541-thread-2) [n:127.0.0.1:59533_solr    ] o.a.s.m.r.SolrJmxReporter JMX monitoring for 'solr_59533.solr.jetty' (registry 'solr.jetty') enabled at server: com.sun.jmx.mbeanserver.JmxMBeanServer@7d806005
   [junit4]   2> 258132 INFO  (jetty-launcher-541-thread-1) [n:127.0.0.1:56548_solr    ] o.a.s.m.r.SolrJmxReporter JMX monitoring for 'solr_56548.solr.jvm' (registry 'solr.jvm') enabled at server: com.sun.jmx.mbeanserver.JmxMBeanServer@7d806005
   [junit4]   2> 258132 INFO  (jetty-launcher-541-thread-1) [n:127.0.0.1:56548_solr    ] o.a.s.m.r.SolrJmxReporter JMX monitoring for 'solr_56548.solr.jetty' (registry 'solr.jetty') enabled at server: com.sun.jmx.mbeanserver.JmxMBeanServer@7d806005
   [junit4]   2> 258133 INFO  (jetty-launcher-541-thread-2) [n:127.0.0.1:59533_solr    ] o.a.s.c.CorePropertiesLocator Found 0 core definitions underneath /x1/jenkins/jenkins-slave/workspace/Lucene-Solr-Tests-master/solr/build/solr-core/test/J1/temp/solr.cloud.TestAuthenticationFramework_B199F550DA2D3A63-001/tempDir-001/node2/.
   [junit4]   2> 258133 INFO  (jetty-launcher-541-thread-1) [n:127.0.0.1:56548_solr    ] o.a.s.c.CorePropertiesLocator Found 0 core definitions underneath /x1/jenkins/jenkins-slave/workspace/Lucene-Solr-Tests-master/solr/build/solr-core/test/J1/temp/solr.cloud.TestAuthenticationFramework_B199F550DA2D3A63-001/tempDir-001/node1/.
   [junit4]   2> 258174 INFO  (zkConnectionManagerCallback-566-thread-1) [    ] o.a.s.c.c.ConnectionManager zkClient has connected
   [junit4]   2> 258177 INFO  (zkConnectionManagerCallback-570-thread-1) [    ] o.a.s.c.c.ConnectionManager zkClient has connected
   [junit4]   2> 258178 INFO  (TEST-TestAuthenticationFramework.testBasics-seed#[B199F550DA2D3A63]) [    ] o.a.s.c.c.ZkStateReader Updated live nodes from ZooKeeper... (0) -> (2)
   [junit4]   2> 258179 INFO  (TEST-TestAuthenticationFramework.testBasics-seed#[B199F550DA2D3A63]) [    ] o.a.s.c.s.i.ZkClientClusterStateProvider Cluster at 127.0.0.1:48983/solr ready
   [junit4]   2> 258181 INFO  (TEST-TestAuthenticationFramework.testBasics-seed#[B199F550DA2D3A63]) [    ] o.a.s.SolrTestCaseJ4 ###Starting testBasics
   [junit4]   2> 258183 INFO  (qtp1706894415-2271) [n:127.0.0.1:59533_solr    ] o.a.s.h.a.CollectionsHandler Invoked Collection Action :create with params async=e2f7be00-1bd5-4ede-855c-dccf62b4ec61&replicationFactor=2&collection.configName=solrCloudCollectionConfig&maxShardsPerNode=2&name=testcollection&nrtReplicas=2&action=CREATE&numShards=2&wt=javabin&version=2 and sendToOCPQueue=true
   [junit4]   2> 258185 INFO  (qtp1706894415-2271) [n:127.0.0.1:59533_solr    ] o.a.s.s.HttpSolrCall [admin] webapp=null path=/admin/collections params={async=e2f7be00-1bd5-4ede-855c-dccf62b4ec61&replicationFactor=2&collection.configName=solrCloudCollectionConfig&maxShardsPerNode=2&name=testcollection&nrtReplicas=2&action=CREATE&numShards=2&wt=javabin&version=2} status=0 QTime=2
   [junit4]   2> 258186 INFO  (qtp1706894415-2275) [n:127.0.0.1:59533_solr    ] o.a.s.h.a.CollectionsHandler Invoked Collection Action :requeststatus with params requestid=e2f7be00-1bd5-4ede-855c-dccf62b4ec61&action=REQUESTSTATUS&wt=javabin&version=2 and sendToOCPQueue=true
   [junit4]   2> 258187 INFO  (OverseerThreadFactory-695-thread-1-processing-n:127.0.0.1:59533_solr) [n:127.0.0.1:59533_solr    ] o.a.s.c.a.c.CreateCollectionCmd Create collection testcollection
   [junit4]   2> 258187 INFO  (qtp1706894415-2275) [n:127.0.0.1:59533_solr    ] o.a.s.s.HttpSolrCall [admin] webapp=null path=/admin/collections params={requestid=e2f7be00-1bd5-4ede-855c-dccf62b4ec61&action=REQUESTSTATUS&wt=javabin&version=2} status=0 QTime=0
   [junit4]   2> 258294 INFO  (OverseerStateUpdate-73368195258646533-127.0.0.1:59533_solr-n_0000000000) [n:127.0.0.1:59533_solr    ] o.a.s.c.o.SliceMutator createReplica() {
   [junit4]   2>   "operation":"ADDREPLICA",
   [junit4]   2>   "collection":"testcollection",
   [junit4]   2>   "shard":"shard1",
   [junit4]   2>   "core":"testcollection_shard1_replica_n1",
   [junit4]   2>   "state":"down",
   [junit4]   2>   "base_url":"http://127.0.0.1:56548/solr",
   [junit4]   2>   "type":"NRT",
   [junit4]   2>   "waitForFinalState":"false"} 
   [junit4]   2> 258296 INFO  (OverseerStateUpdate-73368195258646533-127.0.0.1:59533_solr-n_0000000000) [n:127.0.0.1:59533_solr    ] o.a.s.c.o.SliceMutator createReplica() {
   [junit4]   2>   "operation":"ADDREPLICA",
   [junit4]   2>   "collection":"testcollection",
   [junit4]   2>   "shard":"shard1",
   [junit4]   2>   "core":"testcollection_shard1_replica_n2",
   [junit4]   2>   "state":"down",
   [junit4]   2>   "base_url":"http://127.0.0.1:59533/solr",
   [junit4]   2>   "type":"NRT",
   [junit4]   2>   "waitForFinalState":"false"} 
   [junit4]   2> 258299 INFO  (OverseerStateUpdate-73368195258646533-127.0.0.1:59533_solr-n_0000000000) [n:127.0.0.1:59533_solr    ] o.a.s.c.o.SliceMutator createReplica() {
   [junit4]   2>   "operation":"ADDREPLICA",
   [junit4]   2>   "collection":"testcollection",
   [junit4]   2>   "shard":"shard2",
   [junit4]   2>   "core":"testcollection_shard2_replica_n4",
   [junit4]   2>   "state":"down",
   [junit4]   2>   "base_url":"http://127.0.0.1:56548/solr",
   [junit4]   2>   "type":"NRT",
   [junit4]   2>   "waitForFinalState":"false"} 
   [junit4]   2> 258301 INFO  (OverseerStateUpdate-73368195258646533-127.0.0.1:59533_solr-n_0000000000) [n:127.0.0.1:59533_solr    ] o.a.s.c.o.SliceMutator createReplica() {
   [junit4]   2>   "operation":"ADDREPLICA",
   [junit4]   2>   "collection":"testcollection",
   [junit4]   2>   "shard":"shard2",
   [junit4]   2>   "core":"testcollection_shard2_replica_n6",
   [junit4]   2>   "state":"down",
   [junit4]   2>   "base_url":"http://127.0.0.1:59533/solr",
   [junit4]   2>   "type":"NRT",
   [junit4]   2>   "waitForFinalState":"false"} 
   [junit4]   2> 258514 INFO  (qtp1272313298-2268) [n:127.0.0.1:56548_solr    ] o.a.s.s.HttpSolrCall [admin] webapp=null path=/admin/cores params={qt=/admin/cores&collection.configName=solrCloudCollectionConfig&newCollection=true&collection=testcollection&version=2&replicaType=NRT&async=e2f7be00-1bd5-4ede-855c-dccf62b4ec6119998188047038428&coreNodeName=core_node3&name=testcollection_shard1_replica_n1&action=CREATE&numShards=2&shard=shard1&wt=javabin} status=0 QTime=6
   [junit4]   2> 258514 INFO  (parallelCoreAdminExecutor-697-thread-1-processing-n:127.0.0.1:56548_solr e2f7be00-1bd5-4ede-855c-dccf62b4ec6119998188047038428 CREATE) [n:127.0.0.1:56548_solr    ] o.a.s.h.a.CoreAdminOperation core create command qt=/admin/cores&collection.configName=solrCloudCollectionConfig&newCollection=true&collection=testcollection&version=2&replicaType=NRT&async=e2f7be00-1bd5-4ede-855c-dccf62b4ec6119998188047038428&coreNodeName=core_node3&name=testcollection_shard1_replica_n1&action=CREATE&numShards=2&shard=shard1&wt=javabin
   [junit4]   2> 258514 INFO  (parallelCoreAdminExecutor-697-thread-1-processing-n:127.0.0.1:56548_solr e2f7be00-1bd5-4ede-855c-dccf62b4ec6119998188047038428 CREATE) [n:127.0.0.1:56548_solr    ] o.a.s.c.TransientSolrCoreCacheDefault Allocating transient cache for 2147483647 transient cores
   [junit4]   2> 258514 INFO  (qtp1706894415-2275) [n:127.0.0.1:59533_solr    ] o.a.s.s.HttpSolrCall [admin] webapp=null path=/admin/cores params={qt=/admin/cores&collection.configName=solrCloudCollectionConfig&newCollection=true&collection=testcollection&version=2&replicaType=NRT&async=e2f7be00-1bd5-4ede-855c-dccf62b4ec6119998188049153202&coreNodeName=core_node5&name=testcollection_shard1_replica_n2&action=CREATE&numShards=2&shard=shard1&wt=javabin} status=0 QTime=3
   [junit4]   2> 258518 INFO  (qtp1706894415-2280) [n:127.0.0.1:59533_solr    ] o.a.s.s.HttpSolrCall [admin] webapp=null path=/admin/cores params={qt=/admin/cores&collection.configName=solrCloudCollectionConfig&newCollection=true&collection=testcollection&version=2&replicaType=NRT&async=e2f7be00-1bd5-4ede-855c-dccf62b4ec6119998188054764436&coreNodeName=core_node8&name=testcollection_shard2_replica_n6&action=CREATE&numShards=2&shard=shard2&wt=javabin} status=0 QTime=7
   [junit4]   2> 258518 INFO  (parallelCoreAdminExecutor-696-thread-1-processing-n:127.0.0.1:59533_solr e2f7be00-1bd5-4ede-855c-dccf62b4ec6119998188049153202 CREATE) [n:127.0.0.1:59533_solr    ] o.a.s.h.a.CoreAdminOperation core create command qt=/admin/cores&collection.configName=solrCloudCollectionConfig&newCollection=true&collection=testcollection&version=2&replicaType=NRT&async=e2f7be00-1bd5-4ede-855c-dccf62b4ec6119998188049153202&coreNodeName=core_node5&name=testcollection_shard1_replica_n2&action=CREATE&numShards=2&shard=shard1&wt=javabin
   [junit4]   2> 258518 INFO  (qtp1272313298-2273) [n:127.0.0.1:56548_solr    ] o.a.s.s.HttpSolrCall [admin] webapp=null path=/admin/cores params={qt=/admin/cores&collection.configName=solrCloudCollectionConfig&newCollection=true&collection=testcollection&version=2&replicaType=NRT&async=e2f7be00-1bd5-4ede-855c-dccf62b4ec6119998188051862174&coreNodeName=core_node7&name=testcollection_shard2_replica_n4&action=CREATE&numShards=2&shard=shard2&wt=javabin} status=0 QTime=8
   [junit4]   2> 258518 INFO  (parallelCoreAdminExecutor-696-thread-2-processing-n:127.0.0.1:59533_solr e2f7be00-1bd5-4ede-855c-dccf62b4ec6119998188054764436 CREATE) [n:127.0.0.1:59533_solr    ] o.a.s.h.a.CoreAdminOperation core create command qt=/admin/cores&collection.configName=solrCloudCollectionConfig&newCollection=true&collection=testcollection&version=2&replicaType=NRT&async=e2f7be00-1bd5-4ede-855c-dccf62b4ec6119998188054764436&coreNodeName=core_node8&name=testcollection_shard2_replica_n6&action=CREATE&numShards=2&shard=shard2&wt=javabin
   [junit4]   2> 258519 INFO  (parallelCoreAdminExecutor-696-thread-2-processing-n:127.0.0.1:59533_solr e2f7be00-1bd5-4ede-855c-dccf62b4ec6119998188054764436 CREATE) [n:127.0.0.1:59533_solr    ] o.a.s.c.TransientSolrCoreCacheDefault Allocating transient cache for 2147483647 transient cores
   [junit4]   2> 258519 INFO  (parallelCoreAdminExecutor-697-thread-2-processing-n:127.0.0.1:56548_solr e2f7be00-1bd5-4ede-855c-dccf62b4ec6119998188051862174 CREATE) [n:127.0.0.1:56548_solr    ] o.a.s.h.a.CoreAdminOperation core create command qt=/admin/cores&collection.configName=solrCloudCollectionConfig&newCollection=true&collection=testcollection&version=2&replicaType=NRT&async=e2f7be00-1bd5-4ede-855c-dccf62b4ec6119998188051862174&coreNodeName=core_node7&name=testcollection_shard2_replica_n4&action=CREATE&numShards=2&shard=shard2&wt=javabin
   [junit4]   2> 258523 INFO  (qtp1706894415-2277) [n:127.0.0.1:59533_solr    ] o.a.s.h.a.CoreAdminOperation Checking request status for : e2f7be00-1bd5-4ede-855c-dccf62b4ec6119998188054764436
   [junit4]   2> 258523 INFO  (qtp1706894415-2277) [n:127.0.0.1:59533_solr    ] o.a.s.s.HttpSolrCall [admin] webapp=null path=/admin/cores params={qt=/admin/cores&requestid=e2f7be00-1bd5-4ede-855c-dccf62b4ec6119998188054764436&action=REQUESTSTATUS&wt=javabin&version=2} status=0 QTime=0
   [junit4]   2> 258632 INFO  (zkCallback-559-thread-1-processing-n:127.0.0.1:56548_solr) [n:127.0.0.1:56548_solr    ] o.a.s.c.c.ZkStateReader A cluster state change: [WatchedEvent state:SyncConnected type:NodeDataChanged path:/collections/testcollection/state.json] for collection [testcollection] has occurred - updating... (live nodes size: [2])
   [junit4]   2> 258632 INFO  (zkCallback-557-thread-1-processing-n:127.0.0.1:59533_solr) [n:127.0.0.1:59533_solr    ] o.a.s.c.c.ZkStateReader A cluster state change: [WatchedEvent state:SyncConnected type:NodeDataChanged path:/collections/testcollection/state.json] for collection [testcollection] has occurred - updating... (live nodes size: [2])
   [junit4]   2> 258642 INFO  (zkCallback-557-thread-1-processing-n:127.0.0.1:59533_solr) [n:127.0.0.1:59533_solr    ] o.a.s.c.c.ZkStateReader A cluster state change: [WatchedEvent state:SyncConnected type:NodeDataChanged path:/collections/testcollection/state.json] for collection [testcollection] has occurred - updating... (live nodes size: [2])
   [junit4]   2> 258642 INFO  (zkCallback-557-thread-2-processing-n:127.0.0.1:59533_solr) [n:127.0.0.1:59533_solr    ] o.a.s.c.c.ZkStateReader A cluster state change: [WatchedEvent state:SyncConnected type:NodeDataChanged path:/collections/testcollection/state.json] for collection [testcollection] has occurred - updating... (live nodes size: [2])
   [junit4]   2> 258643 INFO  (zkCallback-559-thread-2-processing-n:127.0.0.1:56548_solr) [n:127.0.0.1:56548_solr    ] o.a.s.c.c.ZkStateReader A cluster state change: [WatchedEvent state:SyncConnected type:NodeDataChanged path:/collections/testcollection/state.json] for collection [testcollection] has occurred - updating... (live nodes size: [2])
   [junit4]   2> 259188 INFO  (qtp1706894415-2280) [n:127.0.0.1:59533_solr    ] o.a.s.h.a.CollectionsHandler Invoked Collection Action :requeststatus with params requestid=e2f7be00-1bd5-4ede-855c-dccf62b4ec61&action=REQUESTSTATUS&wt=javabin&version=2 and sendToOCPQueue=true
   [junit4]   2> 259189 INFO  (qtp1706894415-2280) [n:127.0.0.1:59533_solr    ] o.a.s.s.HttpSolrCall [admin] webapp=null path=/admin/collections params={requestid=e2f7be00-1bd5-4ede-855c-dccf62b4ec61&action=REQUESTSTATUS&wt=javabin&version=2} status=0 QTime=0
   [junit4]   2> 259526 INFO  (qtp1706894415-2277) [n:127.0.0.1:59533_solr    ] o.a.s.h.a.CoreAdminOperation Checking request status for : e2f7be00-1bd5-4ede-855c-dccf62b4ec6119998188054764436
   [junit4]   2> 259526 INFO  (qtp1706894415-2277) [n:127.0.0.1:59533_solr    ] o.a.s.s.HttpSolrCall [admin] webapp=null path=/admin/cores params={qt=/admin/cores&requestid=e2f7be00-1bd5-4ede-855c-dccf62b4ec6119998188054764436&action=REQUESTSTATUS&wt=javabin&version=2} status=0 QTime=0
   [junit4]   2> 259543 INFO  (parallelCoreAdminExecutor-696-thread-1-processing-n:127.0.0.1:59533_solr e2f7be00-1bd5-4ede-855c-dccf62b4ec6119998188049153202 CREATE) [n:127.0.0.1:59533_solr c:testcollection s:shard1 r:core_node5 x:testcollection_shard1_replica_n2] o.a.s.c.SolrConfig Using Lucene MatchVersion: 8.0.0
   [junit4]   2> 259545 INFO  (parallelCoreAdminExecutor-696-thread-2-processing-n:127.0.0.1:59533_solr e2f7be00-1bd5-4ede-855c-dccf62b4ec6119998188054764436 CREATE) [n:127.0.0.1:59533_solr c:testcollection s:shard2 r:core_node8 x:testcollection_shard2_replica_n6] o.a.s.c.SolrConfig Using Lucene MatchVersion: 8.0.0
   [junit4]   2> 259546 INFO  (parallelCoreAdminExecutor-697-thread-1-processing-n:127.0.0.1:56548_solr e2f7be00-1bd5-4ede-855c-dccf62b4ec6119998188047038428 CREATE) [n:127.0.0.1:56548_solr c:testcollection s:shard1 r:core_node3 x:testcollection_shard1_replica_n1] o.a.s.c.SolrConfig Using Lucene MatchVersion: 8.0.0
   [junit4]   2> 259550 INFO  (parallelCoreAdminExecutor-697-thread-2-processing-n:127.0.0.1:56548_solr e2f7be00-1bd5-4ede-855c-dccf62b4ec6119998188051862174 CREATE) [n:127.0.0.1:56548_solr c:testcollection s:shard2 r:core_node7 x:testcollection_shard2_replica_n4] o.a.s.c.SolrConfig Using Lucene MatchVersion: 8.0.0
   [junit4]   2> 259552 INFO  (parallelCoreAdminExecutor-696-thread-1-processing-n:127.0.0.1:59533_solr e2f7be00-1bd5-4ede-855c-dccf62b4ec6119998188049153202 CREATE) [n:127.0.0.1:59533_solr c:testcollection s:shard1 r:core_node5 x:testcollection_shard1_replica_n2] o.a.s.s.IndexSchema [testcollection_shard1_replica_n2] Schema name=minimal
   [junit4]   2> 259565 INFO  (parallelCoreAdminExecutor-696-thread-1-processing-n:127.0.0.1:59533_solr e2f7be00-1bd5-4ede-855c-dccf62b4ec6119998188049153202 CREATE) [n:127.0.0.1:59533_solr c:testcollection s:shard1 r:core_node5 x:testcollection_shard1_replica_n2] o.a.s.s.IndexSchema Loaded schema minimal/1.1 with uniqueid field id
   [junit4]   2> 259565 INFO  (parallelCoreAdminExecutor-696-thread-1-processing-n:127.0.0.1:59533_solr e2f7be00-1bd5-4ede-855c-dccf62b4ec6119998188049153202 CREATE) [n:127.0.0.1:59533_solr c:testcollection s:shard1 r:core_node5 x:testcollection_shard1_replica_n2] o.a.s.c.CoreContainer Creating SolrCore 'testcollection_shard1_replica_n2' using configuration from collection testcollection, trusted=true
   [junit4]   2> 259565 INFO  (parallelCoreAdminExecutor-697-thread-1-processing-n:127.0.0.1:56548_solr e2f7be00-1bd5-4ede-855c-dccf62b4ec6119998188047038428 CREATE) [n:127.0.0.1:56548_solr c:testcollection s:shard1 r:core_node3 x:testcollection_shard1_replica_n1] o.a.s.s.IndexSchema [testcollection_shard1_replica_n1] Schema name=minimal
   [junit4]   2> 259565 INFO  (parallelCoreAdminExecutor-696-thread-1-processing-n:127.0.0.1:59533_solr e2f7be00-1bd5-4ede-855c-dccf62b4ec6119998188049153202 CREATE) [n:127.0.0.1:59533_solr c:testcollection s:shard1 r:core_node5 x:testcollection_shard1_replica_n2] o.a.s.m.r.SolrJmxReporter JMX monitoring for 'solr_59533.solr.core.testcollection.shard1.replica_n2' (registry 'solr.core.testcollection.shard1.replica_n2') enabled at server: com.sun.jmx.mbeanserver.JmxMBeanServer@7d806005
   [junit4]   2> 259565 INFO  (parallelCoreAdminExecutor-696-thread-1-processing-n:127.0.0.1:59533_solr e2f7be00-1bd5-4ede-855c-dccf62b4ec6119998188049153202 CREATE) [n:127.0.0.1:59533_solr c:testcollection s:shard1 r:core_node5 x:testcollection_shard1_replica_n2] o.a.s.c.SolrCore solr.RecoveryStrategy.Builder
   [junit4]   2> 259565 INFO  (parallelCoreAdminExecutor-696-thread-1-processing-n:127.0.0.1:59533_solr e2f7be00-1bd5-4ede-855c-dccf62b4ec6119998188049153202 CREATE) [n:127.0.0.1:59533_solr c:testcollection s:shard1 r:core_node5 x:testcollection_shard1_replica_n2] o.a.s.c.SolrCore [[testcollection_shard1_replica_n2] ] Opening new SolrCore at [/x1/jenkins/jenkins-slave/workspace/Lucene-Solr-Tests-master/solr/build/solr-core/test/J1/temp/solr.cloud.TestAuthenticationFramework_B199F550DA2D3A63-001/tempDir-001/node2/testcollection_shard1_replica_n2], dataDir=[/x1/jenkins/jenkins-slave/workspace/Lucene-Solr-Tests-master/solr/build/solr-core/test/J1/temp/solr.cloud.TestAuthenticationFramework_B199F550DA2D3A63-001/tempDir-001/node2/./testcollection_shard1_replica_n2/data/]
   [junit4]   2> 259567 INFO  (parallelCoreAdminExecutor-697-thread-1-processing-n:127.0.0.1:56548_solr e2f7be00-1bd5-4ede-855c-dccf62

[...truncated too long message...]

2389056386776, sim=Asserting(org.apache.lucene.search.similarities.AssertingSimilarity@69447b2c), locale=pt-PT, timezone=Europe/Belgrade
   [junit4]   2> NOTE: Linux 3.13.0-88-generic amd64/Oracle Corporation 1.8.0_144 (64-bit)/cpus=4,threads=1,free=197395616,total=527958016
   [junit4]   2> NOTE: All tests run in this JVM: [SuggesterTest, TestZkAclsWithHadoopAuth, HDFSCollectionsAPITest, TestBackupRepositoryFactory, TestGraphMLResponseWriter, TestUniqueKeyFieldResource, TestPrepRecovery, TestXmlQParserPlugin, TestFieldCacheSort, TestFieldTypeResource, PrimUtilsTest, TestClusterStateProvider, BadComponentTest, TestClusterStateMutator, SubstringBytesRefFilterTest, ParsingFieldUpdateProcessorsTest, SolrJmxReporterCloudTest, TestXIncludeConfig, TestSubQueryTransformerCrossCore, TestRandomCollapseQParserPlugin, XsltUpdateRequestHandlerTest, TestCharFilters, CustomHighlightComponentTest, TestConfigSetsAPI, TestFunctionQuery, TestReplicationHandlerBackup, RemoteQueryErrorTest, TestLockTree, LeaderElectionContextKeyTest, TestFuzzyAnalyzedSuggestions, TestSolrJ, CursorMarkTest, TestLegacyNumericUtils, SampleTest, TestAuthenticationFramework, TestNonDefinedSimilarityFactory, TestSystemIdResolver, CSVRequestHandlerTest, SOLR749Test, TestConfigSetProperties, TestNumericRangeQuery32, TestSurroundQueryParser, DistributedMLTComponentTest, SoftAutoCommitTest, CloneFieldUpdateProcessorFactoryTest, DocValuesNotIndexedTest, SolrCLIZkUtilsTest, TestSortByMinMaxFunction, TestConfigReload, TestDocTermOrds, TestMultiWordSynonyms, TestSearchPerf, CheckHdfsIndexTest, BufferStoreTest, TestCustomDocTransformer, DocumentBuilderTest, TestCloudJSONFacetJoinDomain, TestFastLRUCache, TestBlendedInfixSuggestions, ScriptEngineTest, TestManagedSchema, TestTrie, TestGraphTermsQParserPlugin, TestBM25SimilarityFactory, SimpleMLTQParserTest, LoggingHandlerTest, SolrCoreTest, TestFoldingMultitermQuery, BasicAuthStandaloneTest, SpatialRPTFieldTypeTest, SystemInfoHandlerTest, SystemLogListenerTest, AlternateDirectoryTest, TestFieldCacheWithThreads, TestCloudSchemaless, TestImplicitCoreProperties, TestJsonFacets, TestSweetSpotSimilarityFactory, AsyncCallRequestStatusResponseTest, CdcrReplicationHandlerTest, FastVectorHighlighterTest, MetricsHandlerTest, TestSQLHandler, TestSimDistributedQueue, SortByFunctionTest, ZkControllerTest, ConjunctionSolrSpellCheckerTest, TestSimpleQParserPlugin, TestStressCloudBlindAtomicUpdates, AddSchemaFieldsUpdateProcessorFactoryTest, CollectionStateFormat2Test, TestPointFields, TestDistributedGrouping, QueryElevationComponentTest, TestCollapseQParserPlugin, TestPKIAuthenticationPlugin, DeleteStatusTest, TestSolrConfigHandlerConcurrent, AutoScalingHandlerTest, JavabinLoaderTest, MissingSegmentRecoveryTest, BlobRepositoryCloudTest, TestReversedWildcardFilterFactory, ConfigSetsAPITest, SolrCloudReportersTest, HdfsUnloadDistributedZkTest, TestCursorMarkWithoutUniqueKey, TestSchemaSimilarityResource, TestDistributedMap, CollectionsAPIAsyncDistributedZkTest, V2StandaloneTest, OverseerModifyCollectionTest, TestCloudNestedDocsSort, HdfsRecoverLeaseTest, SimplePostToolTest, ClassificationUpdateProcessorFactoryTest, SparseHLLTest, TestDelegationWithHadoopAuth, TestFieldCollectionResource, TestPartialUpdateDeduplication, ExitableDirectoryReaderTest, PolyFieldTest, CdcrBidirectionalTest, TestSortableTextField, JSONWriterTest, DistribJoinFromCollectionTest, CoreAdminRequestStatusTest, TestRTGBase, QueryParsingTest, ChaosMonkeySafeLeaderTest, BasicDistributedZk2Test, SyncSliceTest, OpenCloseCoreStressTest, OverseerTest, LeaderElectionIntegrationTest, ShardRoutingTest, BasicZkTest, FullSolrCloudDistribCmdsTest, TestReplicationHandler, LeaderElectionTest, TestZkChroot, ZkCLITest, ShardRoutingCustomTest, TestRecovery, DistributedSpellCheckComponentTest, TermVectorComponentDistributedTest, TestStressReorder, TestReload, TestStressVersions, DistributedTermsComponentTest, TestRangeQuery, TestCoreContainer, TestSolr4Spatial, StatsComponentTest, SpellCheckComponentTest, SolrCmdDistributorTest, PeerSyncTest, BasicFunctionalityTest, TestLazyCores, ShowFileRequestHandlerTest, DistributedQueryElevationComponentTest, SignatureUpdateProcessorFactoryTest, SuggesterFSTTest, SuggesterTSTTest, SpatialFilterTest, TestCSVLoader, WordBreakSolrSpellCheckerTest, SolrCoreCheckLockOnStartupTest, TestUpdate, TestWordDelimiterFilterFactory, DirectUpdateHandlerOptimizeTest, CacheHeaderTest, DisMaxRequestHandlerTest, TestQueryUtils, TestWriterPerf, FileBasedSpellCheckerTest, RequestHandlersTest, TestValueSourceCache, PathHierarchyTokenizerFactoryTest, RequiredFieldsTest, IndexSchemaRuntimeFieldTest, IndexSchemaTest, ReturnFieldsTest, JsonLoaderTest, TestQuerySenderListener, SolrIndexConfigTest, TestSolrDeletionPolicy2, MultiTermTest, TestDocSet, TestBinaryField, TestElisionMultitermQuery, TestConfig, OutputWriterTest, ExternalFileFieldSortTest, TestPostingsSolrHighlighter, TestPhraseSuggestions, SynonymTokenizerTest, TestLMDirichletSimilarityFactory, TestIBSimilarityFactory, ResourceLoaderTest, OpenExchangeRatesOrgProviderTest, DateMathParserTest, PreAnalyzedFieldTest, DateFieldTest, DOMUtilTest, RAMDirectoryFactoryTest, TestLRUCache, TestUtils, SliceStateTest, FileUtilsTest, DistributedIntervalFacetingTest, TestHighlightDedupGrouping, TestSimpleTrackingShardHandler, TestLuceneIndexBackCompat, TestEmbeddedSolrServerAdminHandler, TestJettySolrRunner, ConnectionReuseTest, AddReplicaTest, AliasIntegrationTest, ConcurrentCreateRoutedAliasTest, CreateRoutedAliasTest, DeleteReplicaTest, DistributedVersionInfoTest, LIRRollingUpdatesTest, MoveReplicaHDFSFailoverTest, OutOfBoxZkACLAndCredentialsProvidersTest, OverseerTaskQueueTest, ReplaceNodeNoTargetTest, ReplaceNodeTest, ReplicationFactorTest, TestCloudDeleteByQuery, TestCloudRecovery, TestDistribDocBasedVersion, TestLeaderElectionZkExpiry, TestLeaderInitiatedRecoveryThread, TestPullReplicaErrorHandling, TestTolerantUpdateProcessorRandomCloud, TestUtilizeNode, VMParamsZkACLAndCredentialsProvidersTest, ZkFailoverTest, SimpleCollectionCreateDeleteTest, TestCollectionsAPIViaSolrCloudCluster, TestRequestStatusCollectionAPI, ComputePlanActionTest, HdfsAutoAddReplicasIntegrationTest, TestDistribStateManager, TestExecutePlanAction, TestGenericDistributedQueue, TestLargeCluster, TestNodeAddedTrigger, TestPolicyCloud, TestTriggerIntegration, BaseCdcrDistributedZkTest, CdcrBootstrapTest, CdcrReplicationDistributedZkTest, CdcrRequestHandlerTest, CdcrVersionReplicationTest, HdfsRestartWhileUpdatingTest, HdfsSyncSliceTest, HdfsThreadLeakTest, HdfsTlogReplayBufferedWhileIndexingTest, HdfsWriteToMultipleCollectionsTest, StressHdfsTest, ConfigureRecoveryStrategyTest, CoreSorterTest, HdfsDirectoryFactoryTest, TestDynamicLoading, ResponseBuilderTest, SearchHandlerTest, TestBlobHandler, TestReqParamsAPI, TestRestoreCore, TestSolrConfigHandlerCloud, FacetPivotSmallTest, ShufflingReplicaListTransformerTest, SuggestComponentContextFilterQueryTest, TestDistributedStatsComponentCardinality, TestManagedResourceStorage, TestCopyFieldCollectionResource, TestFieldTypeCollectionResource, TestSchemaResource, ChangedSchemaMergeTest, CurrencyFieldTypeTest, EnumFieldTest, TestCloudManagedSchema, AnalyticsQueryTest, CurrencyRangeFacetCloudTest, RankQueryTest, TestCustomSort, TestLegacyNumericRangeQueryBuilder, TestMissingGroups, TestOverriddenPrefixQueryForCustomFieldType, TestReloadDeadlock, TestSolr4Spatial2, TestSolrCoreParser, TestStressUserVersions, TestTrieFacet, TestJsonFacetRefinement, TestOrdValues, BJQParserTest, BlockJoinFacetDistribTest, TestScoreJoinQPScore, TestDFISimilarityFactory, TestPerFieldSimilarityWithDefaultOverride, TestDefaultStatsCache, TestExactSharedStatsCache, TestExactStatsCache, BasicAuthIntegrationTest, PKIAuthenticationIntegrationTest, TestSha256AuthenticationProvider, TestImpersonationWithHadoopAuth, ResponseHeaderTest, SpellCheckCollatorWithCollapseTest, TestFileDictionaryLookup, TestHighFrequencyDictionaryFactory, BlockDirectoryTest, TestLegacyFieldCache, TestNumericTerms64, TestExceedMaxTermLength, TestHdfsUpdateLog, VersionInfoTest, AtomicUpdateProcessorFactoryTest]
   [junit4] Completed [760/778 (7!)] on J1 in 0.59s, 4 tests, 1 error <<< FAILURES!

[...truncated 7522 lines...]
   [junit4] Suite: org.apache.solr.ltr.TestLTRReRankingPipeline
   [junit4]   2> 18418 INFO  (TEST-TestLTRReRankingPipeline.testDifferentTopN-seed#[B4FF1E3DB83E88C7]) [    ] o.a.s.l.TestLTRReRankingPipeline rerank 1 documents 
   [junit4]   2> 18422 INFO  (TEST-TestLTRReRankingPipeline.testDifferentTopN-seed#[B4FF1E3DB83E88C7]) [    ] o.a.s.l.TestLTRReRankingPipeline doc 0 in pos 0
   [junit4]   2> NOTE: reproduce with: ant test  -Dtestcase=TestLTRReRankingPipeline -Dtests.method=testDifferentTopN -Dtests.seed=B4FF1E3DB83E88C7 -Dtests.multiplier=2 -Dtests.slow=true -Dtests.locale=uk-UA -Dtests.timezone=Asia/Dili -Dtests.asserts=true -Dtests.file.encoding=ISO-8859-1
   [junit4] FAILURE 0.04s J0 | TestLTRReRankingPipeline.testDifferentTopN <<<
   [junit4]    > Throwable #1: java.lang.AssertionError: expected:<1.0> but was:<0.0>
   [junit4]    > 	at __randomizedtesting.SeedInfo.seed([B4FF1E3DB83E88C7:455E6C6D8D854255]:0)
   [junit4]    > 	at org.apache.solr.ltr.TestLTRReRankingPipeline.testDifferentTopN(TestLTRReRankingPipeline.java:256)
   [junit4]    > 	at java.lang.Thread.run(Thread.java:748)
   [junit4]   2> NOTE: test params are: codec=Asserting(Lucene70), sim=Asserting(org.apache.lucene.search.similarities.AssertingSimilarity@36028abb), locale=uk-UA, timezone=Asia/Dili
   [junit4]   2> NOTE: Linux 3.13.0-88-generic amd64/Oracle Corporation 1.8.0_144 (64-bit)/cpus=4,threads=1,free=287239400,total=331350016
   [junit4]   2> NOTE: All tests run in this JVM: [TestFieldLengthFeature, TestSelectiveWeightCreation, TestExternalValueFeatures, TestRankingFeature, TestDefaultWrapperModel, TestNoMatchSolrFeature, TestLTRReRankingPipeline]
   [junit4] Completed [20/36 (1!)] on J0 in 0.12s, 3 tests, 1 failure <<< FAILURES!

[...truncated 40336 lines...]

Mime
View raw message