lucene-dev mailing list archives

Site index · List index
Message view « Date » · « Thread »
Top « Date » · « Thread »
From Policeman Jenkins Server <jenk...@thetaphi.de>
Subject [JENKINS] Lucene-Solr-master-Linux (64bit/jdk1.8.0_162) - Build # 21509 - Still Unstable!
Date Thu, 22 Feb 2018 03:35:55 GMT
Build: https://jenkins.thetaphi.de/job/Lucene-Solr-master-Linux/21509/
Java: 64bit/jdk1.8.0_162 -XX:+UseCompressedOops -XX:+UseG1GC

3 tests failed.
FAILED:  org.apache.solr.cloud.ReplaceNodeNoTargetTest.test

Error Message:


Stack Trace:
java.lang.AssertionError
	at __randomizedtesting.SeedInfo.seed([BBEA183626B44C34:33BE27EC884821CC]:0)
	at org.junit.Assert.fail(Assert.java:92)
	at org.junit.Assert.assertTrue(Assert.java:43)
	at org.junit.Assert.assertTrue(Assert.java:54)
	at org.apache.solr.cloud.ReplaceNodeNoTargetTest.test(ReplaceNodeNoTargetTest.java:92)
	at sun.reflect.NativeMethodAccessorImpl.invoke0(Native Method)
	at sun.reflect.NativeMethodAccessorImpl.invoke(NativeMethodAccessorImpl.java:62)
	at sun.reflect.DelegatingMethodAccessorImpl.invoke(DelegatingMethodAccessorImpl.java:43)
	at java.lang.reflect.Method.invoke(Method.java:498)
	at com.carrotsearch.randomizedtesting.RandomizedRunner.invoke(RandomizedRunner.java:1737)
	at com.carrotsearch.randomizedtesting.RandomizedRunner$8.evaluate(RandomizedRunner.java:934)
	at com.carrotsearch.randomizedtesting.RandomizedRunner$9.evaluate(RandomizedRunner.java:970)
	at com.carrotsearch.randomizedtesting.RandomizedRunner$10.evaluate(RandomizedRunner.java:984)
	at com.carrotsearch.randomizedtesting.rules.SystemPropertiesRestoreRule$1.evaluate(SystemPropertiesRestoreRule.java:57)
	at org.apache.lucene.util.TestRuleSetupTeardownChained$1.evaluate(TestRuleSetupTeardownChained.java:49)
	at org.apache.lucene.util.AbstractBeforeAfterRule$1.evaluate(AbstractBeforeAfterRule.java:45)
	at org.apache.lucene.util.TestRuleThreadAndTestName$1.evaluate(TestRuleThreadAndTestName.java:48)
	at org.apache.lucene.util.TestRuleIgnoreAfterMaxFailures$1.evaluate(TestRuleIgnoreAfterMaxFailures.java:64)
	at org.apache.lucene.util.TestRuleMarkFailure$1.evaluate(TestRuleMarkFailure.java:47)
	at com.carrotsearch.randomizedtesting.rules.StatementAdapter.evaluate(StatementAdapter.java:36)
	at com.carrotsearch.randomizedtesting.ThreadLeakControl$StatementRunner.run(ThreadLeakControl.java:368)
	at com.carrotsearch.randomizedtesting.ThreadLeakControl.forkTimeoutingTask(ThreadLeakControl.java:817)
	at com.carrotsearch.randomizedtesting.ThreadLeakControl$3.evaluate(ThreadLeakControl.java:468)
	at com.carrotsearch.randomizedtesting.RandomizedRunner.runSingleTest(RandomizedRunner.java:943)
	at com.carrotsearch.randomizedtesting.RandomizedRunner$5.evaluate(RandomizedRunner.java:829)
	at com.carrotsearch.randomizedtesting.RandomizedRunner$6.evaluate(RandomizedRunner.java:879)
	at com.carrotsearch.randomizedtesting.RandomizedRunner$7.evaluate(RandomizedRunner.java:890)
	at com.carrotsearch.randomizedtesting.rules.StatementAdapter.evaluate(StatementAdapter.java:36)
	at com.carrotsearch.randomizedtesting.rules.SystemPropertiesRestoreRule$1.evaluate(SystemPropertiesRestoreRule.java:57)
	at org.apache.lucene.util.AbstractBeforeAfterRule$1.evaluate(AbstractBeforeAfterRule.java:45)
	at com.carrotsearch.randomizedtesting.rules.StatementAdapter.evaluate(StatementAdapter.java:36)
	at org.apache.lucene.util.TestRuleStoreClassName$1.evaluate(TestRuleStoreClassName.java:41)
	at com.carrotsearch.randomizedtesting.rules.NoShadowingOrOverridesOnMethodsRule$1.evaluate(NoShadowingOrOverridesOnMethodsRule.java:40)
	at com.carrotsearch.randomizedtesting.rules.NoShadowingOrOverridesOnMethodsRule$1.evaluate(NoShadowingOrOverridesOnMethodsRule.java:40)
	at com.carrotsearch.randomizedtesting.rules.StatementAdapter.evaluate(StatementAdapter.java:36)
	at com.carrotsearch.randomizedtesting.rules.StatementAdapter.evaluate(StatementAdapter.java:36)
	at com.carrotsearch.randomizedtesting.rules.StatementAdapter.evaluate(StatementAdapter.java:36)
	at org.apache.lucene.util.TestRuleAssertionsRequired$1.evaluate(TestRuleAssertionsRequired.java:53)
	at org.apache.lucene.util.TestRuleMarkFailure$1.evaluate(TestRuleMarkFailure.java:47)
	at org.apache.lucene.util.TestRuleIgnoreAfterMaxFailures$1.evaluate(TestRuleIgnoreAfterMaxFailures.java:64)
	at org.apache.lucene.util.TestRuleIgnoreTestSuites$1.evaluate(TestRuleIgnoreTestSuites.java:54)
	at com.carrotsearch.randomizedtesting.rules.StatementAdapter.evaluate(StatementAdapter.java:36)
	at com.carrotsearch.randomizedtesting.ThreadLeakControl$StatementRunner.run(ThreadLeakControl.java:368)
	at java.lang.Thread.run(Thread.java:748)


FAILED:  org.apache.solr.cloud.api.collections.ShardSplitTest.testSplitAfterFailedSplit

Error Message:
expected:<1> but was:<2>

Stack Trace:
java.lang.AssertionError: expected:<1> but was:<2>
	at __randomizedtesting.SeedInfo.seed([BBEA183626B44C34:42A78B991AC101BE]:0)
	at org.junit.Assert.fail(Assert.java:93)
	at org.junit.Assert.failNotEquals(Assert.java:647)
	at org.junit.Assert.assertEquals(Assert.java:128)
	at org.junit.Assert.assertEquals(Assert.java:472)
	at org.junit.Assert.assertEquals(Assert.java:456)
	at org.apache.solr.cloud.api.collections.ShardSplitTest.testSplitAfterFailedSplit(ShardSplitTest.java:282)
	at sun.reflect.NativeMethodAccessorImpl.invoke0(Native Method)
	at sun.reflect.NativeMethodAccessorImpl.invoke(NativeMethodAccessorImpl.java:62)
	at sun.reflect.DelegatingMethodAccessorImpl.invoke(DelegatingMethodAccessorImpl.java:43)
	at java.lang.reflect.Method.invoke(Method.java:498)
	at com.carrotsearch.randomizedtesting.RandomizedRunner.invoke(RandomizedRunner.java:1737)
	at com.carrotsearch.randomizedtesting.RandomizedRunner$8.evaluate(RandomizedRunner.java:934)
	at com.carrotsearch.randomizedtesting.RandomizedRunner$9.evaluate(RandomizedRunner.java:970)
	at com.carrotsearch.randomizedtesting.RandomizedRunner$10.evaluate(RandomizedRunner.java:984)
	at org.apache.solr.BaseDistributedSearchTestCase$ShardsRepeatRule$ShardsFixedStatement.callStatement(BaseDistributedSearchTestCase.java:993)
	at org.apache.solr.BaseDistributedSearchTestCase$ShardsRepeatRule$ShardsStatement.evaluate(BaseDistributedSearchTestCase.java:968)
	at com.carrotsearch.randomizedtesting.rules.SystemPropertiesRestoreRule$1.evaluate(SystemPropertiesRestoreRule.java:57)
	at org.apache.lucene.util.TestRuleSetupTeardownChained$1.evaluate(TestRuleSetupTeardownChained.java:49)
	at org.apache.lucene.util.AbstractBeforeAfterRule$1.evaluate(AbstractBeforeAfterRule.java:45)
	at org.apache.lucene.util.TestRuleThreadAndTestName$1.evaluate(TestRuleThreadAndTestName.java:48)
	at org.apache.lucene.util.TestRuleIgnoreAfterMaxFailures$1.evaluate(TestRuleIgnoreAfterMaxFailures.java:64)
	at org.apache.lucene.util.TestRuleMarkFailure$1.evaluate(TestRuleMarkFailure.java:47)
	at com.carrotsearch.randomizedtesting.rules.StatementAdapter.evaluate(StatementAdapter.java:36)
	at com.carrotsearch.randomizedtesting.ThreadLeakControl$StatementRunner.run(ThreadLeakControl.java:368)
	at com.carrotsearch.randomizedtesting.ThreadLeakControl.forkTimeoutingTask(ThreadLeakControl.java:817)
	at com.carrotsearch.randomizedtesting.ThreadLeakControl$3.evaluate(ThreadLeakControl.java:468)
	at com.carrotsearch.randomizedtesting.RandomizedRunner.runSingleTest(RandomizedRunner.java:943)
	at com.carrotsearch.randomizedtesting.RandomizedRunner$5.evaluate(RandomizedRunner.java:829)
	at com.carrotsearch.randomizedtesting.RandomizedRunner$6.evaluate(RandomizedRunner.java:879)
	at com.carrotsearch.randomizedtesting.RandomizedRunner$7.evaluate(RandomizedRunner.java:890)
	at com.carrotsearch.randomizedtesting.rules.StatementAdapter.evaluate(StatementAdapter.java:36)
	at com.carrotsearch.randomizedtesting.rules.SystemPropertiesRestoreRule$1.evaluate(SystemPropertiesRestoreRule.java:57)
	at org.apache.lucene.util.AbstractBeforeAfterRule$1.evaluate(AbstractBeforeAfterRule.java:45)
	at com.carrotsearch.randomizedtesting.rules.StatementAdapter.evaluate(StatementAdapter.java:36)
	at org.apache.lucene.util.TestRuleStoreClassName$1.evaluate(TestRuleStoreClassName.java:41)
	at com.carrotsearch.randomizedtesting.rules.NoShadowingOrOverridesOnMethodsRule$1.evaluate(NoShadowingOrOverridesOnMethodsRule.java:40)
	at com.carrotsearch.randomizedtesting.rules.NoShadowingOrOverridesOnMethodsRule$1.evaluate(NoShadowingOrOverridesOnMethodsRule.java:40)
	at com.carrotsearch.randomizedtesting.rules.StatementAdapter.evaluate(StatementAdapter.java:36)
	at com.carrotsearch.randomizedtesting.rules.StatementAdapter.evaluate(StatementAdapter.java:36)
	at com.carrotsearch.randomizedtesting.rules.StatementAdapter.evaluate(StatementAdapter.java:36)
	at org.apache.lucene.util.TestRuleAssertionsRequired$1.evaluate(TestRuleAssertionsRequired.java:53)
	at org.apache.lucene.util.TestRuleMarkFailure$1.evaluate(TestRuleMarkFailure.java:47)
	at org.apache.lucene.util.TestRuleIgnoreAfterMaxFailures$1.evaluate(TestRuleIgnoreAfterMaxFailures.java:64)
	at org.apache.lucene.util.TestRuleIgnoreTestSuites$1.evaluate(TestRuleIgnoreTestSuites.java:54)
	at com.carrotsearch.randomizedtesting.rules.StatementAdapter.evaluate(StatementAdapter.java:36)
	at com.carrotsearch.randomizedtesting.ThreadLeakControl$StatementRunner.run(ThreadLeakControl.java:368)
	at java.lang.Thread.run(Thread.java:748)


FAILED:  org.apache.solr.cloud.autoscaling.ComputePlanActionTest.testNodeWithMultipleReplicasLost

Error Message:
The operations computed by ComputePlanAction should not be null SolrClientNodeStateProvider.DEBUG{AFTER_ACTION=[compute_plan, null], BEFORE_ACTION=[compute_plan, null]}

Stack Trace:
java.lang.AssertionError: The operations computed by ComputePlanAction should not be null SolrClientNodeStateProvider.DEBUG{AFTER_ACTION=[compute_plan, null], BEFORE_ACTION=[compute_plan, null]}
	at __randomizedtesting.SeedInfo.seed([BBEA183626B44C34:8B2AF9B4AEC6AD68]:0)
	at org.junit.Assert.fail(Assert.java:93)
	at org.junit.Assert.assertTrue(Assert.java:43)
	at org.junit.Assert.assertNotNull(Assert.java:526)
	at org.apache.solr.cloud.autoscaling.ComputePlanActionTest.testNodeWithMultipleReplicasLost(ComputePlanActionTest.java:291)
	at sun.reflect.NativeMethodAccessorImpl.invoke0(Native Method)
	at sun.reflect.NativeMethodAccessorImpl.invoke(NativeMethodAccessorImpl.java:62)
	at sun.reflect.DelegatingMethodAccessorImpl.invoke(DelegatingMethodAccessorImpl.java:43)
	at java.lang.reflect.Method.invoke(Method.java:498)
	at com.carrotsearch.randomizedtesting.RandomizedRunner.invoke(RandomizedRunner.java:1737)
	at com.carrotsearch.randomizedtesting.RandomizedRunner$8.evaluate(RandomizedRunner.java:934)
	at com.carrotsearch.randomizedtesting.RandomizedRunner$9.evaluate(RandomizedRunner.java:970)
	at com.carrotsearch.randomizedtesting.RandomizedRunner$10.evaluate(RandomizedRunner.java:984)
	at com.carrotsearch.randomizedtesting.rules.SystemPropertiesRestoreRule$1.evaluate(SystemPropertiesRestoreRule.java:57)
	at org.apache.lucene.util.TestRuleSetupTeardownChained$1.evaluate(TestRuleSetupTeardownChained.java:49)
	at org.apache.lucene.util.AbstractBeforeAfterRule$1.evaluate(AbstractBeforeAfterRule.java:45)
	at org.apache.lucene.util.TestRuleThreadAndTestName$1.evaluate(TestRuleThreadAndTestName.java:48)
	at org.apache.lucene.util.TestRuleIgnoreAfterMaxFailures$1.evaluate(TestRuleIgnoreAfterMaxFailures.java:64)
	at org.apache.lucene.util.TestRuleMarkFailure$1.evaluate(TestRuleMarkFailure.java:47)
	at com.carrotsearch.randomizedtesting.rules.StatementAdapter.evaluate(StatementAdapter.java:36)
	at com.carrotsearch.randomizedtesting.ThreadLeakControl$StatementRunner.run(ThreadLeakControl.java:368)
	at com.carrotsearch.randomizedtesting.ThreadLeakControl.forkTimeoutingTask(ThreadLeakControl.java:817)
	at com.carrotsearch.randomizedtesting.ThreadLeakControl$3.evaluate(ThreadLeakControl.java:468)
	at com.carrotsearch.randomizedtesting.RandomizedRunner.runSingleTest(RandomizedRunner.java:943)
	at com.carrotsearch.randomizedtesting.RandomizedRunner$5.evaluate(RandomizedRunner.java:829)
	at com.carrotsearch.randomizedtesting.RandomizedRunner$6.evaluate(RandomizedRunner.java:879)
	at com.carrotsearch.randomizedtesting.RandomizedRunner$7.evaluate(RandomizedRunner.java:890)
	at com.carrotsearch.randomizedtesting.rules.StatementAdapter.evaluate(StatementAdapter.java:36)
	at com.carrotsearch.randomizedtesting.rules.SystemPropertiesRestoreRule$1.evaluate(SystemPropertiesRestoreRule.java:57)
	at org.apache.lucene.util.AbstractBeforeAfterRule$1.evaluate(AbstractBeforeAfterRule.java:45)
	at com.carrotsearch.randomizedtesting.rules.StatementAdapter.evaluate(StatementAdapter.java:36)
	at org.apache.lucene.util.TestRuleStoreClassName$1.evaluate(TestRuleStoreClassName.java:41)
	at com.carrotsearch.randomizedtesting.rules.NoShadowingOrOverridesOnMethodsRule$1.evaluate(NoShadowingOrOverridesOnMethodsRule.java:40)
	at com.carrotsearch.randomizedtesting.rules.NoShadowingOrOverridesOnMethodsRule$1.evaluate(NoShadowingOrOverridesOnMethodsRule.java:40)
	at com.carrotsearch.randomizedtesting.rules.StatementAdapter.evaluate(StatementAdapter.java:36)
	at com.carrotsearch.randomizedtesting.rules.StatementAdapter.evaluate(StatementAdapter.java:36)
	at com.carrotsearch.randomizedtesting.rules.StatementAdapter.evaluate(StatementAdapter.java:36)
	at org.apache.lucene.util.TestRuleAssertionsRequired$1.evaluate(TestRuleAssertionsRequired.java:53)
	at org.apache.lucene.util.TestRuleMarkFailure$1.evaluate(TestRuleMarkFailure.java:47)
	at org.apache.lucene.util.TestRuleIgnoreAfterMaxFailures$1.evaluate(TestRuleIgnoreAfterMaxFailures.java:64)
	at org.apache.lucene.util.TestRuleIgnoreTestSuites$1.evaluate(TestRuleIgnoreTestSuites.java:54)
	at com.carrotsearch.randomizedtesting.rules.StatementAdapter.evaluate(StatementAdapter.java:36)
	at com.carrotsearch.randomizedtesting.ThreadLeakControl$StatementRunner.run(ThreadLeakControl.java:368)
	at java.lang.Thread.run(Thread.java:748)




Build Log:
[...truncated 13937 lines...]
   [junit4] Suite: org.apache.solr.cloud.ReplaceNodeNoTargetTest
   [junit4]   2> 2572219 INFO  (SUITE-ReplaceNodeNoTargetTest-seed#[BBEA183626B44C34]-worker) [    ] o.a.s.SolrTestCaseJ4 SecureRandom sanity checks: test.solr.allowed.securerandom=null & java.security.egd=file:/dev/./urandom
   [junit4]   2> Creating dataDir: /home/jenkins/workspace/Lucene-Solr-master-Linux/solr/build/solr-core/test/J2/temp/solr.cloud.ReplaceNodeNoTargetTest_BBEA183626B44C34-001/init-core-data-001
   [junit4]   2> 2572219 WARN  (SUITE-ReplaceNodeNoTargetTest-seed#[BBEA183626B44C34]-worker) [    ] o.a.s.SolrTestCaseJ4 startTrackingSearchers: numOpens=2 numCloses=2
   [junit4]   2> 2572219 INFO  (SUITE-ReplaceNodeNoTargetTest-seed#[BBEA183626B44C34]-worker) [    ] o.a.s.SolrTestCaseJ4 Using TrieFields (NUMERIC_POINTS_SYSPROP=false) w/NUMERIC_DOCVALUES_SYSPROP=true
   [junit4]   2> 2572221 INFO  (SUITE-ReplaceNodeNoTargetTest-seed#[BBEA183626B44C34]-worker) [    ] o.a.s.SolrTestCaseJ4 Randomized ssl (true) and clientAuth (false) via: @org.apache.solr.util.RandomizeSSL(reason=, value=NaN, ssl=NaN, clientAuth=NaN)
   [junit4]   2> 2572221 INFO  (SUITE-ReplaceNodeNoTargetTest-seed#[BBEA183626B44C34]-worker) [    ] o.a.s.c.MiniSolrCloudCluster Starting cluster of 6 servers in /home/jenkins/workspace/Lucene-Solr-master-Linux/solr/build/solr-core/test/J2/temp/solr.cloud.ReplaceNodeNoTargetTest_BBEA183626B44C34-001/tempDir-001
   [junit4]   2> 2572222 INFO  (SUITE-ReplaceNodeNoTargetTest-seed#[BBEA183626B44C34]-worker) [    ] o.a.s.c.ZkTestServer STARTING ZK TEST SERVER
   [junit4]   2> 2572222 INFO  (Thread-7505) [    ] o.a.s.c.ZkTestServer client port:0.0.0.0/0.0.0.0:0
   [junit4]   2> 2572222 INFO  (Thread-7505) [    ] o.a.s.c.ZkTestServer Starting server
   [junit4]   2> 2572224 ERROR (Thread-7505) [    ] o.a.z.s.ZooKeeperServer ZKShutdownHandler is not registered, so ZooKeeper server won't take any action on ERROR or SHUTDOWN server state changes
   [junit4]   2> 2572322 INFO  (SUITE-ReplaceNodeNoTargetTest-seed#[BBEA183626B44C34]-worker) [    ] o.a.s.c.ZkTestServer start zk server on port:39647
   [junit4]   2> 2572324 INFO  (zkConnectionManagerCallback-3678-thread-1) [    ] o.a.s.c.c.ConnectionManager zkClient has connected
   [junit4]   2> 2572327 INFO  (jetty-launcher-3675-thread-4) [    ] o.e.j.s.Server jetty-9.4.8.v20171121, build timestamp: 2017-11-21T21:27:37Z, git hash: 82b8fb23f757335bb3329d540ce37a2a2615f0a8
   [junit4]   2> 2572328 INFO  (jetty-launcher-3675-thread-3) [    ] o.e.j.s.Server jetty-9.4.8.v20171121, build timestamp: 2017-11-21T21:27:37Z, git hash: 82b8fb23f757335bb3329d540ce37a2a2615f0a8
   [junit4]   2> 2572328 INFO  (jetty-launcher-3675-thread-2) [    ] o.e.j.s.Server jetty-9.4.8.v20171121, build timestamp: 2017-11-21T21:27:37Z, git hash: 82b8fb23f757335bb3329d540ce37a2a2615f0a8
   [junit4]   2> 2572328 INFO  (jetty-launcher-3675-thread-5) [    ] o.e.j.s.Server jetty-9.4.8.v20171121, build timestamp: 2017-11-21T21:27:37Z, git hash: 82b8fb23f757335bb3329d540ce37a2a2615f0a8
   [junit4]   2> 2572328 INFO  (jetty-launcher-3675-thread-1) [    ] o.e.j.s.Server jetty-9.4.8.v20171121, build timestamp: 2017-11-21T21:27:37Z, git hash: 82b8fb23f757335bb3329d540ce37a2a2615f0a8
   [junit4]   2> 2572329 INFO  (jetty-launcher-3675-thread-6) [    ] o.e.j.s.Server jetty-9.4.8.v20171121, build timestamp: 2017-11-21T21:27:37Z, git hash: 82b8fb23f757335bb3329d540ce37a2a2615f0a8
   [junit4]   2> 2572331 INFO  (jetty-launcher-3675-thread-6) [    ] o.e.j.s.session DefaultSessionIdManager workerName=node0
   [junit4]   2> 2572331 INFO  (jetty-launcher-3675-thread-6) [    ] o.e.j.s.session No SessionScavenger set, using defaults
   [junit4]   2> 2572331 INFO  (jetty-launcher-3675-thread-6) [    ] o.e.j.s.session Scavenging every 660000ms
   [junit4]   2> 2572331 INFO  (jetty-launcher-3675-thread-1) [    ] o.e.j.s.session DefaultSessionIdManager workerName=node0
   [junit4]   2> 2572331 INFO  (jetty-launcher-3675-thread-1) [    ] o.e.j.s.session No SessionScavenger set, using defaults
   [junit4]   2> 2572331 INFO  (jetty-launcher-3675-thread-1) [    ] o.e.j.s.session Scavenging every 660000ms
   [junit4]   2> 2572331 INFO  (jetty-launcher-3675-thread-3) [    ] o.e.j.s.session DefaultSessionIdManager workerName=node0
   [junit4]   2> 2572331 INFO  (jetty-launcher-3675-thread-2) [    ] o.e.j.s.session DefaultSessionIdManager workerName=node0
   [junit4]   2> 2572331 INFO  (jetty-launcher-3675-thread-3) [    ] o.e.j.s.session No SessionScavenger set, using defaults
   [junit4]   2> 2572331 INFO  (jetty-launcher-3675-thread-2) [    ] o.e.j.s.session No SessionScavenger set, using defaults
   [junit4]   2> 2572331 INFO  (jetty-launcher-3675-thread-3) [    ] o.e.j.s.session Scavenging every 660000ms
   [junit4]   2> 2572331 INFO  (jetty-launcher-3675-thread-2) [    ] o.e.j.s.session Scavenging every 660000ms
   [junit4]   2> 2572331 INFO  (jetty-launcher-3675-thread-1) [    ] o.e.j.s.h.ContextHandler Started o.e.j.s.ServletContextHandler@7125379c{/solr,null,AVAILABLE}
   [junit4]   2> 2572332 INFO  (jetty-launcher-3675-thread-3) [    ] o.e.j.s.h.ContextHandler Started o.e.j.s.ServletContextHandler@3d7788bb{/solr,null,AVAILABLE}
   [junit4]   2> 2572332 INFO  (jetty-launcher-3675-thread-5) [    ] o.e.j.s.session DefaultSessionIdManager workerName=node0
   [junit4]   2> 2572332 INFO  (jetty-launcher-3675-thread-5) [    ] o.e.j.s.session No SessionScavenger set, using defaults
   [junit4]   2> 2572332 INFO  (jetty-launcher-3675-thread-5) [    ] o.e.j.s.session Scavenging every 600000ms
   [junit4]   2> 2572332 INFO  (jetty-launcher-3675-thread-2) [    ] o.e.j.s.h.ContextHandler Started o.e.j.s.ServletContextHandler@3d2168f6{/solr,null,AVAILABLE}
   [junit4]   2> 2572332 INFO  (jetty-launcher-3675-thread-6) [    ] o.e.j.s.h.ContextHandler Started o.e.j.s.ServletContextHandler@4222acf2{/solr,null,AVAILABLE}
   [junit4]   2> 2572332 INFO  (jetty-launcher-3675-thread-5) [    ] o.e.j.s.h.ContextHandler Started o.e.j.s.ServletContextHandler@214db336{/solr,null,AVAILABLE}
   [junit4]   2> 2572333 INFO  (jetty-launcher-3675-thread-4) [    ] o.e.j.s.session DefaultSessionIdManager workerName=node0
   [junit4]   2> 2572333 INFO  (jetty-launcher-3675-thread-4) [    ] o.e.j.s.session No SessionScavenger set, using defaults
   [junit4]   2> 2572333 INFO  (jetty-launcher-3675-thread-4) [    ] o.e.j.s.session Scavenging every 660000ms
   [junit4]   2> 2572334 INFO  (jetty-launcher-3675-thread-1) [    ] o.e.j.s.AbstractConnector Started ServerConnector@65719f09{SSL,[ssl, http/1.1]}{127.0.0.1:36975}
   [junit4]   2> 2572334 INFO  (jetty-launcher-3675-thread-3) [    ] o.e.j.s.AbstractConnector Started ServerConnector@10c6321b{SSL,[ssl, http/1.1]}{127.0.0.1:36063}
   [junit4]   2> 2572334 INFO  (jetty-launcher-3675-thread-1) [    ] o.e.j.s.Server Started @2574207ms
   [junit4]   2> 2572334 INFO  (jetty-launcher-3675-thread-2) [    ] o.e.j.s.AbstractConnector Started ServerConnector@7e46a41d{SSL,[ssl, http/1.1]}{127.0.0.1:38205}
   [junit4]   2> 2572334 INFO  (jetty-launcher-3675-thread-6) [    ] o.e.j.s.AbstractConnector Started ServerConnector@3e143ce3{SSL,[ssl, http/1.1]}{127.0.0.1:46547}
   [junit4]   2> 2572334 INFO  (jetty-launcher-3675-thread-2) [    ] o.e.j.s.Server Started @2574207ms
   [junit4]   2> 2572334 INFO  (jetty-launcher-3675-thread-6) [    ] o.e.j.s.Server Started @2574207ms
   [junit4]   2> 2572334 INFO  (jetty-launcher-3675-thread-4) [    ] o.e.j.s.h.ContextHandler Started o.e.j.s.ServletContextHandler@a8d12c6{/solr,null,AVAILABLE}
   [junit4]   2> 2572334 INFO  (jetty-launcher-3675-thread-5) [    ] o.e.j.s.AbstractConnector Started ServerConnector@2500188{SSL,[ssl, http/1.1]}{127.0.0.1:39961}
   [junit4]   2> 2572334 INFO  (jetty-launcher-3675-thread-6) [    ] o.a.s.c.s.e.JettySolrRunner Jetty properties: {hostContext=/solr, hostPort=46547}
   [junit4]   2> 2572334 INFO  (jetty-launcher-3675-thread-5) [    ] o.e.j.s.Server Started @2574207ms
   [junit4]   2> 2572334 INFO  (jetty-launcher-3675-thread-2) [    ] o.a.s.c.s.e.JettySolrRunner Jetty properties: {hostContext=/solr, hostPort=38205}
   [junit4]   2> 2572334 INFO  (jetty-launcher-3675-thread-1) [    ] o.a.s.c.s.e.JettySolrRunner Jetty properties: {hostContext=/solr, hostPort=36975}
   [junit4]   2> 2572334 INFO  (jetty-launcher-3675-thread-3) [    ] o.e.j.s.Server Started @2574207ms
   [junit4]   2> 2572334 ERROR (jetty-launcher-3675-thread-6) [    ] o.a.s.u.StartupLoggingUtils Missing Java Option solr.log.dir. Logging may be missing or incomplete.
   [junit4]   2> 2572334 INFO  (jetty-launcher-3675-thread-3) [    ] o.a.s.c.s.e.JettySolrRunner Jetty properties: {hostContext=/solr, hostPort=36063}
   [junit4]   2> 2572334 ERROR (jetty-launcher-3675-thread-2) [    ] o.a.s.u.StartupLoggingUtils Missing Java Option solr.log.dir. Logging may be missing or incomplete.
   [junit4]   2> 2572334 INFO  (jetty-launcher-3675-thread-6) [    ] o.a.s.s.SolrDispatchFilter  ___      _       Welcome to Apache Solr? version 8.0.0
   [junit4]   2> 2572335 INFO  (jetty-launcher-3675-thread-2) [    ] o.a.s.s.SolrDispatchFilter  ___      _       Welcome to Apache Solr? version 8.0.0
   [junit4]   2> 2572335 INFO  (jetty-launcher-3675-thread-6) [    ] o.a.s.s.SolrDispatchFilter / __| ___| |_ _   Starting in cloud mode on port null
   [junit4]   2> 2572335 INFO  (jetty-launcher-3675-thread-2) [    ] o.a.s.s.SolrDispatchFilter / __| ___| |_ _   Starting in cloud mode on port null
   [junit4]   2> 2572335 INFO  (jetty-launcher-3675-thread-6) [    ] o.a.s.s.SolrDispatchFilter \__ \/ _ \ | '_|  Install dir: null
   [junit4]   2> 2572335 INFO  (jetty-launcher-3675-thread-2) [    ] o.a.s.s.SolrDispatchFilter \__ \/ _ \ | '_|  Install dir: null
   [junit4]   2> 2572335 INFO  (jetty-launcher-3675-thread-6) [    ] o.a.s.s.SolrDispatchFilter |___/\___/_|_|    Start time: 2018-02-22T02:35:20.296Z
   [junit4]   2> 2572335 INFO  (jetty-launcher-3675-thread-2) [    ] o.a.s.s.SolrDispatchFilter |___/\___/_|_|    Start time: 2018-02-22T02:35:20.296Z
   [junit4]   2> 2572335 ERROR (jetty-launcher-3675-thread-3) [    ] o.a.s.u.StartupLoggingUtils Missing Java Option solr.log.dir. Logging may be missing or incomplete.
   [junit4]   2> 2572335 INFO  (jetty-launcher-3675-thread-4) [    ] o.e.j.s.AbstractConnector Started ServerConnector@647c48d5{SSL,[ssl, http/1.1]}{127.0.0.1:34237}
   [junit4]   2> 2572335 INFO  (jetty-launcher-3675-thread-3) [    ] o.a.s.s.SolrDispatchFilter  ___      _       Welcome to Apache Solr? version 8.0.0
   [junit4]   2> 2572335 INFO  (jetty-launcher-3675-thread-4) [    ] o.e.j.s.Server Started @2574208ms
   [junit4]   2> 2572335 INFO  (jetty-launcher-3675-thread-3) [    ] o.a.s.s.SolrDispatchFilter / __| ___| |_ _   Starting in cloud mode on port null
   [junit4]   2> 2572335 INFO  (jetty-launcher-3675-thread-4) [    ] o.a.s.c.s.e.JettySolrRunner Jetty properties: {hostContext=/solr, hostPort=34237}
   [junit4]   2> 2572335 INFO  (jetty-launcher-3675-thread-3) [    ] o.a.s.s.SolrDispatchFilter \__ \/ _ \ | '_|  Install dir: null
   [junit4]   2> 2572334 ERROR (jetty-launcher-3675-thread-1) [    ] o.a.s.u.StartupLoggingUtils Missing Java Option solr.log.dir. Logging may be missing or incomplete.
   [junit4]   2> 2572335 INFO  (jetty-launcher-3675-thread-3) [    ] o.a.s.s.SolrDispatchFilter |___/\___/_|_|    Start time: 2018-02-22T02:35:20.296Z
   [junit4]   2> 2572335 INFO  (jetty-launcher-3675-thread-1) [    ] o.a.s.s.SolrDispatchFilter  ___      _       Welcome to Apache Solr? version 8.0.0
   [junit4]   2> 2572335 INFO  (jetty-launcher-3675-thread-1) [    ] o.a.s.s.SolrDispatchFilter / __| ___| |_ _   Starting in cloud mode on port null
   [junit4]   2> 2572335 INFO  (jetty-launcher-3675-thread-1) [    ] o.a.s.s.SolrDispatchFilter \__ \/ _ \ | '_|  Install dir: null
   [junit4]   2> 2572335 INFO  (jetty-launcher-3675-thread-1) [    ] o.a.s.s.SolrDispatchFilter |___/\___/_|_|    Start time: 2018-02-22T02:35:20.296Z
   [junit4]   2> 2572334 INFO  (jetty-launcher-3675-thread-5) [    ] o.a.s.c.s.e.JettySolrRunner Jetty properties: {hostContext=/solr, hostPort=39961}
   [junit4]   2> 2572336 ERROR (jetty-launcher-3675-thread-5) [    ] o.a.s.u.StartupLoggingUtils Missing Java Option solr.log.dir. Logging may be missing or incomplete.
   [junit4]   2> 2572336 INFO  (zkConnectionManagerCallback-3682-thread-1) [    ] o.a.s.c.c.ConnectionManager zkClient has connected
   [junit4]   2> 2572336 INFO  (jetty-launcher-3675-thread-5) [    ] o.a.s.s.SolrDispatchFilter  ___      _       Welcome to Apache Solr? version 8.0.0
   [junit4]   2> 2572336 INFO  (jetty-launcher-3675-thread-5) [    ] o.a.s.s.SolrDispatchFilter / __| ___| |_ _   Starting in cloud mode on port null
   [junit4]   2> 2572336 INFO  (jetty-launcher-3675-thread-5) [    ] o.a.s.s.SolrDispatchFilter \__ \/ _ \ | '_|  Install dir: null
   [junit4]   2> 2572336 INFO  (jetty-launcher-3675-thread-5) [    ] o.a.s.s.SolrDispatchFilter |___/\___/_|_|    Start time: 2018-02-22T02:35:20.297Z
   [junit4]   2> 2572336 INFO  (jetty-launcher-3675-thread-2) [    ] o.a.s.s.SolrDispatchFilter solr.xml found in ZooKeeper. Loading...
   [junit4]   2> 2572336 INFO  (zkConnectionManagerCallback-3684-thread-1) [    ] o.a.s.c.c.ConnectionManager zkClient has connected
   [junit4]   2> 2572336 INFO  (zkConnectionManagerCallback-3681-thread-1) [    ] o.a.s.c.c.ConnectionManager zkClient has connected
   [junit4]   2> 2572335 ERROR (jetty-launcher-3675-thread-4) [    ] o.a.s.u.StartupLoggingUtils Missing Java Option solr.log.dir. Logging may be missing or incomplete.
   [junit4]   2> 2572336 INFO  (jetty-launcher-3675-thread-4) [    ] o.a.s.s.SolrDispatchFilter  ___      _       Welcome to Apache Solr? version 8.0.0
   [junit4]   2> 2572336 INFO  (jetty-launcher-3675-thread-4) [    ] o.a.s.s.SolrDispatchFilter / __| ___| |_ _   Starting in cloud mode on port null
   [junit4]   2> 2572336 INFO  (jetty-launcher-3675-thread-6) [    ] o.a.s.s.SolrDispatchFilter solr.xml found in ZooKeeper. Loading...
   [junit4]   2> 2572336 INFO  (jetty-launcher-3675-thread-3) [    ] o.a.s.s.SolrDispatchFilter solr.xml found in ZooKeeper. Loading...
   [junit4]   2> 2572336 INFO  (jetty-launcher-3675-thread-4) [    ] o.a.s.s.SolrDispatchFilter \__ \/ _ \ | '_|  Install dir: null
   [junit4]   2> 2572337 INFO  (jetty-launcher-3675-thread-4) [    ] o.a.s.s.SolrDispatchFilter |___/\___/_|_|    Start time: 2018-02-22T02:35:20.298Z
   [junit4]   2> 2572341 INFO  (zkConnectionManagerCallback-3686-thread-1) [    ] o.a.s.c.c.ConnectionManager zkClient has connected
   [junit4]   2> 2572341 INFO  (jetty-launcher-3675-thread-1) [    ] o.a.s.s.SolrDispatchFilter solr.xml found in ZooKeeper. Loading...
   [junit4]   2> 2572342 INFO  (zkConnectionManagerCallback-3688-thread-1) [    ] o.a.s.c.c.ConnectionManager zkClient has connected
   [junit4]   2> 2572342 INFO  (jetty-launcher-3675-thread-5) [    ] o.a.s.s.SolrDispatchFilter solr.xml found in ZooKeeper. Loading...
   [junit4]   2> 2572365 WARN  (NIOServerCxn.Factory:0.0.0.0/0.0.0.0:0) [    ] o.a.z.s.NIOServerCnxn Unable to read additional data from client sessionid 0x1007900926e0006, likely client has closed socket
   [junit4]   2> 2572365 INFO  (jetty-launcher-3675-thread-3) [    ] o.a.s.c.ZkContainer Zookeeper client=127.0.0.1:39647/solr
   [junit4]   2> 2572366 INFO  (zkConnectionManagerCallback-3690-thread-1) [    ] o.a.s.c.c.ConnectionManager zkClient has connected
   [junit4]   2> 2572366 INFO  (jetty-launcher-3675-thread-4) [    ] o.a.s.s.SolrDispatchFilter solr.xml found in ZooKeeper. Loading...
   [junit4]   2> 2572367 INFO  (jetty-launcher-3675-thread-2) [    ] o.a.s.c.ZkContainer Zookeeper client=127.0.0.1:39647/solr
   [junit4]   2> 2572367 INFO  (zkConnectionManagerCallback-3694-thread-1) [    ] o.a.s.c.c.ConnectionManager zkClient has connected
   [junit4]   2> 2572368 INFO  (jetty-launcher-3675-thread-6) [    ] o.a.s.c.ZkContainer Zookeeper client=127.0.0.1:39647/solr
   [junit4]   2> 2572372 INFO  (jetty-launcher-3675-thread-5) [    ] o.a.s.c.ZkContainer Zookeeper client=127.0.0.1:39647/solr
   [junit4]   2> 2572385 INFO  (jetty-launcher-3675-thread-1) [    ] o.a.s.c.ZkContainer Zookeeper client=127.0.0.1:39647/solr
   [junit4]   2> 2572387 INFO  (zkConnectionManagerCallback-3706-thread-1) [    ] o.a.s.c.c.ConnectionManager zkClient has connected
   [junit4]   2> 2572394 INFO  (zkConnectionManagerCallback-3708-thread-1-processing-n:127.0.0.1:36063_solr) [n:127.0.0.1:36063_solr    ] o.a.s.c.c.ConnectionManager zkClient has connected
   [junit4]   2> 2572394 INFO  (jetty-launcher-3675-thread-4) [    ] o.a.s.c.ZkContainer Zookeeper client=127.0.0.1:39647/solr
   [junit4]   2> 2572397 INFO  (zkConnectionManagerCallback-3702-thread-1) [    ] o.a.s.c.c.ConnectionManager zkClient has connected
   [junit4]   2> 2572401 INFO  (zkConnectionManagerCallback-3712-thread-1) [    ] o.a.s.c.c.ConnectionManager zkClient has connected
   [junit4]   2> 2572409 INFO  (zkConnectionManagerCallback-3699-thread-1) [    ] o.a.s.c.c.ConnectionManager zkClient has connected
   [junit4]   2> 2572418 INFO  (zkConnectionManagerCallback-3714-thread-1-processing-n:127.0.0.1:39961_solr) [n:127.0.0.1:39961_solr    ] o.a.s.c.c.ConnectionManager zkClient has connected
   [junit4]   2> 2572423 INFO  (jetty-launcher-3675-thread-5) [n:127.0.0.1:39961_solr    ] o.a.s.c.Overseer Overseer (id=null) closing
   [junit4]   2> 2572432 INFO  (jetty-launcher-3675-thread-5) [n:127.0.0.1:39961_solr    ] o.a.s.c.OverseerElectionContext I am going to be the leader 127.0.0.1:39961_solr
   [junit4]   2> 2572433 INFO  (jetty-launcher-3675-thread-5) [n:127.0.0.1:39961_solr    ] o.a.s.c.Overseer Overseer (id=72190637401571341-127.0.0.1:39961_solr-n_0000000000) starting
   [junit4]   2> 2572437 INFO  (zkConnectionManagerCallback-3725-thread-1-processing-n:127.0.0.1:38205_solr) [n:127.0.0.1:38205_solr    ] o.a.s.c.c.ConnectionManager zkClient has connected
   [junit4]   2> 2572441 INFO  (jetty-launcher-3675-thread-3) [n:127.0.0.1:36063_solr    ] o.a.s.c.Overseer Overseer (id=null) closing
   [junit4]   2> 2572441 INFO  (jetty-launcher-3675-thread-3) [n:127.0.0.1:36063_solr    ] o.a.s.c.ZkController Register node as live in ZooKeeper:/live_nodes/127.0.0.1:36063_solr
   [junit4]   2> 2572442 INFO  (jetty-launcher-3675-thread-2) [n:127.0.0.1:38205_solr    ] o.a.s.c.Overseer Overseer (id=null) closing
   [junit4]   2> 2572443 INFO  (jetty-launcher-3675-thread-2) [n:127.0.0.1:38205_solr    ] o.a.s.c.ZkController Register node as live in ZooKeeper:/live_nodes/127.0.0.1:38205_solr
   [junit4]   2> 2572444 INFO  (zkConnectionManagerCallback-3718-thread-1) [    ] o.a.s.c.c.ConnectionManager zkClient has connected
   [junit4]   2> 2572453 INFO  (zkConnectionManagerCallback-3721-thread-1-processing-n:127.0.0.1:46547_solr) [n:127.0.0.1:46547_solr    ] o.a.s.c.c.ConnectionManager zkClient has connected
   [junit4]   2> 2572456 INFO  (jetty-launcher-3675-thread-6) [n:127.0.0.1:46547_solr    ] o.a.s.c.c.ZkStateReader Updated live nodes from ZooKeeper... (0) -> (2)
   [junit4]   2> 2572457 INFO  (jetty-launcher-3675-thread-6) [n:127.0.0.1:46547_solr    ] o.a.s.c.Overseer Overseer (id=null) closing
   [junit4]   2> 2572458 INFO  (jetty-launcher-3675-thread-6) [n:127.0.0.1:46547_solr    ] o.a.s.c.ZkController Register node as live in ZooKeeper:/live_nodes/127.0.0.1:46547_solr
   [junit4]   2> 2572473 INFO  (zkConnectionManagerCallback-3723-thread-1-processing-n:127.0.0.1:36975_solr) [n:127.0.0.1:36975_solr    ] o.a.s.c.c.ConnectionManager zkClient has connected
   [junit4]   2> 2572476 INFO  (jetty-launcher-3675-thread-1) [n:127.0.0.1:36975_solr    ] o.a.s.c.c.ZkStateReader Updated live nodes from ZooKeeper... (0) -> (3)
   [junit4]   2> 2572476 INFO  (jetty-launcher-3675-thread-1) [n:127.0.0.1:36975_solr    ] o.a.s.c.Overseer Overseer (id=null) closing
   [junit4]   2> 2572477 INFO  (jetty-launcher-3675-thread-1) [n:127.0.0.1:36975_solr    ] o.a.s.c.ZkController Register node as live in ZooKeeper:/live_nodes/127.0.0.1:36975_solr
   [junit4]   2> 2572478 INFO  (zkCallback-3724-thread-1-processing-n:127.0.0.1:38205_solr) [n:127.0.0.1:38205_solr    ] o.a.s.c.c.ZkStateReader Updated live nodes from ZooKeeper... (0) -> (3)
   [junit4]   2> 2572479 INFO  (zkCallback-3713-thread-1-processing-n:127.0.0.1:39961_solr) [n:127.0.0.1:39961_solr    ] o.a.s.c.c.ZkStateReader Updated live nodes from ZooKeeper... (0) -> (3)
   [junit4]   2> 2572479 INFO  (zkCallback-3707-thread-1-processing-n:127.0.0.1:36063_solr) [n:127.0.0.1:36063_solr    ] o.a.s.c.c.ZkStateReader Updated live nodes from ZooKeeper... (0) -> (3)
   [junit4]   2> 2572479 INFO  (zkCallback-3720-thread-1-processing-n:127.0.0.1:46547_solr) [n:127.0.0.1:46547_solr    ] o.a.s.c.c.ZkStateReader Updated live nodes from ZooKeeper... (2) -> (3)
   [junit4]   2> 2572480 INFO  (zkCallback-3724-thread-1-processing-n:127.0.0.1:38205_solr) [n:127.0.0.1:38205_solr    ] o.a.s.c.c.ZkStateReader Updated live nodes from ZooKeeper... (3) -> (4)
   [junit4]   2> 2572481 INFO  (zkCallback-3713-thread-1-processing-n:127.0.0.1:39961_solr) [n:127.0.0.1:39961_solr    ] o.a.s.c.c.ZkStateReader Updated live nodes from ZooKeeper... (3) -> (4)
   [junit4]   2> 2572481 INFO  (jetty-launcher-3675-thread-5) [n:127.0.0.1:39961_solr    ] o.a.s.c.ZkController Register node as live in ZooKeeper:/live_nodes/127.0.0.1:39961_solr
   [junit4]   2> 2572481 INFO  (zkCallback-3707-thread-1-processing-n:127.0.0.1:36063_solr) [n:127.0.0.1:36063_solr    ] o.a.s.c.c.ZkStateReader Updated live nodes from ZooKeeper... (3) -> (4)
   [junit4]   2> 2572485 INFO  (zkCallback-3713-thread-1-processing-n:127.0.0.1:39961_solr) [n:127.0.0.1:39961_solr    ] o.a.s.c.c.ZkStateReader Updated live nodes from ZooKeeper... (4) -> (5)
   [junit4]   2> 2572489 INFO  (zkCallback-3724-thread-1-processing-n:127.0.0.1:38205_solr) [n:127.0.0.1:38205_solr    ] o.a.s.c.c.ZkStateReader Updated live nodes from ZooKeeper... (4) -> (5)
   [junit4]   2> 2572496 INFO  (zkCallback-3707-thread-1-processing-n:127.0.0.1:36063_solr) [n:127.0.0.1:36063_solr    ] o.a.s.c.c.ZkStateReader Updated live nodes from ZooKeeper... (4) -> (5)
   [junit4]   2> 2572500 INFO  (zkCallback-3720-thread-2-processing-n:127.0.0.1:46547_solr) [n:127.0.0.1:46547_solr    ] o.a.s.c.c.ZkStateReader Updated live nodes from ZooKeeper... (3) -> (4)
   [junit4]   2> 2572500 INFO  (zkCallback-3720-thread-1-processing-n:127.0.0.1:46547_solr) [n:127.0.0.1:46547_solr    ] o.a.s.c.c.ZkStateReader Updated live nodes from ZooKeeper... (4) -> (5)
   [junit4]   2> 2572505 INFO  (zkCallback-3722-thread-1-processing-n:127.0.0.1:36975_solr) [n:127.0.0.1:36975_solr    ] o.a.s.c.c.ZkStateReader Updated live nodes from ZooKeeper... (3) -> (5)
   [junit4]   2> 2572509 INFO  (zkConnectionManagerCallback-3731-thread-1-processing-n:127.0.0.1:34237_solr) [n:127.0.0.1:34237_solr    ] o.a.s.c.c.ConnectionManager zkClient has connected
   [junit4]   2> 2572512 INFO  (jetty-launcher-3675-thread-4) [n:127.0.0.1:34237_solr    ] o.a.s.c.c.ZkStateReader Updated live nodes from ZooKeeper... (0) -> (5)
   [junit4]   2> 2572513 INFO  (jetty-launcher-3675-thread-4) [n:127.0.0.1:34237_solr    ] o.a.s.c.Overseer Overseer (id=null) closing
   [junit4]   2> 2572514 INFO  (jetty-launcher-3675-thread-4) [n:127.0.0.1:34237_solr    ] o.a.s.c.ZkController Register node as live in ZooKeeper:/live_nodes/127.0.0.1:34237_solr
   [junit4]   2> 2572515 INFO  (zkCallback-3720-thread-1-processing-n:127.0.0.1:46547_solr) [n:127.0.0.1:46547_solr    ] o.a.s.c.c.ZkStateReader Updated live nodes from ZooKeeper... (5) -> (6)
   [junit4]   2> 2572515 INFO  (zkCallback-3724-thread-1-processing-n:127.0.0.1:38205_solr) [n:127.0.0.1:38205_solr    ] o.a.s.c.c.ZkStateReader Updated live nodes from ZooKeeper... (5) -> (6)
   [junit4]   2> 2572515 INFO  (zkCallback-3707-thread-1-processing-n:127.0.0.1:36063_solr) [n:127.0.0.1:36063_solr    ] o.a.s.c.c.ZkStateReader Updated live nodes from ZooKeeper... (5) -> (6)
   [junit4]   2> 2572525 INFO  (zkCallback-3722-thread-1-processing-n:127.0.0.1:36975_solr) [n:127.0.0.1:36975_solr    ] o.a.s.c.c.ZkStateReader Updated live nodes from ZooKeeper... (5) -> (6)
   [junit4]   2> 2572529 INFO  (zkCallback-3713-thread-2-processing-n:127.0.0.1:39961_solr) [n:127.0.0.1:39961_solr    ] o.a.s.c.c.ZkStateReader Updated live nodes from ZooKeeper... (5) -> (6)
   [junit4]   2> 2572535 INFO  (zkCallback-3730-thread-1-processing-n:127.0.0.1:34237_solr) [n:127.0.0.1:34237_solr    ] o.a.s.c.c.ZkStateReader Updated live nodes from ZooKeeper... (5) -> (6)
   [junit4]   2> 2572699 INFO  (jetty-launcher-3675-thread-1) [n:127.0.0.1:36975_solr    ] o.a.s.m.r.SolrJmxReporter JMX monitoring for 'solr_36975.solr.node' (registry 'solr.node') enabled at server: com.sun.jmx.mbeanserver.JmxMBeanServer@fe40a04
   [junit4]   2> 2572699 INFO  (jetty-launcher-3675-thread-4) [n:127.0.0.1:34237_solr    ] o.a.s.m.r.SolrJmxReporter JMX monitoring for 'solr_34237.solr.node' (registry 'solr.node') enabled at server: com.sun.jmx.mbeanserver.JmxMBeanServer@fe40a04
   [junit4]   2> 2572700 INFO  (jetty-launcher-3675-thread-2) [n:127.0.0.1:38205_solr    ] o.a.s.m.r.SolrJmxReporter JMX monitoring for 'solr_38205.solr.node' (registry 'solr.node') enabled at server: com.sun.jmx.mbeanserver.JmxMBeanServer@fe40a04
   [junit4]   2> 2572701 INFO  (jetty-launcher-3675-thread-3) [n:127.0.0.1:36063_solr    ] o.a.s.m.r.SolrJmxReporter JMX monitoring for 'solr_36063.solr.node' (registry 'solr.node') enabled at server: com.sun.jmx.mbeanserver.JmxMBeanServer@fe40a04
   [junit4]   2> 2572703 INFO  (jetty-launcher-3675-thread-5) [n:127.0.0.1:39961_solr    ] o.a.s.m.r.SolrJmxReporter JMX monitoring for 'solr_39961.solr.node' (registry 'solr.node') enabled at server: com.sun.jmx.mbeanserver.JmxMBeanServer@fe40a04
   [junit4]   2> 2572704 INFO  (jetty-launcher-3675-thread-6) [n:127.0.0.1:46547_solr    ] o.a.s.m.r.SolrJmxReporter JMX monitoring for 'solr_46547.solr.node' (registry 'solr.node') enabled at server: com.sun.jmx.mbeanserver.JmxMBeanServer@fe40a04
   [junit4]   2> 2572722 INFO  (jetty-launcher-3675-thread-1) [n:127.0.0.1:36975_solr    ] o.a.s.m.r.SolrJmxReporter JMX monitoring for 'solr_36975.solr.jvm' (registry 'solr.jvm') enabled at server: com.sun.jmx.mbeanserver.JmxMBeanServer@fe40a04
   [junit4]   2> 2572722 INFO  (jetty-launcher-3675-thread-4) [n:127.0.0.1:34237_solr    ] o.a.s.m.r.SolrJmxReporter JMX monitoring for 'solr_34237.solr.jvm' (registry 'solr.jvm') enabled at server: com.sun.jmx.mbeanserver.JmxMBeanServer@fe40a04
   [junit4]   2> 2572722 INFO  (jetty-launcher-3675-thread-4) [n:127.0.0.1:34237_solr    ] o.a.s.m.r.SolrJmxReporter JMX monitoring for 'solr_34237.solr.jetty' (registry 'solr.jetty') enabled at server: com.sun.jmx.mbeanserver.JmxMBeanServer@fe40a04
   [junit4]   2> 2572722 INFO  (jetty-launcher-3675-thread-1) [n:127.0.0.1:36975_solr    ] o.a.s.m.r.SolrJmxReporter JMX monitoring for 'solr_36975.solr.jetty' (registry 'solr.jetty') enabled at server: com.sun.jmx.mbeanserver.JmxMBeanServer@fe40a04
   [junit4]   2> 2572724 INFO  (jetty-launcher-3675-thread-2) [n:127.0.0.1:38205_solr    ] o.a.s.m.r.SolrJmxReporter JMX monitoring for 'solr_38205.solr.jvm' (registry 'solr.jvm') enabled at server: com.sun.jmx.mbeanserver.JmxMBeanServer@fe40a04
   [junit4]   2> 2572724 INFO  (jetty-launcher-3675-thread-2) [n:127.0.0.1:38205_solr    ] o.a.s.m.r.SolrJmxReporter JMX monitoring for 'solr_38205.solr.jetty' (registry 'solr.jetty') enabled at server: com.sun.jmx.mbeanserver.JmxMBeanServer@fe40a04
   [junit4]   2> 2572724 INFO  (jetty-launcher-3675-thread-3) [n:127.0.0.1:36063_solr    ] o.a.s.m.r.SolrJmxReporter JMX monitoring for 'solr_36063.solr.jvm' (registry 'solr.jvm') enabled at server: com.sun.jmx.mbeanserver.JmxMBeanServer@fe40a04
   [junit4]   2> 2572725 INFO  (jetty-launcher-3675-thread-3) [n:127.0.0.1:36063_solr    ] o.a.s.m.r.SolrJmxReporter JMX monitoring for 'solr_36063.solr.jetty' (registry 'solr.jetty') enabled at server: com.sun.jmx.mbeanserver.JmxMBeanServer@fe40a04
   [junit4]   2> 2572725 INFO  (jetty-launcher-3675-thread-4) [n:127.0.0.1:34237_solr    ] o.a.s.c.CorePropertiesLocator Found 0 core definitions underneath /home/jenkins/workspace/Lucene-Solr-master-Linux/solr/build/solr-core/test/J2/temp/solr.cloud.ReplaceNodeNoTargetTest_BBEA183626B44C34-001/tempDir-001/node4/.
   [junit4]   2> 2572725 INFO  (jetty-launcher-3675-thread-1) [n:127.0.0.1:36975_solr    ] o.a.s.c.CorePropertiesLocator Found 0 core definitions underneath /home/jenkins/workspace/Lucene-Solr-master-Linux/solr/build/solr-core/test/J2/temp/solr.cloud.ReplaceNodeNoTargetTest_BBEA183626B44C34-001/tempDir-001/node1/.
   [junit4]   2> 2572725 INFO  (jetty-launcher-3675-thread-5) [n:127.0.0.1:39961_solr    ] o.a.s.m.r.SolrJmxReporter JMX monitoring for 'solr_39961.solr.jvm' (registry 'solr.jvm') enabled at server: com.sun.jmx.mbeanserver.JmxMBeanServer@fe40a04
   [junit4]   2> 2572725 INFO  (jetty-launcher-3675-thread-2) [n:127.0.0.1:38205_solr    ] o.a.s.c.CorePropertiesLocator Found 0 core definitions underneath /home/jenkins/workspace/Lucene-Solr-master-Linux/solr/build/solr-core/test/J2/temp/solr.cloud.ReplaceNodeNoTargetTest_BBEA183626B44C34-001/tempDir-001/node2/.
   [junit4]   2> 2572725 INFO  (jetty-launcher-3675-thread-5) [n:127.0.0.1:39961_solr    ] o.a.s.m.r.SolrJmxReporter JMX monitoring for 'solr_39961.solr.jetty' (registry 'solr.jetty') enabled at server: com.sun.jmx.mbeanserver.JmxMBeanServer@fe40a04
   [junit4]   2> 2572726 INFO  (jetty-launcher-3675-thread-6) [n:127.0.0.1:46547_solr    ] o.a.s.m.r.SolrJmxReporter JMX monitoring for 'solr_46547.solr.jvm' (registry 'solr.jvm') enabled at server: com.sun.jmx.mbeanserver.JmxMBeanServer@fe40a04
   [junit4]   2> 2572726 INFO  (jetty-launcher-3675-thread-3) [n:127.0.0.1:36063_solr    ] o.a.s.c.CorePropertiesLocator Found 0 core definitions underneath /home/jenkins/workspace/Lucene-Solr-master-Linux/solr/build/solr-core/test/J2/temp/solr.cloud.ReplaceNodeNoTargetTest_BBEA183626B44C34-001/tempDir-001/node3/.
   [junit4]   2> 2572726 INFO  (jetty-launcher-3675-thread-6) [n:127.0.0.1:46547_solr    ] o.a.s.m.r.SolrJmxReporter JMX monitoring for 'solr_46547.solr.jetty' (registry 'solr.jetty') enabled at server: com.sun.jmx.mbeanserver.JmxMBeanServer@fe40a04
   [junit4]   2> 2572726 INFO  (jetty-launcher-3675-thread-6) [n:127.0.0.1:46547_solr    ] o.a.s.c.CorePropertiesLocator Found 0 core definitions underneath /home/jenkins/workspace/Lucene-Solr-master-Linux/solr/build/solr-core/test/J2/temp/solr.cloud.ReplaceNodeNoTargetTest_BBEA183626B44C34-001/tempDir-001/node6/.
   [junit4]   2> 2572726 INFO  (jetty-launcher-3675-thread-5) [n:127.0.0.1:39961_solr    ] o.a.s.c.CorePropertiesLocator Found 0 core definitions underneath /home/jenkins/workspace/Lucene-Solr-master-Linux/solr/build/solr-core/test/J2/temp/solr.cloud.ReplaceNodeNoTargetTest_BBEA183626B44C34-001/tempDir-001/node5/.
   [junit4]   2> 2573050 INFO  (zkConnectionManagerCallback-3740-thread-1) [    ] o.a.s.c.c.ConnectionManager zkClient has connected
   [junit4]   2> 2573052 INFO  (zkConnectionManagerCallback-3744-thread-1) [    ] o.a.s.c.c.ConnectionManager zkClient has connected
   [junit4]   2> 2573052 INFO  (SUITE-ReplaceNodeNoTargetTest-seed#[BBEA183626B44C34]-worker) [    ] o.a.s.c.c.ZkStateReader Updated live nodes from ZooKeeper... (0) -> (6)
   [junit4]   2> 2573053 INFO  (SUITE-ReplaceNodeNoTargetTest-seed#[BBEA183626B44C34]-worker) [    ] o.a.s.c.s.i.ZkClientClusterStateProvider Cluster at 127.0.0.1:39647/solr ready
   [junit4]   2> 2573094 INFO  (TEST-ReplaceNodeNoTargetTest.test-seed#[BBEA183626B44C34]) [    ] o.a.s.SolrTestCaseJ4 ###Starting test
   [junit4]   2> 2573095 INFO  (zkConnectionManagerCallback-3746-thread-1) [    ] o.a.s.c.c.ConnectionManager zkClient has connected
   [junit4]   2> 2573095 INFO  (TEST-ReplaceNodeNoTargetTest.test-seed#[BBEA183626B44C34]) [    ] o.a.s.c.ReplaceNodeNoTargetTest total_jettys: 6
   [junit4]   2> 2573118 INFO  (qtp81531992-22591) [n:127.0.0.1:34237_solr    ] o.a.s.s.HttpSolrCall [admin] webapp=null path=/admin/metrics params={prefix=CONTAINER.fs.usableSpace,CORE.coreName&wt=javabin&version=2&group=solr.node,solr.core} status=0 QTime=0
   [junit4]   2> 2573130 INFO  (qtp17947923-22580) [n:127.0.0.1:36063_solr    ] o.a.s.s.HttpSolrCall [admin] webapp=null path=/admin/metrics params={prefix=CONTAINER.fs.usableSpace,CORE.coreName&wt=javabin&version=2&group=solr.node,solr.core} status=0 QTime=0
   [junit4]   2> 2573133 INFO  (qtp1916196117-22573) [n:127.0.0.1:36975_solr    ] o.a.s.s.HttpSolrCall [admin] webapp=null path=/admin/metrics params={prefix=CONTAINER.fs.usableSpace,CORE.coreName&wt=javabin&version=2&group=solr.node,solr.core} status=0 QTime=0
   [junit4]   2> 2573145 INFO  (qtp316735416-22585) [n:127.0.0.1:38205_solr    ] o.a.s.s.HttpSolrCall [admin] webapp=null path=/admin/metrics params={prefix=CONTAINER.fs.usableSpace,CORE.coreName&wt=javabin&version=2&group=solr.node,solr.core} status=0 QTime=0
   [junit4]   2> 2573157 INFO  (qtp1369381719-22588) [n:127.0.0.1:39961_solr    ] o.a.s.s.HttpSolrCall [admin] webapp=null path=/admin/metrics params={prefix=CONTAINER.fs.usableSpace,CORE.coreName&wt=javabin&version=2&group=solr.node,solr.core} status=0 QTime=0
   [junit4]   2> 2573168 INFO  (qtp1681842650-22574) [n:127.0.0.1:46547_solr    ] o.a.s.s.HttpSolrCall [admin] webapp=null path=/admin/metrics params={prefix=CONTAINER.fs.usableSpace,CORE.coreName&wt=javabin&version=2&group=solr.node,solr.core} status=0 QTime=0
   [junit4]   2> 2573168 INFO  (qtp1916196117-22581) [n:127.0.0.1:36975_solr    ] o.a.s.s.HttpSolrCall [admin] webapp=null path=/admin/autoscaling params={wt=javabin&version=2} status=0 QTime=62
   [junit4]   2> 2573169 INFO  (qtp1916196117-22569) [n:127.0.0.1:36975_solr    ] o.a.s.h.a.CollectionsHandler Invoked Collection Action :create with params pullReplicas=0&replicationFactor=2&collection.configName=conf1&name=replacenodetest_coll_notarget&nrtReplicas=2&action=CREATE&numShards=5&tlogReplicas=0&wt=javabin&version=2 and sendToOCPQueue=true
   [junit4]   2> 2573171 INFO  (OverseerThreadFactory-7999-thread-1-processing-n:127.0.0.1:39961_solr) [n:127.0.0.1:39961_solr    ] o.a.s.c.a.c.CreateCollectionCmd Create collection replacenodetest_coll_notarget
   [junit4]   2> 2573174 INFO  (qtp81531992-22591) [n:127.0.0.1:34237_solr    ] o.a.s.s.HttpSolrCall [admin] webapp=null path=/admin/metrics params={prefix=CONTAINER.fs.usableSpace,CORE.coreName&wt=javabin&version=2&group=solr.node,solr.core} status=0 QTime=0
   [junit4]   2> 2573176 INFO  (qtp17947923-22583) [n:127.0.0.1:36063_solr    ] o.a.s.s.HttpSolrCall [admin] webapp=null path=/admin/metrics params={prefix=CONTAINER.fs.usableSpace,CORE.coreName&wt=javabin&version=2&group=solr.node,solr.core} status=0 QTime=0
   [junit4]   2> 2573179 INFO  (qtp1916196117-22703) [n:127.0.0.1:36975_solr    ] o.a.s.s.HttpSolrCall [admin] webapp=null path=/admin/metrics params={prefix=CONTAINER.fs.usableSpace,CORE.coreName&wt=javabin&version=2&group=solr.node,solr.core} status=0 QTime=0
   [junit4]   2> 2573181 INFO  (qtp316735416-22579) [n:127.0.0.1:38205_solr    ] o.a.s.s.HttpSolrCall [admin] webapp=null path=/admin/metrics params={prefix=CONTAINER.fs.usableSpace,CORE.coreName&wt=javabin&version=2&group=solr.node,solr.core} status=0 QTime=0
   [junit4]   2> 2573184 INFO  (qtp1369381719-22578) [n:127.0.0.1:39961_solr    ] o.a.s.s.HttpSolrCall [admin] webapp=null path=/admin/metrics params={prefix=CONTAINER.fs.usableSpace,CORE.coreName&wt=javabin&version=2&group=solr.node,solr.core} status=0 QTime=0
   [junit4]   2> 2573187 INFO  (qtp1681842650-22572) [n:127.0.0.1:46547_solr    ] o.a.s.s.HttpSolrCall [admin] webapp=null path=/admin/metrics params={prefix=CONTAINER.fs.usableSpace,CORE.coreName&wt=javabin&version=2&group=solr.node,solr.core} status=0 QTime=0
   [junit4]   2> 2573191 INFO  (OverseerThreadFactory-7999-thread-1-processing-n:127.0.0.1:39961_solr) [n:127.0.0.1:39961_solr    ] o.a.s.c.s.c.a.PolicyHelper returnSession, curr-time 2030081590 sessionWrapper.createTime 2030081586579231, this.sessionWrapper.createTime 2030081586579231 
   [junit4]   2> 2573300 INFO  (OverseerStateUpdate-72190637401571341-127.0.0.1:39961_solr-n_0000000000) [n:127.0.0.1:39961_solr    ] o.a.s.c.o.SliceMutator createReplica() {
   [junit4]   2>   "operation":"ADDREPLICA",
   [junit4]   2>   "collection":"replacenodetest_coll_notarget",
   [junit4]   2>   "shard":"shard1",
   [junit4]   2>   "core":"replacenodetest_coll_notarget_shard1_replica_n1",
   [junit4]   2>   "state":"down",
   [junit4]   2>   "base_url":"https://127.0.0.1:46547/solr",
   [junit4]   2>   "type":"NRT",
   [junit4]   2>   "waitForFinalState":"false"} 
   [junit4]   2> 2573301 INFO  (OverseerStateUpdate-72190637401571341-127.0.0.1:39961_solr-n_0000000000) [n:127.0.0.1:39961_solr    ] o.a.s.c.o.SliceMutator createReplica() {
   [junit4]   2>   "operation":"ADDREPLICA",
   [junit4]   2>   "collection":"replacenodetest_coll_notarget",
   [junit4]   2>   "shard":"shard1",
   [junit4]   2>   "core":"replacenodetest_coll_notarget_shard1_replica_n2",
   [junit4]   2>   "state":"down",
   [junit4]   2>   "base_url":"https://127.0.0.1:39961/solr",
   [junit4]   2>   "type":"NRT",
   [junit4]   2>   "waitForFinalState":"false"} 
   [junit4]   2> 2573302 INFO  (OverseerStateUpdate-72190637401571341-127.0.0.1:39961_solr-n_0000000000) [n:127.0.0.1:39961_solr    ] o.a.s.c.o.SliceMutator createReplica() {
   [junit4]   2>   "operation":"ADDREPLICA",
   [junit4]   2>   "collection":"replacenodetest_coll_notarget",
   [junit4]   2>   "shard":"shard2",
   [junit4]   2>   "core":"replacenodetest_coll_notarget_shard2_replica_n4",
   [junit4]   2>   "state":"down",
   [junit4]   2>   "base_url":"https://127.0.0.1:38205/solr",
   [junit4]   2>   "type":"NRT",
   [junit4]   2>   "waitForFinalState":"false"} 
   [junit4]   2> 2573303 INFO  (OverseerStateUpdate-72190637401571341-127.0.0.1:39961_solr-n_0000000000) [n:127.0.0.1:39961_solr    ] o.a.s.c.o.SliceMutator createReplica() {
   [junit4]   2>   "operation":"ADDREPLICA",
   [junit4]   2>   "collection":"replacenodetest_coll_notarget",
   [junit4]   2>   "shard":"shard2",
   [junit4]   2>   "core":"replacenodetest_coll_notarget_shard2_replica_n6",
   [junit4]   2>   "state":"down",
   [junit4]   2>   "base_url":"https://127.0.0.1:36975/solr",
   [junit4]   2>   "type":"NRT",
   [junit4]   2>   "waitForFinalState":"false"} 
   [junit4]   2> 2573303 INFO  (OverseerStateUpdate-72190637401571341-127.0.0.1:39961_solr-n_0000000000) [n:127.0.0.1:39961_solr    ] o.a.s.c.o.SliceMutator createReplica() {
   [junit4]   2>   "operation":"ADDREPLICA",
   [junit4]   2>   "collection":"replacenodetest_coll_notarget",
   [junit4]   2>   "shard":"shard3",
   [junit4]   2>   "core":"replacenodetest_coll_notarget_shard3_replica_n8",
   [junit4]   2>   "state":"down",
   [junit4]   2>   "base_url":"https://127.0.0.1:36063/solr",
   [junit4]   2>   "type":"NRT",
   [junit4]   2>   "waitForFinalState":"false"} 
   [junit4]   2> 2573304 INFO  (OverseerStateUpdate-72190637401571341-127.0.0.1:39961_solr-n_0000000000) [n:127.0.0.1:39961_solr    ] o.a.s.c.o.SliceMutator createReplica() {
   [junit4]   2>   "operation":"ADDREPLICA",
   [junit4]   2>   "collection":"replacenodetest_coll_notarget",
   [junit4]   2>   "shard":"shard3",
   [junit4]   2>   "core":"replacenodetest_coll_notarget_shard3_replica_n10",
   [junit4]   2>   "state":"down",
   [junit4]   2>   "base_url":"https://127.0.0.1:34237/solr",
   [junit4]   2>   "type":"NRT",
   [junit4]   2>   "waitForFinalState":"false"} 
   [junit4]   2> 2573305 INFO  (OverseerStateUpdate-72190637401571341-127.0.0.1:39961_solr-n_0000000000) [n:127.0.0.1:39961_solr    ] o.a.s.c.o.SliceMutator createReplica() {
   [junit4]   2>   "operation":"ADDREPLICA",
   [junit4]   2>   "collection":"replacenodetest_coll_notarget",
   [junit4]   2>   "shard":"shard4",
   [junit4]   2>   "core":"replacenodetest_coll_notarget_shard4_replica_n12",
   [junit4]   2>   "state":"down",
   [junit4]   2>   "base_url":"https://127.0.0.1:34237/solr",
   [junit4]   2>   "type":"NRT",
   [junit4]   2>   "waitForFinalState":"false"} 
   [junit4]   2> 2573306 INFO  (OverseerStateUpdate-72190637401571341-127.0.0.1:39961_solr-n_0000000000) [n:127.0.0.1:39961_solr    ] o.a.s.c.o.SliceMutator createReplica() {
   [junit4]   2>   "operation":"ADDREPLICA",
   [junit4]   2>   "collection":"replacenodetest_coll_notarget",
   [junit4]   2>   "shard":"shard4",
   [junit4]   2>   "core":"replacenodetest_coll_notarget_shard4_replica_n14",
   [junit4]   2>   "state":"down",
   [junit4]   2>   "base_url":"https://127.0.0.1:36063/solr",
   [junit4]   2>   "type":"NRT",
   [junit4]   2>   "waitForFinalState":"false"} 
   [junit4]   2> 2573307 INFO  (OverseerStateUpdate-72190637401571341-127.0.0.1:39961_solr-n_0000000000) [n:127.0.0.1:39961_solr    ] o.a.s.c.o.SliceMutator createReplica() {
   [junit4]   2>   "operation":"ADDREPLICA",
   [junit4]   2>   "collection":"replacenodetest_coll_notarget",
   [junit4]   2>   "shard":"shard5",
   [junit4]   2>   "core":"replacenodetest_coll_notarget_shard5_replica_n16",
   [junit4]   2>   "state":"down",
   [junit4]   2>   "base_url":"https://127.0.0.1:36975/solr",
   [junit4]   2>   "type":"NRT",
   [junit4]   2>   "waitForFinalState":"false"} 
   [junit4]   2> 2573307 INFO  (OverseerStateUpdate-72190637401571341-127.0.0.1:39961_solr-n_0000000000) [n:127.0.0.1:39961_solr    ] o.a.s.c.o.SliceMutator createReplica() {
   [junit4]   2>   "operation":"ADDREPLICA",
   [junit4]   2>   "collection":"replacenodetest_coll_notarget",
   [junit4]   2>   "shard":"shard5",
   [junit4]   2>   "core":"replacenodetest_coll_notarget_shard5_replica_n18",
   [junit4]   2>   "state":"down",
   [junit4]   2>   "base_url":"https://127.0.0.1:38205/solr",
   [junit4]   2>   "type":"NRT",
   [junit4]   2>   "waitForFinalState":"false"} 
   [junit4]   2> 2573510 INFO  (qtp1681842650-22554) [n:127.0.0.1:46547_solr    ] o.a.s.h.a.CoreAdminOperation core create command qt=/admin/cores&coreNodeName=core_node3&collection.configName=conf1&newCollection=true&name=replacenodetest_coll_notarget_shard1_replica_n1&action=CREATE&numShards=5&collection=replacenodetest_coll_notarget&shard=shard1&wt=javabin&version=2&replicaType=NRT
   [junit4]   2> 2573510 INFO  (qtp316735416-22579) [n:127.0.0.1:38205_solr    ] o.a.s.h.a.CoreAdminOperation core create command qt=/admin/cores&coreNodeName=core_node7&collection.configName=conf1&newCollection=true&name=replacenodetest_coll_notarget_shard2_replica_n4&action=CREATE&numShards=5&collection=replacenodetest_coll_notarget&shard=shard2&wt=javabin&version=2&replicaType=NRT
   [junit4]   2> 2573511 INFO  (qtp1681842650-22554) [n:127.0.0.1:46547_solr    ] o.a.s.c.TransientSolrCoreCacheDefault Allocating transient cache for 2147483647 transient cores
   [junit4]   2> 2573511 INFO  (qtp316735416-22579) [n:127.0.0.1:38205_solr    ] o.a.s.c.TransientSolrCoreCacheDefault Allocating transient cache for 2147483647 transient cores
   [junit4]   2> 2573510 INFO  (qtp1369381719-22544) [n:127.0.0.1:39961_solr    ] o.a.s.h.a.CoreAdminOperation core create command qt=/admin/cores&coreNodeName=core_node5&collection.configName=conf1&newCollection=true&name=replacenodetest_coll_notarget_shard1_replica_n2&action=CREATE&numShards=5&collection=replacenodetest_coll_notarget&shard=shard1&wt=javabin&version=2&replicaType=NRT
   [junit4]   2> 2573511 INFO  (qtp17947923-22583) [n:127.0.0.1:36063_solr    ] o.a.s.h.a.CoreAdminOperation core create command qt=/admin/cores&coreNodeName=core_node11&collection.configName=conf1&newCollection=true&name=replacenodetest_coll_notarget_shard3_replica_n8&action=CREATE&numShards=5&collection=replacenodetest_coll_notarget&shard=shard3&wt=javabin&version=2&replicaType=NRT
   [junit4]   2> 2573511 INFO  (qtp1369381719-22544) [n:127.0.0.1:39961_solr    ] o.a.s.c.TransientSolrCoreCacheDefault Allocating transient cache for 2147483647 transient cores
   [junit4]   2> 2573511 INFO  (qtp17947923-22583) [n:127.0.0.1:36063_solr    ] o.a.s.c.TransientSolrCoreCacheDefault Allocating transient cache for 2147483647 transient cores
   [junit4]   2> 2573512 INFO  (qtp1916196117-22704) [n:127.0.0.1:36975_solr    ] o.a.s.h.a.CoreAdminOperation core create command qt=/admin/cores&coreNodeName=core_node9&collection.configName=conf1&newCollection=true&name=replacenodetest_coll_notarget_shard2_replica_n6&action=CREATE&numShards=5&collection=replacenodetest_coll_notarget&shard=shard2&wt=javabin&version=2&replicaType=NRT
   [junit4]   2> 2573513 INFO  (qtp1916196117-22704) [n:127.0.0.1:36975_solr    ] o.a.s.c.TransientSolrCoreCacheDefault Allocating transient cache for 2147483647 transient cores
   [junit4]   2> 2573513 INFO  (qtp81531992-22542) [n:127.0.0.1:34237_solr    ] o.a.s.h.a.CoreAdminOperation core create command qt=/admin/cores&coreNodeName=core_node15&collection.configName=conf1&newCollection=true&name=replacenodetest_coll_notarget_shard4_replica_n12&action=CREATE&numShards=5&collection=replacenodetest_coll_notarget&shard=shard4&wt=javabin&version=2&replicaType=NRT
   [junit4]   2> 2573513 INFO  (qtp81531992-22561) [n:127.0.0.1:34237_solr    ] o.a.s.h.a.CoreAdminOperation core create command qt=/admin/cores&coreNodeName=core_node13&collection.configName=conf1&newCollection=true&name=replacenodetest_coll_notarget_shard3_replica_n10&action=CREATE&numShards=5&collection=replacenodetest_coll_notarget&shard=shard3&wt=javabin&version=2&replicaType=NRT
   [junit4]   2> 2573513 INFO  (qtp81531992-22542) [n:127.0.0.1:34237_solr    ] o.a.s.c.TransientSolrCoreCacheDefault Allocating transient cache for 2147483647 transient cores
   [junit4]   2> 2573549 INFO  (qtp1916196117-22703) [n:127.0.0.1:36975_solr    ] o.a.s.h.a.CoreAdminOperation core create command qt=/admin/cores&coreNodeName=core_node19&collection.configName=conf1&newCollection=true&name=replacenodetest_coll_notarget_shard5_replica_n16&action=CREATE&numShards=5&collection=replacenodetest_coll_notarget&shard=shard5&wt=javabin&version=2&replicaType=NRT
   [junit4]   2> 2573551 INFO  (qtp316735416-22540) [n:127.0.0.1:38205_solr    ] o.a.s.h.a.CoreAdminOperation core create command qt=/admin/cores&coreNodeName=core_node20&collection.configName=conf1&newCollection=true&name=replacenodetest_coll_notarget_shard5_replica_n18&action=CREATE&numShards=5&collection=replacenodetest_coll_notarget&shard=shard5&wt=javabin&version=2&replicaType=NRT
   [junit4]   2> 2573552 INFO  (qtp17947923-22566) [n:127.0.0.1:36063_solr    ] o.a.s.h.a.CoreAdminOperation core create command qt=/admin/cores&coreNodeName=core_node17&collection.configName=conf1&newCollection=true&name=replacenodetest_coll_notarget_shard4_replica_n14&action=CREATE&numShards=5&collection=replacenodetest_coll_notarget&shard=shard4&wt=javabin&version=2&replicaType=NRT
   [junit4]   2> 2573654 INFO  (zkCallback-3720-thread-1-processing-n:127.0.0.1:46547_solr) [n:127.0.0.1:46547_solr    ] o.a.s.c.c.ZkStateReader A cluster state change: [WatchedEvent state:SyncConnected type:NodeDataChanged path:/collections/replacenodetest_coll_notarget/state.json] for collection [replacenodetest_coll_notarget] has occurred - updating... (live nodes size: [6])
   [junit4]   2> 2573654 INFO  (zkCallback-3713-thread-2-processing-n:127.0.0.1:39961_solr) [n:127.0.0.1:39961_solr    ] o.a.s.c.c.ZkStateReader A cluster state change: [WatchedEvent state:SyncConnected type:NodeDataChanged path:/collections/replacenodetest_coll_notarget/state.json] for collection [replacenodetest_coll_notarget] has occurred - updating... (live nodes size: [6])
   [junit4]   2> 2573654 INFO  (zkCallback-3722-thread-1-processing-n:127.0.0.1:36975_solr) [n:127.0.0.1:36975_solr    ] o.a.s.c.c.ZkStateReader A cluster state change: [WatchedEvent state:SyncConnected type:NodeDataChanged path:/collections/replacenodetest_coll_notarget/state.json] for collection [replacenodetest_coll_notarget] has occurred - updating... (live nodes size: [6])
   [junit4]   2> 2573654 INFO  (zkCallback-3707-thread-2-processing-n:127.0.0.1:36063_solr) [n:127.0.0.1:36063_solr    ] o.a.s.c.c.ZkStateReader A cluster state change: [WatchedEvent state:SyncConnected type:NodeDataChanged path:/collections/replacenodetest_coll_notarget/state.json] for collection [replacenodetest_coll_notarget] has occurred - updating... (live nodes size: [6])
   [junit4]   2> 2573654 INFO  (zkCallback-3720-thread-2-processing-n:127.0.0.1:46547_solr) [n:127.0.0.1:46547_solr    ] o.a.s.c.c.ZkStateReader A cluster state change: [WatchedEvent state:SyncConnected type:NodeDataChanged path:/collections/replacenodetest_coll_notarget/state.json] for collection [replacenodetest_coll_notarget] has occurred - updating... (live nodes size: [6])
   [junit4]   2> 2573654 INFO  (zkCallback-3707-thread-1-processing-n:127.0.0.1:36063_solr) [n:127.0.0.1:36063_solr    ] o.a.s.c.c.ZkStateReader A cluster state change: [WatchedEvent state:SyncConnected type:NodeDataChanged path:/collections/replacenodetest_coll_notarget/state.json] for collection [replacenodetest_coll_notarget] has occurred - updating... (live nodes size: [6])
   [junit4]   2> 2573654 INFO  (zkCallback-3724-thread-1-processing-n:127.0.0.1:38205_solr) [n:127.0.0.1:38205_solr    ] o.a.s.c.c.ZkStateReader A cluster state change: [WatchedEvent state:SyncConnected type:NodeDataChanged path:/collections/replacenodetest_coll_notarget/state.json] for collection [replacenodetest_coll_notarget] has occurred - updating... (live nodes size: [6])
   [junit4]   2> 2573654 INFO  (zkCallback-3730-thread-1-processing-n:127.0.0.1:34237_solr) [n:127.0.0.1:34237_solr    ] o.a.s.c.c.ZkStateReader A cluster state change: [WatchedEvent state:SyncConnected type:NodeDataChanged path:/collections/replacenodetest_coll_notarget/state.json] for collection [replacenodetest_coll_notarget] has occurred - updating... (live nodes size: [6])
   [junit4]   2> 2573654 INFO  (zkCallback-3713-thread-1-processing-n:127.0.0.1:39961_solr) [n:127.0.0.1:39961_solr    ] o.a.s.c.c.ZkStateReader A cluster state change: [WatchedEvent state:SyncConnected type:NodeDataChanged path:/collections/replacenodetest_coll_notarget/state.json] for collection [replacenodetest_coll_notarget] has occurred - updating... (live nodes size: [6])
   [junit4]   2> 2573655 INFO  (zkCallback-3724-thread-2-processing-n:127.0.0.1:38205_solr) [n:127.0.0.1:38205_solr    ] o.a.s.c.c.ZkStateReader A cluster state change: [WatchedEvent state:SyncConnected type:NodeDataChanged path:/collections/replacenodetest_coll_notarget/state.json] for collection [replacenodetest_coll_notarget] has occurred - updating... (live nodes size: [6])
   [junit4]   2> 2573655 INFO  (zkCallback-3722-thread-2-processing-n:127.0.0.1:36975_solr) [n:127.0.0.1:36975_solr    ] o.a.s.c.c.ZkStateReader A cluster state change: [WatchedEvent state:SyncConnected type:NodeDataChanged path:/collections/replacenodetest_coll_notarget/state.json] for collection [replacenodetest_coll_notarget] has occurred - updating... (live nodes size: [6])
   [junit4]   2> 2574559 INFO  (qtp17947923-22583) [n:127.0.0.1:36063_solr c:replacenodetest_coll_notarget s:shard3 r:core_node11 x:replacenodetest_coll_notarget_shard3_replica_n8] o.a.s.c.SolrConfig Using Lucene MatchVersion: 8.0.0
   [junit4]   2> 2574560 INFO  (qtp81531992-22561) [n:127.0.0.1:34237_solr c:replacenodetest_coll_notarget s:shard3 r:core_node13 x:replacenodetest_coll_notarget_shard3_replica_n10] o.a.s.c.SolrConfig Using Lucene MatchVersion: 8.0.0
   [junit4]   2> 2574561 INFO  (qtp1369381719-22544) [n:127.0.0.1:39961_solr c:replacenodetest_coll_notarget s:shard1 r:core_node5 x:replacenodetest_coll_notarget_shard1_replica_n2] o.a.s.c.SolrConfig Using Lucene MatchVersion: 8.0.0
   [junit4]   2> 2574559 INFO  (qtp1681842650-22554) [n:127.0.0.1:46547_solr c:replacenodetest_coll_notarget s:shard1 r:core_node3 x:replacenodetest_coll_notarget_shard1_replica_n1] o.a.s.c.SolrConfig Using Lucene MatchVersion: 8.0.0
   [junit4]   2> 2574562 INFO  (qtp316735416-22579) [n:127.0.0.1:38205_solr c:replacenodetest_coll_notarget s:shard2 r:core_node7 x:replacenodetest_coll_notarget_shard2_replica_n4] o.a.s.c.SolrConfig Using Lucene MatchVersion: 8.0.0
   [junit4]   2> 2574565 INFO  (qtp1916196117-22704) [n:127.0.0.1:36975_solr c:replacenodetest_coll_notarget s:shard2 r:core_node9 x:replacenodetest_coll_notarget_shard2_replica_n6] o.a.s.c.SolrConfig Using Lucene MatchVersion: 8.0.0
   [junit4]   2> 2574571 INFO  (qtp316735416-22540) [n:127.0.0.1:38205_solr c:replacenodetest_coll_notarget s:shard5 r:core_node20 x:replacenodetest_coll_notarget_shard5_replica_n18] o.a.s.c.SolrConfig Using Lucene MatchVersion: 8.0.0
   [junit4]   2> 2574571 INFO  (qtp1916196117-22703) [n:127.0.0.1:36975_solr c:replacenodetest_coll_notarget s:shard5 r:core_node19 x:replacenodetest_coll_notarget_shard5_replica_n16] o.a.s.c.SolrConfig Using Lucene MatchVersion: 8.0.0
   [junit4]   2> 2574572 INFO  (qtp81531992-22542) [n:127.0.0.1:34237_solr c:replacenodetest_coll_notarget s:shard4 r:core_node15 x:replacenodetest_coll_notarget_shard4_replica_n12] o.a.s.c.SolrConfig Using Lucene MatchVersion: 8.0.0
   [junit4]   2> 2574619 INFO  (qtp1916196117-22704) [n:127.0.0.1:36975_solr c:replacenodetest_coll_notarget s:shard2 r:core_node9 x:replacenodetest_coll_notarget_shard2_replica_n6] o.a.s.s.IndexSchema [replacenodetest_coll_notarget_shard2_replica_n6] Schema name=cloud-dynamic
   [junit4]   2> 2574622 INFO  (qtp1681842650-22554) [n:127.0.0.1:46547_solr c:replacenodetest_coll_notarget s:shard1 r:core_node3 x:replacenodetest_coll_notarget_shard1_replica_n1] o.a.s.s.IndexSchema [replacenodetest_coll_notarget_shard1_replica_n1] Schema name=cloud-dynamic
   [junit4]   2> 2574623 INFO  (qtp17947923-22566) [n:127.0.0.1:36063_solr c:replacenodetest_coll_notarget s:shard4 r:core_node17 x:replacenodetest_coll_notarget_shard4_replica_n14] o.a.s.c.SolrConfig Using Lucene MatchVersion: 8.0.0
   [junit4]   2> 2574624 INFO  (qtp316735416-22579) [n:127.0.0.1:38205_solr c:replacenodetest_coll_notarget s:shard2 r:core_node7 x:replacenodetest_coll_notarget_shard2_replica_n4] o.a.s.s.IndexSchema [replacenodetest_coll_notarget_shard2_replica_n4] Schema name=cloud-dynamic
   [junit4]   2> 2574619 INFO  (qtp81531992-22561) [n:127.0.0.1:34237_solr c:replacenodetest_coll_notarget s:shard3 r:core_node13 x:replacenodetest_coll_notarget_shard3_replica_n10] o.a.s.s.IndexSchema [replacenodetest_coll_notarget_shard3_replica_n10] Schema name=cloud-dynamic
   [junit4]   2> 2574627 INFO  (qtp81531992-22542) [n:127.0.0.1:34237_solr c:replacenodetest_coll_notarget s:shard4 r:core_node15 x:replacenodetest_coll_notarget_shard4_replica_n12] o.a.s.s.IndexSchema [replacenodetest_coll_notarget_shard4_replica_n12] Schema name=cloud-dynamic
   [junit4]   2> 2574632 INFO  (qtp1916196117-22703) [n:127.0.0.1:36975_solr c:replacenodetest_coll_notarget s:shard5 r:core_node19 x:replacenodetest_coll_notarget_shard5_replica_n16] o.a.s.s.IndexSchema [replacenodetest_coll_notarget_shard5_replica_n16] Schema name=cloud-dynamic
   [junit4]   2> 2574632 INFO  (qtp1369381719-22544) [n:127.0.0.1:39961_solr c:replacenodetest_coll_notarget s:shard1 r:core_node5 x:replacenodetest_coll_notarget_shard1_replica_n2] o.a.s.s.IndexSchema [replacenodetest_coll_notarget_shard1_replica_n2] Schema name=cloud-dynamic
   [junit4]   2> 2574637 INFO  (qtp316735416-22540) [n:127.0.0.1:38205_solr c:replacenodetest_coll_notarget s:shard5 r:core_node20 x:replacenodetest_coll_notarget_shard5_replica_n18] o.a.s.s.IndexSchema [replacenodetest_coll_notarget_shard5_replica_n18] Schema name=cloud-dynamic
   [junit4]   2> 2574676 INFO  (qtp17947923-22583) [n:127.0.0.1:36063_solr c:replacenodetest_coll_notarget s:shard3 r:core_node11 x:replacenodetest_coll_notarget_shard3_replica_n8] o.a.s.s.IndexSchema [replacenodetest_coll_notarget_shard3_replica_n8] Schema name=cloud-dynamic
   [junit4]   2> 2574678 INFO  (qtp1681842650-22554) [n:127.0.0.1:46547_solr c:replacenodetest_coll_notarget s:shard1 r:core_node3 x:replacenodetest_coll_notarget_shard1_replica_n1] o.a.s.s.IndexSchema Loaded schema cloud-dynamic/1.6 with uniqueid field id
   [junit4]   2> 2574678 INFO  (qtp1681842650-22554) [n:127.0.0.1:46547_solr c:replacenodetest_coll_notarget s:shard1 r:core_node3 x:replacenodetest_coll_notarget_shard1_replica_n1] o.a.s.c.CoreContainer Creating SolrCore 'replacenodetest_coll_notarget_shard1_replica_n1' using configuration from collection replacenodetest_coll_notarget, trusted=true
   [junit4]   2> 2574679 INFO  (qtp1681842650-22554) [n:127.0.0.1:46547_solr c:replacenodetest_coll_notarget s:shard1 r:core_node3 x:replacenodetest_coll_notarget_shard1_replica_n1] o.a.s.m.r.SolrJmxReporter JMX monitoring for 'solr_46547.solr.core.replacenodetest_coll_notarget.shard1.replica_n1' (registry 'solr.core.replacenodetest_coll_notarget.shard1.replica_n1') enabled at server: com.sun.jmx.mbeanserver.JmxMBeanServer@fe40a04
   [junit4]   2> 2574679 INFO  (qtp1681842650-22554) [n:127.0.0.1:46547_solr c:replacenodetest_coll_notarget s:shard1 r:core_node3 x:replacenodetest_coll_notarget_shard1_replica_n1] o.a.s.c.SolrCore solr.RecoveryStrategy.Builder
   [junit4]   2> 2574679 INFO  (qtp1681842650-22554) [n:127.0.0.1:46547_solr c:replacenodetest_coll_notarget s:shard1 r:core_node3 x:replacenodetest_coll_notarget_shard1_replica_n1] o.a.s.c.SolrCore [[replacenodetest_coll_notarget_shard1_replica_n1] ] Opening new SolrCore at [/home/jenkins/workspace/Lucene-Solr-master-Linux/solr/build/solr-core/test/J2/temp/solr.cloud.ReplaceNodeNoTargetTest_BBEA183626B44C34-001/tempDir-001/node6/replacenodetest_coll_notarget_shard1_replica_n1], dataDir=[/home/jenkins/workspace/Lucene-Solr-master-Linux/solr/build/solr-core/test/J2/temp/solr.cloud.ReplaceNodeNoTargetTest_BBEA183626B44C34-001/tempDir-001/node6/./replacenodetest_coll_notarget_shard1_replica_n1/data/]
   [junit4]   2> 2574686 INFO  (qtp17947923-22566) [n:127.0.0.1:36063_solr c:replacenodetest_coll_notarget s:shard4 r:core_node17 x:replacenodetest_coll_notarget_shard4_replica_n14] o.a.s.s.IndexSchema [replacenodetest_coll_notarget_shard4_replica_n14] Schema name=cloud-dynamic
   [junit4]   2> 2574730 INFO  (qtp1369381719-22544) [n:127.0.0.1:39961_solr c:replacenodetest_coll_notarget s:shard1 r:core_node5 x:replacenodetest_coll_notarget_shard1_replica_n2] o.a.s.s.IndexSchema Loaded schema cloud-dynamic/1.6 with uniqueid field id
   [junit4]   2> 2574730 INFO  (qtp1369381719-22544) [n:127.0.0.1:39961_solr c:replacenodetest_coll_notarget s:shard1 r:core_node5 x:replacenodetest_coll_notarget_shard1_replica_n2] o.a.s.c.CoreContainer Creating SolrCore 'replacenodetest_coll_notarget_shard1_replica_n2' using configuration from collection replacenodetest_coll_notarget, trusted=true
   [junit4]   2> 2574730 INFO  (qtp1369381719-22544) [n:127.0.0.1:39961_solr c:replacenodetest_coll_notarget s:shard1 r:core_node5 x:replacenodetest_coll_notarget_shard1_replica_n2] o.a.s.m.r.SolrJmxReporter JMX monitoring for 'solr_39961.solr.core.replacenodetest_coll_notarget.shard1.replica_n2' (registry 'solr.core.replacenodetest_coll_notarget.shard1.replica_n2') enabled at server: com.sun.jmx.mbeanserver.JmxMBeanServer@fe40a04
   [junit4]   2> 2574730 INFO  (qtp1369381719-22544) [n:127.0.0.1:39961_solr c:replacenodetest_coll_notarget s:shard1 r:core_node5 x:replacenodetest_coll_notarget_shard1_replica_n2] o.a.s.c.SolrCore solr.RecoveryStrategy.Builder
   [junit4]   2> 2574730 INFO  (qtp1369381719-22544) [n:127.0.0.1:39961_solr c:replacenodetest_coll_notarget s:shard1 r:core_node5 x:replacenodetest_coll_notarget_shard1_replica_n2] o.a.s.c.SolrCore [[replacenodetest_coll_notarget_shard1_replica_n2] ] Opening new SolrCore at [/home/jenkins/workspace/Lucene-Solr-master-Linux/solr/build/solr-core/test/J2/temp/solr.cloud.ReplaceNodeNoTargetTest_BBEA183626B44C34-001/tempDir-001/node5/replacenodetest_coll_notarget_shard1_replica_n2], dataDir=[/home/jenkins/workspace/Lucene-Solr-master-Linux/solr/build/solr-core/test/J2/temp/solr.cloud.ReplaceNodeNoTargetTest_BBEA183626B44C34-001/tempDir-001/node5/./replacenodetest_coll_notarget_shard1_replica_n2/data/]
   [junit4]   2> 2574734 INFO  (qtp81531992-22542) [n:127.0.0.1:34237_solr c:replacenodetest_coll_notarget s:shard4 r:core_node15 x:replacenodetest_coll_notarget_shard4_replica_n12] o.a.s.s.IndexSchema Loaded schema cloud-dynamic/1.6 with uniqueid field id
   [junit4]   2> 2574734 INFO  (qtp81531992-22542) [n:127.0.0.1:34237_solr c:replacenodetest_coll_notarget s:shard4 r:core_node15 x:replacenodetest_coll_notarget_shard4_replica_n12] o.a.s.c.CoreContainer Creating SolrCore 'replacenodetest_coll_notarget_shard4_replica_n12' using configuration from collection replacenodetest_coll_notarget, trusted=true
   [junit4]   2> 2574734 INFO  (qtp81531992-22542) [n:127.0.0.1:34237_solr c:replacenodetest_coll_notarget s:shard4 r:core_node15 x:replacenodetest_coll_notarget_shard4_replica_n12] o.a.s.m.r.SolrJmxReporter JMX monitoring for 'solr_34237.solr.core.replacenodetest_coll_notarget.shard4.replica_n12' (registry 'solr.core.replacenodetest_coll_notarget.shard4.replica_n12') enabled at server: com.sun.jmx.mbeanserver.JmxMBeanServer@fe40a04
   [junit4]   2> 2574735 INFO  (qtp81531992-22542) [n:127.0.0.1:34237_solr c:replacenodetest_coll_notarget s:shard4 r:core_node15 x:replacenodetest_coll_notarget_shard4_replica_n12] o.a.s.c.SolrCore solr.RecoveryStrategy.Builder
   [junit4]   2> 2574735 INFO  (qtp81531992-22542) [n:127.0.0.1:34237_solr c:replacenodetest_coll_notarget s:shard4 r:core_node15 x:replacenodetest_coll_notarget_shard4_replica_n12] o.a.s.c.SolrCore [[replacenodetest_coll_notarget_shard4_replica_n12] ] Opening new SolrCore at [/home/jenkins/workspace/Lucene-Solr-master-Linux/solr/build/solr-core/test/J2/temp/solr.cloud.ReplaceNodeNoTargetTest_BBEA183626B44C34-001/tempDir-001/node4/replacenodetest_coll_notarget_shard4_replica_n12], dataDir=[/home/jenkins/workspace/Lucene-Solr-master-Linux/solr/build/solr-core/test/J2/temp/solr.cloud.ReplaceNodeNoTargetTest_BBEA183626B44C34-001/tempDir-001/node4/./replacenodetest_coll_notarget_shard4_replica_n12/data/]
   [junit4]   2> 2574735 INFO  (qtp316735416-22540) [n:127.0.0.1:38205_solr c:replacenodetest_coll_notarget s:shard5 r:core_node20 x:replacenodetest_coll_notarget_shard5_replica_n18] o.a.s.s.IndexSchema Loaded schema cloud-dynamic/1.6 with uniqueid field id
   [junit4]   2> 2574735 INFO  (qtp316735416-22540) [n:127.0.0.1:38205_solr c:replacenodetest_coll_notarget s:shard5 r:core_node20 x:replacenodetest_coll_notarget_shard5_replica_n18] o.a.s.c.CoreContainer Creating SolrCore 'replacenodetest_coll_notarget_shard5_replica_n18' using configuration from collection replacenodetest_coll_notarget, trusted=true
   [junit4]   2> 2574736 INFO  (qtp316735416-22540) [n:127.0.0.1:38205_solr c:replacenodetest_coll_notarget s:shard5 r:core_node20 x:replacenodetest_coll_notarget_shard5_replica_n18] o.a.s.m.r.SolrJmxReporter JMX monitoring for 'solr_38205.solr.core.replacenodetest_coll_notarget.shard5.replica_n18' (registry 'solr.core.replacenodetest_coll_notarget.shard5.replica_n18') enabled at server: com.sun.jmx.mbeanserver.JmxMBeanServer@fe40a04
   [junit4]   2> 2574736 INFO  (qtp316735416-22540) [n:127.0.0.1:38205_solr c:replacenodetest_coll_notarget s:shard5 r:core_node20 x:replacenodetest_coll_notarget_shard5_replica_n18] o.a.s.c.SolrCore solr.RecoveryStrategy.Builder
   [junit4]   2> 2574736 INFO  (qtp316735416-22540) [n:127.0.0.1:38205_solr c:replacenodetest_coll_notarget s:shard5 r:core_node20 x:replacenodetest_coll_notarget_shard5_replica_n18] o.a.s.c.SolrCore [[replacenodetest_coll_notarget_shard5_replica_n18] ] Opening new SolrCore at [/home/jenkins/workspace/Lucene-Solr-master-Linux/solr/build/solr-core/test/J2/temp/solr.cloud.ReplaceNodeNoTargetTest_BBEA183626B44C34-001/tempDir-001/node2/replacenodetest_coll_notarget_shard5_replica_n18], dataDir=[/home/jenkins/workspace/Lucene-Solr-master-Linux/solr/build/solr-core/test/J2/temp/solr.cloud.ReplaceNodeNoTargetTest_BBEA183626B44C34-001/tempDir-001/node2/./replacenodetest_coll_notarget_shard5_replica_n18/data/]
   [junit4]   2> 2574745 INFO  (qtp17947923-22583) [n:127.0.0.1:36063_solr c:replacenodetest_coll_notarget s:shard3 r:core_node11 x:replacenodetest_coll_notarget_shard3_replica_n8] o.a.s.s.IndexSchema Loaded schema cloud-dynamic/1.6 with uniqueid field id
   [junit4]   2> 2574745 INFO  (qtp17947923-22583) [n:127.0.0.1:36063_solr c:replacenodetest_coll_notarget s:shard3 r:core_node11 x:replacenodetest_coll_notarget_shard3_replica_n8] o.a.s.c.CoreContainer Creating SolrCore 'replacenodetest_coll_notarget_shard3_replica_n8' using configuration from collection replacenodetest_coll_notarget, trusted=true
   [junit4]   2> 2574746 INFO  (qtp81531992-22561) [n:127.0.0.1:34237_solr c:replacenodetest_coll_notarget s:shard3 r:core_node13 x:replacenodetest_coll_notarget_shard3_replica_n10] o.a.s.s.IndexSchema Loaded schema cloud-dynamic/1.6 with uniqueid field id
   [junit4]   2> 2574746 INFO  (qtp81531992-22561) [n:127.0.0.1:34237_solr c:replacenodetest_coll_notarget s:shard3 r:core_node13 x:replacenodetest_coll_notarget_shard3_replica_n10] o.a.s.c.CoreContainer Creating SolrCore 'replacenodetest_coll_notarget_shard3_replica_n10' using configuration from collection replacenodetest_coll_notarget, trusted=true
   [junit4]   2> 2574747 INFO  (qtp81531992-22561) [n:127.0.0.1:34237_solr c:replacenodetest_coll_notarget s:shard3 r:core_node13 x:replacenodetest_coll_notarget_shard3_replica_n10] o.a.s.m.r.SolrJmxReporter JMX monitoring for 'solr_34237.solr.core.replacenodetest_coll_notarget.shard3.replica_n10' (registry 'solr.core.replacenodetest_coll_notarget.shard3.replica_n10') enabled at server: com.sun.jmx.mbeanserver.JmxMBeanServer@fe40a04
   [junit4]   2> 2574747 INFO  (qtp81531992-22561) [n:127.0.0.1:34237_solr c:replacenodetest_coll_notarget s:shard3 r:core_node13 x:replacenodetest_coll_notarget_shard3_replica_n10] o.a.s.c.SolrCore solr.RecoveryStrategy.Builder
   [junit4]   2> 2574747 INFO  (qtp81531992-22561) [n:127.0.0.1:34237_solr c:replacenodetest_coll_notarget s:shard3 r:core_node13 x:replacenodetest_coll_notarget_shard3_replica_n10] o.a.s.c.SolrCore [[replacenodetest_coll_notarget_shard3_replica_n10] ] Opening new SolrCore at [/home/jenkins/workspace/Lucene-Solr-master-Linux/solr/build/solr-core/test/J2/temp/solr.cloud.ReplaceNodeNoTargetTest_BBEA183626B44C34-001/tempDir-001/node4/replacenodetest_coll_notarget_shard3_replica_n10], dataDir=[/home/jenkins/workspace/Lucene-Solr-master-Linux/solr/build/solr-core/test/J2/temp/solr.cloud.ReplaceNodeNoTargetTest_BBEA183626B44C34-001/tempDir-001/node4/./replacenodetest_coll_notarget_shard3_replica_n10/data/]
   [junit4]   2> 2574760 INFO  (qtp17947923-22583) [n:127.0.0.1:36063_solr c:replacenodetest_coll_notarget s:shard3 r:core_node11 x:replacenodetest_coll_notarget_shard3_replica_n8] o.a.s.m.r.SolrJmxReporter JMX monitoring for 'solr_36063.solr.core.replacenodetest_coll_notarget.shard3.replica_n8' (registry 'solr.core.replacenodetest_coll_notarget.shard3.replica_n8') enabled at server: com.sun.jmx.mbeanserver.JmxMBeanServer@fe40a04
   [junit4]   2> 2574760 INFO  (qtp17947923-22583) [n:127.0.0.1:36063_solr c:replacenodetest_coll_notarget s:shard3 r:core_node11 x:replacenodetest_coll_notarget_shard3_replica_n8] o.a.s.c.SolrCore solr.RecoveryStrategy.Builder
   [junit4]   2> 2574760 INFO  (qtp17947923-22583) [n:127.0.0.1:36063_solr c:replacenodetest_coll_notarget s:shard3 r:core_node11 x:replacenodetest_coll_notarget_shard3_replica_n8] o.a.s.c.SolrCore [[replacenodetest_coll_notarget_shard3_replica_n8] ] Opening new SolrCore at [/home/jenkins/workspace/Lucene-Solr-master-Linux/solr/build/solr-core/test/J2/temp/solr.cloud.ReplaceNodeNoTargetTest_BBEA183626B44C34-001/tempDir-001/node3/replacenodetest_coll_notarget_shard3_replica_n8], dataDir=[/home/jenkins/workspace/Lucene-Solr-master-Linux/solr/build/solr-core/test/J2/temp/solr.cloud.ReplaceNodeNoTargetTest_BBEA183626B44C34-001/tempDir-001/node3/./replacenodetest_coll_notarget_shard3_replica_n8/data/]
   [junit4]   2> 2574765 INFO  (qtp17947923-22566) [n:127.0.0.1:36063_solr c:replacenodetest_coll_notarget s:shard4 r:core_node17 x:replacenodetest_coll_notarget_shard4_replica_n14] o.a.s.s.IndexSchema Loaded schema cloud-dynamic/1.6 with uniqueid field id
   [junit4]   2> 2574766 INFO  (qtp17947923-22566) [n:127.0.0.1:36063_solr c:replacenodetest_coll_notarget s:shard4 r:core_node17 x:replacenodetest_coll_notarget_shard4_replica_n14] o.a.s.c.CoreContainer Creating SolrCore 'replacenodetest_coll_notarget_shard4_replica_n14' using configuration from collection replacenodetest_coll_notarget, trusted=true
   [junit4]   2> 2574766 INFO  (qtp17947923-22566) [n:127.0.0.1:36063_solr c:replacenodetest_coll_notarget s:shard4 r:core_node17 x:replacenodetest_coll_notarget_shard4_replica_n14] o.a.s.m.r.SolrJmxReporter JMX monitoring for 'solr_36063.solr.core.replacenodetest_coll_notarget.shard4.replica_n14' (registry 'solr.core.replacenodetest_coll_notarget.shard4.replica_n14') enabled at server: com.sun.jmx.mbeanserver.JmxMBeanServer@fe40a04
   [junit4]   2> 2574766 INFO  (qtp17947923-22566) [n:127.0.0.1:36063_solr c:replacenodetest_coll_notarget s:shard4 r:core_node17 x:replacenodetest_coll_notarget_shard4_replica_n14] o.a.s.c.SolrCore solr.RecoveryStrategy.Builder
   [junit4]   2> 2574766 INFO  (qtp17947923-22566) [n:127.0.0.1:36063_solr c:replacenodetest_coll_notarget s:shard4 r:core_node17 x:replacenodetest_coll_notarget_shard4_replica_n14] o.a.s.c.SolrCore [[replacenodetest_coll_notarget_shard4_replica_n14] ] Opening new SolrCore at [/home/jenkins/workspace/Lucene-Solr-master-Linux/solr/build/solr-core/test/J2/temp/solr.cloud.ReplaceNodeNoTargetTest_BBEA183626B44C34-001/tempDir-001/node3/replacenodetest_coll_notarget_shard4_replica_n14], dataDir=[/home/jenkins/workspace/Lucene-Solr-master-Linux/solr/build/solr-core/test/J2/temp/solr.cloud.ReplaceNodeNoTargetTest_BBEA183626B44C34-001/tempDir-001/node3/./replacenodetest_coll_notarget_shard4_replica_n14/data/]
   [junit4]   2> 2575100 INFO  (qtp1916196117-22703) [n:127.0.0.1:36975_solr c:replacenodetest_coll_notarget s:shard5 r:core_node19 x:replacenodetest_coll_notarget_shard5_replica_n16] o.a.s.s.IndexSchema Loaded schema cloud-dynamic/1.6 with uniqueid field id
   [junit4]   2> 2575101 INFO  (qtp1916196117-22703) [n:127.0.0.1:36975_solr c:replacenodetest_coll_notarget s:shard5 r:core_node19 x:replacenodetest_coll_notarget_shard5_replica_n16] o.a.s.c.CoreContainer Creating SolrCore 'replacenodetest_coll_notarget_shard5_replica_n16' using configuration from collection replacenodetest_coll_notarget, trusted=true
   [junit4]   2> 2575101 INFO  (qtp1916196117-22703) [n:127.0.0.1:36975_solr c:replacenodetest_coll_notarget s:shard5 r:core_node19 x:replacenodetest_coll_notarget_shard5_replica_n16] o.a.s.m.r.SolrJmxReporter JMX monitoring for 'solr_36975.solr.core.replacenodetest_coll_notarget.shard5.replica_n16' (registry 'solr.core.replacenodetest_coll_notarget.shard5.replica_n16') enabled at server: com.sun.jmx.mbeanserver.JmxMBeanServer@fe40a04
   [junit4]   2> 2575101 INFO  (qtp1916196117-22703) [n:127.0.0.1:36975_solr c:replacenodetest_coll_notarget s:shard5 r:core_node19 x:replacenodetest_coll_notarget_shard5_replica_n16] o.a.s.c.SolrCore solr.RecoveryStrategy.Builder
   [junit4]   2> 2575101 INFO  (qtp1916196117-22703) [n:127.0.0.1:36975_solr c:replacenodetest_coll_notarget s:shard5 r:core_node19 x:replacenodetest_coll_notarget_shard5_replica_n16] o.a.s.c.SolrCore [[replacenodetest_coll_notarget_shard5_replica_n16] ] Opening new SolrCore at [/home/jenkins/workspace/Lucene-Solr-master-Linux/solr/build/solr-core/test/J2/temp/solr.cloud.ReplaceNodeNoTargetTest_BBEA183626B44C34-001/tempDir-001/node1/replacenodetest_coll_notarget_shard5_replica_n16], dataDir=[/home/jenkins/workspace/Lucene-Solr-master-Linux/solr/build/solr-core/test/J2/temp/solr.cloud.ReplaceNodeNoTargetTest_BBEA183626B44C34-001/tempDir-001/node1/./replacenodetest_coll_notarget_shard5_replica_n16/data/]
   [junit4]   2> 2575104 INFO  (qtp1916196117-22704) [n:127.0.0.1:36975_solr c:replacenodetest_coll_notarget s:shard2 r:core_node9 x:replacenodetest_coll_notarget_shard2_replica_n6] o.a.s.s.IndexSchema Loaded schema cloud-dynamic/1.6 with uniqueid field id
   [junit4]   2> 2575105 INFO  (qtp1916196117-22704) [n:127.0.0.1:36975_solr c:replacenodetest_coll_notarget s:shard2 r:core_node9 x:replacenodetest_coll_notarget_shard2_replica_n6] o.a.s.c.CoreContainer Creating SolrCore 'replacenodetest_coll_notarget_shard2_replica_n6' using configuration from collection replacenodetest_coll_notarget, trusted=true
   [junit4]   2> 2575105 INFO  (qtp1916196117-22704) [n:127.0.0.1:36975_solr c:replacenodetest_coll_notarget s:shard2 r:core_node9 x:replacenodetest_coll_notarget_shard2_replica_n6] o.a.s.m.r.SolrJmxReporter JMX monitoring for 'solr_36975.solr.core.replacenodetest_coll_notarget.shard2.replica_n6' (registry 'solr.core.replacenodetest_coll_notarget.shard2.replica_n6') enabled at server: com.sun.jmx.mbeanserver.JmxMBeanServer@fe40a04
   [junit4]   2> 2575105 INFO  (qtp1916196117-22704) [n:127.0.0.1:36975_solr c:replacenodetest_coll_notarget s:shard2 r:core_node9 x:replacenodetest_coll_notarget_shard2_replica_n6] o.a.s.c.SolrCore solr.RecoveryStrategy.Builder
   [junit4]   2> 2575105 INFO  (qtp1916196117-22704) [n:127.0.0.1:36975_solr c:replacenodetest_coll_notarget s:shard2 r:core_node9 x:replacenodetest_coll_notarget_shard2_replica_n6] o.a.s.c.SolrCore [[replacenodetest_coll_notarget_shard2_replica_n6] ] Opening new SolrCore at [/home/jenkins/workspace/Lucene-Solr-master-Linux/solr/build/solr-core/test/J2/temp/solr.cloud.ReplaceNodeNoTargetTest_BBEA183626B44C34-001/tempDir-001/node1/replacenodetest_coll_notarget_shard2_replica_n6], dataDir=[/home/jenkins/workspace/Lucene-Solr-master-Linux/solr/build/solr-core/test/J2/temp/solr.cloud.ReplaceNodeNoTargetTest_BBEA183626B44C34-001/tempDir-001/node1/./replacenodetest_coll_notarget_shard2_replica_n6/data/]
   [junit4]   2> 2575108 INFO  (qtp316735416-22579) [n:127.0.0.1:38205_solr c:replacenodetest_coll_notarget s:shard2 r:core_node7 x:replacenodetest_coll_notarget_shard2_replica_n4] o.a.s.s.IndexSchema Loaded schema cloud-dynamic/1.6 with uniqueid field id
   [junit4]   2> 2575109 INFO  (qtp316735416-22579) [n:127.0.0.1:38205_solr c:replacenodetest_coll_notarget s:shard2 r:core_node7 x:replacenodetest_coll_notarget_shard2_replica_n4] o.a.s.c.CoreContainer Creating SolrCore 'replacenodetest_coll_notarget_shard2_replica_n4' using configuration from collection replacenodetest_coll_notarget, trusted=true
   [junit4]   2> 2575109 INFO  (qtp316735416-22579) [n:127.0.0.1:38205_solr c:replacenodetest_coll_notarget s:shard2 r:core_node7 x:replacenodetest_coll_notarget_shard2_replica_n4] o.a.s.m.r.SolrJmxReporter JMX monitoring for 'solr_38205.solr.core.replacenodetest_coll_notarget.shard2.replica_n4' (registry 'solr.core.replacenodetest_coll_notarget.shard2.replica_n4') enabled at server: com.sun.jmx.mbeanserver.JmxMBeanServer@fe40a04
   [junit4]   2> 2575110 INFO  (qtp316735416-22579) [n:127.0.0.1:38205_solr c:replacenodetest_coll_notarget s:shard2 r:core_node7 x:replacenodetest_coll_notarget_shard2_replica_n4] o.a.s.c.SolrCore solr.RecoveryStrategy.Builder
   [junit4]   2> 2575110 INFO  (qtp316735416-22579) [n:127.0.0.1:38205_solr c:replacenodetest_coll_notarget s:shard2 r:core_node7 x:replacenodetest_coll_notarget_shard2_replica_n4] o.a.s.c.SolrCore [[replacenodetest_coll_notarget_shard2_replica_n4] ] Opening new SolrCore at [/home/jenkins/workspace/Lucene-Solr-master-Linux/solr/build/solr-core/test/J2/temp/solr.cloud.ReplaceNodeNoTargetTest_BBEA183626B44C34-001/tempDir-001/node2/replacenodetest_coll_notarget_shard2_replica_n4], dataDir=[/home/jenkins/workspace/Lucene-Solr-master-Linux/solr/build/solr-core/test/J2/temp/solr.cloud.ReplaceNodeNoTargetTest_BBEA183626B44C34-001/tempDir-001/node2/./replacenodetest_coll_notarget_shard2_replica_n4/data/]
   [junit4]   2> 2575241 INFO  (qtp81531992-22542) [n:127.0.0.1:34237_solr c:replacenodetest_coll_notarget s:shard4 r:core_node15 x:replacenodetest_coll_notarget_shard4_replica_n12] o.a.s.u.UpdateHandler Using UpdateLog implementation: org.apache.solr.update.UpdateLog
   [junit4]   2> 2575241 INFO  (qtp81531992-22542) [n:127.0.0.1:34237_solr c:replace

[...truncated too long message...]

tty-closer-1293-thread-1) [    ] o.e.j.s.session Stopped scavenging
   [junit4]   2> 1120013 WARN  (zkCallback-1336-thread-3-processing-n:127.0.0.1:43471_solr) [n:127.0.0.1:43471_solr c:replacenodetest_coll_notarget s:shard5 r:core_node19 x:replacenodetest_coll_notarget_shard5_replica_n16] o.a.s.c.SyncStrategy Closed, skipping sync up.
   [junit4]   2> 1120013 WARN  (zkCallback-1336-thread-2-processing-n:127.0.0.1:43471_solr) [n:127.0.0.1:43471_solr c:replacenodetest_coll_notarget s:shard2 r:core_node9 x:replacenodetest_coll_notarget_shard2_replica_n6] o.a.s.c.SyncStrategy Closed, skipping sync up.
   [junit4]   2> 1120013 INFO  (zkCallback-1336-thread-3-processing-n:127.0.0.1:43471_solr) [n:127.0.0.1:43471_solr c:replacenodetest_coll_notarget s:shard5 r:core_node19 x:replacenodetest_coll_notarget_shard5_replica_n16] o.a.s.c.ShardLeaderElectionContext We failed sync, but we have no versions - we can't sync in that case - we were active before, so become leader anyway
   [junit4]   2> 1120013 INFO  (zkCallback-1336-thread-2-processing-n:127.0.0.1:43471_solr) [n:127.0.0.1:43471_solr c:replacenodetest_coll_notarget s:shard2 r:core_node9 x:replacenodetest_coll_notarget_shard2_replica_n6] o.a.s.c.ShardLeaderElectionContext We failed sync, but we have no versions - we can't sync in that case - we were active before, so become leader anyway
   [junit4]   2> 1120013 INFO  (zkCallback-1336-thread-3-processing-n:127.0.0.1:43471_solr) [n:127.0.0.1:43471_solr c:replacenodetest_coll_notarget s:shard5 r:core_node19 x:replacenodetest_coll_notarget_shard5_replica_n16] o.a.s.c.SolrCore [replacenodetest_coll_notarget_shard5_replica_n16]  CLOSING SolrCore org.apache.solr.core.SolrCore@7f176118
   [junit4]   2> 1120013 INFO  (zkCallback-1336-thread-2-processing-n:127.0.0.1:43471_solr) [n:127.0.0.1:43471_solr c:replacenodetest_coll_notarget s:shard2 r:core_node9 x:replacenodetest_coll_notarget_shard2_replica_n6] o.a.s.c.SolrCore [replacenodetest_coll_notarget_shard2_replica_n6]  CLOSING SolrCore org.apache.solr.core.SolrCore@30512c9d
   [junit4]   2> 1120014 INFO  (zkCallback-1336-thread-3-processing-n:127.0.0.1:43471_solr) [n:127.0.0.1:43471_solr c:replacenodetest_coll_notarget s:shard5 r:core_node19 x:replacenodetest_coll_notarget_shard5_replica_n16] o.a.s.m.SolrMetricManager Closing metric reporters for registry=solr.core.replacenodetest_coll_notarget.shard5.replica_n16, tag=2132238616
   [junit4]   2> 1120014 INFO  (zkCallback-1336-thread-3-processing-n:127.0.0.1:43471_solr) [n:127.0.0.1:43471_solr c:replacenodetest_coll_notarget s:shard5 r:core_node19 x:replacenodetest_coll_notarget_shard5_replica_n16] o.a.s.m.r.SolrJmxReporter Closing reporter [org.apache.solr.metrics.reporters.SolrJmxReporter@7a257d00: rootName = solr_43471, domain = solr.core.replacenodetest_coll_notarget.shard5.replica_n16, service url = null, agent id = null] for registry solr.core.replacenodetest_coll_notarget.shard5.replica_n16 / com.codahale.metrics.MetricRegistry@5fdc0f
   [junit4]   2> 1120019 INFO  (zkCallback-1336-thread-3-processing-n:127.0.0.1:43471_solr) [n:127.0.0.1:43471_solr c:replacenodetest_coll_notarget s:shard5 r:core_node19 x:replacenodetest_coll_notarget_shard5_replica_n16] o.a.s.m.SolrMetricManager Closing metric reporters for registry=solr.collection.replacenodetest_coll_notarget.shard5.leader, tag=2132238616
   [junit4]   2> 1120019 INFO  (zkCallback-1336-thread-2-processing-n:127.0.0.1:43471_solr) [n:127.0.0.1:43471_solr c:replacenodetest_coll_notarget s:shard2 r:core_node9 x:replacenodetest_coll_notarget_shard2_replica_n6] o.a.s.m.SolrMetricManager Closing metric reporters for registry=solr.core.replacenodetest_coll_notarget.shard2.replica_n6, tag=810626205
   [junit4]   2> 1120019 INFO  (zkCallback-1336-thread-2-processing-n:127.0.0.1:43471_solr) [n:127.0.0.1:43471_solr c:replacenodetest_coll_notarget s:shard2 r:core_node9 x:replacenodetest_coll_notarget_shard2_replica_n6] o.a.s.m.r.SolrJmxReporter Closing reporter [org.apache.solr.metrics.reporters.SolrJmxReporter@323e1170: rootName = solr_43471, domain = solr.core.replacenodetest_coll_notarget.shard2.replica_n6, service url = null, agent id = null] for registry solr.core.replacenodetest_coll_notarget.shard2.replica_n6 / com.codahale.metrics.MetricRegistry@5de0a9ce
   [junit4]   2> 1120025 INFO  (zkCallback-1336-thread-2-processing-n:127.0.0.1:43471_solr) [n:127.0.0.1:43471_solr c:replacenodetest_coll_notarget s:shard2 r:core_node9 x:replacenodetest_coll_notarget_shard2_replica_n6] o.a.s.m.SolrMetricManager Closing metric reporters for registry=solr.collection.replacenodetest_coll_notarget.shard2.leader, tag=810626205
   [junit4]   2> 1120026 INFO  (jetty-closer-1293-thread-6) [    ] o.e.j.s.h.ContextHandler Stopped o.e.j.s.ServletContextHandler@77a0a8d0{/solr,null,UNAVAILABLE}
   [junit4]   2> 1120026 INFO  (jetty-closer-1293-thread-6) [    ] o.e.j.s.session Stopped scavenging
   [junit4]   2> 1120026 ERROR (SUITE-ReplaceNodeNoTargetTest-seed#[BBEA183626B44C34]-worker) [    ] o.a.z.s.ZooKeeperServer ZKShutdownHandler is not registered, so ZooKeeper server won't take any action on ERROR or SHUTDOWN server state changes
   [junit4]   2> 1120026 INFO  (SUITE-ReplaceNodeNoTargetTest-seed#[BBEA183626B44C34]-worker) [    ] o.a.s.c.ZkTestServer connecting to 127.0.0.1:45179 45179
   [junit4]   2> 1125140 INFO  (Thread-1329) [    ] o.a.s.c.ZkTestServer connecting to 127.0.0.1:45179 45179
   [junit4]   2> 1125141 WARN  (Thread-1329) [    ] o.a.s.c.ZkTestServer Watch limit violations: 
   [junit4]   2> Maximum concurrent create/delete watches above limit:
   [junit4]   2> 
   [junit4]   2> 	11	/solr/collections/replacenodetest_coll_notarget/terms/shard5
   [junit4]   2> 	9	/solr/collections/replacenodetest_coll_notarget/terms/shard2
   [junit4]   2> 	7	/solr/aliases.json
   [junit4]   2> 	6	/solr/security.json
   [junit4]   2> 	6	/solr/configs/conf1
   [junit4]   2> 	5	/solr/collections/replacenodetest_coll_notarget/terms/shard1
   [junit4]   2> 	5	/solr/collections/replacenodetest_coll_notarget/terms/shard4
   [junit4]   2> 	5	/solr/collections/replacenodetest_coll_notarget/terms/shard3
   [junit4]   2> 
   [junit4]   2> Maximum concurrent data watches above limit:
   [junit4]   2> 
   [junit4]   2> 	76	/solr/collections/replacenodetest_coll_notarget/state.json
   [junit4]   2> 	7	/solr/clusterprops.json
   [junit4]   2> 	7	/solr/clusterstate.json
   [junit4]   2> 	2	/solr/overseer_elect/election/72190845470507022-127.0.0.1:45645_solr-n_0000000000
   [junit4]   2> 	2	/solr/overseer_elect/election/72190845470507025-127.0.0.1:44477_solr-n_0000000001
   [junit4]   2> 
   [junit4]   2> Maximum concurrent children watches above limit:
   [junit4]   2> 
   [junit4]   2> 	7	/solr/live_nodes
   [junit4]   2> 	7	/solr/collections
   [junit4]   2> 
   [junit4]   2> NOTE: leaving temporary files on disk at: /home/jenkins/workspace/Lucene-Solr-master-Linux/solr/build/solr-core/test/J2/temp/solr.cloud.ReplaceNodeNoTargetTest_BBEA183626B44C34-001
   [junit4]   2> NOTE: test params are: codec=CheapBastard, sim=Asserting(org.apache.lucene.search.similarities.AssertingSimilarity@4bdffe72), locale=lv, timezone=Asia/Barnaul
   [junit4]   2> NOTE: Linux 4.13.0-32-generic amd64/Oracle Corporation 1.8.0_162 (64-bit)/cpus=8,threads=1,free=179080552,total=510656512
   [junit4]   2> NOTE: All tests run in this JVM: [ComputePlanActionTest, ComputePlanActionTest, ReplaceNodeNoTargetTest, ReplaceNodeNoTargetTest, ComputePlanActionTest, ComputePlanActionTest, ShardSplitTest, ComputePlanActionTest, ReplaceNodeNoTargetTest, ReplaceNodeNoTargetTest, ReplaceNodeNoTargetTest]
   [junit4] Completed [13/15 (6!)] on J2 in 15.12s, 1 test, 1 failure <<< FAILURES!

[...truncated 38 lines...]
BUILD FAILED
/home/jenkins/workspace/Lucene-Solr-master-Linux/lucene/common-build.xml:1560: The following error occurred while executing this line:
/home/jenkins/workspace/Lucene-Solr-master-Linux/lucene/common-build.xml:1085: There were test failures: 15 suites, 50 tests, 6 failures [seed: BBEA183626B44C34]

Total time: 23 minutes 20 seconds

[repro] Setting last failure code to 256

[repro] Failures:
[repro]   1/5 failed: org.apache.solr.cloud.ReplaceNodeNoTargetTest
[repro]   1/5 failed: org.apache.solr.cloud.api.collections.ShardSplitTest
[repro]   4/5 failed: org.apache.solr.cloud.autoscaling.ComputePlanActionTest
[repro] git checkout 82a99840718bb7e696ef4af114eee976c776a251
HEAD is now at 82a9984... SOLR-11912: Clean up left-over collections and defaults between tests.
[repro] Exiting with code 256
+ mv lucene/build lucene/build.repro
+ mv solr/build solr/build.repro
+ mv lucene/build.orig lucene/build
+ mv solr/build.orig solr/build
+ rm -f /tmp/tmp.bY63NA2C9H
Archiving artifacts
Setting ANT_1_8_2_HOME=/var/lib/jenkins/tools/hudson.tasks.Ant_AntInstallation/ANT_1.8.2
[WARNINGS] Parsing warnings in console log with parser Java Compiler (javac)
Setting ANT_1_8_2_HOME=/var/lib/jenkins/tools/hudson.tasks.Ant_AntInstallation/ANT_1.8.2
Setting ANT_1_8_2_HOME=/var/lib/jenkins/tools/hudson.tasks.Ant_AntInstallation/ANT_1.8.2
<Git Blamer> Using GitBlamer to create author and commit information for all warnings.
<Git Blamer> GIT_COMMIT=82a99840718bb7e696ef4af114eee976c776a251, workspace=/var/lib/jenkins/workspace/Lucene-Solr-master-Linux
[WARNINGS] Computing warning deltas based on reference build #21508
Recording test results
Setting ANT_1_8_2_HOME=/var/lib/jenkins/tools/hudson.tasks.Ant_AntInstallation/ANT_1.8.2
Build step 'Publish JUnit test result report' changed build result to UNSTABLE
Email was triggered for: Unstable (Test Failures)
Sending email for trigger: Unstable (Test Failures)
Setting ANT_1_8_2_HOME=/var/lib/jenkins/tools/hudson.tasks.Ant_AntInstallation/ANT_1.8.2
Setting ANT_1_8_2_HOME=/var/lib/jenkins/tools/hudson.tasks.Ant_AntInstallation/ANT_1.8.2
Setting ANT_1_8_2_HOME=/var/lib/jenkins/tools/hudson.tasks.Ant_AntInstallation/ANT_1.8.2
Setting ANT_1_8_2_HOME=/var/lib/jenkins/tools/hudson.tasks.Ant_AntInstallation/ANT_1.8.2

Mime
View raw message