lucene-dev mailing list archives

Site index · List index
Message view « Date » · « Thread »
Top « Date » · « Thread »
From Policeman Jenkins Server <jenk...@thetaphi.de>
Subject [JENKINS] Lucene-Solr-7.x-Linux (64bit/jdk-9.0.1) - Build # 1272 - Still Unstable!
Date Thu, 01 Feb 2018 06:37:52 GMT
Build: https://jenkins.thetaphi.de/job/Lucene-Solr-7.x-Linux/1272/
Java: 64bit/jdk-9.0.1 -XX:+UseCompressedOops -XX:+UseG1GC

4 tests failed.
FAILED:  junit.framework.TestSuite.org.apache.solr.analytics.legacy.facet.LegacyRangeFacetCloudTest

Error Message:
2 threads leaked from SUITE scope at org.apache.solr.analytics.legacy.facet.LegacyRangeFacetCloudTest:     1) Thread[id=41, name=qtp1909419050-41, state=TIMED_WAITING, group=TGRP-LegacyRangeFacetCloudTest]         at java.base@9.0.1/jdk.internal.misc.Unsafe.park(Native Method)         at java.base@9.0.1/java.util.concurrent.locks.LockSupport.parkNanos(LockSupport.java:234)         at java.base@9.0.1/java.util.concurrent.locks.AbstractQueuedSynchronizer$ConditionObject.await(AbstractQueuedSynchronizer.java:2192)         at app//org.eclipse.jetty.util.thread.ReservedThreadExecutor$ReservedThread.reservedWait(ReservedThreadExecutor.java:308)         at app//org.eclipse.jetty.util.thread.ReservedThreadExecutor$ReservedThread.run(ReservedThreadExecutor.java:373)         at app//org.eclipse.jetty.util.thread.QueuedThreadPool.runJob(QueuedThreadPool.java:708)         at app//org.eclipse.jetty.util.thread.QueuedThreadPool$2.run(QueuedThreadPool.java:626)         at java.base@9.0.1/java.lang.Thread.run(Thread.java:844)    2) Thread[id=147, name=qtp1909419050-147, state=TIMED_WAITING, group=TGRP-LegacyRangeFacetCloudTest]         at java.base@9.0.1/jdk.internal.misc.Unsafe.park(Native Method)         at java.base@9.0.1/java.util.concurrent.locks.LockSupport.parkNanos(LockSupport.java:234)         at java.base@9.0.1/java.util.concurrent.locks.AbstractQueuedSynchronizer$ConditionObject.await(AbstractQueuedSynchronizer.java:2192)         at app//org.eclipse.jetty.util.thread.ReservedThreadExecutor$ReservedThread.reservedWait(ReservedThreadExecutor.java:308)         at app//org.eclipse.jetty.util.thread.ReservedThreadExecutor$ReservedThread.run(ReservedThreadExecutor.java:373)         at app//org.eclipse.jetty.util.thread.QueuedThreadPool.runJob(QueuedThreadPool.java:708)         at app//org.eclipse.jetty.util.thread.QueuedThreadPool$2.run(QueuedThreadPool.java:626)         at java.base@9.0.1/java.lang.Thread.run(Thread.java:844)

Stack Trace:
com.carrotsearch.randomizedtesting.ThreadLeakError: 2 threads leaked from SUITE scope at org.apache.solr.analytics.legacy.facet.LegacyRangeFacetCloudTest: 
   1) Thread[id=41, name=qtp1909419050-41, state=TIMED_WAITING, group=TGRP-LegacyRangeFacetCloudTest]
        at java.base@9.0.1/jdk.internal.misc.Unsafe.park(Native Method)
        at java.base@9.0.1/java.util.concurrent.locks.LockSupport.parkNanos(LockSupport.java:234)
        at java.base@9.0.1/java.util.concurrent.locks.AbstractQueuedSynchronizer$ConditionObject.await(AbstractQueuedSynchronizer.java:2192)
        at app//org.eclipse.jetty.util.thread.ReservedThreadExecutor$ReservedThread.reservedWait(ReservedThreadExecutor.java:308)
        at app//org.eclipse.jetty.util.thread.ReservedThreadExecutor$ReservedThread.run(ReservedThreadExecutor.java:373)
        at app//org.eclipse.jetty.util.thread.QueuedThreadPool.runJob(QueuedThreadPool.java:708)
        at app//org.eclipse.jetty.util.thread.QueuedThreadPool$2.run(QueuedThreadPool.java:626)
        at java.base@9.0.1/java.lang.Thread.run(Thread.java:844)
   2) Thread[id=147, name=qtp1909419050-147, state=TIMED_WAITING, group=TGRP-LegacyRangeFacetCloudTest]
        at java.base@9.0.1/jdk.internal.misc.Unsafe.park(Native Method)
        at java.base@9.0.1/java.util.concurrent.locks.LockSupport.parkNanos(LockSupport.java:234)
        at java.base@9.0.1/java.util.concurrent.locks.AbstractQueuedSynchronizer$ConditionObject.await(AbstractQueuedSynchronizer.java:2192)
        at app//org.eclipse.jetty.util.thread.ReservedThreadExecutor$ReservedThread.reservedWait(ReservedThreadExecutor.java:308)
        at app//org.eclipse.jetty.util.thread.ReservedThreadExecutor$ReservedThread.run(ReservedThreadExecutor.java:373)
        at app//org.eclipse.jetty.util.thread.QueuedThreadPool.runJob(QueuedThreadPool.java:708)
        at app//org.eclipse.jetty.util.thread.QueuedThreadPool$2.run(QueuedThreadPool.java:626)
        at java.base@9.0.1/java.lang.Thread.run(Thread.java:844)
	at __randomizedtesting.SeedInfo.seed([55A736C440B6F3BE]:0)


FAILED:  junit.framework.TestSuite.org.apache.solr.analytics.legacy.facet.LegacyRangeFacetCloudTest

Error Message:
There are still zombie threads that couldn't be terminated:    1) Thread[id=41, name=qtp1909419050-41, state=TIMED_WAITING, group=TGRP-LegacyRangeFacetCloudTest]         at java.base@9.0.1/jdk.internal.misc.Unsafe.park(Native Method)         at java.base@9.0.1/java.util.concurrent.locks.LockSupport.parkNanos(LockSupport.java:234)         at java.base@9.0.1/java.util.concurrent.locks.AbstractQueuedSynchronizer$ConditionObject.await(AbstractQueuedSynchronizer.java:2192)         at app//org.eclipse.jetty.util.thread.ReservedThreadExecutor$ReservedThread.reservedWait(ReservedThreadExecutor.java:308)         at app//org.eclipse.jetty.util.thread.ReservedThreadExecutor$ReservedThread.run(ReservedThreadExecutor.java:373)         at app//org.eclipse.jetty.util.thread.QueuedThreadPool.runJob(QueuedThreadPool.java:708)         at app//org.eclipse.jetty.util.thread.QueuedThreadPool$2.run(QueuedThreadPool.java:626)         at java.base@9.0.1/java.lang.Thread.run(Thread.java:844)    2) Thread[id=147, name=qtp1909419050-147, state=TIMED_WAITING, group=TGRP-LegacyRangeFacetCloudTest]         at java.base@9.0.1/jdk.internal.misc.Unsafe.park(Native Method)         at java.base@9.0.1/java.util.concurrent.locks.LockSupport.parkNanos(LockSupport.java:234)         at java.base@9.0.1/java.util.concurrent.locks.AbstractQueuedSynchronizer$ConditionObject.await(AbstractQueuedSynchronizer.java:2192)         at app//org.eclipse.jetty.util.thread.ReservedThreadExecutor$ReservedThread.reservedWait(ReservedThreadExecutor.java:308)         at app//org.eclipse.jetty.util.thread.ReservedThreadExecutor$ReservedThread.run(ReservedThreadExecutor.java:373)         at app//org.eclipse.jetty.util.thread.QueuedThreadPool.runJob(QueuedThreadPool.java:708)         at app//org.eclipse.jetty.util.thread.QueuedThreadPool$2.run(QueuedThreadPool.java:626)         at java.base@9.0.1/java.lang.Thread.run(Thread.java:844)

Stack Trace:
com.carrotsearch.randomizedtesting.ThreadLeakError: There are still zombie threads that couldn't be terminated:
   1) Thread[id=41, name=qtp1909419050-41, state=TIMED_WAITING, group=TGRP-LegacyRangeFacetCloudTest]
        at java.base@9.0.1/jdk.internal.misc.Unsafe.park(Native Method)
        at java.base@9.0.1/java.util.concurrent.locks.LockSupport.parkNanos(LockSupport.java:234)
        at java.base@9.0.1/java.util.concurrent.locks.AbstractQueuedSynchronizer$ConditionObject.await(AbstractQueuedSynchronizer.java:2192)
        at app//org.eclipse.jetty.util.thread.ReservedThreadExecutor$ReservedThread.reservedWait(ReservedThreadExecutor.java:308)
        at app//org.eclipse.jetty.util.thread.ReservedThreadExecutor$ReservedThread.run(ReservedThreadExecutor.java:373)
        at app//org.eclipse.jetty.util.thread.QueuedThreadPool.runJob(QueuedThreadPool.java:708)
        at app//org.eclipse.jetty.util.thread.QueuedThreadPool$2.run(QueuedThreadPool.java:626)
        at java.base@9.0.1/java.lang.Thread.run(Thread.java:844)
   2) Thread[id=147, name=qtp1909419050-147, state=TIMED_WAITING, group=TGRP-LegacyRangeFacetCloudTest]
        at java.base@9.0.1/jdk.internal.misc.Unsafe.park(Native Method)
        at java.base@9.0.1/java.util.concurrent.locks.LockSupport.parkNanos(LockSupport.java:234)
        at java.base@9.0.1/java.util.concurrent.locks.AbstractQueuedSynchronizer$ConditionObject.await(AbstractQueuedSynchronizer.java:2192)
        at app//org.eclipse.jetty.util.thread.ReservedThreadExecutor$ReservedThread.reservedWait(ReservedThreadExecutor.java:308)
        at app//org.eclipse.jetty.util.thread.ReservedThreadExecutor$ReservedThread.run(ReservedThreadExecutor.java:373)
        at app//org.eclipse.jetty.util.thread.QueuedThreadPool.runJob(QueuedThreadPool.java:708)
        at app//org.eclipse.jetty.util.thread.QueuedThreadPool$2.run(QueuedThreadPool.java:626)
        at java.base@9.0.1/java.lang.Thread.run(Thread.java:844)
	at __randomizedtesting.SeedInfo.seed([55A736C440B6F3BE]:0)


FAILED:  org.apache.solr.cloud.autoscaling.ComputePlanActionTest.testSelectedCollections

Error Message:
The operations computed by ComputePlanAction should not be nullSolrClientNodeStateProvider.DEBUG{AFTER_ACTION=[compute_plan, null], BEFORE_ACTION=[compute_plan, null]}

Stack Trace:
java.lang.AssertionError: The operations computed by ComputePlanAction should not be nullSolrClientNodeStateProvider.DEBUG{AFTER_ACTION=[compute_plan, null], BEFORE_ACTION=[compute_plan, null]}
	at __randomizedtesting.SeedInfo.seed([B8CBD7234C714071:826532FA7215991F]:0)
	at org.junit.Assert.fail(Assert.java:93)
	at org.junit.Assert.assertTrue(Assert.java:43)
	at org.junit.Assert.assertNotNull(Assert.java:526)
	at org.apache.solr.cloud.autoscaling.ComputePlanActionTest.testSelectedCollections(ComputePlanActionTest.java:469)
	at java.base/jdk.internal.reflect.NativeMethodAccessorImpl.invoke0(Native Method)
	at java.base/jdk.internal.reflect.NativeMethodAccessorImpl.invoke(NativeMethodAccessorImpl.java:62)
	at java.base/jdk.internal.reflect.DelegatingMethodAccessorImpl.invoke(DelegatingMethodAccessorImpl.java:43)
	at java.base/java.lang.reflect.Method.invoke(Method.java:564)
	at com.carrotsearch.randomizedtesting.RandomizedRunner.invoke(RandomizedRunner.java:1737)
	at com.carrotsearch.randomizedtesting.RandomizedRunner$8.evaluate(RandomizedRunner.java:934)
	at com.carrotsearch.randomizedtesting.RandomizedRunner$9.evaluate(RandomizedRunner.java:970)
	at com.carrotsearch.randomizedtesting.RandomizedRunner$10.evaluate(RandomizedRunner.java:984)
	at com.carrotsearch.randomizedtesting.rules.SystemPropertiesRestoreRule$1.evaluate(SystemPropertiesRestoreRule.java:57)
	at org.apache.lucene.util.TestRuleSetupTeardownChained$1.evaluate(TestRuleSetupTeardownChained.java:49)
	at org.apache.lucene.util.AbstractBeforeAfterRule$1.evaluate(AbstractBeforeAfterRule.java:45)
	at org.apache.lucene.util.TestRuleThreadAndTestName$1.evaluate(TestRuleThreadAndTestName.java:48)
	at org.apache.lucene.util.TestRuleIgnoreAfterMaxFailures$1.evaluate(TestRuleIgnoreAfterMaxFailures.java:64)
	at org.apache.lucene.util.TestRuleMarkFailure$1.evaluate(TestRuleMarkFailure.java:47)
	at com.carrotsearch.randomizedtesting.rules.StatementAdapter.evaluate(StatementAdapter.java:36)
	at com.carrotsearch.randomizedtesting.ThreadLeakControl$StatementRunner.run(ThreadLeakControl.java:368)
	at com.carrotsearch.randomizedtesting.ThreadLeakControl.forkTimeoutingTask(ThreadLeakControl.java:817)
	at com.carrotsearch.randomizedtesting.ThreadLeakControl$3.evaluate(ThreadLeakControl.java:468)
	at com.carrotsearch.randomizedtesting.RandomizedRunner.runSingleTest(RandomizedRunner.java:943)
	at com.carrotsearch.randomizedtesting.RandomizedRunner$5.evaluate(RandomizedRunner.java:829)
	at com.carrotsearch.randomizedtesting.RandomizedRunner$6.evaluate(RandomizedRunner.java:879)
	at com.carrotsearch.randomizedtesting.RandomizedRunner$7.evaluate(RandomizedRunner.java:890)
	at com.carrotsearch.randomizedtesting.rules.StatementAdapter.evaluate(StatementAdapter.java:36)
	at com.carrotsearch.randomizedtesting.rules.SystemPropertiesRestoreRule$1.evaluate(SystemPropertiesRestoreRule.java:57)
	at org.apache.lucene.util.AbstractBeforeAfterRule$1.evaluate(AbstractBeforeAfterRule.java:45)
	at com.carrotsearch.randomizedtesting.rules.StatementAdapter.evaluate(StatementAdapter.java:36)
	at org.apache.lucene.util.TestRuleStoreClassName$1.evaluate(TestRuleStoreClassName.java:41)
	at com.carrotsearch.randomizedtesting.rules.NoShadowingOrOverridesOnMethodsRule$1.evaluate(NoShadowingOrOverridesOnMethodsRule.java:40)
	at com.carrotsearch.randomizedtesting.rules.NoShadowingOrOverridesOnMethodsRule$1.evaluate(NoShadowingOrOverridesOnMethodsRule.java:40)
	at com.carrotsearch.randomizedtesting.rules.StatementAdapter.evaluate(StatementAdapter.java:36)
	at com.carrotsearch.randomizedtesting.rules.StatementAdapter.evaluate(StatementAdapter.java:36)
	at org.apache.lucene.util.TestRuleAssertionsRequired$1.evaluate(TestRuleAssertionsRequired.java:53)
	at org.apache.lucene.util.TestRuleMarkFailure$1.evaluate(TestRuleMarkFailure.java:47)
	at org.apache.lucene.util.TestRuleIgnoreAfterMaxFailures$1.evaluate(TestRuleIgnoreAfterMaxFailures.java:64)
	at org.apache.lucene.util.TestRuleIgnoreTestSuites$1.evaluate(TestRuleIgnoreTestSuites.java:54)
	at com.carrotsearch.randomizedtesting.rules.StatementAdapter.evaluate(StatementAdapter.java:36)
	at com.carrotsearch.randomizedtesting.ThreadLeakControl$StatementRunner.run(ThreadLeakControl.java:368)
	at java.base/java.lang.Thread.run(Thread.java:844)


FAILED:  org.apache.solr.handler.admin.AutoscalingHistoryHandlerTest.testHistory

Error Message:
expected:<5> but was:<0>

Stack Trace:
java.lang.AssertionError: expected:<5> but was:<0>
	at __randomizedtesting.SeedInfo.seed([B8CBD7234C714071:D53773DEF639BF76]:0)
	at org.junit.Assert.fail(Assert.java:93)
	at org.junit.Assert.failNotEquals(Assert.java:647)
	at org.junit.Assert.assertEquals(Assert.java:128)
	at org.junit.Assert.assertEquals(Assert.java:472)
	at org.junit.Assert.assertEquals(Assert.java:456)
	at org.apache.solr.handler.admin.AutoscalingHistoryHandlerTest.testHistory(AutoscalingHistoryHandlerTest.java:241)
	at java.base/jdk.internal.reflect.NativeMethodAccessorImpl.invoke0(Native Method)
	at java.base/jdk.internal.reflect.NativeMethodAccessorImpl.invoke(NativeMethodAccessorImpl.java:62)
	at java.base/jdk.internal.reflect.DelegatingMethodAccessorImpl.invoke(DelegatingMethodAccessorImpl.java:43)
	at java.base/java.lang.reflect.Method.invoke(Method.java:564)
	at com.carrotsearch.randomizedtesting.RandomizedRunner.invoke(RandomizedRunner.java:1737)
	at com.carrotsearch.randomizedtesting.RandomizedRunner$8.evaluate(RandomizedRunner.java:934)
	at com.carrotsearch.randomizedtesting.RandomizedRunner$9.evaluate(RandomizedRunner.java:970)
	at com.carrotsearch.randomizedtesting.RandomizedRunner$10.evaluate(RandomizedRunner.java:984)
	at com.carrotsearch.randomizedtesting.rules.SystemPropertiesRestoreRule$1.evaluate(SystemPropertiesRestoreRule.java:57)
	at org.apache.lucene.util.TestRuleSetupTeardownChained$1.evaluate(TestRuleSetupTeardownChained.java:49)
	at org.apache.lucene.util.AbstractBeforeAfterRule$1.evaluate(AbstractBeforeAfterRule.java:45)
	at org.apache.lucene.util.TestRuleThreadAndTestName$1.evaluate(TestRuleThreadAndTestName.java:48)
	at org.apache.lucene.util.TestRuleIgnoreAfterMaxFailures$1.evaluate(TestRuleIgnoreAfterMaxFailures.java:64)
	at org.apache.lucene.util.TestRuleMarkFailure$1.evaluate(TestRuleMarkFailure.java:47)
	at com.carrotsearch.randomizedtesting.rules.StatementAdapter.evaluate(StatementAdapter.java:36)
	at com.carrotsearch.randomizedtesting.ThreadLeakControl$StatementRunner.run(ThreadLeakControl.java:368)
	at com.carrotsearch.randomizedtesting.ThreadLeakControl.forkTimeoutingTask(ThreadLeakControl.java:817)
	at com.carrotsearch.randomizedtesting.ThreadLeakControl$3.evaluate(ThreadLeakControl.java:468)
	at com.carrotsearch.randomizedtesting.RandomizedRunner.runSingleTest(RandomizedRunner.java:943)
	at com.carrotsearch.randomizedtesting.RandomizedRunner$5.evaluate(RandomizedRunner.java:829)
	at com.carrotsearch.randomizedtesting.RandomizedRunner$6.evaluate(RandomizedRunner.java:879)
	at com.carrotsearch.randomizedtesting.RandomizedRunner$7.evaluate(RandomizedRunner.java:890)
	at com.carrotsearch.randomizedtesting.rules.StatementAdapter.evaluate(StatementAdapter.java:36)
	at com.carrotsearch.randomizedtesting.rules.SystemPropertiesRestoreRule$1.evaluate(SystemPropertiesRestoreRule.java:57)
	at org.apache.lucene.util.AbstractBeforeAfterRule$1.evaluate(AbstractBeforeAfterRule.java:45)
	at com.carrotsearch.randomizedtesting.rules.StatementAdapter.evaluate(StatementAdapter.java:36)
	at org.apache.lucene.util.TestRuleStoreClassName$1.evaluate(TestRuleStoreClassName.java:41)
	at com.carrotsearch.randomizedtesting.rules.NoShadowingOrOverridesOnMethodsRule$1.evaluate(NoShadowingOrOverridesOnMethodsRule.java:40)
	at com.carrotsearch.randomizedtesting.rules.NoShadowingOrOverridesOnMethodsRule$1.evaluate(NoShadowingOrOverridesOnMethodsRule.java:40)
	at com.carrotsearch.randomizedtesting.rules.StatementAdapter.evaluate(StatementAdapter.java:36)
	at com.carrotsearch.randomizedtesting.rules.StatementAdapter.evaluate(StatementAdapter.java:36)
	at org.apache.lucene.util.TestRuleAssertionsRequired$1.evaluate(TestRuleAssertionsRequired.java:53)
	at org.apache.lucene.util.TestRuleMarkFailure$1.evaluate(TestRuleMarkFailure.java:47)
	at org.apache.lucene.util.TestRuleIgnoreAfterMaxFailures$1.evaluate(TestRuleIgnoreAfterMaxFailures.java:64)
	at org.apache.lucene.util.TestRuleIgnoreTestSuites$1.evaluate(TestRuleIgnoreTestSuites.java:54)
	at com.carrotsearch.randomizedtesting.rules.StatementAdapter.evaluate(StatementAdapter.java:36)
	at com.carrotsearch.randomizedtesting.ThreadLeakControl$StatementRunner.run(ThreadLeakControl.java:368)
	at java.base/java.lang.Thread.run(Thread.java:844)




Build Log:
[...truncated 13388 lines...]
   [junit4] Suite: org.apache.solr.handler.admin.AutoscalingHistoryHandlerTest
   [junit4]   2> 2609450 INFO  (SUITE-AutoscalingHistoryHandlerTest-seed#[B8CBD7234C714071]-worker) [    ] o.a.s.SolrTestCaseJ4 SecureRandom sanity checks: test.solr.allowed.securerandom=null & java.security.egd=file:/dev/./urandom
   [junit4]   2> Creating dataDir: /home/jenkins/workspace/Lucene-Solr-7.x-Linux/solr/build/solr-core/test/J1/temp/solr.handler.admin.AutoscalingHistoryHandlerTest_B8CBD7234C714071-001/init-core-data-001
   [junit4]   2> 2609451 INFO  (SUITE-AutoscalingHistoryHandlerTest-seed#[B8CBD7234C714071]-worker) [    ] o.a.s.SolrTestCaseJ4 Using PointFields (NUMERIC_POINTS_SYSPROP=true) w/NUMERIC_DOCVALUES_SYSPROP=true
   [junit4]   2> 2609451 INFO  (SUITE-AutoscalingHistoryHandlerTest-seed#[B8CBD7234C714071]-worker) [    ] o.a.s.SolrTestCaseJ4 Randomized ssl (true) and clientAuth (false) via: @org.apache.solr.util.RandomizeSSL(reason="", ssl=0.0/0.0, value=0.0/0.0, clientAuth=0.0/0.0)
   [junit4]   2> 2609452 INFO  (SUITE-AutoscalingHistoryHandlerTest-seed#[B8CBD7234C714071]-worker) [    ] o.a.s.c.MiniSolrCloudCluster Starting cluster of 3 servers in /home/jenkins/workspace/Lucene-Solr-7.x-Linux/solr/build/solr-core/test/J1/temp/solr.handler.admin.AutoscalingHistoryHandlerTest_B8CBD7234C714071-001/tempDir-001
   [junit4]   2> 2609452 INFO  (SUITE-AutoscalingHistoryHandlerTest-seed#[B8CBD7234C714071]-worker) [    ] o.a.s.c.ZkTestServer STARTING ZK TEST SERVER
   [junit4]   2> 2609452 INFO  (Thread-3021) [    ] o.a.s.c.ZkTestServer client port:0.0.0.0/0.0.0.0:0
   [junit4]   2> 2609452 INFO  (Thread-3021) [    ] o.a.s.c.ZkTestServer Starting server
   [junit4]   2> 2609453 ERROR (Thread-3021) [    ] o.a.z.s.ZooKeeperServer ZKShutdownHandler is not registered, so ZooKeeper server won't take any action on ERROR or SHUTDOWN server state changes
   [junit4]   2> 2609552 INFO  (SUITE-AutoscalingHistoryHandlerTest-seed#[B8CBD7234C714071]-worker) [    ] o.a.s.c.ZkTestServer start zk server on port:37667
   [junit4]   2> 2609569 INFO  (zkConnectionManagerCallback-7033-thread-1) [    ] o.a.s.c.c.ConnectionManager zkClient has connected
   [junit4]   2> 2609571 INFO  (jetty-launcher-7030-thread-1) [    ] o.e.j.s.Server jetty-9.4.8.v20171121, build timestamp: ٢٠١٧-١١-٢١T١٤:٢٧:٣٧-07:00, git hash: 82b8fb23f757335bb3329d540ce37a2a2615f0a8
   [junit4]   2> 2609572 INFO  (jetty-launcher-7030-thread-1) [    ] o.e.j.s.session DefaultSessionIdManager workerName=node0
   [junit4]   2> 2609572 INFO  (jetty-launcher-7030-thread-1) [    ] o.e.j.s.session No SessionScavenger set, using defaults
   [junit4]   2> 2609572 INFO  (jetty-launcher-7030-thread-1) [    ] o.e.j.s.session Scavenging every 660000ms
   [junit4]   2> 2609572 INFO  (jetty-launcher-7030-thread-2) [    ] o.e.j.s.Server jetty-9.4.8.v20171121, build timestamp: ٢٠١٧-١١-٢١T١٤:٢٧:٣٧-07:00, git hash: 82b8fb23f757335bb3329d540ce37a2a2615f0a8
   [junit4]   2> 2609572 INFO  (jetty-launcher-7030-thread-1) [    ] o.e.j.s.h.ContextHandler Started o.e.j.s.ServletContextHandler@2da8dbab{/solr,null,AVAILABLE}
   [junit4]   2> 2609573 INFO  (jetty-launcher-7030-thread-1) [    ] o.e.j.s.AbstractConnector Started ServerConnector@15d13dd7{SSL,[ssl, http/1.1]}{127.0.0.1:46177}
   [junit4]   2> 2609573 INFO  (jetty-launcher-7030-thread-1) [    ] o.e.j.s.Server Started @2612149ms
   [junit4]   2> 2609573 INFO  (jetty-launcher-7030-thread-1) [    ] o.a.s.c.s.e.JettySolrRunner Jetty properties: {hostContext=/solr, hostPort=46177}
   [junit4]   2> 2609573 INFO  (jetty-launcher-7030-thread-3) [    ] o.e.j.s.Server jetty-9.4.8.v20171121, build timestamp: ٢٠١٧-١١-٢١T١٤:٢٧:٣٧-07:00, git hash: 82b8fb23f757335bb3329d540ce37a2a2615f0a8
   [junit4]   2> 2609573 ERROR (jetty-launcher-7030-thread-1) [    ] o.a.s.u.StartupLoggingUtils Missing Java Option solr.log.dir. Logging may be missing or incomplete.
   [junit4]   2> 2609573 INFO  (jetty-launcher-7030-thread-1) [    ] o.a.s.s.SolrDispatchFilter  ___      _       Welcome to Apache Solr™ version 7.3.0
   [junit4]   2> 2609573 INFO  (jetty-launcher-7030-thread-1) [    ] o.a.s.s.SolrDispatchFilter / __| ___| |_ _   Starting in cloud mode on port null
   [junit4]   2> 2609573 INFO  (jetty-launcher-7030-thread-1) [    ] o.a.s.s.SolrDispatchFilter \__ \/ _ \ | '_|  Install dir: null
   [junit4]   2> 2609573 INFO  (jetty-launcher-7030-thread-1) [    ] o.a.s.s.SolrDispatchFilter |___/\___/_|_|    Start time: 2018-02-01T06:03:11.855576Z
   [junit4]   2> 2609573 INFO  (jetty-launcher-7030-thread-3) [    ] o.e.j.s.session DefaultSessionIdManager workerName=node0
   [junit4]   2> 2609573 INFO  (jetty-launcher-7030-thread-3) [    ] o.e.j.s.session No SessionScavenger set, using defaults
   [junit4]   2> 2609573 INFO  (jetty-launcher-7030-thread-3) [    ] o.e.j.s.session Scavenging every 600000ms
   [junit4]   2> 2609574 INFO  (jetty-launcher-7030-thread-3) [    ] o.e.j.s.h.ContextHandler Started o.e.j.s.ServletContextHandler@19772516{/solr,null,AVAILABLE}
   [junit4]   2> 2609574 INFO  (zkConnectionManagerCallback-7035-thread-1) [    ] o.a.s.c.c.ConnectionManager zkClient has connected
   [junit4]   2> 2609574 INFO  (jetty-launcher-7030-thread-3) [    ] o.e.j.s.AbstractConnector Started ServerConnector@27f12876{SSL,[ssl, http/1.1]}{127.0.0.1:39735}
   [junit4]   2> 2609574 INFO  (jetty-launcher-7030-thread-3) [    ] o.e.j.s.Server Started @2612150ms
   [junit4]   2> 2609574 INFO  (jetty-launcher-7030-thread-3) [    ] o.a.s.c.s.e.JettySolrRunner Jetty properties: {hostContext=/solr, hostPort=39735}
   [junit4]   2> 2609574 INFO  (jetty-launcher-7030-thread-1) [    ] o.a.s.s.SolrDispatchFilter solr.xml found in ZooKeeper. Loading...
   [junit4]   2> 2609574 ERROR (jetty-launcher-7030-thread-3) [    ] o.a.s.u.StartupLoggingUtils Missing Java Option solr.log.dir. Logging may be missing or incomplete.
   [junit4]   2> 2609574 INFO  (jetty-launcher-7030-thread-3) [    ] o.a.s.s.SolrDispatchFilter  ___      _       Welcome to Apache Solr™ version 7.3.0
   [junit4]   2> 2609574 INFO  (jetty-launcher-7030-thread-3) [    ] o.a.s.s.SolrDispatchFilter / __| ___| |_ _   Starting in cloud mode on port null
   [junit4]   2> 2609574 INFO  (jetty-launcher-7030-thread-3) [    ] o.a.s.s.SolrDispatchFilter \__ \/ _ \ | '_|  Install dir: null
   [junit4]   2> 2609575 INFO  (jetty-launcher-7030-thread-3) [    ] o.a.s.s.SolrDispatchFilter |___/\___/_|_|    Start time: 2018-02-01T06:03:11.857012Z
   [junit4]   2> 2609580 INFO  (jetty-launcher-7030-thread-2) [    ] o.e.j.s.session DefaultSessionIdManager workerName=node0
   [junit4]   2> 2609580 INFO  (jetty-launcher-7030-thread-2) [    ] o.e.j.s.session No SessionScavenger set, using defaults
   [junit4]   2> 2609580 INFO  (jetty-launcher-7030-thread-2) [    ] o.e.j.s.session Scavenging every 660000ms
   [junit4]   2> 2609580 INFO  (zkConnectionManagerCallback-7037-thread-1) [    ] o.a.s.c.c.ConnectionManager zkClient has connected
   [junit4]   2> 2609580 INFO  (jetty-launcher-7030-thread-2) [    ] o.e.j.s.h.ContextHandler Started o.e.j.s.ServletContextHandler@2e456157{/solr,null,AVAILABLE}
   [junit4]   2> 2609580 INFO  (jetty-launcher-7030-thread-3) [    ] o.a.s.s.SolrDispatchFilter solr.xml found in ZooKeeper. Loading...
   [junit4]   2> 2609582 INFO  (jetty-launcher-7030-thread-1) [    ] o.a.s.c.ZkContainer Zookeeper client=127.0.0.1:37667/solr
   [junit4]   2> 2609582 INFO  (jetty-launcher-7030-thread-2) [    ] o.e.j.s.AbstractConnector Started ServerConnector@2163c4bf{SSL,[ssl, http/1.1]}{127.0.0.1:41689}
   [junit4]   2> 2609582 INFO  (jetty-launcher-7030-thread-2) [    ] o.e.j.s.Server Started @2612158ms
   [junit4]   2> 2609582 INFO  (jetty-launcher-7030-thread-2) [    ] o.a.s.c.s.e.JettySolrRunner Jetty properties: {hostContext=/solr, hostPort=41689}
   [junit4]   2> 2609582 ERROR (jetty-launcher-7030-thread-2) [    ] o.a.s.u.StartupLoggingUtils Missing Java Option solr.log.dir. Logging may be missing or incomplete.
   [junit4]   2> 2609582 INFO  (jetty-launcher-7030-thread-2) [    ] o.a.s.s.SolrDispatchFilter  ___      _       Welcome to Apache Solr™ version 7.3.0
   [junit4]   2> 2609582 INFO  (jetty-launcher-7030-thread-2) [    ] o.a.s.s.SolrDispatchFilter / __| ___| |_ _   Starting in cloud mode on port null
   [junit4]   2> 2609583 INFO  (jetty-launcher-7030-thread-2) [    ] o.a.s.s.SolrDispatchFilter \__ \/ _ \ | '_|  Install dir: null
   [junit4]   2> 2609583 INFO  (jetty-launcher-7030-thread-2) [    ] o.a.s.s.SolrDispatchFilter |___/\___/_|_|    Start time: 2018-02-01T06:03:11.865032Z
   [junit4]   2> 2609583 INFO  (zkConnectionManagerCallback-7041-thread-1) [    ] o.a.s.c.c.ConnectionManager zkClient has connected
   [junit4]   2> 2609600 INFO  (zkConnectionManagerCallback-7045-thread-1-processing-n:127.0.0.1:46177_solr) [n:127.0.0.1:46177_solr    ] o.a.s.c.c.ConnectionManager zkClient has connected
   [junit4]   2> 2609604 INFO  (jetty-launcher-7030-thread-3) [    ] o.a.s.c.ZkContainer Zookeeper client=127.0.0.1:37667/solr
   [junit4]   2> 2609627 INFO  (zkConnectionManagerCallback-7043-thread-1) [    ] o.a.s.c.c.ConnectionManager zkClient has connected
   [junit4]   2> 2609627 INFO  (jetty-launcher-7030-thread-2) [    ] o.a.s.s.SolrDispatchFilter solr.xml found in ZooKeeper. Loading...
   [junit4]   2> 2609634 INFO  (zkConnectionManagerCallback-7050-thread-1) [    ] o.a.s.c.c.ConnectionManager zkClient has connected
   [junit4]   2> 2609638 INFO  (jetty-launcher-7030-thread-2) [    ] o.a.s.c.ZkContainer Zookeeper client=127.0.0.1:37667/solr
   [junit4]   2> 2609640 INFO  (jetty-launcher-7030-thread-1) [n:127.0.0.1:46177_solr    ] o.a.s.c.Overseer Overseer (id=null) closing
   [junit4]   2> 2609640 INFO  (zkConnectionManagerCallback-7054-thread-1) [    ] o.a.s.c.c.ConnectionManager zkClient has connected
   [junit4]   2> 2609641 INFO  (jetty-launcher-7030-thread-1) [n:127.0.0.1:46177_solr    ] o.a.s.c.OverseerElectionContext I am going to be the leader 127.0.0.1:46177_solr
   [junit4]   2> 2609641 INFO  (zkConnectionManagerCallback-7056-thread-1-processing-n:127.0.0.1:39735_solr) [n:127.0.0.1:39735_solr    ] o.a.s.c.c.ConnectionManager zkClient has connected
   [junit4]   2> 2609642 INFO  (zkConnectionManagerCallback-7058-thread-1-processing-n:127.0.0.1:41689_solr) [n:127.0.0.1:41689_solr    ] o.a.s.c.c.ConnectionManager zkClient has connected
   [junit4]   2> 2609643 INFO  (jetty-launcher-7030-thread-1) [n:127.0.0.1:46177_solr    ] o.a.s.c.Overseer Overseer (id=72072546218672133-127.0.0.1:46177_solr-n_0000000000) starting
   [junit4]   2> 2609645 INFO  (jetty-launcher-7030-thread-3) [n:127.0.0.1:39735_solr    ] o.a.s.c.Overseer Overseer (id=null) closing
   [junit4]   2> 2609646 DEBUG (OverseerStateUpdate-72072546218672133-127.0.0.1:46177_solr-n_0000000000) [n:127.0.0.1:46177_solr    ] o.a.s.c.Overseer Starting to work on the main queue
   [junit4]   2> 2609646 INFO  (jetty-launcher-7030-thread-1) [n:127.0.0.1:46177_solr    ] o.a.s.c.ZkController Register node as live in ZooKeeper:/live_nodes/127.0.0.1:46177_solr
   [junit4]   2> 2609646 DEBUG (OverseerAutoScalingTriggerThread-72072546218672133-127.0.0.1:46177_solr-n_0000000000) [n:127.0.0.1:46177_solr    ] o.a.s.c.a.OverseerTriggerThread Adding .autoAddReplicas trigger
   [junit4]   2> 2609646 INFO  (jetty-launcher-7030-thread-3) [n:127.0.0.1:39735_solr    ] o.a.s.c.ZkController Register node as live in ZooKeeper:/live_nodes/127.0.0.1:39735_solr
   [junit4]   2> 2609647 INFO  (zkCallback-7057-thread-1-processing-n:127.0.0.1:41689_solr) [n:127.0.0.1:41689_solr    ] o.a.s.c.c.ZkStateReader Updated live nodes from ZooKeeper... (0) -> (1)
   [junit4]   2> 2609647 INFO  (jetty-launcher-7030-thread-2) [n:127.0.0.1:41689_solr    ] o.a.s.c.Overseer Overseer (id=null) closing
   [junit4]   2> 2609659 INFO  (zkCallback-7044-thread-1-processing-n:127.0.0.1:46177_solr) [n:127.0.0.1:46177_solr    ] o.a.s.c.c.ZkStateReader Updated live nodes from ZooKeeper... (0) -> (1)
   [junit4]   2> 2609664 DEBUG (OverseerAutoScalingTriggerThread-72072546218672133-127.0.0.1:46177_solr-n_0000000000) [n:127.0.0.1:46177_solr    ] o.a.s.c.a.OverseerTriggerThread Refreshing /autoscaling.json with znode version 1
   [junit4]   2> 2609664 INFO  (zkCallback-7044-thread-1-processing-n:127.0.0.1:46177_solr) [n:127.0.0.1:46177_solr    ] o.a.s.c.c.ZkStateReader Updated live nodes from ZooKeeper... (1) -> (2)
   [junit4]   2> 2609665 DEBUG (OverseerAutoScalingTriggerThread-72072546218672133-127.0.0.1:46177_solr-n_0000000000) [n:127.0.0.1:46177_solr    ] o.a.s.c.a.NodeLostTrigger Initial livenodes: [127.0.0.1:46177_solr, 127.0.0.1:39735_solr]
   [junit4]   2> 2609665 DEBUG (OverseerAutoScalingTriggerThread-72072546218672133-127.0.0.1:46177_solr-n_0000000000) [n:127.0.0.1:46177_solr    ] o.a.s.c.a.OverseerTriggerThread Current znodeVersion 1, lastZnodeVersion -1
   [junit4]   2> 2609665 DEBUG (OverseerAutoScalingTriggerThread-72072546218672133-127.0.0.1:46177_solr-n_0000000000) [n:127.0.0.1:46177_solr    ] o.a.s.c.a.OverseerTriggerThread Processed trigger updates upto znodeVersion 1
   [junit4]   2> 2609665 INFO  (zkCallback-7057-thread-1-processing-n:127.0.0.1:41689_solr) [n:127.0.0.1:41689_solr    ] o.a.s.c.c.ZkStateReader Updated live nodes from ZooKeeper... (1) -> (2)
   [junit4]   2> 2609669 INFO  (jetty-launcher-7030-thread-2) [n:127.0.0.1:41689_solr    ] o.a.s.c.ZkController Register node as live in ZooKeeper:/live_nodes/127.0.0.1:41689_solr
   [junit4]   2> 2609671 INFO  (zkCallback-7044-thread-1-processing-n:127.0.0.1:46177_solr) [n:127.0.0.1:46177_solr    ] o.a.s.c.c.ZkStateReader Updated live nodes from ZooKeeper... (2) -> (3)
   [junit4]   2> 2609671 DEBUG (OverseerStateUpdate-72072546218672133-127.0.0.1:46177_solr-n_0000000000) [n:127.0.0.1:46177_solr    ] o.a.s.c.Overseer processMessage: queueSize: 1, message = {
   [junit4]   2>   "operation":"downnode",
   [junit4]   2>   "node_name":"127.0.0.1:41689_solr"} current state version: 0
   [junit4]   2> 2609671 DEBUG (OverseerStateUpdate-72072546218672133-127.0.0.1:46177_solr-n_0000000000) [n:127.0.0.1:46177_solr    ] o.a.s.c.o.NodeMutator DownNode state invoked for node: 127.0.0.1:41689_solr
   [junit4]   2> 2609676 INFO  (zkCallback-7057-thread-1-processing-n:127.0.0.1:41689_solr) [n:127.0.0.1:41689_solr    ] o.a.s.c.c.ZkStateReader Updated live nodes from ZooKeeper... (2) -> (3)
   [junit4]   2> 2609677 INFO  (zkCallback-7055-thread-1-processing-n:127.0.0.1:39735_solr) [n:127.0.0.1:39735_solr    ] o.a.s.c.c.ZkStateReader Updated live nodes from ZooKeeper... (0) -> (2)
   [junit4]   2> 2609692 DEBUG (OverseerAutoScalingTriggerThread-72072546218672133-127.0.0.1:46177_solr-n_0000000000) [n:127.0.0.1:46177_solr    ] o.a.s.c.a.OverseerTriggerThread -- clean old nodeAdded markers
   [junit4]   2> 2609696 INFO  (zkCallback-7055-thread-1-processing-n:127.0.0.1:39735_solr) [n:127.0.0.1:39735_solr    ] o.a.s.c.c.ZkStateReader Updated live nodes from ZooKeeper... (2) -> (3)
   [junit4]   2> 2609696 DEBUG (OverseerAutoScalingTriggerThread-72072546218672133-127.0.0.1:46177_solr-n_0000000000) [n:127.0.0.1:46177_solr    ] o.a.s.c.a.OverseerTriggerThread Current znodeVersion 1, lastZnodeVersion 1
   [junit4]   2> 2609708 DEBUG (ScheduledTrigger-4992-thread-1) [n:127.0.0.1:46177_solr    ] o.a.s.c.a.NodeLostTrigger Running NodeLostTrigger: .auto_add_replicas with currently live nodes: 3
   [junit4]   2> 2609714 INFO  (jetty-launcher-7030-thread-1) [n:127.0.0.1:46177_solr    ] o.a.s.m.r.SolrJmxReporter JMX monitoring for 'solr_46177.solr.node' (registry 'solr.node') enabled at server: com.sun.jmx.mbeanserver.JmxMBeanServer@381dcbd1
   [junit4]   2> 2609723 INFO  (jetty-launcher-7030-thread-1) [n:127.0.0.1:46177_solr    ] o.a.s.m.r.SolrJmxReporter JMX monitoring for 'solr_46177.solr.jvm' (registry 'solr.jvm') enabled at server: com.sun.jmx.mbeanserver.JmxMBeanServer@381dcbd1
   [junit4]   2> 2609723 INFO  (jetty-launcher-7030-thread-1) [n:127.0.0.1:46177_solr    ] o.a.s.m.r.SolrJmxReporter JMX monitoring for 'solr_46177.solr.jetty' (registry 'solr.jetty') enabled at server: com.sun.jmx.mbeanserver.JmxMBeanServer@381dcbd1
   [junit4]   2> 2609724 INFO  (jetty-launcher-7030-thread-3) [n:127.0.0.1:39735_solr    ] o.a.s.m.r.SolrJmxReporter JMX monitoring for 'solr_39735.solr.node' (registry 'solr.node') enabled at server: com.sun.jmx.mbeanserver.JmxMBeanServer@381dcbd1
   [junit4]   2> 2609724 INFO  (jetty-launcher-7030-thread-1) [n:127.0.0.1:46177_solr    ] o.a.s.c.CorePropertiesLocator Found 0 core definitions underneath /home/jenkins/workspace/Lucene-Solr-7.x-Linux/solr/build/solr-core/test/J1/temp/solr.handler.admin.AutoscalingHistoryHandlerTest_B8CBD7234C714071-001/tempDir-001/node1/.
   [junit4]   2> 2609725 INFO  (jetty-launcher-7030-thread-2) [n:127.0.0.1:41689_solr    ] o.a.s.m.r.SolrJmxReporter JMX monitoring for 'solr_41689.solr.node' (registry 'solr.node') enabled at server: com.sun.jmx.mbeanserver.JmxMBeanServer@381dcbd1
   [junit4]   2> 2609731 INFO  (jetty-launcher-7030-thread-3) [n:127.0.0.1:39735_solr    ] o.a.s.m.r.SolrJmxReporter JMX monitoring for 'solr_39735.solr.jvm' (registry 'solr.jvm') enabled at server: com.sun.jmx.mbeanserver.JmxMBeanServer@381dcbd1
   [junit4]   2> 2609731 INFO  (jetty-launcher-7030-thread-3) [n:127.0.0.1:39735_solr    ] o.a.s.m.r.SolrJmxReporter JMX monitoring for 'solr_39735.solr.jetty' (registry 'solr.jetty') enabled at server: com.sun.jmx.mbeanserver.JmxMBeanServer@381dcbd1
   [junit4]   2> 2609748 INFO  (jetty-launcher-7030-thread-3) [n:127.0.0.1:39735_solr    ] o.a.s.c.CorePropertiesLocator Found 0 core definitions underneath /home/jenkins/workspace/Lucene-Solr-7.x-Linux/solr/build/solr-core/test/J1/temp/solr.handler.admin.AutoscalingHistoryHandlerTest_B8CBD7234C714071-001/tempDir-001/node3/.
   [junit4]   2> 2609749 INFO  (jetty-launcher-7030-thread-2) [n:127.0.0.1:41689_solr    ] o.a.s.m.r.SolrJmxReporter JMX monitoring for 'solr_41689.solr.jvm' (registry 'solr.jvm') enabled at server: com.sun.jmx.mbeanserver.JmxMBeanServer@381dcbd1
   [junit4]   2> 2609749 INFO  (jetty-launcher-7030-thread-2) [n:127.0.0.1:41689_solr    ] o.a.s.m.r.SolrJmxReporter JMX monitoring for 'solr_41689.solr.jetty' (registry 'solr.jetty') enabled at server: com.sun.jmx.mbeanserver.JmxMBeanServer@381dcbd1
   [junit4]   2> 2609750 INFO  (jetty-launcher-7030-thread-2) [n:127.0.0.1:41689_solr    ] o.a.s.c.CorePropertiesLocator Found 0 core definitions underneath /home/jenkins/workspace/Lucene-Solr-7.x-Linux/solr/build/solr-core/test/J1/temp/solr.handler.admin.AutoscalingHistoryHandlerTest_B8CBD7234C714071-001/tempDir-001/node2/.
   [junit4]   2> 2609846 INFO  (zkConnectionManagerCallback-7065-thread-1) [    ] o.a.s.c.c.ConnectionManager zkClient has connected
   [junit4]   2> 2609847 INFO  (zkConnectionManagerCallback-7069-thread-1) [    ] o.a.s.c.c.ConnectionManager zkClient has connected
   [junit4]   2> 2609848 INFO  (SUITE-AutoscalingHistoryHandlerTest-seed#[B8CBD7234C714071]-worker) [    ] o.a.s.c.c.ZkStateReader Updated live nodes from ZooKeeper... (0) -> (3)
   [junit4]   2> 2609848 INFO  (SUITE-AutoscalingHistoryHandlerTest-seed#[B8CBD7234C714071]-worker) [    ] o.a.s.c.s.i.ZkClientClusterStateProvider Cluster at 127.0.0.1:37667/solr ready
   [junit4]   2> 2609861 INFO  (qtp940941147-20385) [n:127.0.0.1:41689_solr    ] o.a.s.h.a.CollectionsHandler Invoked Collection Action :create with params replicationFactor=3&name=AutoscalingHistoryHandlerTest_collection&nrtReplicas=3&action=CREATE&numShards=1&wt=javabin&version=2 and sendToOCPQueue=true
   [junit4]   2> 2609863 INFO  (OverseerThreadFactory-4994-thread-1-processing-n:127.0.0.1:46177_solr) [n:127.0.0.1:46177_solr    ] o.a.s.c.a.c.CreateCollectionCmd Create collection AutoscalingHistoryHandlerTest_collection
   [junit4]   2> 2609863 INFO  (OverseerThreadFactory-4994-thread-1-processing-n:127.0.0.1:46177_solr) [n:127.0.0.1:46177_solr    ] o.a.s.c.c.ZkConfigManager Copying zk node /configs/_default/protwords.txt to /configs/AutoscalingHistoryHandlerTest_collection.AUTOCREATED/protwords.txt
   [junit4]   2> 2609864 INFO  (OverseerThreadFactory-4994-thread-1-processing-n:127.0.0.1:46177_solr) [n:127.0.0.1:46177_solr    ] o.a.s.c.c.ZkConfigManager Copying zk node /configs/_default/managed-schema to /configs/AutoscalingHistoryHandlerTest_collection.AUTOCREATED/managed-schema
   [junit4]   2> 2609864 INFO  (OverseerThreadFactory-4994-thread-1-processing-n:127.0.0.1:46177_solr) [n:127.0.0.1:46177_solr    ] o.a.s.c.c.ZkConfigManager Copying zk node /configs/_default/solrconfig.xml to /configs/AutoscalingHistoryHandlerTest_collection.AUTOCREATED/solrconfig.xml
   [junit4]   2> 2609865 INFO  (OverseerThreadFactory-4994-thread-1-processing-n:127.0.0.1:46177_solr) [n:127.0.0.1:46177_solr    ] o.a.s.c.c.ZkConfigManager Copying zk node /configs/_default/synonyms.txt to /configs/AutoscalingHistoryHandlerTest_collection.AUTOCREATED/synonyms.txt
   [junit4]   2> 2609865 INFO  (OverseerThreadFactory-4994-thread-1-processing-n:127.0.0.1:46177_solr) [n:127.0.0.1:46177_solr    ] o.a.s.c.c.ZkConfigManager Copying zk node /configs/_default/stopwords.txt to /configs/AutoscalingHistoryHandlerTest_collection.AUTOCREATED/stopwords.txt
   [junit4]   2> 2609866 INFO  (OverseerThreadFactory-4994-thread-1-processing-n:127.0.0.1:46177_solr) [n:127.0.0.1:46177_solr    ] o.a.s.c.c.ZkConfigManager Copying zk node /configs/_default/lang/contractions_it.txt to /configs/AutoscalingHistoryHandlerTest_collection.AUTOCREATED/lang/contractions_it.txt
   [junit4]   2> 2609867 INFO  (OverseerThreadFactory-4994-thread-1-processing-n:127.0.0.1:46177_solr) [n:127.0.0.1:46177_solr    ] o.a.s.c.c.ZkConfigManager Copying zk node /configs/_default/lang/stemdict_nl.txt to /configs/AutoscalingHistoryHandlerTest_collection.AUTOCREATED/lang/stemdict_nl.txt
   [junit4]   2> 2609867 INFO  (OverseerThreadFactory-4994-thread-1-processing-n:127.0.0.1:46177_solr) [n:127.0.0.1:46177_solr    ] o.a.s.c.c.ZkConfigManager Copying zk node /configs/_default/lang/stopwords_hy.txt to /configs/AutoscalingHistoryHandlerTest_collection.AUTOCREATED/lang/stopwords_hy.txt
   [junit4]   2> 2609867 INFO  (OverseerThreadFactory-4994-thread-1-processing-n:127.0.0.1:46177_solr) [n:127.0.0.1:46177_solr    ] o.a.s.c.c.ZkConfigManager Copying zk node /configs/_default/lang/stopwords_no.txt to /configs/AutoscalingHistoryHandlerTest_collection.AUTOCREATED/lang/stopwords_no.txt
   [junit4]   2> 2609868 INFO  (OverseerThreadFactory-4994-thread-1-processing-n:127.0.0.1:46177_solr) [n:127.0.0.1:46177_solr    ] o.a.s.c.c.ZkConfigManager Copying zk node /configs/_default/lang/contractions_ca.txt to /configs/AutoscalingHistoryHandlerTest_collection.AUTOCREATED/lang/contractions_ca.txt
   [junit4]   2> 2609868 INFO  (OverseerThreadFactory-4994-thread-1-processing-n:127.0.0.1:46177_solr) [n:127.0.0.1:46177_solr    ] o.a.s.c.c.ZkConfigManager Copying zk node /configs/_default/lang/stopwords_id.txt to /configs/AutoscalingHistoryHandlerTest_collection.AUTOCREATED/lang/stopwords_id.txt
   [junit4]   2> 2609869 INFO  (OverseerThreadFactory-4994-thread-1-processing-n:127.0.0.1:46177_solr) [n:127.0.0.1:46177_solr    ] o.a.s.c.c.ZkConfigManager Copying zk node /configs/_default/lang/stopwords_ga.txt to /configs/AutoscalingHistoryHandlerTest_collection.AUTOCREATED/lang/stopwords_ga.txt
   [junit4]   2> 2609869 INFO  (OverseerThreadFactory-4994-thread-1-processing-n:127.0.0.1:46177_solr) [n:127.0.0.1:46177_solr    ] o.a.s.c.c.ZkConfigManager Copying zk node /configs/_default/lang/stopwords_hi.txt to /configs/AutoscalingHistoryHandlerTest_collection.AUTOCREATED/lang/stopwords_hi.txt
   [junit4]   2> 2609870 INFO  (OverseerThreadFactory-4994-thread-1-processing-n:127.0.0.1:46177_solr) [n:127.0.0.1:46177_solr    ] o.a.s.c.c.ZkConfigManager Copying zk node /configs/_default/lang/stopwords_da.txt to /configs/AutoscalingHistoryHandlerTest_collection.AUTOCREATED/lang/stopwords_da.txt
   [junit4]   2> 2609871 INFO  (OverseerThreadFactory-4994-thread-1-processing-n:127.0.0.1:46177_solr) [n:127.0.0.1:46177_solr    ] o.a.s.c.c.ZkConfigManager Copying zk node /configs/_default/lang/stopwords_ja.txt to /configs/AutoscalingHistoryHandlerTest_collection.AUTOCREATED/lang/stopwords_ja.txt
   [junit4]   2> 2609871 INFO  (OverseerThreadFactory-4994-thread-1-processing-n:127.0.0.1:46177_solr) [n:127.0.0.1:46177_solr    ] o.a.s.c.c.ZkConfigManager Copying zk node /configs/_default/lang/stopwords_pt.txt to /configs/AutoscalingHistoryHandlerTest_collection.AUTOCREATED/lang/stopwords_pt.txt
   [junit4]   2> 2609872 INFO  (OverseerThreadFactory-4994-thread-1-processing-n:127.0.0.1:46177_solr) [n:127.0.0.1:46177_solr    ] o.a.s.c.c.ZkConfigManager Copying zk node /configs/_default/lang/stopwords_hu.txt to /configs/AutoscalingHistoryHandlerTest_collection.AUTOCREATED/lang/stopwords_hu.txt
   [junit4]   2> 2609872 INFO  (OverseerThreadFactory-4994-thread-1-processing-n:127.0.0.1:46177_solr) [n:127.0.0.1:46177_solr    ] o.a.s.c.c.ZkConfigManager Copying zk node /configs/_default/lang/stopwords_el.txt to /configs/AutoscalingHistoryHandlerTest_collection.AUTOCREATED/lang/stopwords_el.txt
   [junit4]   2> 2609872 INFO  (OverseerThreadFactory-4994-thread-1-processing-n:127.0.0.1:46177_solr) [n:127.0.0.1:46177_solr    ] o.a.s.c.c.ZkConfigManager Copying zk node /configs/_default/lang/stopwords_ru.txt to /configs/AutoscalingHistoryHandlerTest_collection.AUTOCREATED/lang/stopwords_ru.txt
   [junit4]   2> 2609873 INFO  (OverseerThreadFactory-4994-thread-1-processing-n:127.0.0.1:46177_solr) [n:127.0.0.1:46177_solr    ] o.a.s.c.c.ZkConfigManager Copying zk node /configs/_default/lang/stopwords_tr.txt to /configs/AutoscalingHistoryHandlerTest_collection.AUTOCREATED/lang/stopwords_tr.txt
   [junit4]   2> 2609873 INFO  (OverseerThreadFactory-4994-thread-1-processing-n:127.0.0.1:46177_solr) [n:127.0.0.1:46177_solr    ] o.a.s.c.c.ZkConfigManager Copying zk node /configs/_default/lang/stopwords_ar.txt to /configs/AutoscalingHistoryHandlerTest_collection.AUTOCREATED/lang/stopwords_ar.txt
   [junit4]   2> 2609874 INFO  (OverseerThreadFactory-4994-thread-1-processing-n:127.0.0.1:46177_solr) [n:127.0.0.1:46177_solr    ] o.a.s.c.c.ZkConfigManager Copying zk node /configs/_default/lang/userdict_ja.txt to /configs/AutoscalingHistoryHandlerTest_collection.AUTOCREATED/lang/userdict_ja.txt
   [junit4]   2> 2609874 INFO  (OverseerThreadFactory-4994-thread-1-processing-n:127.0.0.1:46177_solr) [n:127.0.0.1:46177_solr    ] o.a.s.c.c.ZkConfigManager Copying zk node /configs/_default/lang/stopwords_eu.txt to /configs/AutoscalingHistoryHandlerTest_collection.AUTOCREATED/lang/stopwords_eu.txt
   [junit4]   2> 2609875 INFO  (OverseerThreadFactory-4994-thread-1-processing-n:127.0.0.1:46177_solr) [n:127.0.0.1:46177_solr    ] o.a.s.c.c.ZkConfigManager Copying zk node /configs/_default/lang/stopwords_it.txt to /configs/AutoscalingHistoryHandlerTest_collection.AUTOCREATED/lang/stopwords_it.txt
   [junit4]   2> 2609875 INFO  (OverseerThreadFactory-4994-thread-1-processing-n:127.0.0.1:46177_solr) [n:127.0.0.1:46177_solr    ] o.a.s.c.c.ZkConfigManager Copying zk node /configs/_default/lang/stopwords_cz.txt to /configs/AutoscalingHistoryHandlerTest_collection.AUTOCREATED/lang/stopwords_cz.txt
   [junit4]   2> 2609876 INFO  (OverseerThreadFactory-4994-thread-1-processing-n:127.0.0.1:46177_solr) [n:127.0.0.1:46177_solr    ] o.a.s.c.c.ZkConfigManager Copying zk node /configs/_default/lang/stoptags_ja.txt to /configs/AutoscalingHistoryHandlerTest_collection.AUTOCREATED/lang/stoptags_ja.txt
   [junit4]   2> 2609876 INFO  (OverseerThreadFactory-4994-thread-1-processing-n:127.0.0.1:46177_solr) [n:127.0.0.1:46177_solr    ] o.a.s.c.c.ZkConfigManager Copying zk node /configs/_default/lang/contractions_fr.txt to /configs/AutoscalingHistoryHandlerTest_collection.AUTOCREATED/lang/contractions_fr.txt
   [junit4]   2> 2609877 INFO  (OverseerThreadFactory-4994-thread-1-processing-n:127.0.0.1:46177_solr) [n:127.0.0.1:46177_solr    ] o.a.s.c.c.ZkConfigManager Copying zk node /configs/_default/lang/stopwords_de.txt to /configs/AutoscalingHistoryHandlerTest_collection.AUTOCREATED/lang/stopwords_de.txt
   [junit4]   2> 2609877 INFO  (OverseerThreadFactory-4994-thread-1-processing-n:127.0.0.1:46177_solr) [n:127.0.0.1:46177_solr    ] o.a.s.c.c.ZkConfigManager Copying zk node /configs/_default/lang/stopwords_fa.txt to /configs/AutoscalingHistoryHandlerTest_collection.AUTOCREATED/lang/stopwords_fa.txt
   [junit4]   2> 2609878 INFO  (OverseerThreadFactory-4994-thread-1-processing-n:127.0.0.1:46177_solr) [n:127.0.0.1:46177_solr    ] o.a.s.c.c.ZkConfigManager Copying zk node /configs/_default/lang/contractions_ga.txt to /configs/AutoscalingHistoryHandlerTest_collection.AUTOCREATED/lang/contractions_ga.txt
   [junit4]   2> 2609878 INFO  (OverseerThreadFactory-4994-thread-1-processing-n:127.0.0.1:46177_solr) [n:127.0.0.1:46177_solr    ] o.a.s.c.c.ZkConfigManager Copying zk node /configs/_default/lang/stopwords_ca.txt to /configs/AutoscalingHistoryHandlerTest_collection.AUTOCREATED/lang/stopwords_ca.txt
   [junit4]   2> 2609879 INFO  (OverseerThreadFactory-4994-thread-1-processing-n:127.0.0.1:46177_solr) [n:127.0.0.1:46177_solr    ] o.a.s.c.c.ZkConfigManager Copying zk node /configs/_default/lang/stopwords_nl.txt to /configs/AutoscalingHistoryHandlerTest_collection.AUTOCREATED/lang/stopwords_nl.txt
   [junit4]   2> 2609879 INFO  (OverseerThreadFactory-4994-thread-1-processing-n:127.0.0.1:46177_solr) [n:127.0.0.1:46177_solr    ] o.a.s.c.c.ZkConfigManager Copying zk node /configs/_default/lang/stopwords_bg.txt to /configs/AutoscalingHistoryHandlerTest_collection.AUTOCREATED/lang/stopwords_bg.txt
   [junit4]   2> 2609879 INFO  (OverseerThreadFactory-4994-thread-1-processing-n:127.0.0.1:46177_solr) [n:127.0.0.1:46177_solr    ] o.a.s.c.c.ZkConfigManager Copying zk node /configs/_default/lang/stopwords_lv.txt to /configs/AutoscalingHistoryHandlerTest_collection.AUTOCREATED/lang/stopwords_lv.txt
   [junit4]   2> 2609880 INFO  (OverseerThreadFactory-4994-thread-1-processing-n:127.0.0.1:46177_solr) [n:127.0.0.1:46177_solr    ] o.a.s.c.c.ZkConfigManager Copying zk node /configs/_default/lang/stopwords_en.txt to /configs/AutoscalingHistoryHandlerTest_collection.AUTOCREATED/lang/stopwords_en.txt
   [junit4]   2> 2609880 INFO  (OverseerThreadFactory-4994-thread-1-processing-n:127.0.0.1:46177_solr) [n:127.0.0.1:46177_solr    ] o.a.s.c.c.ZkConfigManager Copying zk node /configs/_default/lang/stopwords_es.txt to /configs/AutoscalingHistoryHandlerTest_collection.AUTOCREATED/lang/stopwords_es.txt
   [junit4]   2> 2609881 INFO  (OverseerThreadFactory-4994-thread-1-processing-n:127.0.0.1:46177_solr) [n:127.0.0.1:46177_solr    ] o.a.s.c.c.ZkConfigManager Copying zk node /configs/_default/lang/stopwords_th.txt to /configs/AutoscalingHistoryHandlerTest_collection.AUTOCREATED/lang/stopwords_th.txt
   [junit4]   2> 2609881 INFO  (OverseerThreadFactory-4994-thread-1-processing-n:127.0.0.1:46177_solr) [n:127.0.0.1:46177_solr    ] o.a.s.c.c.ZkConfigManager Copying zk node /configs/_default/lang/stopwords_ro.txt to /configs/AutoscalingHistoryHandlerTest_collection.AUTOCREATED/lang/stopwords_ro.txt
   [junit4]   2> 2609882 INFO  (OverseerThreadFactory-4994-thread-1-processing-n:127.0.0.1:46177_solr) [n:127.0.0.1:46177_solr    ] o.a.s.c.c.ZkConfigManager Copying zk node /configs/_default/lang/stopwords_fr.txt to /configs/AutoscalingHistoryHandlerTest_collection.AUTOCREATED/lang/stopwords_fr.txt
   [junit4]   2> 2609882 INFO  (OverseerThreadFactory-4994-thread-1-processing-n:127.0.0.1:46177_solr) [n:127.0.0.1:46177_solr    ] o.a.s.c.c.ZkConfigManager Copying zk node /configs/_default/lang/stopwords_sv.txt to /configs/AutoscalingHistoryHandlerTest_collection.AUTOCREATED/lang/stopwords_sv.txt
   [junit4]   2> 2609883 INFO  (OverseerThreadFactory-4994-thread-1-processing-n:127.0.0.1:46177_solr) [n:127.0.0.1:46177_solr    ] o.a.s.c.c.ZkConfigManager Copying zk node /configs/_default/lang/stopwords_fi.txt to /configs/AutoscalingHistoryHandlerTest_collection.AUTOCREATED/lang/stopwords_fi.txt
   [junit4]   2> 2609883 INFO  (OverseerThreadFactory-4994-thread-1-processing-n:127.0.0.1:46177_solr) [n:127.0.0.1:46177_solr    ] o.a.s.c.c.ZkConfigManager Copying zk node /configs/_default/lang/hyphenations_ga.txt to /configs/AutoscalingHistoryHandlerTest_collection.AUTOCREATED/lang/hyphenations_ga.txt
   [junit4]   2> 2609884 INFO  (OverseerThreadFactory-4994-thread-1-processing-n:127.0.0.1:46177_solr) [n:127.0.0.1:46177_solr    ] o.a.s.c.c.ZkConfigManager Copying zk node /configs/_default/lang/stopwords_gl.txt to /configs/AutoscalingHistoryHandlerTest_collection.AUTOCREATED/lang/stopwords_gl.txt
   [junit4]   2> 2609884 INFO  (OverseerThreadFactory-4994-thread-1-processing-n:127.0.0.1:46177_solr) [n:127.0.0.1:46177_solr    ] o.a.s.c.c.ZkConfigManager Copying zk node /configs/_default/params.json to /configs/AutoscalingHistoryHandlerTest_collection.AUTOCREATED/params.json
   [junit4]   2> 2609886 DEBUG (OverseerStateUpdate-72072546218672133-127.0.0.1:46177_solr-n_0000000000) [n:127.0.0.1:46177_solr    ] o.a.s.c.Overseer processMessage: queueSize: 1, message = {
   [junit4]   2>   "name":"AutoscalingHistoryHandlerTest_collection",
   [junit4]   2>   "fromApi":"true",
   [junit4]   2>   "replicationFactor":"3",
   [junit4]   2>   "numShards":"1",
   [junit4]   2>   "nrtReplicas":"3",
   [junit4]   2>   "stateFormat":"2",
   [junit4]   2>   "operation":"create"} current state version: 0
   [junit4]   2> 2609886 DEBUG (OverseerStateUpdate-72072546218672133-127.0.0.1:46177_solr-n_0000000000) [n:127.0.0.1:46177_solr    ] o.a.s.c.o.ClusterStateMutator building a new cName: AutoscalingHistoryHandlerTest_collection
   [junit4]   2> 2609886 DEBUG (OverseerStateUpdate-72072546218672133-127.0.0.1:46177_solr-n_0000000000) [n:127.0.0.1:46177_solr    ] o.a.s.c.o.ZkStateWriter going to create_collection /collections/AutoscalingHistoryHandlerTest_collection/state.json
   [junit4]   2> 2609988 DEBUG (OverseerStateUpdate-72072546218672133-127.0.0.1:46177_solr-n_0000000000) [n:127.0.0.1:46177_solr    ] o.a.s.c.Overseer processMessage: queueSize: 1, message = {
   [junit4]   2>   "operation":"ADDREPLICA",
   [junit4]   2>   "collection":"AutoscalingHistoryHandlerTest_collection",
   [junit4]   2>   "shard":"shard1",
   [junit4]   2>   "core":"AutoscalingHistoryHandlerTest_collection_shard1_replica_n1",
   [junit4]   2>   "state":"down",
   [junit4]   2>   "base_url":"https://127.0.0.1:39735/solr",
   [junit4]   2>   "type":"NRT",
   [junit4]   2>   "waitForFinalState":"false"} current state version: 0
   [junit4]   2> 2609988 INFO  (OverseerStateUpdate-72072546218672133-127.0.0.1:46177_solr-n_0000000000) [n:127.0.0.1:46177_solr    ] o.a.s.c.o.SliceMutator createReplica() {
   [junit4]   2>   "operation":"ADDREPLICA",
   [junit4]   2>   "collection":"AutoscalingHistoryHandlerTest_collection",
   [junit4]   2>   "shard":"shard1",
   [junit4]   2>   "core":"AutoscalingHistoryHandlerTest_collection_shard1_replica_n1",
   [junit4]   2>   "state":"down",
   [junit4]   2>   "base_url":"https://127.0.0.1:39735/solr",
   [junit4]   2>   "type":"NRT",
   [junit4]   2>   "waitForFinalState":"false"} 
   [junit4]   2> 2609988 DEBUG (OverseerStateUpdate-72072546218672133-127.0.0.1:46177_solr-n_0000000000) [n:127.0.0.1:46177_solr    ] o.a.s.c.o.SliceMutator Old Slice: shard1:{
   [junit4]   2>   "range":"80000000-7fffffff",
   [junit4]   2>   "state":"active",
   [junit4]   2>   "replicas":{}}
   [junit4]   2> 2609988 DEBUG (OverseerStateUpdate-72072546218672133-127.0.0.1:46177_solr-n_0000000000) [n:127.0.0.1:46177_solr    ] o.a.s.c.o.SliceMutator New Slice: shard1:{
   [junit4]   2>   "range":"80000000-7fffffff",
   [junit4]   2>   "state":"active",
   [junit4]   2>   "replicas":{"core_node3":{
   [junit4]   2>       "core":"AutoscalingHistoryHandlerTest_collection_shard1_replica_n1",
   [junit4]   2>       "base_url":"https://127.0.0.1:39735/solr",
   [junit4]   2>       "state":"down",
   [junit4]   2>       "node_name":null,
   [junit4]   2>       "type":"NRT"}}}
   [junit4]   2> 2609988 DEBUG (OverseerStateUpdate-72072546218672133-127.0.0.1:46177_solr-n_0000000000) [n:127.0.0.1:46177_solr    ] o.a.s.c.Overseer processMessage: queueSize: 2, message = {
   [junit4]   2>   "operation":"ADDREPLICA",
   [junit4]   2>   "collection":"AutoscalingHistoryHandlerTest_collection",
   [junit4]   2>   "shard":"shard1",
   [junit4]   2>   "core":"AutoscalingHistoryHandlerTest_collection_shard1_replica_n2",
   [junit4]   2>   "state":"down",
   [junit4]   2>   "base_url":"https://127.0.0.1:41689/solr",
   [junit4]   2>   "type":"NRT",
   [junit4]   2>   "waitForFinalState":"false"} current state version: 0
   [junit4]   2> 2609989 INFO  (OverseerStateUpdate-72072546218672133-127.0.0.1:46177_solr-n_0000000000) [n:127.0.0.1:46177_solr    ] o.a.s.c.o.SliceMutator createReplica() {
   [junit4]   2>   "operation":"ADDREPLICA",
   [junit4]   2>   "collection":"AutoscalingHistoryHandlerTest_collection",
   [junit4]   2>   "shard":"shard1",
   [junit4]   2>   "core":"AutoscalingHistoryHandlerTest_collection_shard1_replica_n2",
   [junit4]   2>   "state":"down",
   [junit4]   2>   "base_url":"https://127.0.0.1:41689/solr",
   [junit4]   2>   "type":"NRT",
   [junit4]   2>   "waitForFinalState":"false"} 
   [junit4]   2> 2609989 DEBUG (OverseerStateUpdate-72072546218672133-127.0.0.1:46177_solr-n_0000000000) [n:127.0.0.1:46177_solr    ] o.a.s.c.o.SliceMutator Old Slice: shard1:{
   [junit4]   2>   "range":"80000000-7fffffff",
   [junit4]   2>   "state":"active",
   [junit4]   2>   "replicas":{"core_node3":{
   [junit4]   2>       "core":"AutoscalingHistoryHandlerTest_collection_shard1_replica_n1",
   [junit4]   2>       "base_url":"https://127.0.0.1:39735/solr",
   [junit4]   2>       "state":"down",
   [junit4]   2>       "node_name":null,
   [junit4]   2>       "type":"NRT"}}}
   [junit4]   2> 2609989 DEBUG (OverseerStateUpdate-72072546218672133-127.0.0.1:46177_solr-n_0000000000) [n:127.0.0.1:46177_solr    ] o.a.s.c.o.SliceMutator New Slice: shard1:{
   [junit4]   2>   "range":"80000000-7fffffff",
   [junit4]   2>   "state":"active",
   [junit4]   2>   "replicas":{
   [junit4]   2>     "core_node3":{
   [junit4]   2>       "core":"AutoscalingHistoryHandlerTest_collection_shard1_replica_n1",
   [junit4]   2>       "base_url":"https://127.0.0.1:39735/solr",
   [junit4]   2>       "state":"down",
   [junit4]   2>       "node_name":null,
   [junit4]   2>       "type":"NRT"},
   [junit4]   2>     "core_node5":{
   [junit4]   2>       "core":"AutoscalingHistoryHandlerTest_collection_shard1_replica_n2",
   [junit4]   2>       "base_url":"https://127.0.0.1:41689/solr",
   [junit4]   2>       "state":"down",
   [junit4]   2>       "node_name":null,
   [junit4]   2>       "type":"NRT"}}}
   [junit4]   2> 2609989 DEBUG (OverseerStateUpdate-72072546218672133-127.0.0.1:46177_solr-n_0000000000) [n:127.0.0.1:46177_solr    ] o.a.s.c.Overseer processMessage: queueSize: 3, message = {
   [junit4]   2>   "operation":"ADDREPLICA",
   [junit4]   2>   "collection":"AutoscalingHistoryHandlerTest_collection",
   [junit4]   2>   "shard":"shard1",
   [junit4]   2>   "core":"AutoscalingHistoryHandlerTest_collection_shard1_replica_n4",
   [junit4]   2>   "state":"down",
   [junit4]   2>   "base_url":"https://127.0.0.1:46177/solr",
   [junit4]   2>   "type":"NRT",
   [junit4]   2>   "waitForFinalState":"false"} current state version: 0
   [junit4]   2> 2609989 INFO  (OverseerStateUpdate-72072546218672133-127.0.0.1:46177_solr-n_0000000000) [n:127.0.0.1:46177_solr    ] o.a.s.c.o.SliceMutator createReplica() {
   [junit4]   2>   "operation":"ADDREPLICA",
   [junit4]   2>   "collection":"AutoscalingHistoryHandlerTest_collection",
   [junit4]   2>   "shard":"shard1",
   [junit4]   2>   "core":"AutoscalingHistoryHandlerTest_collection_shard1_replica_n4",
   [junit4]   2>   "state":"down",
   [junit4]   2>   "base_url":"https://127.0.0.1:46177/solr",
   [junit4]   2>   "type":"NRT",
   [junit4]   2>   "waitForFinalState":"false"} 
   [junit4]   2> 2609990 DEBUG (OverseerStateUpdate-72072546218672133-127.0.0.1:46177_solr-n_0000000000) [n:127.0.0.1:46177_solr    ] o.a.s.c.o.SliceMutator Old Slice: shard1:{
   [junit4]   2>   "range":"80000000-7fffffff",
   [junit4]   2>   "state":"active",
   [junit4]   2>   "replicas":{
   [junit4]   2>     "core_node3":{
   [junit4]   2>       "core":"AutoscalingHistoryHandlerTest_collection_shard1_replica_n1",
   [junit4]   2>       "base_url":"https://127.0.0.1:39735/solr",
   [junit4]   2>       "state":"down",
   [junit4]   2>       "node_name":null,
   [junit4]   2>       "type":"NRT"},
   [junit4]   2>     "core_node5":{
   [junit4]   2>       "core":"AutoscalingHistoryHandlerTest_collection_shard1_replica_n2",
   [junit4]   2>       "base_url":"https://127.0.0.1:41689/solr",
   [junit4]   2>       "state":"down",
   [junit4]   2>       "node_name":null,
   [junit4]   2>       "type":"NRT"}}}
   [junit4]   2> 2609990 DEBUG (OverseerStateUpdate-72072546218672133-127.0.0.1:46177_solr-n_0000000000) [n:127.0.0.1:46177_solr    ] o.a.s.c.o.SliceMutator New Slice: shard1:{
   [junit4]   2>   "range":"80000000-7fffffff",
   [junit4]   2>   "state":"active",
   [junit4]   2>   "replicas":{
   [junit4]   2>     "core_node3":{
   [junit4]   2>       "core":"AutoscalingHistoryHandlerTest_collection_shard1_replica_n1",
   [junit4]   2>       "base_url":"https://127.0.0.1:39735/solr",
   [junit4]   2>       "state":"down",
   [junit4]   2>       "node_name":null,
   [junit4]   2>       "type":"NRT"},
   [junit4]   2>     "core_node5":{
   [junit4]   2>       "core":"AutoscalingHistoryHandlerTest_collection_shard1_replica_n2",
   [junit4]   2>       "base_url":"https://127.0.0.1:41689/solr",
   [junit4]   2>       "state":"down",
   [junit4]   2>       "node_name":null,
   [junit4]   2>       "type":"NRT"},
   [junit4]   2>     "core_node6":{
   [junit4]   2>       "core":"AutoscalingHistoryHandlerTest_collection_shard1_replica_n4",
   [junit4]   2>       "base_url":"https://127.0.0.1:46177/solr",
   [junit4]   2>       "state":"down",
   [junit4]   2>       "node_name":null,
   [junit4]   2>       "type":"NRT"}}}
   [junit4]   2> 2610090 DEBUG (OverseerStateUpdate-72072546218672133-127.0.0.1:46177_solr-n_0000000000) [n:127.0.0.1:46177_solr    ] o.a.s.c.o.ZkStateWriter going to update_collection /collections/AutoscalingHistoryHandlerTest_collection/state.json version: 0
   [junit4]   2> 2610194 INFO  (qtp940941147-20386) [n:127.0.0.1:41689_solr    ] o.a.s.h.a.CoreAdminOperation core create command qt=/admin/cores&coreNodeName=core_node5&collection.configName=AutoscalingHistoryHandlerTest_collection.AUTOCREATED&newCollection=true&name=AutoscalingHistoryHandlerTest_collection_shard1_replica_n2&action=CREATE&numShards=1&collection=AutoscalingHistoryHandlerTest_collection&shard=shard1&wt=javabin&version=2&replicaType=NRT
   [junit4]   2> 2610195 INFO  (qtp940941147-20386) [n:127.0.0.1:41689_solr    ] o.a.s.c.TransientSolrCoreCacheDefault Allocating transient cache for 2147483647 transient cores
   [junit4]   2> 2610196 DEBUG (OverseerStateUpdate-72072546218672133-127.0.0.1:46177_solr-n_0000000000) [n:127.0.0.1:46177_solr    ] o.a.s.c.Overseer processMessage: queueSize: 1, message = {
   [junit4]   2>   "core":"AutoscalingHistoryHandlerTest_collection_shard1_replica_n2",
   [junit4]   2>   "core_node_name":"core_node5",
   [junit4]   2>   "roles":null,
   [junit4]   2>   "base_url":"https://127.0.0.1:41689/solr",
   [junit4]   2>   "node_name":"127.0.0.1:41689_solr",
   [junit4]   2>   "numShards":"1",
   [junit4]   2>   "state":"down",
   [junit4]   2>   "shard":"shard1",
   [junit4]   2>   "collection":"AutoscalingHistoryHandlerTest_collection",
   [junit4]   2>   "type":"NRT",
   [junit4]   2>   "operation":"state"} current state version: 0
   [junit4]   2> 2610196 DEBUG (OverseerStateUpdate-72072546218672133-127.0.0.1:46177_solr-n_0000000000) [n:127.0.0.1:46177_solr    ] o.a.s.c.o.ReplicaMutator Update state numShards=1 message={
   [junit4]   2>   "core":"AutoscalingHistoryHandlerTest_collection_shard1_replica_n2",
   [junit4]   2>   "core_node_name":"core_node5",
   [junit4]   2>   "roles":null,
   [junit4]   2>   "base_url":"https://127.0.0.1:41689/solr",
   [junit4]   2>   "node_name":"127.0.0.1:41689_solr",
   [junit4]   2>   "numShards":"1",
   [junit4]   2>   "state":"down",
   [junit4]   2>   "shard":"shard1",
   [junit4]   2>   "collection":"AutoscalingHistoryHandlerTest_collection",
   [junit4]   2>   "type":"NRT",
   [junit4]   2>   "operation":"state"}
   [junit4]   2> 2610196 DEBUG (OverseerStateUpdate-72072546218672133-127.0.0.1:46177_solr-n_0000000000) [n:127.0.0.1:46177_solr    ] o.a.s.c.o.ReplicaMutator Will update state for replica: core_node5:{"core":"AutoscalingHistoryHandlerTest_collection_shard1_replica_n2","base_url":"https://127.0.0.1:41689/solr","node_name":"127.0.0.1:41689_solr","state":"down","type":"NRT"}
   [junit4]   2> 2610196 DEBUG (OverseerStateUpdate-72072546218672133-127.0.0.1:46177_solr-n_0000000000) [n:127.0.0.1:46177_solr    ] o.a.s.c.o.ReplicaMutator Collection is now: DocCollection(AutoscalingHistoryHandlerTest_collection//collections/AutoscalingHistoryHandlerTest_collection/state.json/1)={
   [junit4]   2>   "pullReplicas":"0",
   [junit4]   2>   "replicationFactor":"3",
   [junit4]   2>   "router":{"name":"compositeId"},
   [junit4]   2>   "maxShardsPerNode":"1",
   [junit4]   2>   "autoAddReplicas":"false",
   [junit4]   2>   "nrtReplicas":"3",
   [junit4]   2>   "tlogReplicas":"0",
   [junit4]   2>   "shards":{"shard1":{
   [junit4]   2>       "range":"80000000-7fffffff",
   [junit4]   2>       "state":"active",
   [junit4]   2>       "replicas":{
   [junit4]   2>         "core_node3":{
   [junit4]   2>           "core":"AutoscalingHistoryHandlerTest_collection_shard1_replica_n1",
   [junit4]   2>           "base_url":"https://127.0.0.1:39735/solr",
   [junit4]   2>           "state":"down",
   [junit4]   2>           "node_name":null,
   [junit4]   2>           "type":"NRT"},
   [junit4]   2>         "core_node5":{
   [junit4]   2>           "core":"AutoscalingHistoryHandlerTest_collection_shard1_replica_n2",
   [junit4]   2>           "base_url":"https://127.0.0.1:41689/solr",
   [junit4]   2>           "node_name":"127.0.0.1:41689_solr",
   [junit4]   2>           "state":"down",
   [junit4]   2>           "type":"NRT"},
   [junit4]   2>         "core_node6":{
   [junit4]   2>           "core":"AutoscalingHistoryHandlerTest_collection_shard1_replica_n4",
   [junit4]   2>           "base_url":"https://127.0.0.1:46177/solr",
   [junit4]   2>           "state":"down",
   [junit4]   2>           "node_name":null,
   [junit4]   2>           "type":"NRT"}}}}}
   [junit4]   2> 2610201 INFO  (qtp780121261-20373) [n:127.0.0.1:39735_solr    ] o.a.s.h.a.CoreAdminOperation core create command qt=/admin/cores&coreNodeName=core_node3&collection.configName=AutoscalingHistoryHandlerTest_collection.AUTOCREATED&newCollection=true&name=AutoscalingHistoryHandlerTest_collection_shard1_replica_n1&action=CREATE&numShards=1&collection=AutoscalingHistoryHandlerTest_collection&shard=shard1&wt=javabin&version=2&replicaType=NRT
   [junit4]   2> 2610201 INFO  (qtp786905178-20361) [n:127.0.0.1:46177_solr    ] o.a.s.h.a.CoreAdminOperation core create command qt=/admin/cores&coreNodeName=core_node6&collection.configName=AutoscalingHistoryHandlerTest_collection.AUTOCREATED&newCollection=true&name=AutoscalingHistoryHandlerTest_collection_shard1_replica_n4&action=CREATE&numShards=1&collection=AutoscalingHistoryHandlerTest_collection&shard=shard1&wt=javabin&version=2&replicaType=NRT
   [junit4]   2> 2610201 INFO  (qtp780121261-20373) [n:127.0.0.1:39735_solr    ] o.a.s.c.TransientSolrCoreCacheDefault Allocating transient cache for 2147483647 transient cores
   [junit4]   2> 2610201 INFO  (qtp786905178-20361) [n:127.0.0.1:46177_solr    ] o.a.s.c.TransientSolrCoreCacheDefault Allocating transient cache for 2147483647 transient cores
   [junit4]   2> 2610204 DEBUG (OverseerStateUpdate-72072546218672133-127.0.0.1:46177_solr-n_0000000000) [n:127.0.0.1:46177_solr    ] o.a.s.c.Overseer processMessage: queueSize: 2, message = {
   [junit4]   2>   "core":"AutoscalingHistoryHandlerTest_collection_shard1_replica_n1",
   [junit4]   2>   "core_node_name":"core_node3",
   [junit4]   2>   "roles":null,
   [junit4]   2>   "base_url":"https://127.0.0.1:39735/solr",
   [junit4]   2>   "node_name":"127.0.0.1:39735_solr",
   [junit4]   2>   "numShards":"1",
   [junit4]   2>   "state":"down",
   [junit4]   2>   "shard":"shard1",
   [junit4]   2>   "collection":"AutoscalingHistoryHandlerTest_collection",
   [junit4]   2>   "type":"NRT",
   [junit4]   2>   "operation":"state"} current state version: 0
   [junit4]   2> 2610204 DEBUG (OverseerStateUpdate-72072546218672133-127.0.0.1:46177_solr-n_0000000000) [n:127.0.0.1:46177_solr    ] o.a.s.c.o.ReplicaMutator Update state numShards=1 message={
   [junit4]   2>   "core":"AutoscalingHistoryHandlerTest_collection_shard1_replica_n1",
   [junit4]   2>   "core_node_name":"core_node3",
   [junit4]   2>   "roles":null,
   [junit4]   2>   "base_url":"https://127.0.0.1:39735/solr",
   [junit4]   2>   "node_name":"127.0.0.1:39735_solr",
   [junit4]   2>   "numShards":"1",
   [junit4]   2>   "state":"down",
   [junit4]   2>   "shard":"shard1",
   [junit4]   2>   "collection":"AutoscalingHistoryHandlerTest_collection",
   [junit4]   2>   "type":"NRT",
   [junit4]   2>   "operation":"state"}
   [junit4]   2> 2610204 DEBUG (OverseerStateUpdate-72072546218672133-127.0.0.1:46177_solr-n_0000000000) [n:127.0.0.1:46177_solr    ] o.a.s.c.o.ReplicaMutator Will update state for replica: core_node3:{"core":"AutoscalingHistoryHandlerTest_collection_shard1_replica_n1","base_url":"https://127.0.0.1:39735/solr","node_name":"127.0.0.1:39735_solr","state":"down","type":"NRT"}
   [junit4]   2> 2610204 DEBUG (OverseerStateUpdate-72072546218672133-127.0.0.1:46177_solr-n_0000000000) [n:127.0.0.1:46177_solr    ] o.a.s.c.o.ReplicaMutator Collection is now: DocCollection(AutoscalingHistoryHandlerTest_collection//collections/AutoscalingHistoryHandlerTest_collection/state.json/1)={
   [junit4]   2>   "pullReplicas":"0",
   [junit4]   2>   "replicationFactor":"3",
   [junit4]   2>   "router":{"name":"compositeId"},
   [junit4]   2>   "maxShardsPerNode":"1",
   [junit4]   2>   "autoAddReplicas":"false",
   [junit4]   2>   "nrtReplicas":"3",
   [junit4]   2>   "tlogReplicas":"0",
   [junit4]   2>   "shards":{"shard1":{
   [junit4]   2>       "range":"80000000-7fffffff",
   [junit4]   2>       "state":"active",
   [junit4]   2>       "replicas":{
   [junit4]   2>         "core_node3":{
   [junit4]   2>           "core":"AutoscalingHistoryHandlerTest_collection_shard1_replica_n1",
   [junit4]   2>           "base_url":"https://127.0.0.1:39735/solr",
   [junit4]   2>           "node_name":"127.0.0.1:39735_solr",
   [junit4]   2>           "state":"down",
   [junit4]   2>           "type":"NRT"},
   [junit4]   2>         "core_node5":{
   [junit4]   2>           "core":"AutoscalingHistoryHandlerTest_collection_shard1_replica_n2",
   [junit4]   2>           "base_url":"https://127.0.0.1:41689/solr",
   [junit4]   2>           "node_name":"127.0.0.1:41689_solr",
   [junit4]   2>           "state":"down",
   [junit4]   2>           "type":"NRT"},
   [junit4]   2>         "core_node6":{
   [junit4]   2>           "core":"AutoscalingHistoryHandlerTest_collection_shard1_replica_n4",
   [junit4]   2>           "base_url":"https://127.0.0.1:46177/solr",
   [junit4]   2>           "state":"down",
   [junit4]   2>           "node_name":null,
   [junit4]   2>           "type":"NRT"}}}}}
   [junit4]   2> 2610205 DEBUG (OverseerStateUpdate-72072546218672133-127.0.0.1:46177_solr-n_0000000000) [n:127.0.0.1:46177_solr    ] o.a.s.c.Overseer processMessage: queueSize: 3, message = {
   [junit4]   2>   "core":"AutoscalingHistoryHandlerTest_collection_shard1_replica_n4",
   [junit4]   2>   "core_node_name":"core_node6",
   [junit4]   2>   "roles":null,
   [junit4]   2>   "base_url":"https://127.0.0.1:46177/solr",
   [junit4]   2>   "node_name":"127.0.0.1:46177_solr",
   [junit4]   2>   "numShards":"1",
   [junit4]   2>   "state":"down",
   [junit4]   2>   "shard":"shard1",
   [junit4]   2>   "collection":"AutoscalingHistoryHandlerTest_collection",
   [junit4]   2>   "type":"NRT",
   [junit4]   2>   "operation":"state"} current state version: 0
   [junit4]   2> 2610205 DEBUG (OverseerStateUpdate-72072546218672133-127.0.0.1:46177_solr-n_0000000000) [n:127.0.0.1:46177_solr    ] o.a.s.c.o.ReplicaMutator Update state numShards=1 message={
   [junit4]   2>   "core":"AutoscalingHistoryHandlerTest_collection_shard1_replica_n4",
   [junit4]   2>   "core_node_name":"core_node6",
   [junit4]   2>   "roles":null,
   [junit4]   2>   "base_url":"https://127.0.0.1:46177/solr",
   [junit4]   2>   "node_name":"127.0.0.1:46177_solr",
   [junit4]   2>   "numShards":"1",
   [junit4]   2>   "state":"down",
   [junit4]   2>   "shard":"shard1",
   [junit4]   2>   "collection":"AutoscalingHistoryHandlerTest_collection",
   [junit4]   2>   "type":"NRT",
   [junit4]   2>   "operation":"state"}
   [junit4]   2> 2610205 DEBUG (OverseerStateUpdate-72072546218672133-127.0.0.1:46177_solr-n_0000000000) [n:127.0.0.1:46177_solr    ] o.a.s.c.o.ReplicaMutator Will update state for replica: core_node6:{"core":"AutoscalingHistoryHandlerTest_collection_shard1_replica_n4","base_url":"https://127.0.0.1:46177/solr","node_name":"127.0.0.1:46177_solr","state":"down","type":"NRT"}
   [junit4]   2> 2610205 DEBUG (OverseerStateUpdate-72072546218672133-127.0.0.1:46177_solr-n_0000000000) [n:127.0.0.1:46177_solr    ] o.a.s.c.o.ReplicaMutator Collection is now: DocCollection(AutoscalingHistoryHandlerTest_collection//collections/AutoscalingHistoryHandlerTest_collection/state.json/1)={
   [junit4]   2>   "pullReplicas":"0",
   [junit4]   2>   "replicationFactor":"3",
   [junit4]   2>   "router":{"name":"compositeId"},
   [junit4]   2>   "maxShardsPerNode":"1",
   [junit4]   2>   "autoAddReplicas":"false",
   [junit4]   2>   "nrtReplicas":"3",
   [junit4]   2>   "tlogReplicas":"0",
   [junit4]   2>   "shards":{"shard1":{
   [junit4]   2>       "range":"80000000-7fffffff",
   [junit4]   2>       "state":"active",
   [junit4]   2>       "replicas":{
   [junit4]   2>         "core_node3":{
   [junit4]   2>           "core":"AutoscalingHistoryHandlerTest_collection_shard1_replica_n1",
   [junit4]   2>           "base_url":"https://127.0.0.1:39735/solr",
   [junit4]   2>           "node_name":"127.0.0.1:39735_solr",
   [junit4]   2>           "state":"down",
   [junit4]   2>           "type":"NRT"},
   [junit4]   2>         "core_node5":{
   [junit4]   2>           "core":"AutoscalingHistoryHandlerTest_collection_shard1_replica_n2",
   [junit4]   2>           "base_url":"https://127.0.0.1:41689/solr",
   [junit4]   2>           "node_name":"127.0.0.1:41689_solr",
   [junit4]   2>           "state":"down",
   [junit4]   2>           "type":"NRT"},
   [junit4]   2>         "core_node6":{
   [junit4]   2>           "core":"AutoscalingHistoryHandlerTest_collection_shard1_replica_n4",
   [junit4]   2>           "base_url":"https://127.0.0.1:46177/solr",
   [junit4]   2>           "node_name":"127.0.0.1:46177_solr",
   [junit4]   2>           "state":"down",
   [junit4]   2>           "type":"NRT"}}}}}
   [junit4]   2> 2610305 DEBUG (OverseerStateUpdate-72072546218672133-127.0.0.1:46177_solr-n_0000000000) [n:127.0.0.1:46177_solr    ] o.a.s.c.o.ZkStateWriter going to update_collection /collections/AutoscalingHistoryHandlerTest_collection/state.json version: 1
   [junit4]   2> 2610306 INFO  (zkCallback-7057-thread-1-processing-n:127.0.0.1:41689_solr) [n:127.0.0.1:41689_solr    ] o.a.s.c.c.ZkStateReader A cluster state change: [WatchedEvent state:SyncConnected type:NodeDataChanged path:/collections/AutoscalingHistoryHandlerTest_collection/state.json] for collection [AutoscalingHistoryHandlerTest_collection] has occurred - updating... (live nodes size: [3])
   [junit4]   2> 2610306 INFO  (zkCallback-7055-thread-1-processing-n:127.0.0.1:39735_solr) [n:127.0.0.1:39735_solr    ] o.a.s.c.c.ZkStateReader A cluster state change: [WatchedEvent state:SyncConnected type:NodeDataChanged path:/collections/AutoscalingHistoryHandlerTest_collection/state.json] for collection [AutoscalingHistoryHandlerTest_collection] has occurred - updating... (live nodes size: [3])
   [junit4]   2> 2610306 INFO  (zkCallback-7055-thread-2-processing-n:127.0.0.1:39735_solr) [n:127.0.0.1:39735_solr    ] o.a.s.c.c.ZkStateReader A cluster state change: [WatchedEvent state:SyncConnected type:NodeDataChanged path:/collections/AutoscalingHistoryHandlerTest_collection/state.json] for collection [AutoscalingHistoryHandlerTest_collection] has occurred - updating... (live nodes size: [3])
   [junit4]   2> 2610306 INFO  (zkCallback-7044-thread-1-processing-n:127.0.0.1:46177_solr) [n:127.0.0.1:46177_solr    ] o.a.s.c.c.ZkStateReader A cluster state change: [WatchedEvent state:SyncConnected type:NodeDataChanged path:/collections/AutoscalingHistoryHandlerTest_collection/state.json] for collection [AutoscalingHistoryHandlerTest_collection] has occurred - updating... (live nodes size: [3])
   [junit4]   2> 2610306 INFO  (zkCallback-7044-thread-2-processing-n:127.0.0.1:46177_solr) [n:127.0.0.1:46177_solr    ] o.a.s.c.c.ZkStateReader A cluster state change: [WatchedEvent state:SyncConnected type:NodeDataChanged path:/collections/AutoscalingHistoryHandlerTest_collection/state.json] for collection [AutoscalingHistoryHandlerTest_collection] has occurred - updating... (live nodes size: [3])
   [junit4]   2> 2610306 INFO  (zkCallback-7057-thread-2-processing-n:127.0.0.1:41689_solr) [n:127.0.0.1:41689_solr    ] o.a.s.c.c.ZkStateReader A cluster state change: [WatchedEvent state:SyncConnected type:NodeDataChanged path:/collections/AutoscalingHistoryHandlerTest_collection/state.json] for collection [AutoscalingHistoryHandlerTest_collection] has occurred - updating... (live nodes size: [3])
   [junit4]   2> 2610709 DEBUG (ScheduledTrigger-4992-thread-1) [n:127.0.0.1:46177_solr    ] o.a.s.c.a.NodeLostTrigger Running NodeLostTrigger: .auto_add_replicas with currently live nodes: 3
   [junit4]   2> 2611201 INFO  (qtp940941147-20386) [n:127.0.0.1:41689_solr c:AutoscalingHistoryHandlerTest_collection s:shard1 r:core_node5 x:AutoscalingHistoryHandlerTest_collection_shard1_replica_n2] o.a.s.c.RequestParams conf resource params.json loaded . version : 0 
   [junit4]   2> 2611202 INFO  (qtp940941147-20386) [n:127.0.0.1:41689_solr c:AutoscalingHistoryHandlerTest_collection s:shard1 r:core_node5 x:AutoscalingHistoryHandlerTest_collection_shard1_replica_n2] o.a.s.c.RequestParams request params refreshed to version 0
   [junit4]   2> 2611202 WARN  (qtp940941147-20386) [n:127.0.0.1:41689_solr c:AutoscalingHistoryHandlerTest_collection s:shard1 r:core_node5 x:AutoscalingHistoryHandlerTest_collection_shard1_replica_n2] o.a.s.c.SolrConfig Couldn't add files from /home/jenkins/workspace/Lucene-Solr-7.x-Linux/solr/build/solr-core/test/J1/temp/solr.handler.admin.AutoscalingHistoryHandlerTest_B8CBD7234C714071-001/tempDir-001/node2/AutoscalingHistoryHandlerTest_collection_shard1_replica_n2/../../../../contrib/extraction/lib filtered by .*\.jar to classpath: /home/jenkins/workspace/Lucene-Solr-7.x-Linux/solr/build/solr-core/test/J1/temp/solr.handler.admin.AutoscalingHistoryHandlerTest_B8CBD7234C714071-001/tempDir-001/node2/AutoscalingHistoryHandlerTest_collection_shard1_replica_n2/../../../../contrib/extraction/lib
   [junit4]   2> 2611202 WARN  (qtp940941147-20386) [n:127.0.0.1:41689_solr c:AutoscalingHistoryHandlerTest_collection s:shard1 r:core_node5 x:AutoscalingHistoryHandlerTest_collection_shard1_replica_n2] o.a.s.c.SolrConfig Couldn't add files from /home/jenkins/workspace/Lucene-Solr-7.x-Linux/solr/build/solr-core/test/J1/temp/solr.handler.admin.AutoscalingHistoryHandlerTest_B8CBD7234C714071-001/tempDir-001/node2/AutoscalingHistoryHandlerTest_collection_shard1_replica_n2/../../../../dist filtered by solr-cell-\d.*\.jar to classpath: /home/jenkins/workspace/Lucene-Solr-7.x-Linux/solr/build/solr-core/test/J1/temp/solr.handler.admin.AutoscalingHistoryHandlerTest_B8CBD7234C714071-001/tempDir-001/node2/AutoscalingHistoryHandlerTest_collection_shard1_replica_n2/../../../../dist
   [junit4]   2> 2611202 WARN  (qtp940941147-20386) [n:127.0.0.1:41689_solr c:AutoscalingHistoryHandlerTest_collection s:shard1 r:core_node5 x:AutoscalingHistoryHandlerTest_collection_shard1_replica_n2] o.a.s.c.SolrConfig Couldn't add files from /home/jenkins/workspace/Lucene-Solr-7.x-Linux/solr/build/solr-core/test/J1/temp/solr.handler.admin.AutoscalingHistoryHandlerTest_B8CBD7234C714071-001/tempDir-001/node2/AutoscalingHistoryHandlerTest_collection_shard1_replica_n2/../../../../contrib/clustering/lib filtered by .*\.jar to classpath: /home/jenkins/workspace/Lucene-Solr-7.x-Linux/solr/build/solr-core/test/J1/temp/solr.handler.admin.AutoscalingHistoryHandlerTest_B8CBD7234C714071-001/tempDir-001/node2/AutoscalingHistoryHandlerTest_collection_shard1_replica_n2/../../../../contrib/clustering/lib
   [junit4]   2> 2611202 WARN  (qtp940941147-20386) [n:127.0.0.1:41689_solr c:AutoscalingHistoryHandlerTest_collection s:shard1 r:core_node5 x:AutoscalingHistoryHandlerTest_collection_shard1_replica_n2] o.a.s.c.SolrConfig Couldn't add files from /home/jenkins/workspace/Lucene-Solr-7.x-Linux/solr/build/solr-core/test/J1/temp/solr.handler.admin.AutoscalingHistoryHandlerTest_B8CBD7234C714071-001/tempDir-001/node2/AutoscalingHistoryHandlerTest_collection_shard1_replica_n2/../../../../dist filtered by solr-clustering-\d.*\.jar to classpath: /home/jenkins/workspace/Lucene-Solr-7.x-Linux/solr/build/solr-core/test/J1/temp/solr.handler.admin.AutoscalingHistoryHandlerTest_B8CBD7234C714071-001/tempDir-001/node2/AutoscalingHistoryHandlerTest_collection_shard1_replica_n2/../../../../dist
   [junit4]   2> 2611202 WARN  (qtp940941147-20386) [n:127.0.0.1:41689_solr c:AutoscalingHistoryHandlerTest_collection s:shard1 r:core_node5 x:AutoscalingHistoryHandlerTest_collection_shard1_replica_n2] o.a.s.c.SolrConfig Couldn't add files from /home/jenkins/workspace/Lucene-Solr-7.x-Linux/solr/build/solr-core/test/J1/temp/solr.handler.admin.AutoscalingHistoryHandlerTest_B8CBD7234C714071-001/tempDir-001/node2/AutoscalingHistoryHandlerTest_collection_shard1_replica_n2/../../../../contrib/langid/lib filtered by .*\.jar to classpath: /home/jenkins/workspace/Lucene-Solr-7.x-Linux/solr/build/solr-core/test/J1/temp/solr.handler.admin.AutoscalingHistoryHandlerTest_B8CBD7234C714071-001/tempDir-001/node2/AutoscalingHistoryHandlerTest_collection_shard1_replica_n2/../../../../contrib/langid/lib
   [junit4]   2> 2611202 WARN  (qtp940941147-20386) [n:127.0.0.1:41689_solr c:AutoscalingHistoryHandlerTest_collection s:shard1 r:core_node5 x:AutoscalingHistoryHandlerTest_collection_shard1_replica_n2] o.a.s.c.SolrConfig Couldn't add files from /home/jenkins/workspace/Lucene-Solr-7.x-Linux/solr/build/solr-core/test/J1/temp/solr.handler.admin.AutoscalingHistoryHandlerTest_B8CBD7234C714071-001/tempDir-001/node2/AutoscalingHistoryHandlerTest_collection_shard1_replica_n2/../../../../dist filtered by solr-langid-\d.*\.jar to classpath: /home/jenkins/workspace/Lucene-Solr-7.x-Linux/solr/build/solr-core/test/J1/temp/solr.handler.admin.AutoscalingHistoryHandlerTest_B8CBD7234C714071-001/tempDir-001/node2/AutoscalingHistoryHandlerTest_collection_shard1_replica_n2/../../../../dist
   [junit4]   2> 2611203 WARN  (qtp940941147-20386) [n:127.0.0.1:41689_solr c:AutoscalingHistoryHandlerTest_collection s:shard1 r:core_node5 x:AutoscalingHistoryHandlerTest_collection_shard1_replica_n2] o.a.s.c.SolrConfig Couldn't add files from /home/jenkins/workspace/Lucene-Solr-7.x-Linux/solr/build/solr-core/test/J1/temp/solr.handler.admin.AutoscalingHistoryHandlerTest_B8CBD7234C714071-001/tempDir-001/node2/AutoscalingHistoryHandlerTest_collection_shard1_replica_n2/../../../../contrib/velocity/lib filtered by .*\.jar to classpath: /home/jenkins/workspace/Lucene-Solr-7.x-Linux/solr/build/solr-core/test/J1/temp/solr.handler.admin.AutoscalingHistoryHandlerTest_B8CBD7234C714071-001/tempDir-001/node2/AutoscalingHistoryHandlerTest_collection_shard1_replica_n2/../../../../contrib/velocity/lib
   [junit4]   2> 2611203 WARN  (qtp940941147-20386) [n:127.0.0.1:41689_solr c:AutoscalingHistoryHandlerTest_collection s:shard1 r:core_node5 x:AutoscalingHistoryHandlerTest_collection_shard1_replica_n2] o.a.s.c.SolrConfig Couldn't add files from /home/jenkins/workspace/Lucene-Solr-7.x-Linux/solr/build/solr-core/test/J1/temp/solr.handler.admin.AutoscalingHistoryHandlerTest_B8CBD7234C714071-001/tempDir-001/node2/AutoscalingHistoryHandlerTest_collection_shard1_replica_n2/../../../../dist filtered by solr-velocity-\d.*\.jar to classpath: /home/jenkins/workspace/Lucene-Solr-7.x-Linux/solr/build/solr-core/test/J1/temp/solr.handler.admin.AutoscalingHistoryHandlerTest_B8CBD7234C714071-001/tempDir-001/node2/AutoscalingHistoryHandlerTest_collection_shard1_replica_n2/../../../../dist
   [junit4]   2> 2611207 INFO  (qtp940941147-20386) [n:127.0.0.1:41689_solr c:AutoscalingHistoryHandlerTest_collection s:shard1 r:core_node5 x:AutoscalingHistoryHandlerTest_collection_shard1_replica_n2] o.a.s.c.SolrConfig Using Lucene MatchVersion: 7.3.0
   [junit4]   2> 2611207 INFO  (qtp780121261-20373) [n:127.0.0.1:39735_solr c:AutoscalingHistoryHandlerTest_collection s:shard1 r:core_node3 x:AutoscalingHistoryHandlerTest_collection_shard1_replica_n1] o.a.s.c.RequestParams conf resource params.json loaded . version : 0 
   [junit4]   2> 2611208 INFO  (qtp780121261-20373) [n:127.0.0.1:39735_solr c:AutoscalingHistoryHandlerTest_collection s:shard1 r:core_node3 x:AutoscalingHistoryHandlerTest_collection_shard1_replica_n1] o.a.s.c.RequestParams request params refreshed to version 0
   [junit4]   2> 2611208 INFO  (qtp786905178-20361) [n:127.0.0.1:46177_solr c:AutoscalingHistoryHandlerTest_collection s:shard1 r:core_node6 x:AutoscalingHistoryHandlerTest_collection_shard1_replica_n4] o.a.s.c.RequestParams conf resource params.json loaded . version : 0 
   [junit4]   2> 2611208 INFO  (qtp786905178-20361) [n:127.0.0.1:46177_solr c:AutoscalingHistoryHandlerTest_collection s:shard1 r:core_node6 x:AutoscalingHistoryHandlerTest_collection_shard1_replica_n4] o.a.s.c.RequestParams request params refreshed to version 0
   [junit4]   2> 2611208 WARN  (qtp780121261-20373) [n:127.0.0.1:39735_solr c:AutoscalingHistoryHandlerTest_collection s:shard1 r:core_node3 x:AutoscalingHistoryHandlerTest_collection_shard1_replica_n1] o.a.s.c.SolrConfig Couldn't add files from /home/jenkins/workspace/Lucene-Solr-7.x-Linux/solr/build/solr-core/test/J1/temp/solr.handler.admin.AutoscalingHistoryHandlerTest_B8CBD7234C714071-001/tempDir-001/node3/AutoscalingHistoryHandlerTest_collection_shard1_replica_n1/../../../../contrib/extraction/lib filtered by .*\.jar to classpath: /home/jenkins/workspace/Lucene-Solr-7.x-Linux/solr/build/solr-core/test/J1/temp/solr.handler.admin.AutoscalingHistoryHandlerTest_B8CBD7234C714071-001/tempDir-001/node3/AutoscalingHistoryHandlerTest_collection_shard1_replica_n1/../../../../contrib/extraction/lib
   [junit4]   2> 2611208 WARN  (qtp780121261-20373) [n:127.0.0.1:39735_solr c:AutoscalingHistoryHandlerTest_collection s:shard1 r:core_node3 x:AutoscalingHistoryHandlerTest_collection_shard1_replica_n1] o.a.s.c.SolrConfig Couldn't add files from /home/jenkins/workspace/Lucene-Solr-7.x-Linux/solr/build/solr-core/test/J1/temp/solr.handler.admin.AutoscalingHistoryHandlerTest_B8CBD7234C714071-001/tempDir-001/node3/AutoscalingHistoryHandlerTest_collection_shard1_replica_n1/../../../../dist filtered by solr-cell-\d.*\.jar to classpath: /home/jenkins/workspace/Lucene-Solr-7.x-Linux/solr/build/solr-core/test/J1/temp/solr.handler.admin.AutoscalingHistoryHandlerTest_B8CBD7234C714071-001/tempDir-001/node3/AutoscalingHistoryHandlerTest_collection_shard1_replica_n1/../../../../dist
   [junit4]   2> 2611208 WARN  (qtp780121261-20373) [n:127.0.0.1:39735_solr c:AutoscalingHistoryHandlerTest_collection s:shard1 r:core_node3 x:AutoscalingHistoryHandlerTest_collection_shard1_replica_n1] o.a.s.c.SolrConfig Couldn't add files from /home/jenkins/workspace/Lucene-Solr-7.x-Linux/solr/build/solr-core/test/J1/temp/solr.handler.admin.AutoscalingHistoryHandlerTest_B8CBD7234C714071-001/tempDir-001/node3/AutoscalingHistoryHandlerTest_collection_shard1_replica_n1/../../../../contrib/clustering/lib filtered by .*\.jar to classpath: /home/jenkins/workspace/Lucene-Solr-7.x-Linux/solr/build/solr-core/test/J1/temp/solr.handler.admin.AutoscalingHistoryHandlerTest_B8CBD7234C714071-001/tempDir-001/node3/AutoscalingHistoryHandlerTest_collection_shard1_replica_n1/../../../../contrib/clustering/lib
   [junit4]   2> 2611208 WARN  (qtp786905178-20361) [n:127.0.0.1:46177_solr c:AutoscalingHistoryHandlerTest_collection s:shard1 r:core_node6 x:AutoscalingHistoryHandlerTest_collection_shard1_replica_n4] o.a.s.c.SolrConfig Couldn't add files from /home/jenkins/workspace/Lucene-Solr-7.x-Linux/solr/build/solr-core/test/J1/temp/solr.handler.admin.AutoscalingHistoryHandlerTest_B8CBD7234C714071-001/tempDir-001/node1/AutoscalingHistoryHandlerTest_collection_shard1_replica_n4/../../../../contrib/extraction/lib filtered by .*\.jar to classpath: /home/jenkins/workspace/Lucene-Solr-7.x-Linux/solr/build/solr-core/test/J1/temp/solr.handler.admin.AutoscalingHistoryHandlerTest_B8CBD7234C714071-001/tempDir-001/node1/AutoscalingHistoryHandlerTest_collection_shard1_replica_n4/../../../../contrib/extraction/lib
   [junit4]   2> 2611208 WARN  (qtp780121261-20373) [n:127.0.0.1:39735_solr c:AutoscalingHistoryHandlerTest_collection s:shard1 r:core_node3 x:AutoscalingHistoryHandlerTest_collection_shard1_replica_n1] o.a.s.c.SolrConfig Couldn't add files from /home/jenkins/workspace/Lucene-Solr-7.x-Linux/solr/build/solr-core/test/J1/temp/solr.handler.admin.AutoscalingHistoryHandlerTest_B8CBD7234C714071-001/tempDir-001/node3/AutoscalingHistoryHandlerTest_collection_shard1_replica_n1/../../../../dist filtered by solr-clustering-\d.*\.jar to classpath: /home/jenkins/workspace/Lucene-Solr-7.x-Linux/solr/build/solr-core/test/J1/temp/solr.handler.admin.AutoscalingHistoryHandlerTest_B8CBD7234C714071-001/tempDir-001/node3/AutoscalingHistoryHandlerTest_collection_shard1_replica_n1/../../../../dist
   [junit4]   2> 2611208 WARN  (qtp786905178-20361) [n:127.0.0.1:46177_solr c:AutoscalingHistoryHandlerTest_collection s:shard1 r:core_node6 x:AutoscalingHistoryHandlerTest_collection_shard1_replica_n4] o.a.s.c.SolrConfig Couldn't add files from /home/jenkins/workspace/Lucene-Solr-7.x-Linux/solr/build/solr-core/test/J1/temp/solr.handler.admin.AutoscalingHistoryHandlerTest_B8CBD7234C714071-001/tempDir-001/node1/AutoscalingHistoryHandlerTest_collection_shard1_replica_n4/../../../../dist filtered by solr-cell-\d.*\.jar to classpath: /home/jenkins/workspace/Lucene-Solr-7.x-Linux/solr/build/solr-core/test/J1/temp/solr.handler.admin.AutoscalingHistoryHandlerTest_B8CBD7234C714071-001/tempDir-001/node1/AutoscalingHistoryHandlerTest_collection_shard1_replica_n4/../../../../dist
   [junit4]   2> 2611208 WARN  (qtp780121261-20373) [n:127.0.0.1:39735_solr c:AutoscalingHistoryHandlerTest_collection s:shard1 r:core_node3 x:AutoscalingHistoryHandlerTest_collection_shard1_replica_n1] o.a.s.c.SolrConfig Couldn't add files from /home/jenkins/workspace/Lucene-Solr-7.x-Linux/solr/build/solr-core/test/J1/temp/solr.handler.admin.AutoscalingHistoryHandlerTest_B8CBD7234C714071-001/tempDir-001/node3/AutoscalingHistoryHandlerTest_collection_shard1_replica_n1/../../../../contrib/langid/lib filtered by .*\.jar to classpath: /home/jenkins/workspace/Lucene-Solr-7.x-Linux/solr/build/solr-core/test/J1/temp/solr.handler.admin.AutoscalingHistoryHandlerTest_B8CBD7234C714071-001/tempDir-001/node3/AutoscalingHistoryHandlerTest_collection_shard1_replica_n1/../../../../contrib/langid/lib
   [junit4]   2> 2611209 WARN  (qtp786905178-20361) [n:127.0.0.1:46177_solr c:AutoscalingHistoryHandlerTest_collection s:shard1 r:core_node6 x:AutoscalingHistoryHandlerTest_collection_shard1_replica_n4] o.a.s.c.SolrConfig Couldn't add files from /home/jenkins/workspace/Lucene-Solr-7.x-Linux/solr/build/solr-core/test/J1/temp/solr.handler.admin.AutoscalingHistoryHandlerTest_B8CBD7234C714071-001/tempDir-001/node1/AutoscalingHistoryHandlerTest_collection_shard1_replica_n4/../../../../contrib/clustering/lib filtered by .*\.jar to classpath: /home/jenkins/workspace/Lucene-Solr-7.x-Linux/solr/build/solr-core/test/J1/temp/solr.handler.admin.Autoscal

[...truncated too long message...]

up=TGRP-LegacyRangeFacetCloudTest]
   [junit4]   2>         at java.base@9.0.1/jdk.internal.misc.Unsafe.park(Native Method)
   [junit4]   2>         at java.base@9.0.1/java.util.concurrent.locks.LockSupport.parkNanos(LockSupport.java:234)
   [junit4]   2>         at java.base@9.0.1/java.util.concurrent.locks.AbstractQueuedSynchronizer$ConditionObject.await(AbstractQueuedSynchronizer.java:2192)
   [junit4]   2>         at app//org.eclipse.jetty.util.thread.ReservedThreadExecutor$ReservedThread.reservedWait(ReservedThreadExecutor.java:308)
   [junit4]   2>         at app//org.eclipse.jetty.util.thread.ReservedThreadExecutor$ReservedThread.run(ReservedThreadExecutor.java:373)
   [junit4]   2>         at app//org.eclipse.jetty.util.thread.QueuedThreadPool.runJob(QueuedThreadPool.java:708)
   [junit4]   2>         at app//org.eclipse.jetty.util.thread.QueuedThreadPool$2.run(QueuedThreadPool.java:626)
   [junit4]   2>         at java.base@9.0.1/java.lang.Thread.run(Thread.java:844)
   [junit4]   2> Feb 01, 2018 6:28:09 AM com.carrotsearch.randomizedtesting.ThreadLeakControl tryToInterruptAll
   [junit4]   2> INFO: Starting to interrupt leaked threads:
   [junit4]   2>    1) Thread[id=41, name=qtp1909419050-41, state=TIMED_WAITING, group=TGRP-LegacyRangeFacetCloudTest]
   [junit4]   2>    2) Thread[id=147, name=qtp1909419050-147, state=TIMED_WAITING, group=TGRP-LegacyRangeFacetCloudTest]
   [junit4]   2> Feb 01, 2018 6:28:12 AM com.carrotsearch.randomizedtesting.ThreadLeakControl tryToInterruptAll
   [junit4]   2> SEVERE: There are still zombie threads that couldn't be terminated:
   [junit4]   2>    1) Thread[id=41, name=qtp1909419050-41, state=TIMED_WAITING, group=TGRP-LegacyRangeFacetCloudTest]
   [junit4]   2>         at java.base@9.0.1/jdk.internal.misc.Unsafe.park(Native Method)
   [junit4]   2>         at java.base@9.0.1/java.util.concurrent.locks.LockSupport.parkNanos(LockSupport.java:234)
   [junit4]   2>         at java.base@9.0.1/java.util.concurrent.locks.AbstractQueuedSynchronizer$ConditionObject.await(AbstractQueuedSynchronizer.java:2192)
   [junit4]   2>         at app//org.eclipse.jetty.util.thread.ReservedThreadExecutor$ReservedThread.reservedWait(ReservedThreadExecutor.java:308)
   [junit4]   2>         at app//org.eclipse.jetty.util.thread.ReservedThreadExecutor$ReservedThread.run(ReservedThreadExecutor.java:373)
   [junit4]   2>         at app//org.eclipse.jetty.util.thread.QueuedThreadPool.runJob(QueuedThreadPool.java:708)
   [junit4]   2>         at app//org.eclipse.jetty.util.thread.QueuedThreadPool$2.run(QueuedThreadPool.java:626)
   [junit4]   2>         at java.base@9.0.1/java.lang.Thread.run(Thread.java:844)
   [junit4]   2>    2) Thread[id=147, name=qtp1909419050-147, state=TIMED_WAITING, group=TGRP-LegacyRangeFacetCloudTest]
   [junit4]   2>         at java.base@9.0.1/jdk.internal.misc.Unsafe.park(Native Method)
   [junit4]   2>         at java.base@9.0.1/java.util.concurrent.locks.LockSupport.parkNanos(LockSupport.java:234)
   [junit4]   2>         at java.base@9.0.1/java.util.concurrent.locks.AbstractQueuedSynchronizer$ConditionObject.await(AbstractQueuedSynchronizer.java:2192)
   [junit4]   2>         at app//org.eclipse.jetty.util.thread.ReservedThreadExecutor$ReservedThread.reservedWait(ReservedThreadExecutor.java:308)
   [junit4]   2>         at app//org.eclipse.jetty.util.thread.ReservedThreadExecutor$ReservedThread.run(ReservedThreadExecutor.java:373)
   [junit4]   2>         at app//org.eclipse.jetty.util.thread.QueuedThreadPool.runJob(QueuedThreadPool.java:708)
   [junit4]   2>         at app//org.eclipse.jetty.util.thread.QueuedThreadPool$2.run(QueuedThreadPool.java:626)
   [junit4]   2>         at java.base@9.0.1/java.lang.Thread.run(Thread.java:844)
   [junit4]   2> NOTE: test params are: codec=Asserting(Lucene70): {long_ld=PostingsFormat(name=LuceneFixedGap), date_dtd=PostingsFormat(name=LuceneFixedGap), _version_=FSTOrd50, string_sd=PostingsFormat(name=Memory), int_id=PostingsFormat(name=Memory), id=PostingsFormat(name=LuceneFixedGap), double_dd=FSTOrd50, float_fd=PostingsFormat(name=Memory)}, docValues:{long_ld=DocValuesFormat(name=Lucene70), date_dtd=DocValuesFormat(name=Lucene70), _version_=DocValuesFormat(name=Asserting), string_sd=DocValuesFormat(name=Direct), int_id=DocValuesFormat(name=Direct), id=DocValuesFormat(name=Lucene70), double_dd=DocValuesFormat(name=Asserting), float_fd=DocValuesFormat(name=Direct)}, maxPointsInLeafNode=1311, maxMBSortInHeap=6.9915289699200525, sim=RandomSimilarity(queryNorm=false): {}, locale=ast-ES, timezone=Asia/Magadan
   [junit4]   2> NOTE: Linux 4.13.0-32-generic amd64/Oracle Corporation 9.0.1 (64-bit)/cpus=8,threads=3,free=389393120,total=536870912
   [junit4]   2> NOTE: All tests run in this JVM: [LegacyRangeFacetCloudTest]
   [junit4]   2> NOTE: reproduce with: ant test  -Dtestcase=LegacyRangeFacetCloudTest -Dtests.seed=55A736C440B6F3BE -Dtests.multiplier=3 -Dtests.slow=true -Dtests.locale=ast-ES -Dtests.timezone=Asia/Magadan -Dtests.asserts=true -Dtests.file.encoding=UTF-8
   [junit4] ERROR   0.00s J0 | LegacyRangeFacetCloudTest (suite) <<<
   [junit4]    > Throwable #1: com.carrotsearch.randomizedtesting.ThreadLeakError: 2 threads leaked from SUITE scope at org.apache.solr.analytics.legacy.facet.LegacyRangeFacetCloudTest: 
   [junit4]    >    1) Thread[id=41, name=qtp1909419050-41, state=TIMED_WAITING, group=TGRP-LegacyRangeFacetCloudTest]
   [junit4]    >         at java.base@9.0.1/jdk.internal.misc.Unsafe.park(Native Method)
   [junit4]    >         at java.base@9.0.1/java.util.concurrent.locks.LockSupport.parkNanos(LockSupport.java:234)
   [junit4]    >         at java.base@9.0.1/java.util.concurrent.locks.AbstractQueuedSynchronizer$ConditionObject.await(AbstractQueuedSynchronizer.java:2192)
   [junit4]    >         at app//org.eclipse.jetty.util.thread.ReservedThreadExecutor$ReservedThread.reservedWait(ReservedThreadExecutor.java:308)
   [junit4]    >         at app//org.eclipse.jetty.util.thread.ReservedThreadExecutor$ReservedThread.run(ReservedThreadExecutor.java:373)
   [junit4]    >         at app//org.eclipse.jetty.util.thread.QueuedThreadPool.runJob(QueuedThreadPool.java:708)
   [junit4]    >         at app//org.eclipse.jetty.util.thread.QueuedThreadPool$2.run(QueuedThreadPool.java:626)
   [junit4]    >         at java.base@9.0.1/java.lang.Thread.run(Thread.java:844)
   [junit4]    >    2) Thread[id=147, name=qtp1909419050-147, state=TIMED_WAITING, group=TGRP-LegacyRangeFacetCloudTest]
   [junit4]    >         at java.base@9.0.1/jdk.internal.misc.Unsafe.park(Native Method)
   [junit4]    >         at java.base@9.0.1/java.util.concurrent.locks.LockSupport.parkNanos(LockSupport.java:234)
   [junit4]    >         at java.base@9.0.1/java.util.concurrent.locks.AbstractQueuedSynchronizer$ConditionObject.await(AbstractQueuedSynchronizer.java:2192)
   [junit4]    >         at app//org.eclipse.jetty.util.thread.ReservedThreadExecutor$ReservedThread.reservedWait(ReservedThreadExecutor.java:308)
   [junit4]    >         at app//org.eclipse.jetty.util.thread.ReservedThreadExecutor$ReservedThread.run(ReservedThreadExecutor.java:373)
   [junit4]    >         at app//org.eclipse.jetty.util.thread.QueuedThreadPool.runJob(QueuedThreadPool.java:708)
   [junit4]    >         at app//org.eclipse.jetty.util.thread.QueuedThreadPool$2.run(QueuedThreadPool.java:626)
   [junit4]    >         at java.base@9.0.1/java.lang.Thread.run(Thread.java:844)
   [junit4]    > 	at __randomizedtesting.SeedInfo.seed([55A736C440B6F3BE]:0)Throwable #2: com.carrotsearch.randomizedtesting.ThreadLeakError: There are still zombie threads that couldn't be terminated:
   [junit4]    >    1) Thread[id=41, name=qtp1909419050-41, state=TIMED_WAITING, group=TGRP-LegacyRangeFacetCloudTest]
   [junit4]    >         at java.base@9.0.1/jdk.internal.misc.Unsafe.park(Native Method)
   [junit4]    >         at java.base@9.0.1/java.util.concurrent.locks.LockSupport.parkNanos(LockSupport.java:234)
   [junit4]    >         at java.base@9.0.1/java.util.concurrent.locks.AbstractQueuedSynchronizer$ConditionObject.await(AbstractQueuedSynchronizer.java:2192)
   [junit4]    >         at app//org.eclipse.jetty.util.thread.ReservedThreadExecutor$ReservedThread.reservedWait(ReservedThreadExecutor.java:308)
   [junit4]    >         at app//org.eclipse.jetty.util.thread.ReservedThreadExecutor$ReservedThread.run(ReservedThreadExecutor.java:373)
   [junit4]    >         at app//org.eclipse.jetty.util.thread.QueuedThreadPool.runJob(QueuedThreadPool.java:708)
   [junit4]    >         at app//org.eclipse.jetty.util.thread.QueuedThreadPool$2.run(QueuedThreadPool.java:626)
   [junit4]    >         at java.base@9.0.1/java.lang.Thread.run(Thread.java:844)
   [junit4]    >    2) Thread[id=147, name=qtp1909419050-147, state=TIMED_WAITING, group=TGRP-LegacyRangeFacetCloudTest]
   [junit4]    >         at java.base@9.0.1/jdk.internal.misc.Unsafe.park(Native Method)
   [junit4]    >         at java.base@9.0.1/java.util.concurrent.locks.LockSupport.parkNanos(LockSupport.java:234)
   [junit4]    >         at java.base@9.0.1/java.util.concurrent.locks.AbstractQueuedSynchronizer$ConditionObject.await(AbstractQueuedSynchronizer.java:2192)
   [junit4]    >         at app//org.eclipse.jetty.util.thread.ReservedThreadExecutor$ReservedThread.reservedWait(ReservedThreadExecutor.java:308)
   [junit4]    >         at app//org.eclipse.jetty.util.thread.ReservedThreadExecutor$ReservedThread.run(ReservedThreadExecutor.java:373)
   [junit4]    >         at app//org.eclipse.jetty.util.thread.QueuedThreadPool.runJob(QueuedThreadPool.java:708)
   [junit4]    >         at app//org.eclipse.jetty.util.thread.QueuedThreadPool$2.run(QueuedThreadPool.java:626)
   [junit4]    >         at java.base@9.0.1/java.lang.Thread.run(Thread.java:844)
   [junit4]    > 	at __randomizedtesting.SeedInfo.seed([55A736C440B6F3BE]:0)
   [junit4] Completed [66/78 (1!)] on J0 in 76.56s, 3 tests, 2 errors <<< FAILURES!

[...truncated 37786 lines...]

Mime
View raw message