lucene-dev mailing list archives

Site index · List index
Message view « Date » · « Thread »
Top « Date » · « Thread »
From Apache Jenkins Server <jenk...@builds.apache.org>
Subject [JENKINS] Lucene-Solr-SmokeRelease-7.x - Build # 135 - Still Failing
Date Thu, 01 Feb 2018 08:41:05 GMT
Build: https://builds.apache.org/job/Lucene-Solr-SmokeRelease-7.x/135/

No tests ran.

Build Log:
[...truncated 28288 lines...]
prepare-release-no-sign:
    [mkdir] Created dir: /x1/jenkins/jenkins-slave/workspace/Lucene-Solr-SmokeRelease-7.x/lucene/build/smokeTestRelease/dist
     [copy] Copying 491 files to /x1/jenkins/jenkins-slave/workspace/Lucene-Solr-SmokeRelease-7.x/lucene/build/smokeTestRelease/dist/lucene
     [copy] Copying 215 files to /x1/jenkins/jenkins-slave/workspace/Lucene-Solr-SmokeRelease-7.x/lucene/build/smokeTestRelease/dist/solr
   [smoker] Java 1.8 JAVA_HOME=/home/jenkins/tools/java/latest1.8
   [smoker] NOTE: output encoding is UTF-8
   [smoker] 
   [smoker] Load release URL "file:/x1/jenkins/jenkins-slave/workspace/Lucene-Solr-SmokeRelease-7.x/lucene/build/smokeTestRelease/dist/"...
   [smoker] 
   [smoker] Test Lucene...
   [smoker]   test basics...
   [smoker]   get KEYS
   [smoker]     0.2 MB in 0.02 sec (11.0 MB/sec)
   [smoker]   check changes HTML...
   [smoker]   download lucene-7.3.0-src.tgz...
   [smoker]     31.7 MB in 0.05 sec (653.4 MB/sec)
   [smoker]     verify md5/sha1 digests
   [smoker]   download lucene-7.3.0.tgz...
   [smoker]     73.1 MB in 0.31 sec (235.5 MB/sec)
   [smoker]     verify md5/sha1 digests
   [smoker]   download lucene-7.3.0.zip...
   [smoker]     83.6 MB in 0.13 sec (639.9 MB/sec)
   [smoker]     verify md5/sha1 digests
   [smoker]   unpack lucene-7.3.0.tgz...
   [smoker]     verify JAR metadata/identity/no javax.* or java.* classes...
   [smoker]     test demo with 1.8...
   [smoker]       got 6284 hits for query "lucene"
   [smoker]     checkindex with 1.8...
   [smoker]     check Lucene's javadoc JAR
   [smoker]   unpack lucene-7.3.0.zip...
   [smoker]     verify JAR metadata/identity/no javax.* or java.* classes...
   [smoker]     test demo with 1.8...
   [smoker]       got 6284 hits for query "lucene"
   [smoker]     checkindex with 1.8...
   [smoker]     check Lucene's javadoc JAR
   [smoker]   unpack lucene-7.3.0-src.tgz...
   [smoker]     make sure no JARs/WARs in src dist...
   [smoker]     run "ant validate"
   [smoker]     run tests w/ Java 8 and testArgs='-Dtests.slow=false'...
   [smoker] 
   [smoker] command "export JAVA_HOME="/home/jenkins/tools/java/latest1.8" PATH="/home/jenkins/tools/java/latest1.8/bin:$PATH" JAVACMD="/home/jenkins/tools/java/latest1.8/bin/java"; ant clean test -Dtests.slow=false" failed:
   [smoker] Buildfile: /x1/jenkins/jenkins-slave/workspace/Lucene-Solr-SmokeRelease-7.x/lucene/build/smokeTestRelease/tmp/unpack/lucene-7.3.0/build.xml
   [smoker] 
   [smoker] clean:
   [smoker]    [delete] Deleting directory /x1/jenkins/jenkins-slave/workspace/Lucene-Solr-SmokeRelease-7.x/lucene/build/smokeTestRelease/tmp/unpack/lucene-7.3.0/build
   [smoker] 
   [smoker] ivy-availability-check:
   [smoker] [loadresource] Do not set property disallowed.ivy.jars.list as its length is 0.
   [smoker] 
   [smoker] -ivy-fail-disallowed-ivy-version:
   [smoker] 
   [smoker] ivy-fail:
   [smoker] 
   [smoker] ivy-configure:
   [smoker] [ivy:configure] :: Apache Ivy 2.4.0 - 20141213170938 :: http://ant.apache.org/ivy/ ::
   [smoker] [ivy:configure] :: loading settings :: file = /x1/jenkins/jenkins-slave/workspace/Lucene-Solr-SmokeRelease-7.x/lucene/build/smokeTestRelease/tmp/unpack/lucene-7.3.0/top-level-ivy-settings.xml
   [smoker] 
   [smoker] -clover.load:
   [smoker] 
   [smoker] resolve-groovy:
   [smoker] [ivy:cachepath] :: resolving dependencies :: org.codehaus.groovy#groovy-all-caller;working
   [smoker] [ivy:cachepath] 	confs: [default]
   [smoker] [ivy:cachepath] 	found org.codehaus.groovy#groovy-all;2.4.12 in public
   [smoker] [ivy:cachepath] :: resolution report :: resolve 995ms :: artifacts dl 3ms
   [smoker] 	---------------------------------------------------------------------
   [smoker] 	|                  |            modules            ||   artifacts   |
   [smoker] 	|       conf       | number| search|dwnlded|evicted|| number|dwnlded|
   [smoker] 	---------------------------------------------------------------------
   [smoker] 	|      default     |   1   |   0   |   0   |   0   ||   1   |   0   |
   [smoker] 	---------------------------------------------------------------------
   [smoker] 
   [smoker] -init-totals:
   [smoker] 
   [smoker] test-core:
   [smoker] 
   [smoker] -clover.disable:
   [smoker] 
   [smoker] ivy-availability-check:
   [smoker] [loadresource] Do not set property disallowed.ivy.jars.list as its length is 0.
   [smoker] 
   [smoker] -ivy-fail-disallowed-ivy-version:
   [smoker] 
   [smoker] ivy-fail:
   [smoker] 
   [smoker] ivy-configure:
   [smoker] [ivy:configure] :: loading settings :: file = /x1/jenkins/jenkins-slave/workspace/Lucene-Solr-SmokeRelease-7.x/lucene/build/smokeTestRelease/tmp/unpack/lucene-7.3.0/top-level-ivy-settings.xml
   [smoker] 
   [smoker] -clover.load:
   [smoker] 
   [smoker] -clover.classpath:
   [smoker] 
   [smoker] -clover.setup:
   [smoker] 
   [smoker] clover:
   [smoker] 
   [smoker] -check-git-state:
   [smoker] 
   [smoker] -git-cleanroot:
   [smoker] 
   [smoker] -copy-git-state:
   [smoker] 
   [smoker] git-autoclean:
   [smoker] 
   [smoker] resolve:
   [smoker] 
   [smoker] init:
   [smoker] 
   [smoker] compile-core:
   [smoker]     [mkdir] Created dir: /x1/jenkins/jenkins-slave/workspace/Lucene-Solr-SmokeRelease-7.x/lucene/build/smokeTestRelease/tmp/unpack/lucene-7.3.0/build/core/classes/java
   [smoker]     [javac] Compiling 825 source files to /x1/jenkins/jenkins-slave/workspace/Lucene-Solr-SmokeRelease-7.x/lucene/build/smokeTestRelease/tmp/unpack/lucene-7.3.0/build/core/classes/java
   [smoker]     [javac] Note: Some input files use or override a deprecated API.
   [smoker]     [javac] Note: Recompile with -Xlint:deprecation for details.
   [smoker]     [javac] Creating empty /x1/jenkins/jenkins-slave/workspace/Lucene-Solr-SmokeRelease-7.x/lucene/build/smokeTestRelease/tmp/unpack/lucene-7.3.0/build/core/classes/java/org/apache/lucene/util/graph/package-info.class
   [smoker]     [javac] Creating empty /x1/jenkins/jenkins-slave/workspace/Lucene-Solr-SmokeRelease-7.x/lucene/build/smokeTestRelease/tmp/unpack/lucene-7.3.0/build/core/classes/java/org/apache/lucene/document/package-info.class
   [smoker]     [javac] Creating empty /x1/jenkins/jenkins-slave/workspace/Lucene-Solr-SmokeRelease-7.x/lucene/build/smokeTestRelease/tmp/unpack/lucene-7.3.0/build/core/classes/java/org/apache/lucene/package-info.class
   [smoker]     [javac] Creating empty /x1/jenkins/jenkins-slave/workspace/Lucene-Solr-SmokeRelease-7.x/lucene/build/smokeTestRelease/tmp/unpack/lucene-7.3.0/build/core/classes/java/org/apache/lucene/util/bkd/package-info.class
   [smoker]     [javac] Creating empty /x1/jenkins/jenkins-slave/workspace/Lucene-Solr-SmokeRelease-7.x/lucene/build/smokeTestRelease/tmp/unpack/lucene-7.3.0/build/core/classes/java/org/apache/lucene/codecs/compressing/package-info.class
   [smoker]     [javac] Creating empty /x1/jenkins/jenkins-slave/workspace/Lucene-Solr-SmokeRelease-7.x/lucene/build/smokeTestRelease/tmp/unpack/lucene-7.3.0/build/core/classes/java/org/apache/lucene/codecs/lucene60/package-info.class
   [smoker]     [javac] Creating empty /x1/jenkins/jenkins-slave/workspace/Lucene-Solr-SmokeRelease-7.x/lucene/build/smokeTestRelease/tmp/unpack/lucene-7.3.0/build/core/classes/java/org/apache/lucene/codecs/package-info.class
   [smoker]     [javac] Creating empty /x1/jenkins/jenkins-slave/workspace/Lucene-Solr-SmokeRelease-7.x/lucene/build/smokeTestRelease/tmp/unpack/lucene-7.3.0/build/core/classes/java/org/apache/lucene/util/package-info.class
   [smoker]     [javac] Creating empty /x1/jenkins/jenkins-slave/workspace/Lucene-Solr-SmokeRelease-7.x/lucene/build/smokeTestRelease/tmp/unpack/lucene-7.3.0/build/core/classes/java/org/apache/lucene/index/package-info.class
   [smoker]     [javac] Creating empty /x1/jenkins/jenkins-slave/workspace/Lucene-Solr-SmokeRelease-7.x/lucene/build/smokeTestRelease/tmp/unpack/lucene-7.3.0/build/core/classes/java/org/apache/lucene/util/fst/package-info.class
   [smoker]     [javac] Creating empty /x1/jenkins/jenkins-slave/workspace/Lucene-Solr-SmokeRelease-7.x/lucene/build/smokeTestRelease/tmp/unpack/lucene-7.3.0/build/core/classes/java/org/apache/lucene/analysis/tokenattributes/package-info.class
   [smoker]     [javac] Creating empty /x1/jenkins/jenkins-slave/workspace/Lucene-Solr-SmokeRelease-7.x/lucene/build/smokeTestRelease/tmp/unpack/lucene-7.3.0/build/core/classes/java/org/apache/lucene/search/package-info.class
   [smoker]     [javac] Creating empty /x1/jenkins/jenkins-slave/workspace/Lucene-Solr-SmokeRelease-7.x/lucene/build/smokeTestRelease/tmp/unpack/lucene-7.3.0/build/core/classes/java/org/apache/lucene/codecs/lucene62/package-info.class
   [smoker]     [javac] Creating empty /x1/jenkins/jenkins-slave/workspace/Lucene-Solr-SmokeRelease-7.x/lucene/build/smokeTestRelease/tmp/unpack/lucene-7.3.0/build/core/classes/java/org/apache/lucene/util/packed/package-info.class
   [smoker]     [javac] Creating empty /x1/jenkins/jenkins-slave/workspace/Lucene-Solr-SmokeRelease-7.x/lucene/build/smokeTestRelease/tmp/unpack/lucene-7.3.0/build/core/classes/java/org/apache/lucene/util/mutable/package-info.class
   [smoker]     [javac] Creating empty /x1/jenkins/jenkins-slave/workspace/Lucene-Solr-SmokeRelease-7.x/lucene/build/smokeTestRelease/tmp/unpack/lucene-7.3.0/build/core/classes/java/org/apache/lucene/codecs/lucene70/package-info.class
   [smoker]     [javac] Creating empty /x1/jenkins/jenkins-slave/workspace/Lucene-Solr-SmokeRelease-7.x/lucene/build/smokeTestRelease/tmp/unpack/lucene-7.3.0/build/core/classes/java/org/apache/lucene/codecs/perfield/package-info.class
   [smoker]     [javac] Creating empty /x1/jenkins/jenkins-slave/workspace/Lucene-Solr-SmokeRelease-7.x/lucene/build/smokeTestRelease/tmp/unpack/lucene-7.3.0/build/core/classes/java/org/apache/lucene/analysis/package-info.class
   [smoker]     [javac] Creating empty /x1/jenkins/jenkins-slave/workspace/Lucene-Solr-SmokeRelease-7.x/lucene/build/smokeTestRelease/tmp/unpack/lucene-7.3.0/build/core/classes/java/org/apache/lucene/analysis/standard/package-info.class
   [smoker]     [javac] Creating empty /x1/jenkins/jenkins-slave/workspace/Lucene-Solr-SmokeRelease-7.x/lucene/build/smokeTestRelease/tmp/unpack/lucene-7.3.0/build/core/classes/java/org/apache/lucene/store/package-info.class
   [smoker]     [javac] Creating empty /x1/jenkins/jenkins-slave/workspace/Lucene-Solr-SmokeRelease-7.x/lucene/build/smokeTestRelease/tmp/unpack/lucene-7.3.0/build/core/classes/java/org/apache/lucene/codecs/blocktree/package-info.class
   [smoker]     [javac] Creating empty /x1/jenkins/jenkins-slave/workspace/Lucene-Solr-SmokeRelease-7.x/lucene/build/smokeTestRelease/tmp/unpack/lucene-7.3.0/build/core/classes/java/org/apache/lucene/search/spans/package-info.class
   [smoker]     [javac] Creating empty /x1/jenkins/jenkins-slave/workspace/Lucene-Solr-SmokeRelease-7.x/lucene/build/smokeTestRelease/tmp/unpack/lucene-7.3.0/build/core/classes/java/org/apache/lucene/search/similarities/package-info.class
   [smoker]     [javac] Creating empty /x1/jenkins/jenkins-slave/workspace/Lucene-Solr-SmokeRelease-7.x/lucene/build/smokeTestRelease/tmp/unpack/lucene-7.3.0/build/core/classes/java/org/apache/lucene/util/automaton/package-info.class
   [smoker]     [javac] Creating empty /x1/jenkins/jenkins-slave/workspace/Lucene-Solr-SmokeRelease-7.x/lucene/build/smokeTestRelease/tmp/unpack/lucene-7.3.0/build/core/classes/java/org/apache/lucene/codecs/lucene50/package-info.class
   [smoker]     [javac] Creating empty /x1/jenkins/jenkins-slave/workspace/Lucene-Solr-SmokeRelease-7.x/lucene/build/smokeTestRelease/tmp/unpack/lucene-7.3.0/build/core/classes/java/org/apache/lucene/geo/package-info.class
   [smoker]      [copy] Copying 3 files to /x1/jenkins/jenkins-slave/workspace/Lucene-Solr-SmokeRelease-7.x/lucene/build/smokeTestRelease/tmp/unpack/lucene-7.3.0/build/core/classes/java
   [smoker] 
   [smoker] compile-test-framework:
   [smoker] 
   [smoker] -check-git-state:
   [smoker] 
   [smoker] -git-cleanroot:
   [smoker] 
   [smoker] -copy-git-state:
   [smoker] 
   [smoker] git-autoclean:
   [smoker] 
   [smoker] ivy-availability-check:
   [smoker] [loadresource] Do not set property disallowed.ivy.jars.list as its length is 0.
   [smoker] 
   [smoker] -ivy-fail-disallowed-ivy-version:
   [smoker] 
   [smoker] ivy-fail:
   [smoker] 
   [smoker] ivy-configure:
   [smoker] [ivy:configure] :: loading settings :: file = /x1/jenkins/jenkins-slave/workspace/Lucene-Solr-SmokeRelease-7.x/lucene/build/smokeTestRelease/tmp/unpack/lucene-7.3.0/top-level-ivy-settings.xml
   [smoker] 
   [smoker] resolve:
   [smoker] 
   [smoker] init:
   [smoker] 
   [smoker] compile-lucene-core:
   [smoker] 
   [smoker] -check-git-state:
   [smoker] 
   [smoker] -git-cleanroot:
   [smoker] 
   [smoker] -copy-git-state:
   [smoker] 
   [smoker] git-autoclean:
   [smoker] 
   [smoker] ivy-availability-check:
   [smoker] [loadresource] Do not set property disallowed.ivy.jars.list as its length is 0.
   [smoker] 
   [smoker] -ivy-fail-disallowed-ivy-version:
   [smoker] 
   [smoker] ivy-fail:
   [smoker] 
   [smoker] ivy-configure:
   [smoker] [ivy:configure] :: loading settings :: file = /x1/jenkins/jenkins-slave/workspace/Lucene-Solr-SmokeRelease-7.x/lucene/build/smokeTestRelease/tmp/unpack/lucene-7.3.0/top-level-ivy-settings.xml
   [smoker] 
   [smoker] resolve:
   [smoker] 
   [smoker] init:
   [smoker] 
   [smoker] -clover.disable:
   [smoker] 
   [smoker] -clover.load:
   [smoker] 
   [smoker] -clover.classpath:
   [smoker] 
   [smoker] -clover.setup:
   [smoker] 
   [smoker] clover:
   [smoker] 
   [smoker] compile-core:
   [smoker] 
   [smoker] compile-codecs:
   [smoker] 
   [smoker] -check-git-state:
   [smoker] 
   [smoker] -git-cleanroot:
   [smoker] 
   [smoker] -copy-git-state:
   [smoker] 
   [smoker] git-autoclean:
   [smoker] 
   [smoker] ivy-availability-check:
   [smoker] [loadresource] Do not set property disallowed.ivy.jars.list as its length is 0.
   [smoker] 
   [smoker] -ivy-fail-disallowed-ivy-version:
   [smoker] 
   [smoker] ivy-fail:
   [smoker] 
   [smoker] ivy-configure:
   [smoker] [ivy:configure] :: loading settings :: file = /x1/jenkins/jenkins-slave/workspace/Lucene-Solr-SmokeRelease-7.x/lucene/build/smokeTestRelease/tmp/unpack/lucene-7.3.0/top-level-ivy-settings.xml
   [smoker] 
   [smoker] resolve:
   [smoker] 
   [smoker] common.init:
   [smoker] 
   [smoker] compile-lucene-core:
   [smoker] 
   [smoker] init:
   [smoker] 
   [smoker] -clover.disable:
   [smoker] 
   [smoker] -clover.load:
   [smoker] 
   [smoker] -clover.classpath:
   [smoker] 
   [smoker] -clover.setup:
   [smoker] 
   [smoker] clover:
   [smoker] 
   [smoker] compile-core:
   [smoker]     [mkdir] Created dir: /x1/jenkins/jenkins-slave/workspace/Lucene-Solr-SmokeRelease-7.x/lucene/build/smokeTestRelease/tmp/unpack/lucene-7.3.0/build/codecs/classes/java
   [smoker]     [javac] Compiling 67 source files to /x1/jenkins/jenkins-slave/workspace/Lucene-Solr-SmokeRelease-7.x/lucene/build/smokeTestRelease/tmp/unpack/lucene-7.3.0/build/codecs/classes/java
   [smoker]     [javac] Note: Some input files use or override a deprecated API.
   [smoker]     [javac] Note: Recompile with -Xlint:deprecation for details.
   [smoker]     [javac] Creating empty /x1/jenkins/jenkins-slave/workspace/Lucene-Solr-SmokeRelease-7.x/lucene/build/smokeTestRelease/tmp/unpack/lucene-7.3.0/build/codecs/classes/java/org/apache/lucene/codecs/bloom/package-info.class
   [smoker]     [javac] Creating empty /x1/jenkins/jenkins-slave/workspace/Lucene-Solr-SmokeRelease-7.x/lucene/build/smokeTestRelease/tmp/unpack/lucene-7.3.0/build/codecs/classes/java/org/apache/lucene/codecs/memory/package-info.class
   [smoker]     [javac] Creating empty /x1/jenkins/jenkins-slave/workspace/Lucene-Solr-SmokeRelease-7.x/lucene/build/smokeTestRelease/tmp/unpack/lucene-7.3.0/build/codecs/classes/java/org/apache/lucene/codecs/simpletext/package-info.class
   [smoker]     [javac] Creating empty /x1/jenkins/jenkins-slave/workspace/Lucene-Solr-SmokeRelease-7.x/lucene/build/smokeTestRelease/tmp/unpack/lucene-7.3.0/build/codecs/classes/java/org/apache/lucene/codecs/blockterms/package-info.class
   [smoker]     [javac] Creating empty /x1/jenkins/jenkins-slave/workspace/Lucene-Solr-SmokeRelease-7.x/lucene/build/smokeTestRelease/tmp/unpack/lucene-7.3.0/build/codecs/classes/java/org/apache/lucene/codecs/blocktreeords/package-info.class
   [smoker]      [copy] Copying 3 files to /x1/jenkins/jenkins-slave/workspace/Lucene-Solr-SmokeRelease-7.x/lucene/build/smokeTestRelease/tmp/unpack/lucene-7.3.0/build/codecs/classes/java
   [smoker] 
   [smoker] -clover.disable:
   [smoker] 
   [smoker] -clover.load:
   [smoker] 
   [smoker] -clover.classpath:
   [smoker] 
   [smoker] -clover.setup:
   [smoker] 
   [smoker] clover:
   [smoker] 
   [smoker] common.compile-core:
   [smoker]     [mkdir] Created dir: /x1/jenkins/jenkins-slave/workspace/Lucene-Solr-SmokeRelease-7.x/lucene/build/smokeTestRelease/tmp/unpack/lucene-7.3.0/build/test-framework/classes/java
   [smoker]     [javac] Compiling 188 source files to /x1/jenkins/jenkins-slave/workspace/Lucene-Solr-SmokeRelease-7.x/lucene/build/smokeTestRelease/tmp/unpack/lucene-7.3.0/build/test-framework/classes/java
   [smoker]     [javac] Note: Some input files use or override a deprecated API.
   [smoker]     [javac] Note: Recompile with -Xlint:deprecation for details.
   [smoker]     [javac] Creating empty /x1/jenkins/jenkins-slave/workspace/Lucene-Solr-SmokeRelease-7.x/lucene/build/smokeTestRelease/tmp/unpack/lucene-7.3.0/build/test-framework/classes/java/org/apache/lucene/codecs/asserting/package-info.class
   [smoker]     [javac] Creating empty /x1/jenkins/jenkins-slave/workspace/Lucene-Solr-SmokeRelease-7.x/lucene/build/smokeTestRelease/tmp/unpack/lucene-7.3.0/build/test-framework/classes/java/org/apache/lucene/codecs/ramonly/package-info.class
   [smoker]     [javac] Creating empty /x1/jenkins/jenkins-slave/workspace/Lucene-Solr-SmokeRelease-7.x/lucene/build/smokeTestRelease/tmp/unpack/lucene-7.3.0/build/test-framework/classes/java/org/apache/lucene/mockfile/package-info.class
   [smoker]     [javac] Creating empty /x1/jenkins/jenkins-slave/workspace/Lucene-Solr-SmokeRelease-7.x/lucene/build/smokeTestRelease/tmp/unpack/lucene-7.3.0/build/test-framework/classes/java/org/apache/lucene/codecs/cheapbastard/package-info.class
   [smoker]     [javac] Creating empty /x1/jenkins/jenkins-slave/workspace/Lucene-Solr-SmokeRelease-7.x/lucene/build/smokeTestRelease/tmp/unpack/lucene-7.3.0/build/test-framework/classes/java/org/apache/lucene/codecs/mockrandom/package-info.class
   [smoker]     [javac] Creating empty /x1/jenkins/jenkins-slave/workspace/Lucene-Solr-SmokeRelease-7.x/lucene/build/smokeTestRelease/tmp/unpack/lucene-7.3.0/build/test-framework/classes/java/org/apache/lucene/codecs/cranky/package-info.class
   [smoker]     [javac] Creating empty /x1/jenkins/jenkins-slave/workspace/Lucene-Solr-SmokeRelease-7.x/lucene/build/smokeTestRelease/tmp/unpack/lucene-7.3.0/build/test-framework/classes/java/org/apache/lucene/codecs/compressing/dummy/package-info.class
   [smoker]      [copy] Copying 4 files to /x1/jenkins/jenkins-slave/workspace/Lucene-Solr-SmokeRelease-7.x/lucene/build/smokeTestRelease/tmp/unpack/lucene-7.3.0/build/test-framework/classes/java
   [smoker] 
   [smoker] compile-core:
   [smoker] 
   [smoker] compile-test:
   [smoker]     [mkdir] Created dir: /x1/jenkins/jenkins-slave/workspace/Lucene-Solr-SmokeRelease-7.x/lucene/build/smokeTestRelease/tmp/unpack/lucene-7.3.0/build/core/classes/test
   [smoker]     [javac] Compiling 466 source files to /x1/jenkins/jenkins-slave/workspace/Lucene-Solr-SmokeRelease-7.x/lucene/build/smokeTestRelease/tmp/unpack/lucene-7.3.0/build/core/classes/test
   [smoker]     [javac] Note: Some input files use or override a deprecated API.
   [smoker]     [javac] Note: Recompile with -Xlint:deprecation for details.
   [smoker]      [copy] Copying 3 files to /x1/jenkins/jenkins-slave/workspace/Lucene-Solr-SmokeRelease-7.x/lucene/build/smokeTestRelease/tmp/unpack/lucene-7.3.0/build/core/classes/test
   [smoker] 
   [smoker] install-junit4-taskdef:
   [smoker] 
   [smoker] validate:
   [smoker] 
   [smoker] resolve-groovy:
   [smoker] 
   [smoker] -init-totals:
   [smoker] 
   [smoker] -test:
   [smoker]     [mkdir] Created dir: /x1/jenkins/jenkins-slave/workspace/Lucene-Solr-SmokeRelease-7.x/lucene/build/smokeTestRelease/tmp/unpack/lucene-7.3.0/build/core/test
   [smoker]     [mkdir] Created dir: /x1/jenkins/jenkins-slave/workspace/Lucene-Solr-SmokeRelease-7.x/lucene/build/smokeTestRelease/tmp/unpack/lucene-7.3.0/build/core/test/temp
   [smoker]     [mkdir] Created dir: /x1/jenkins/jenkins-slave/workspace/Lucene-Solr-SmokeRelease-7.x/lucene/build/smokeTestRelease/tmp/unpack/.caches/test-stats/core
   [smoker]    [junit4] <JUnit4> says hi! Master seed: 7B316CCE872D1DAC
   [smoker]    [junit4] Executing 459 suites with 3 JVMs.
   [smoker]    [junit4] 
   [smoker]    [junit4] Started J2 PID(2118@localhost).
   [smoker]    [junit4] Started J1 PID(2117@localhost).
   [smoker]    [junit4] Started J0 PID(2119@localhost).
   [smoker]    [junit4] Suite: org.apache.lucene.util.TestTimSorterWorstCase
   [smoker]    [junit4] IGNOR/A 0.23s J1 | TestTimSorterWorstCase.testWorstCaseStackSize
   [smoker]    [junit4]    > Assumption #1: 'slow' test group is disabled (@Slow())
   [smoker]    [junit4] Completed [1/459] on J1 in 3.24s, 1 test, 1 skipped
   [smoker]    [junit4] 
   [smoker]    [junit4] Suite: org.apache.lucene.search.MultiCollectorTest
   [smoker]    [junit4] Completed [2/459] on J2 in 13.33s, 4 tests
   [smoker]    [junit4] 
   [smoker]    [junit4] Suite: org.apache.lucene.index.TestFieldInvertState
   [smoker]    [junit4] Completed [3/459] on J1 in 11.16s, 2 tests
   [smoker]    [junit4] 
   [smoker]    [junit4] Suite: org.apache.lucene.index.Test2BSortedDocValuesFixedSorted
   [smoker]    [junit4] IGNOR/A 0.00s J1 | Test2BSortedDocValuesFixedSorted.testFixedSorted
   [smoker]    [junit4]    > Assumption #1: 'monster' test group is disabled (@Monster(value=Takes ~ 6 hours if the heap is 5gb))
   [smoker]    [junit4] Completed [4/459] on J1 in 0.02s, 1 test, 1 skipped
   [smoker]    [junit4] 
   [smoker]    [junit4] Suite: org.apache.lucene.util.TestSmallFloat
   [smoker]    [junit4] Completed [5/459] on J0 in 11.90s, 4 tests
   [smoker]    [junit4] 
   [smoker]    [junit4] Suite: org.apache.lucene.index.TestFlex
   [smoker]    [junit4] Completed [6/459] on J0 in 17.37s, 2 tests
   [smoker]    [junit4] 
   [smoker]    [junit4] Suite: org.apache.lucene.index.TestStressDeletes
   [smoker]    [junit4] Completed [7/459] on J1 in 22.64s, 1 test
   [smoker]    [junit4] 
   [smoker]    [junit4] Suite: org.apache.lucene.index.TestMergeRateLimiter
   [smoker]    [junit4] Completed [8/459] on J1 in 0.32s, 1 test
   [smoker]    [junit4] 
   [smoker]    [junit4] Suite: org.apache.lucene.index.TestStressAdvance
   [smoker]    [junit4] Completed [9/459] on J2 in 60.97s, 1 test
   [smoker]    [junit4] 
   [smoker]    [junit4] HEARTBEAT J0 PID(2119@localhost): 2018-02-01T06:58:41, stalled for 65.2s at: TestBagOfPositions.test
   [smoker]    [junit4] Suite: org.apache.lucene.index.TestBagOfPositions
   [smoker]    [junit4] Completed [10/459] on J0 in 68.42s, 1 test
   [smoker]    [junit4] 
   [smoker]    [junit4] Suite: org.apache.lucene.index.TestReadOnlyIndex
   [smoker]    [junit4] Completed [11/459] on J0 in 3.13s, 1 test
   [smoker]    [junit4] 
   [smoker]    [junit4] Suite: org.apache.lucene.index.TestIndexWriterWithThreads
   [smoker]    [junit4] IGNOR/A 0.06s J0 | TestIndexWriterWithThreads.testCloseWithThreads
   [smoker]    [junit4]    > Assumption #1: 'slow' test group is disabled (@Slow())
   [smoker]    [junit4] IGNOR/A 0.00s J0 | TestIndexWriterWithThreads.testIOExceptionDuringAbortWithThreads
   [smoker]    [junit4]    > Assumption #1: 'slow' test group is disabled (@Slow())
   [smoker]    [junit4] IGNOR/A 0.00s J0 | TestIndexWriterWithThreads.testIOExceptionDuringWriteSegment
   [smoker]    [junit4]    > Assumption #1: 'slow' test group is disabled (@Slow())
   [smoker]    [junit4] IGNOR/A 0.00s J0 | TestIndexWriterWithThreads.testIOExceptionDuringAbortWithThreadsOnlyOnce
   [smoker]    [junit4]    > Assumption #1: 'slow' test group is disabled (@Slow())
   [smoker]    [junit4] IGNOR/A 0.02s J0 | TestIndexWriterWithThreads.testIOExceptionDuringAbortOnlyOnce
   [smoker]    [junit4]    > Assumption #1: 'slow' test group is disabled (@Slow())
   [smoker]    [junit4] IGNOR/A 0.00s J0 | TestIndexWriterWithThreads.testIOExceptionDuringWriteSegmentOnlyOnce
   [smoker]    [junit4]    > Assumption #1: 'slow' test group is disabled (@Slow())
   [smoker]    [junit4] IGNOR/A 0.00s J0 | TestIndexWriterWithThreads.testIOExceptionDuringAbort
   [smoker]    [junit4]    > Assumption #1: 'slow' test group is disabled (@Slow())
   [smoker]    [junit4] IGNOR/A 0.02s J0 | TestIndexWriterWithThreads.testOpenTwoIndexWritersOnDifferentThreads
   [smoker]    [junit4]    > Assumption #1: 'slow' test group is disabled (@Slow())
   [smoker]    [junit4] IGNOR/A 0.01s J0 | TestIndexWriterWithThreads.testIOExceptionDuringWriteSegmentWithThreads
   [smoker]    [junit4]    > Assumption #1: 'slow' test group is disabled (@Slow())
   [smoker]    [junit4] IGNOR/A 0.02s J0 | TestIndexWriterWithThreads.testRollbackAndCommitWithThreads
   [smoker]    [junit4]    > Assumption #1: 'slow' test group is disabled (@Slow())
   [smoker]    [junit4] IGNOR/A 0.00s J0 | TestIndexWriterWithThreads.testIOExceptionDuringWriteSegmentWithThreadsOnlyOnce
   [smoker]    [junit4]    > Assumption #1: 'slow' test group is disabled (@Slow())
   [smoker]    [junit4] IGNOR/A 0.01s J0 | TestIndexWriterWithThreads.testImmediateDiskFullWithThreads
   [smoker]    [junit4]    > Assumption #1: 'slow' test group is disabled (@Slow())
   [smoker]    [junit4] Completed [12/459] on J0 in 0.32s, 12 tests, 12 skipped
   [smoker]    [junit4] 
   [smoker]    [junit4] Suite: org.apache.lucene.index.TestIndexWriterConfig
   [smoker]    [junit4] Completed [13/459] on J0 in 1.50s, 8 tests
   [smoker]    [junit4] 
   [smoker]    [junit4] Suite: org.apache.lucene.index.TestFilterCodecReader
   [smoker]    [junit4] Completed [14/459] on J0 in 0.55s, 1 test
   [smoker]    [junit4] 
   [smoker]    [junit4] HEARTBEAT J1 PID(2117@localhost): 2018-02-01T06:58:54, stalled for 63.0s at: TestIndexWriterDelete.testIndexingThenDeleting
   [smoker]    [junit4] Suite: org.apache.lucene.index.TestMaxTermFrequency
   [smoker]    [junit4] Completed [15/459] on J0 in 8.39s, 1 test
   [smoker]    [junit4] 
   [smoker]    [junit4] Suite: org.apache.lucene.util.fst.TestBytesStore
   [smoker]    [junit4] Completed [16/459] on J0 in 14.12s, 1 test
   [smoker]    [junit4] 
   [smoker]    [junit4] Suite: org.apache.lucene.index.TestMultiTermsEnum
   [smoker]    [junit4] Completed [17/459] on J0 in 3.31s, 1 test
   [smoker]    [junit4] 
   [smoker]    [junit4] Suite: org.apache.lucene.index.TestDeletionPolicy
   [smoker]    [junit4] Completed [18/459] on J0 in 17.08s, 6 tests
   [smoker]    [junit4] 
   [smoker]    [junit4] Suite: org.apache.lucene.index.TestIndexWriterDelete
   [smoker]    [junit4] IGNOR/A 0.00s J1 | TestIndexWriterDelete.testApplyDeletesOnFlush
   [smoker]    [junit4]    > Assumption #1: 'nightly' test group is disabled (@Nightly())
   [smoker]    [junit4] Completed [19/459] on J1 in 123.76s, 25 tests, 2 skipped
   [smoker]    [junit4] 
   [smoker]    [junit4] Suite: org.apache.lucene.index.TestDuelingCodecsAtNight
   [smoker]    [junit4] IGNOR/A 0.00s J1 | TestDuelingCodecsAtNight.testEquals
   [smoker]    [junit4]    > Assumption #1: 'nightly' test group is disabled (@Nightly())
   [smoker]    [junit4] IGNOR/A 0.00s J1 | TestDuelingCodecsAtNight.testBigEquals
   [smoker]    [junit4]    > Assumption #1: 'nightly' test group is disabled (@Nightly())
   [smoker]    [junit4] IGNOR/A 0.00s J1 | TestDuelingCodecsAtNight.testCrazyReaderEquals
   [smoker]    [junit4]    > Assumption #1: 'nightly' test group is disabled (@Nightly())
   [smoker]    [junit4] Completed [20/459] on J1 in 0.11s, 3 tests, 3 skipped
   [smoker]    [junit4] 
   [smoker]    [junit4] Suite: org.apache.lucene.index.TestOmitPositions
   [smoker]    [junit4] Completed [21/459] on J1 in 4.57s, 4 tests
   [smoker]    [junit4] 
   [smoker]    [junit4] Suite: org.apache.lucene.util.fst.TestFSTs
   [smoker]    [junit4] IGNOR/A 0.01s J1 | TestFSTs.testIllegallyModifyRootArc
   [smoker]    [junit4]    > Assumption #1: 'slow' test group is disabled (@Slow())
   [smoker]    [junit4] IGNOR/A 0.01s J1 | TestFSTs.testRandomWords
   [smoker]    [junit4]    > Assumption #1: 'slow' test group is disabled (@Slow())
   [smoker]    [junit4] IGNOR/A 0.00s J1 | TestFSTs.testDuplicateFSAString
   [smoker]    [junit4]    > Assumption #1: 'slow' test group is disabled (@Slow())
   [smoker]    [junit4] IGNOR/A 0.00s J1 | TestFSTs.testRealTerms
   [smoker]    [junit4]    > Assumption #1: 'slow' test group is disabled (@Slow())
   [smoker]    [junit4] IGNOR/A 0.01s J1 | TestFSTs.testPrimaryKeys
   [smoker]    [junit4]    > Assumption #1: 'slow' test group is disabled (@Slow())
   [smoker]    [junit4] IGNOR/A 0.04s J1 | TestFSTs.testNonFinalStopNode
   [smoker]    [junit4]    > Assumption #1: 'slow' test group is disabled (@Slow())
   [smoker]    [junit4] IGNOR/A 0.00s J1 | TestFSTs.testFinalOutputOnEndState
   [smoker]    [junit4]    > Assumption #1: 'slow' test group is disabled (@Slow())
   [smoker]    [junit4] IGNOR/A 0.02s J1 | TestFSTs.testShortestPaths
   [smoker]    [junit4]    > Assumption #1: 'slow' test group is disabled (@Slow())
   [smoker]    [junit4] IGNOR/A 0.00s J1 | TestFSTs.testRandomTermLookup
   [smoker]    [junit4]    > Assumption #1: 'slow' test group is disabled (@Slow())
   [smoker]    [junit4] IGNOR/A 0.00s J1 | TestFSTs.testShortestPathsWFST
   [smoker]    [junit4]    > Assumption #1: 'slow' test group is disabled (@Slow())
   [smoker]    [junit4] IGNOR/A 0.00s J1 | TestFSTs.testSingleString
   [smoker]    [junit4]    > Assumption #1: 'slow' test group is disabled (@Slow())
   [smoker]    [junit4] IGNOR/A 0.06s J1 | TestFSTs.testInternalFinalState
   [smoker]    [junit4]    > Assumption #1: 'slow' test group is disabled (@Slow())
   [smoker]    [junit4] IGNOR/A 0.00s J1 | TestFSTs.testSimple
   [smoker]    [junit4]    > Assumption #1: 'slow' test group is disabled (@Slow())
   [smoker]    [junit4] IGNOR/A 0.02s J1 | TestFSTs.testExpandedCloseToRoot
   [smoker]    [junit4]    > Assumption #1: 'slow' test group is disabled (@Slow())
   [smoker]    [junit4] IGNOR/A 0.00s J1 | TestFSTs.testRejectNoLimits
   [smoker]    [junit4]    > Assumption #1: 'slow' test group is disabled (@Slow())
   [smoker]    [junit4] IGNOR/A 0.00s J1 | TestFSTs.testShortestPathsWFSTRandom
   [smoker]    [junit4]    > Assumption #1: 'slow' test group is disabled (@Slow())
   [smoker]    [junit4] IGNOR/A 0.00s J1 | TestFSTs.testLargeOutputsOnArrayArcs
   [smoker]    [junit4]    > Assumption #1: 'slow' test group is disabled (@Slow())
   [smoker]    [junit4] IGNOR/A 0.00s J1 | TestFSTs.testShortestPathsRandom
   [smoker]    [junit4]    > Assumption #1: 'slow' test group is disabled (@Slow())
   [smoker]    [junit4] IGNOR/A 0.00s J1 | TestFSTs.testBasicFSA
   [smoker]    [junit4]    > Assumption #1: 'slow' test group is disabled (@Slow())
   [smoker]    [junit4] IGNOR/A 0.00s J1 | TestFSTs.testBigSet
   [smoker]    [junit4]    > Assumption #1: 'nightly' test group is disabled (@Nightly())
   [smoker]    [junit4] Completed [22/459] on J1 in 0.42s, 20 tests, 20 skipped
   [smoker]    [junit4] 
   [smoker]    [junit4] Suite: org.apache.lucene.index.TestOrdinalMap
   [smoker]    [junit4] Completed [23/459] on J1 in 2.44s, 1 test
   [smoker]    [junit4] 
   [smoker]    [junit4] Suite: org.apache.lucene.util.TestOfflineSorter
   [smoker]    [junit4] IGNOR/A 0.16s J2 | TestOfflineSorter.testLargerRandom
   [smoker]    [junit4]    > Assumption #1: 'nightly' test group is disabled (@Nightly())
   [smoker]    [junit4] Completed [24/459] on J2 in 125.66s, 15 tests, 1 skipped
   [smoker]    [junit4] 
   [smoker]    [junit4] HEARTBEAT J0 PID(2119@localhost): 2018-02-01T07:00:41, stalled for 68.3s at: TestIndexWriterNRTIsCurrent.testIsCurrentWithThreads
   [smoker]    [junit4] Suite: org.apache.lucene.index.TestConcurrentMergeScheduler
   [smoker]    [junit4] Completed [25/459] on J1 in 66.70s, 16 tests
   [smoker]    [junit4] 
   [smoker]    [junit4] Suite: org.apache.lucene.index.TestIndexingSequenceNumbers
   [smoker]    [junit4] IGNOR/A 0.00s J1 | TestIndexingSequenceNumbers.testStressConcurrentDocValuesUpdatesCommit
   [smoker]    [junit4]    > Assumption #1: 'slow' test group is disabled (@Slow())
   [smoker]    [junit4] IGNOR/A 0.00s J1 | TestIndexingSequenceNumbers.testStressConcurrentAddAndDeleteAndCommit
   [smoker]    [junit4]    > Assumption #1: 'slow' test group is disabled (@Slow())
   [smoker]    [junit4] IGNOR/A 0.00s J1 | TestIndexingSequenceNumbers.testStressConcurrentCommit
   [smoker]    [junit4]    > Assumption #1: 'slow' test group is disabled (@Slow())
   [smoker]    [junit4] IGNOR/A 0.00s J1 | TestIndexingSequenceNumbers.testStressUpdateSameID
   [smoker]    [junit4]    > Assumption #1: 'slow' test group is disabled (@Slow())
   [smoker]    [junit4] Completed [26/459] on J1 in 1.27s, 8 tests, 4 skipped
   [smoker]    [junit4] 
   [smoker]    [junit4] Suite: org.apache.lucene.index.TestMixedDocValuesUpdates
   [smoker]    [junit4] IGNOR/A 0.02s J2 | TestMixedDocValuesUpdates.testTonsOfUpdates
   [smoker]    [junit4]    > Assumption #1: 'nightly' test group is disabled (@Nightly())
   [smoker]    [junit4] Completed [27/459] on J2 in 55.35s, 4 tests, 1 skipped
   [smoker]    [junit4] 
   [smoker]    [junit4] HEARTBEAT J0 PID(2119@localhost): 2018-02-01T07:01:42, stalled for  129s at: TestIndexWriterNRTIsCurrent.testIsCurrentWithThreads
   [smoker]    [junit4] Suite: org.apache.lucene.index.TestIndexWriterCommit
   [smoker]    [junit4] Completed [28/459] on J2 in 37.78s, 14 tests
   [smoker]    [junit4] 
   [smoker]    [junit4] Suite: org.apache.lucene.util.TestMergedIterator
   [smoker]    [junit4] Completed [29/459] on J2 in 4.12s, 25 tests
   [smoker]    [junit4] 
   [smoker]    [junit4] Suite: org.apache.lucene.index.Test2BBinaryDocValues
   [smoker]    [junit4] IGNOR/A 0.00s J2 | Test2BBinaryDocValues.testFixedBinary
   [smoker]    [junit4]    > Assumption #1: 'monster' test group is disabled (@Monster(value=takes ~ 6 hours if the heap is 5gb))
   [smoker]    [junit4] IGNOR/A 0.00s J2 | Test2BBinaryDocValues.testVariableBinary
   [smoker]    [junit4]    > Assumption #1: 'monster' test group is disabled (@Monster(value=takes ~ 6 hours if the heap is 5gb))
   [smoker]    [junit4] Completed [30/459] on J2 in 0.06s, 2 tests, 2 skipped
   [smoker]    [junit4] 
   [smoker]    [junit4] Suite: org.apache.lucene.util.TestCharsRef
   [smoker]    [junit4] Completed [31/459] on J2 in 0.97s, 5 tests
   [smoker]    [junit4] 
   [smoker]    [junit4] Suite: org.apache.lucene.index.Test2BSortedDocValuesOrds
   [smoker]    [junit4] IGNOR/A 0.00s J2 | Test2BSortedDocValuesOrds.test2BOrds
   [smoker]    [junit4]    > Assumption #1: 'monster' test group is disabled (@Monster(value=Takes ~ 6 hours if the heap is 5gb))
   [smoker]    [junit4] Completed [32/459] on J2 in 0.01s, 1 test, 1 skipped
   [smoker]    [junit4] 
   [smoker]    [junit4] Suite: org.apache.lucene.util.TestWeakIdentityMap
   [smoker]    [junit4] Completed [33/459] on J1 in 63.94s, 2 tests
   [smoker]    [junit4] 
   [smoker]    [junit4] Suite: org.apache.lucene.util.TestRoaringDocIdSet
   [smoker]    [junit4] Completed [34/459] on J2 in 19.49s, 5 tests
   [smoker]    [junit4] 
   [smoker]    [junit4] Suite: org.apache.lucene.index.TestIndexWriterNRTIsCurrent
   [smoker]    [junit4] Completed [35/459] on J0 in 176.09s, 1 test
   [smoker]    [junit4] 
   [smoker]    [junit4] Suite: org.apache.lucene.util.TestTimSorter
   [smoker]    [junit4] Completed [36/459] on J0 in 2.31s, 9 tests
   [smoker]    [junit4] 
   [smoker]    [junit4] Suite: org.apache.lucene.index.TestIndexWriterReader
   [smoker]    [junit4] IGNOR/A 0.00s J2 | TestIndexWriterReader.testDuringAddIndexes
   [smoker]    [junit4]    > Assumption #1: 'nightly' test group is disabled (@Nightly())
   [smoker]    [junit4] IGNOR/A 0.00s J2 | TestIndexWriterReader.testAddIndexesAndDoDeletesThreads
   [smoker]    [junit4]    > Assumption #1: 'slow' test group is disabled (@Slow())
   [smoker]    [junit4] Completed [37/459] on J2 in 67.20s, 23 tests, 2 skipped
   [smoker]    [junit4] 
   [smoker]    [junit4] Suite: org.apache.lucene.util.TestIntsRef
   [smoker]    [junit4] Completed [38/459] on J2 in 0.30s, 2 tests
   [smoker]    [junit4] 
   [smoker]    [junit4] Suite: org.apache.lucene.util.TestSetOnce
   [smoker]    [junit4] Completed [39/459] on J2 in 0.33s, 4 tests
   [smoker]    [junit4] 
   [smoker]    [junit4] Suite: org.apache.lucene.codecs.perfield.TestPerFieldPostingsFormat
   [smoker]    [junit4] IGNOR/A 0.00s J0 | TestPerFieldPostingsFormat.testMergeStability
   [smoker]    [junit4]    > Assumption #1: The MockRandom PF randomizes content on the fly, so we can't check it
   [smoker]    [junit4] IGNOR/A 0.03s J0 | TestPerFieldPostingsFormat.testPostingsEnumReuse
   [smoker]    [junit4]    > Assumption #1: The MockRandom PF randomizes content on the fly, so we can't check it
   [smoker]    [junit4] IGNOR/A 0.01s J0 | TestPerFieldPostingsFormat.testRamBytesUsed
   [smoker]    [junit4]    > Assumption #1: 'slow' test group is disabled (@Slow())
   [smoker]    [junit4] Completed [40/459] on J0 in 70.14s, 25 tests, 3 skipped
   [smoker]    [junit4] 
   [smoker]    [junit4] Suite: org.apache.lucene.search.TestMultiPhraseEnum
   [smoker]    [junit4] Completed [41/459] on J0 in 0.20s, 2 tests
   [smoker]    [junit4] 
   [smoker]    [junit4] Suite: org.apache.lucene.analysis.tokenattributes.TestSimpleAttributeImpl
   [smoker]    [junit4] Completed [42/459] on J0 in 0.24s, 1 test
   [smoker]    [junit4] 
   [smoker]    [junit4] Suite: org.apache.lucene.index.TestIndexTooManyDocs
   [smoker]    [junit4] Completed [43/459] on J2 in 11.22s, 1 test
   [smoker]    [junit4] 
   [smoker]    [junit4] Suite: org.apache.lucene.util.TestVersion
   [smoker]    [junit4] Completed [44/459] on J2 in 0.90s, 11 tests
   [smoker]    [junit4] 
   [smoker]    [junit4] Suite: org.apache.lucene.index.TestSwappedIndexFiles
   [smoker]    [junit4] Completed [45/459] on J2 in 1.93s, 1 test
   [smoker]    [junit4] 
   [smoker]    [junit4] Suite: org.apache.lucene.search.TestMultiCollector
   [smoker]    [junit4] Completed [46/459] on J2 in 5.65s, 2 tests
   [smoker]    [junit4] 
   [smoker]    [junit4] HEARTBEAT J1 PID(2117@localhost): 2018-02-01T07:03:56, stalled for 62.3s at: TestLucene70DocValuesFormat.testTermsEnumLongSharedPrefixes
   [smoker]    [junit4] Suite: org.apache.lucene.store.TestNRTCachingDirectory
   [smoker]    [junit4] IGNOR/A 0.02s J0 | TestNRTCachingDirectory.testFsyncDoesntCreateNewFiles
   [smoker]    [junit4]    > Assumption #1: test only works for FSDirectory subclasses
   [smoker]    [junit4] IGNOR/A 0.02s J0 | TestNRTCachingDirectory.testPendingDeletions
   [smoker]    [junit4]    > Assumption #1: we can only install VirusCheckingFS on an FSDirectory
   [smoker]    [junit4] Completed [47/459] on J0 in 28.45s, 44 tests, 2 skipped
   [smoker]    [junit4] 
   [smoker]    [junit4] Suite: org.apache.lucene.index.TestSnapshotDeletionPolicy
   [smoker]    [junit4] Completed [48/459] on J0 in 4.07s, 7 tests
   [smoker]    [junit4] 
   [smoker]    [junit4] Suite: org.apache.lucene.codecs.perfield.TestPerFieldPostingsFormat2
   [smoker]    [junit4] Completed [49/459] on J2 in 32.94s, 6 tests
   [smoker]    [junit4] 
   [smoker]    [junit4] Suite: org.apache.lucene.index.TestTwoPhaseCommitTool
   [smoker]    [junit4] Completed [50/459] on J2 in 0.32s, 3 tests
   [smoker]    [junit4] 
   [smoker]    [junit4] HEARTBEAT J1 PID(2117@localhost): 2018-02-01T07:04:56, stalled for  122s at: TestLucene70DocValuesFormat.testTermsEnumLongSharedPrefixes
   [smoker]    [junit4] Suite: org.apache.lucene.search.TestSloppyPhraseQuery2
   [smoker]    [junit4] Completed [51/459] on J2 in 36.20s, 9 tests
   [smoker]    [junit4] 
   [smoker]    [junit4] Suite: org.apache.lucene.index.TestParallelCompositeReader
   [smoker]    [junit4] Completed [52/459] on J2 in 3.39s, 11 tests
   [smoker]    [junit4] 
   [smoker]    [junit4] Suite: org.apache.lucene.index.TestTerms
   [smoker]    [junit4] Completed [53/459] on J2 in 1.78s, 2 tests
   [smoker]    [junit4] 
   [smoker]    [junit4] Suite: org.apache.lucene.search.TestSimpleExplanationsOfNonMatches
   [smoker]    [junit4] Completed [54/459] on J2 in 1.35s, 70 tests
   [smoker]    [junit4] 
   [smoker]    [junit4] Suite: org.apache.lucene.codecs.lucene70.TestIndexedDISI
   [smoker]    [junit4] Completed [55/459] on J0 in 53.76s, 10 tests
   [smoker]    [junit4] 
   [smoker]    [junit4] Suite: org.apache.lucene.analysis.TestCharFilter
   [smoker]    [junit4] Completed [56/459] on J0 in 0.23s, 4 tests
   [smoker]    [junit4] 
   [smoker]    [junit4] Suite: org.apache.lucene.util.TestRollingBuffer
   [smoker]    [junit4] Completed [57/459] on J2 in 4.36s, 1 test
   [smoker]    [junit4] 
   [smoker]    [junit4] Suite: org.apache.lucene.util.TestSparseFixedBitSet
   [smoker]    [junit4] Completed [58/459] on J0 in 16.10s, 11 tests
   [smoker]    [junit4] 
   [smoker]    [junit4] Suite: org.apache.lucene.index.TestIndexWriterMerging
   [smoker]    [junit4] IGNOR/A 0.00s J2 | TestIndexWriterMerging.testNoWaitClose
   [smoker]    [junit4]    > Assumption #1: 'slow' test group is disabled (@Slow())
   [smoker]    [junit4] Completed [59/459] on J2 in 28.72s, 6 tests, 1 skipped
   [smoker]    [junit4] 
   [smoker]    [junit4] Suite: org.apache.lucene.analysis.TestStopFilter
   [smoker]    [junit4] Completed [60/459] on J2 in 0.35s, 4 tests
   [smoker]    [junit4] 
   [smoker]    [junit4] HEARTBEAT J1 PID(2117@localhost): 2018-02-01T07:05:56, stalled for  182s at: TestLucene70DocValuesFormat.testTermsEnumLongSharedPrefixes
   [smoker]    [junit4] Suite: org.apache.lucene.util.automaton.TestOperations
   [smoker]    [junit4] Completed [61/459] on J2 in 14.79s, 7 tests
   [smoker]    [junit4] 
   [smoker]    [junit4] Suite: org.apache.lucene.util.TestIOUtils
   [smoker]    [junit4] Completed [62/459] on J2 in 1.80s, 18 tests
   [smoker]    [junit4] 
   [smoker]    [junit4] Suite: org.apache.lucene.index.TestIndexWriterFromReader
   [smoker]    [junit4] Completed [63/459] on J2 in 4.30s, 12 tests
   [smoker]    [junit4] 
   [smoker]    [junit4] Suite: org.apache.lucene.index.TestNRTThreads
   [smoker]    [junit4] Completed [64/459] on J2 in 9.84s, 1 test
   [smoker]    [junit4] 
   [smoker]    [junit4] Suite: org.apache.lucene.analysis.TestCachingTokenFilter
   [smoker]    [junit4] Completed [65/459] on J2 in 0.22s, 2 tests
   [smoker]    [junit4] 
   [smoker]    [junit4] Suite: org.apache.lucene.index.TestConsistentFieldNumbers
   [smoker]    [junit4] Completed [66/459] on J2 in 14.33s, 4 tests
   [smoker]    [junit4] 
   [smoker]    [junit4] Suite: org.apache.lucene.index.TestPayloadsOnVectors
   [smoker]    [junit4] Completed [67/459] on J2 in 0.30s, 3 tests
   [smoker]    [junit4] 
   [smoker]    [junit4] Suite: org.apache.lucene.util.graph.TestGraphTokenStreamFiniteStrings
   [smoker]    [junit4] Completed [68/459] on J2 in 0.48s, 12 tests
   [smoker]    [junit4] 
   [smoker]    [junit4] Suite: org.apache.lucene.search.TestLRUQueryCache
   [smoker]    [junit4] Completed [69/459] on J0 in 74.83s, 21 tests
   [smoker]    [junit4] 
   [smoker]    [junit4] HEARTBEAT J1 PID(2117@localhost): 2018-02-01T07:06:56, stalled for  243s at: TestLucene70DocValuesFormat.testTermsEnumLongSharedPrefixes
   [smoker]    [junit4] Suite: org.apache.lucene.search.TestFloatRangeFieldQueries
   [smoker]    [junit4] IGNOR/A 0.00s J2 | TestFloatRangeFieldQueries.testRandomBig
   [smoker]    [junit4]    > Assumption #1: 'nightly' test group is disabled (@Nightly())
   [smoker]    [junit4] Completed [70/459] on J2 in 53.05s, 5 tests, 1 skipped
   [smoker]    [junit4] 
   [smoker]    [junit4] Suite: org.apache.lucene.search.TestSimpleExplanationsWithFillerDocs
   [smoker]    [junit4] IGNOR/A 0.00s J2 | TestSimpleExplanationsWithFillerDocs.testMA2
   [smoker]    [junit4]    > Assumption #1: 'slow' test group is disabled (@Slow())
   [smoker]    [junit4] IGNOR/A 0.00s J2 | TestSimpleExplanationsWithFillerDocs.testDMQ9
   [smoker]    [junit4]    > Assumption #1: 'slow' test group is disabled (@Slow())
   [smoker]    [junit4] IGNOR/A 0.00s J2 | TestSimpleExplanationsWithFillerDocs.testDMQ2
   [smoker]    [junit4]    > Assumption #1: 'slow' test group is disabled (@Slow())
   [smoker]    [junit4] IGNOR/A 0.00s J2 | TestSimpleExplanationsWithFillerDocs.testCSQ1
   [smoker]    [junit4]    > Assumption #1: 'slow' test group is disabled (@Slow())
   [smoker]    [junit4] IGNOR/A 0.02s J2 | TestSimpleExplanationsWithFillerDocs.testBQ17
   [smoker]    [junit4]    > Assumption #1: 'slow' test group is disabled (@Slow())
   [smoker]    [junit4] IGNOR/A 0.00s J2 | TestSimpleExplanationsWithFillerDocs.testMA1
   [smoker]    [junit4]    > Assumption #1: 'slow' test group is disabled (@Slow())
   [smoker]    [junit4] IGNOR/A 0.00s J2 | TestSimpleExplanationsWithFillerDocs.testMPQ4
   [smoker]    [junit4]    > Assumption #1: 'slow' test group is disabled (@Slow())
   [smoker]    [junit4] IGNOR/A 0.00s J2 | TestSimpleExplanationsWithFillerDocs.testMultiFieldBQofPQ4
   [smoker]    [junit4]    > Assumption #1: 'slow' test group is disabled (@Slow())
   [smoker]    [junit4] IGNOR/A 0.00s J2 | TestSimpleExplanationsWithFillerDocs.testBQ14
   [smoker]    [junit4]    > Assumption #1: 'slow' test group is disabled (@Slow())
   [smoker]    [junit4] IGNOR/A 0.00s J2 | TestSimpleExplanationsWithFillerDocs.testMultiFieldBQ2
   [smoker]    [junit4]    > Assumption #1: 'slow' test group is disabled (@Slow())
   [smoker]    [junit4] IGNOR/A 0.00s J2 | TestSimpleExplanationsWithFillerDocs.testBQ21
   [smoker]    [junit4]    > Assumption #1: 'slow' test group is disabled (@Slow())
   [smoker]    [junit4] IGNOR/A 0.00s J2 | TestSimpleExplanationsWithFillerDocs.testDMQ5
   [smoker]    [junit4]    > Assumption #1: 'slow' test group is disabled (@Slow())
   [smoker]    [junit4] IGNOR/A 0.00s J2 | TestSimpleExplanationsWithFillerDocs.testBQ25
   [smoker]    [junit4]    > Assumption #1: 'slow' test group is disabled (@Slow())
   [smoker]    [junit4] IGNOR/A 0.00s J2 | TestSimpleExplanationsWithFillerDocs.testBQ19
   [smoker]    [junit4]    > Assumption #1: 'slow' test group is disabled (@Slow())
   [smoker]    [junit4] IGNOR/A 0.00s J2 | TestSimpleExplanationsWithFillerDocs.testP5
   [smoker]    [junit4]    > Assumption #1: 'slow' test group is disabled (@Slow())
   [smoker]    [junit4] IGNOR/A 0.00s J2 | TestSimpleExplanationsWithFillerDocs.testMultiFieldBQofPQ3
   [smoker]    [junit4]    > Assumption #1: 'slow' test group is disabled (@Slow())
   [smoker]    [junit4] IGNOR/A 0.00s J2 | TestSimpleExplanationsWithFillerDocs.testMultiFieldBQ6
   [smoker]    [junit4]    > Assumption #1: 'slow' test group is disabled (@Slow())
   [smoker]    [junit4] IGNOR/A 0.00s J2 | TestSimpleExplanationsWithFillerDocs.testBQ11
   [smoker]    [junit4]    > Assumption #1: 'slow' test group is disabled (@Slow())
   [smoker]    [junit4] IGNOR/A 0.00s J2 | TestSimpleExplanationsWithFillerDocs.testMultiFieldBQ9
   [smoker]    [junit4]    > Assumption #1: 'slow' test group is disabled (@Slow())
   [smoker]    [junit4] IGNOR/A 0.00s J2 | TestSimpleExplanationsWithFillerDocs.testBQ1
   [smoker]    [junit4]    > Assumption #1: 'slow' test group is disabled (@Slow())
   [smoker]    [junit4] IGNOR/A 0.00s J2 | TestSimpleExplanationsWithFillerDocs.testMultiFieldBQ10
   [smoker]    [junit4]    > Assumption #1: 'slow' test group is disabled (@Slow())
   [smoker]    [junit4] IGNOR/A 0.00s J2 | TestSimpleExplanationsWithFillerDocs.testP1
   [smoker]    [junit4]    > Assumption #1: 'slow' test group is disabled (@Slow())
   [smoker]    [junit4] IGNOR/A 0.02s J2 | TestSimpleExplanationsWithFillerDocs.testCSQ3
   [smoker]    [junit4]    > Assumption #1: 'slow' test group is disabled (@Slow())
   [smoker]    [junit4] IGNOR/A 0.00s J2 | TestSimpleExplanationsWithFillerDocs.testMultiFieldBQofPQ1
   [smoker]    [junit4]    > Assumption #1: 'slow' test group is disabled (@Slow())
   [smoker]    [junit4] IGNOR/A 0.01s J2 | TestSimpleExplanationsWithFillerDocs.testDMQ6
   [smoker]    [junit4]    > Assumption #1: 'slow' test group is disabled (@Slow())
   [smoker]    [junit4] IGNOR/A 0.00s J2 | TestSimpleExplanationsWithFillerDocs.testMultiFieldBQ1
   [smoker]    [junit4]    > Assumption #1: 'slow' test group is disabled (@Slow())
   [smoker]    [junit4] IGNOR/A 0.00s J2 | TestSimpleExplanationsWithFillerDocs.testBQ24
   [smoker]    [junit4]    > Assumption #1: 'slow' test group is disabled (@Slow())
   [smoker]    [junit4] IGNOR/A 0.00s J2 | TestSimpleExplanationsWithFillerDocs.testDMQ8
   [smoker]    [junit4]    > Assumption #1: 'slow' test group is disabled (@Slow())
   [smoker]    [junit4] IGNOR/A 0.00s J2 | TestSimpleExplanationsWithFillerDocs.testP4
   [smoker]    [junit4]    > Assumption #1: 'slow' test group is disabled (@Slow())
   [smoker]    [junit4] IGNOR/A 0.00s J2 | TestSimpleExplanationsWithFillerDocs.testBQ3
   [smoker]    [junit4]    > Assumption #1: 'slow' test group is disabled (@Slow())
   [smoker]    [junit4] IGNOR/A 0.01s J2 | TestSimpleExplanationsWithFillerDocs.testMultiFieldBQ3
   [smoker]    [junit4]    > Assumption #1: 'slow' test group is disabled (@Slow())
   [smoker]    [junit4] IGNOR/A 0.00s J2 | TestSimpleExplanationsWithFillerDocs.testBQ6
   [smoker]    [junit4]    > Assumption #1: 'slow' test group is disabled (@Slow())
   [smoker]    [junit4] IGNOR/A 0.02s J2 | TestSimpleExplanationsWithFillerDocs.testBQ15
   [smoker]    [junit4]    > Assumption #1: 'slow' test group is disabled (@Slow())
   [smoker]    [junit4] IGNOR/A 0.00s J2 | TestSimpleExplanationsWithFillerDocs.testSynonymQuery
   [smoker]    [junit4]    > Assumption #1: 'slow' test group is disabled (@Slow())
   [smoker]    [junit4] IGNOR/A 0.00s J2 | TestSimpleExplanationsWithFillerDocs.testDMQ1
   [smoker]    [junit4]    > Assumption #1: 'slow' test group is disabled (@Slow())
   [smoker]    [junit4] IGNOR/A 0.00s J2 | TestSimpleExplanationsWithFillerDocs.testMultiFieldBQofPQ6
   [smoker]    [junit4]    > Assumption #1: 'slow' test group is disabled (@Slow())
   [smoker]    [junit4] IGNOR/A 0.00s J2 | TestSimpleExplanationsWithFillerDocs.testBQ9
   [smoker]    [junit4]    > Assumption #1: 'slow' test group is disabled (@Slow())
   [smoker]    [junit4] IGNOR/A 0.00s J2 | TestSimpleExplanationsWithFillerDocs.testP2
   [smoker]    [junit4]    > Assumption #1: 'slow' test group is disabled (@Slow())
   [smoker]    [junit4] IGNOR/A 0.00s J2 | TestSimpleExplanationsWithFillerDocs.testMPQ5
   [smoker]    [junit4]    > Assumption #1: 'slow' test group is disabled (@Slow())
   [smoker]    [junit4] IGNOR/A 0.00s J2 | TestSimpleExplanationsWithFillerDocs.testBQ8
   [smoker]    [junit4]    > Assumption #1: 'slow' test group is disabled (@Slow())
   [smoker]    [junit4] IGNOR/A 0.02s J2 | TestSimpleExplanationsWithFillerDocs.testBQ2
   [smoker]    [junit4]    > Assumption #1: 'slow' test group is disabled (@Slow())
   [smoker]    [junit4] IGNOR/A 0.00s J2 | TestSimpleExplanationsWithFillerDocs.testMPQ6
   [smoker]    [junit4]    > Assumption #1: 'slow' test group is disabled (@Slow())
   [smoker]    [junit4] IGNOR/A 0.00s J2 | TestSimpleExplanationsWithFillerDocs.testBQ7
   [smoker]    [junit4]    > Assumption #1: 'slow' test group is disabled (@Slow())
   [smoker]    [junit4] IGNOR/A 0.00s J2 | TestSimpleExplanationsWithFillerDocs.testBQ20
   [smoker]    [junit4]    > Assumption #1: 'slow' test group is disabled (@Slow())
   [smoker]    [junit4] IGNOR/A 0.00s J2 | TestSimpleExplanationsWithFillerDocs.testMPQ3
   [smoker]    [junit4]    > Assumption #1: 'slow' test group is disabled (@Slow())
   [smoker]    [junit4] IGNOR/A 0.00s J2 | TestSimpleExplanationsWithFillerDocs.testMultiFieldBQ5
   [smoker]    [junit4]    > Assumption #1: 'slow' test group is disabled (@Slow())
   [smoker]    [junit4] IGNOR/A 0.00s J2 | TestSimpleExplanationsWithFillerDocs.testMultiFieldBQ4
   [smoker]    [junit4]    > Assumption #1: 'slow' test group is disabled (@Slow())
   [smoker]    [junit4] IGNOR/A 0.02s J2 | TestSimpleExplanationsWithFillerDocs.testBQ5
   [smoker]    [junit4]    > Assumption #1: 'slow' test group is disabled (@Slow())
   [smoker]    [junit4] IGNOR/A 0.00s J2 | TestSimpleExplanationsWithFillerDocs.testP6
   [smoker]    [junit4]    > Assumption #1: 'slow' test group is disabled (@Slow())
   [smoker]    [junit4] IGNOR/A 0.14s J2 | TestSimpleExplanationsWithFillerDocs.testBQ4
   [smoker]    [junit4]    > Assumption #1: 'slow' test group is disabled (@Slow())
   [smoker]    [junit4] IGNOR/A 0.00s J2 | TestSimpleExplanationsWithFillerDocs.testMultiFieldBQ8
   [smoker]    [junit4]    > Assumption #1: 'slow' test group is disabled (@Slow())
   [smoker]    [junit4] IGNOR/A 0.00s J2 | TestSimpleExplanationsWithFillerDocs.testMPQ2
   [smoker]    [junit4]    > Assumption #1: 'slow' test group is disabled (@Slow())
   [smoker]    [junit4] IGNOR/A 0.00s J2 | TestSimpleExplanationsWithFillerDocs.testDMQ7
   [smoker]    [junit4]    > Assumption #1: 'slow' test group is disabled (@Slow())
   [smoker]    [junit4] IGNOR/A 0.00s J2 | TestSimpleExplanationsWithFillerDocs.testMultiFieldBQofPQ2
   [smoker]    [junit4]    > Assumption #1: 'slow' test group is disabled (@Slow())
   [smoker]    [junit4] IGNOR/A 0.14s J2 | TestSimpleExplanationsWithFillerDocs.testDMQ4
   [smoker]    [junit4]    > Assumption #1: 'slow' test group is disabled (@Slow())
   [smoker]    [junit4] IGNOR/A 0.00s J2 | TestSimpleExplanationsWithFillerDocs.testMPQ1
   [smoker]    [junit4]    > Assumption #1: 'slow' test group is disabled (@Slow())
   [smoker]    [junit4] IGNOR/A 0.00s J2 | TestSimpleExplanationsWithFillerDocs.testMultiFieldBQofPQ5
   [smoker]    [junit4]    > Assumption #1: 'slow' test group is disabled (@Slow())
   [smoker]    [junit4] IGNOR/A 0.00s J2 | TestSimpleExplanationsWithFillerDocs.testP3
   [smoker]    [junit4]    > Assumption #1: 'slow' test group is disabled (@Slow())
   [smoker]    [junit4] IGNOR/A 0.00s J2 | TestSimpleExplanationsWithFillerDocs.testBQ16
   [smoker]    [junit4]    > Assumption #1: 'slow' test group is disabled (@Slow())
   [smoker]    [junit4] IGNOR/A 0.00s J2 | TestSimpleExplanationsWithFillerDocs.testMultiFieldBQofPQ7
   [smoker]    [junit4]    > Assumption #1: 'slow' test group is disabled (@Slow())
   [smoker]    [junit4] IGNOR/A 0.00s J2 | TestSimpleExplanationsWithFillerDocs.testP7
   [smoker]    [junit4]    > Assumption #1: 'slow' test group is disabled (@Slow())
   [smoker]    [junit4] IGNOR/A 0.00s J2 | TestSimpleExplanationsWithFillerDocs.testBQ26
   [smoker]    [junit4]    > Assumption #1: 'slow' test group is disabled (@Slow())
   [smoker]    [junit4] IGNOR/A 0.00s J2 | TestSimpleExplanationsWithFillerDocs.testT1
   [smoker]    [junit4]    > Assumption #1: 'slow' test group is disabled (@Slow())
   [smoker]    [junit4] IGNOR/A 0.00s J2 | TestSimpleExplanationsWithFillerDocs.testEquality
   [smoker]    [junit4]    > Assumption #1: 'slow' test group is disabled (@Slow())
   [smoker]    [junit4] IGNOR/A 0.00s J2 | TestSimpleExplanationsWithFillerDocs.testMultiFieldBQ7
   [smoker]    [junit4]    > Assumption #1: 'slow' test group is disabled (@Slow())
   [smoker]    [junit4] IGNOR/A 0.00s J2 | TestSimpleExplanationsWithFillerDocs.testT2
   [smoker]    [junit4]    > Assumption #1: 'slow' test group is disabled (@Slow())
   [smoker]    [junit4] IGNOR/A 0.00s J2 | TestSimpleExplanationsWithFillerDocs.testDMQ3
   [smoker]    [junit4]    > Assumption #1: 'slow' test group is disabled (@Slow())
   [smoker]    [junit4] IGNOR/A 0.00s J2 | TestSimpleExplanationsWithFillerDocs.testCSQ2
   [smoker]    [junit4]    > Assumption #1: 'slow' test group is disabled (@Slow())
   [smoker]    [junit4] IGNOR/A 0.00s J2 | TestSimpleExplanationsWithFillerDocs.testBQ23
   [smoker]    [junit4]    > Assumption #1: 'slow' test group is disabled (@Slow())
   [smoker]    [junit4] IGNOR/A 0.00s J2 | TestSimpleExplanationsWithFillerDocs.testBQ10
   [smoker]    [junit4]    > Assumption #1: 'slow' test group is disabled (@Slow())
   [smoker]    [junit4] Completed [71/459] on J2 in 0.43s, 70 tests, 70 skipped
   [smoker]    [junit4] 
   [smoker]    [junit4] Suite: org.apache.lucene.index.TestInfoStream
   [smoker]    [junit4] Completed [72/459] on J2 in 0.32s, 2 tests
   [smoker]    [junit4] 
   [smoker]    [junit4] Suite: org.apache.lucene.util.automaton.TestUTF32ToUTF8
   [smoker]    [junit4] Completed [73/459] on J0 in 47.89s, 6 tests
   [smoker]    [junit4] 
   [smoker]    [junit4] Suite: org.apache.lucene.util.TestQueryBuilder
   [smoker]    [junit4] Completed [74/459] on J0 in 1.58s, 23 tests
   [smoker]    [junit4] 
   [smoker]    [junit4] Suite: org.apache.lucene.index.TestNoDeletionPolicy
   [smoker]    [junit4] Completed [75/459] on J0 in 0.98s, 4 tests
   [smoker]    [junit4] 
   [smoker]    [junit4] HEARTBEAT J1 PID(2117@localhost): 2018-02-01T07:07:57, stalled for  303s at: TestLucene70DocValuesFormat.testTermsEnumLongSharedPrefixes
   [smoker]    [junit4] Suite: org.apache.lucene.index.TestLongPostings
   [smoker]    [junit4] Completed [76/459] on J2 in 40.19s, 2 tests
   [smoker]    [junit4] 
   [smoker]    [junit4] Suite: org.apache.lucene.search.TestIntRangeFieldQueries
   [smoker]    [junit4] IGNOR/A 0.00s J2 | TestIntRangeFieldQueries.testRandomBig
   [smoker]    [junit4]    > Assumption #1: 'nightly' test group is disabled (@Nightly())
   [smoker]    [junit4] Completed [77/459] on J2 in 43.77s, 5 tests, 1 skipped
   [smoker]    [junit4] 
   [smoker]    [junit4] Suite: org.apache.lucene.search.similarities.TestSimilarityBase
   [smoker]    [junit4] Completed [78/459] on J2 in 3.97s, 31 tests
   [smoker]    [junit4] 
   [smoker]    [junit4] Suite: org.apache.lucene.index.TestNRTReaderWithThreads
   [smoker]    [junit4] Completed [79/459] on J2 in 3.47s, 1 test
   [smoker]    [junit4] 
   [smoker]    [junit4] HEARTBEAT J1 PID(2117@localhost): 2018-02-01T07:08:57, stalled for  364s at: TestLucene70DocValuesFormat.testTermsEnumLongSharedPrefixes
   [smoker]    [junit4] HEARTBEAT J0 PID(2119@localhost): 2018-02-01T07:09:20, stalled for 70.2s at: TestTermsEnum.testIntersectRandom
   [smoker]    [junit4] Suite: org.apache.lucene.index.TestTermsEnum
   [smoker]    [junit4] IGNOR/A 0.02s J0 | TestTermsEnum.testVaryingTermsPerSegment
   [smoker]    [junit4]    > Assumption #1: 'slow' test group is disabled (@Slow())
   [smoker]    [junit4] Completed [80/459] on J0 in 118.02s, 13 tests, 1 skipped
   [smoker]    [junit4] 
   [smoker]    [junit4] Suite: org.apache.lucene.index.TestCodecHoldsOpenFiles
   [smoker]    [junit4] Completed [81/459] on J0 in 1.33s, 1 test
   [smoker]    [junit4] 
   [smoker]    [junit4] Suite: org.apache.lucene.search.spans.TestBasics
   [smoker]    [junit4] Completed [82/459] on J2 in 39.05s, 27 tests
   [smoker]    [junit4] 
   [smoker]    [junit4] Suite: org.apache.lucene.search.TestLiveFieldValues
   [smoker]    [junit4] Completed [83/459] on J0 in 3.59s, 1 test
   [smoker]    [junit4] 
   [smoker]    [junit4] Suite: org.apache.lucene.store.TestRateLimiter
   [smoker]    [junit4] IGNOR/A 1.09s J0 | TestRateLimiter.testThreads
   [smoker]    [junit4]    > Assumption #1: actualMBPerSec=18.251715601571878 targetMBPerSec=23.666902045331923
   [smoker]    [junit4] Completed [84/459] on J0 in 1.31s, 2 tests, 1 skipped
   [smoker]    [junit4] 
   [smoker]    [junit4] Suite: org.apache.lucene.store.TestNativeFSLockFactory
   [smoker]    [junit4] Completed [85/459] on J2 in 89.41s, 11 tests
   [smoker]    [junit4] 
   [smoker]    [junit4] Suite: org.apache.lucene.util.TestSentinelIntSet
   [smoker]    [junit4] Completed [86/459] on J2 in 2.47s, 2 tests
   [smoker]    [junit4] 
   [smoker]    [junit4] Suite: org.apache.lucene.index.TestLazyProxSkipping
   [smoker]    [junit4] Completed [87/459] on J2 in 3.94s, 2 tests
   [smoker]    [junit4] 
   [smoker]    [junit4] Suite: org.apache.lucene.index.TestFieldReuse
   [smoker]    [junit4] Completed [88/459] on J2 in 0.22s, 2 tests
   [smoker]    [junit4] 
   [smoker]    [junit4] HEARTBEAT J0 PID(2119@localhost): 2018-02-01T07:11:09, stalled for 62.7s at: TestGeoUtils.testCircleOpto
   [smoker]    [junit4] Suite: org.apache.lucene.index.TestMixedCodecs
   [smoker]    [junit4] Completed [89/459] on J2 in 26.36s, 1 test
   [smoker]    [junit4] 
   [smoker]    [junit4] Suite: org.apache.lucene.geo.TestGeoUtils
   [smoker]    [junit4] Completed [90/459] on J0 in 136.21s, 7 tests
   [smoker]    [junit4] 
   [smoker]    [junit4] Suite: org.apache.lucene.index.TestDocsAndPositions
   [smoker]    [junit4] Completed [91/459] on J0 in 4.38s, 6 tests
   [smoker]    [junit4] 
   [smoker]    [junit4] Suite: org.apache.lucene.index.TestMergePolicyWrapper
   [smoker]    [junit4] Completed [92/459] on J0 in 0.20s, 1 test
   [smoker]    [junit4] 
   [smoker]    [junit4] Suite: org.apache.lucene.codecs.lucene70.TestLucene70SegmentInfoFormat
   [smoker]    [junit4] Completed [93/459] on J0 in 13.01s, 16 tests
   [smoker]    [junit4] 
   [smoker]    [junit4] Suite: org.apache.lucene.TestSearch
   [smoker]    [junit4] Completed [94/459] on J0 in 1.19s, 2 tests
   [smoker]    [junit4] 
   [smoker]    [junit4] Suite: org.apache.lucene.codecs.lucene50.TestLucene50TermVectorsFormat
   [smoker]    [junit4] IGNOR/A 0.00s J0 | TestLucene50TermVectorsFormat.testRamBytesUsed
   [smoker]    [junit4]    > Assumption #1: 'slow' test group is disabled (@Slow())
   [smoker]    [junit4] Completed [95/459] on J0 in 100.07s, 17 tests, 1 skipped
   [smoker]    [junit4] 
   [smoker]    [junit4] Suite: org.apache.lucene.index.TestDocIDMerger
   [smoker]    [junit4] Completed [96/459] on J0 in 0.43s, 2 tests
   [smoker]    [junit4] 
   [smoker]    [junit4] Suite: org.apache.lucene.index.TestIndexReaderClose
   [smoker]    [junit4] Completed [97/459] on J0 in 5.06s, 3 tests
   [smoker]    [junit4] 
   [smoker]    [junit4] Suite: org.apache.lucene.search.TestCachingCollector
   [smoker]    [junit4] Completed [98/459] on J0 in 0.46s, 4 tests
   [smoker]    [junit4] 
   [smoker]    [junit4] Suite: org.apache.lucene.index.TestCrashCausesCorruptIndex
   [smoker]    [junit4] Completed [99/459] on J0 in 1.15s, 1 test
   [smoker]    [junit4] 
   [smoker]    [junit4] Suite: org.apache.lucene.index.TestDirectoryReaderReopen
   [smoker]    [junit4] Completed [100/459] on J0 in 6.38s, 14 tests
   [smoker]    [junit4] 
   [smoker]    [junit4] Suite: org.apache.lucene.index.TestTermVectorsWriter
   [smoker]    [junit4] Completed [101/459] on J0 in 2.94s, 15 tests
   [smoker]    [junit4] 
   [smoker]    [junit4] Suite: org.apache.lucene.index.TestIsCurrent
   [smoker]    [junit4] Completed [102/459] on J0 in 0.33s, 2 tests
   [smoker]    [junit4] 
   [smoker]    [junit4] Suite: org.apache.lucene.index.TestNewestSegment
   [smoker]    [junit4] Completed [103/459] on J0 in 0.23s, 1 test
   [smoker]    [junit4] 
   [smoker]    [junit4] Suite: org.apache.lucene.index.TestNeverDelete
   [smoker]    [junit4] Completed [104/459] on J0 in 2.48s, 1 test
   [smoker]    [junit4] 
   [smoker]    [junit4] Suite: org.apache.lucene.codecs.lucene70.TestLucene70NormsFormat
   [smoker]    [junit4] IGNOR/A 0.00s J2 | TestLucene70NormsFormat.testMergeStability
   [smoker]    [junit4]    > Assumption #1: The MockRandom PF randomizes content on the fly, so we can't check it
   [smoker]    [junit4] IGNOR/A 0.00s J2 | TestLucene70NormsFormat.testRamBytesUsed
   [smoker]    [junit4]    > Assumption #1: 'slow' test group is disabled (@Slow())
   [smoker]    [junit4] IGNOR/A 0.00s J2 | TestLucene70NormsFormat.testSparseNCommonBig
   [smoker]    [junit4]    > Assumption #1: 'nightly' test group is disabled (@Nightly())
   [smoker]    [junit4] IGNOR/A 0.01s J2 | TestLucene70NormsFormat.testNCommonBig
   [smoker]    [junit4]    > Assumption #1: 'nightly' test group is disabled (@Nightly())
   [smoker]    [junit4] Completed [105/459] on J2 in 183.29s, 29 tests, 4 skipped
   [smoker]    [junit4] 
   [smoker]    [junit4] Suite: org.apache.lucene.index.TestUpgradeIndexMergePolicy
   [smoker]    [junit4] Completed [106/459] on J2 in 1.05s, 1 test
   [smoker]    [junit4] 
   [smoker]    [junit4] Suite: org.apache.lucene.TestSearchForDuplicates
   [smoker]    [junit4] Completed [107/459] on J2 in 0.48s, 1 test
   [smoker]    [junit4] 
   [smoker]    [junit4] Suite: org.apache.lucene.search.TestRegexpQuery
   [smoker]    [junit4] Completed [108/459] on J2 in 0.81s, 7 tests
   [smoker]    [junit4] 
   [smoker]    [junit4] Suite: org.apache.lucene.search.TestConjunctions
   [smoker]    [junit4] Completed [109/459] on J2 in 0.52s, 2 tests
   [smoker]    [junit4] 
   [smoker]    [junit4] Suite: org.apache.lucene.search.TestTermQuery
   [smoker]    [junit4] Completed [110/459] on J2 in 0.43s, 2 tests
   [smoker]    [junit4] 
   [smoker]    [junit4] Suite: org.apache.lucene.codecs.compressing.TestFastCompressionMode
   [smoker]    [junit4] Completed [111/459] on J2 in 14.78s, 11 tests
   [smoker]    [junit4] 
   [smoker]    [junit4] Suite: org.apache.lucene.codecs.lucene70.TestLucene70DocValuesFormat
   [smoker]    [junit4] IGNOR/A 0.00s J1 | TestLucene70DocValuesFormat.testSparseDocValuesVsStoredFields
   [smoker]    [junit4]    > Assumption #1: 'slow' test group is disabled (@Slow())
   [smoker]    [junit4] IGNOR/A 0.00s J1 | TestLucene70DocValuesFormat.testSortedSetVariableLengthManyVsStoredFields
   [smoker]    [junit4]    > Assumption #1: 'nightly' test group is disabled (@Nightly())
   [smoker]    [junit4] IGNOR/A 0.00s J1 | TestLucene70DocValuesFormat.testRamBytesUsed
   [smoker]    [junit4]    > Assumption #1: 'slow' test group is disabled (@Slow())
   [smoker]    [junit4] IGNOR/A 0.02s J1 | TestLucene70DocValuesFormat.testTermsEnumFixedWidth
   [smoker]    [junit4]    > Assumption #1: 'slow' test group is disabled (@Slow())
   [smoker]    [junit4] IGNOR/A 0.01s J1 | TestLucene70DocValuesFormat.testTermsEnumRandomMany
   [smoker]    [junit4]    > Assumption #1: 'nightly' test group is disabled (@Nightly())
   [smoker]    [junit4] IGNOR/A 0.00s J1 | TestLucene70DocValuesFormat.testSparseNumericBlocksOfVariousBitsPerValue
   [smoker]    [junit4]    > Assumption #1: 'slow' test group is disabled (@Slow())
   [smoker]    [junit4] IGNOR/A 0.00s J1 | TestLucene70DocValuesFormat.testSortedSetVariableLengthBigVsStoredFields
   [smoker]    [junit4]    > Assumption #1: 'slow' test group is disabled (@Slow())
   [smoker]    [junit4] IGNOR/A 0.00s J1 | TestLucene70DocValuesFormat.testSortedVariableLengthManyVsStoredFields
   [smoker]    [junit4]    > Assumption #1: 'nightly' test group is disabled (@Nightly())
   [smoker]    [junit4] IGNOR/A 0.00s J1 | TestLucene70DocValuesFormat.testSortedVariableLengthBigVsStoredFields
   [smoker]    [junit4]    > Assumption #1: 'slow' test group is disabled (@Slow())
   [smoker]    [junit4] IGNOR/A 0.00s J1 | TestLucene70DocValuesFormat.testSortedNumericBlocksOfVariousBitsPerValue
   [smoker]    [junit4]    > Assumption #1: 'slow' test group is disabled (@Slow())
   [smoker]    [junit4] IGNOR/A 0.00s J1 | TestLucene70DocValuesFormat.testThreads2
   [smoker]    [junit4]    > Assumption #1: 'slow' test group is disabled (@Slow())
   [smoker]    [junit4] IGNOR/A 0.00s J1 | TestLucene70DocValuesFormat.testNumericBlocksOfVariousBitsPerValue
   [smoker]    [junit4]    > Assumption #1: 'slow' test group is disabled (@Slow())
   [smoker]    [junit4] IGNOR/A 0.02s J1 | TestLucene70DocValuesFormat.testTermsEnumVariableWidth
   [smoker]    [junit4]    > Assumption #1: 'slow' test group is disabled (@Slow())
   [smoker]    [junit4] IGNOR/A 0.00s J1 | TestLucene70DocValuesFormat.testSortedNumericAroundBlockSize
   [smoker]    [junit4]    > Assumption #1: 'slow' test group is disabled (@Slow())
   [smoker]    [junit4] IGNOR/A 0.00s J1 | TestLucene70DocValuesFormat.testSparseSortedNumericBlocksOfVariousBitsPerValue
   [smoker]    [junit4]    > Assumption #1: 'slow' test group is disabled (@Slow())
   [smoker]    [junit4] IGNOR/A 0.00s J1 | TestLucene70DocValuesFormat.testThreads3
   [smoker]    [junit4]    > Assumption #1: 'slow' test group is disabled (@Slow())
   [smoker]    [junit4] IGNOR/A 0.00s J1 | TestLucene70DocValuesFormat.testSortedSetAroundBlockSize
   [smoker]    [junit4]    > Assumption #1: 'slow' test group is disabled (@Slow())
   [smoker]    [junit4] Completed [112/459] on J1 in 773.22s, 126 tests, 17 skipped
   [smoker]    [junit4] 
   [smoker]    [junit4] Suite: org.apache.lucene.search.TestDoubleValuesSource
   [smoker]    [junit4] Completed [113/459] on J0 in 50.07s, 6 tests
   [smoker]    [junit4] 
   [smoker]    [junit4] Suite: org.apache.lucene.util.automaton.TestCompiledAutomaton
   [smoker]    [junit4] Completed [114/459] on J2 in 5.12s, 6 tests
   [smoker]    [junit4] 
   [smoker]    [junit4] Suite: org.apache.lucene.index.TestIndexWriterLockRelease
   [smoker]    [junit4] Completed [115/459] on J2 in 0.23s, 1 test
   [smoker]    [junit4] 
   [smoker]    [junit4] Suite: org.apache.lucene.util.TestRamUsageEstimator
   [smoker]    [junit4] IGNOR/A 0.00s J2 | TestRamUsageEstimator.testPrintValues
   [smoker]    [junit4]    > Assumption #1: Specify -Dtests.verbose=true to print constants of RamUsageEstimator.
   [smoker]    [junit4] Completed [116/459] on J2 in 0.67s, 5 tests, 1 skipped
   [smoker]    [junit4] 
   [smoker]    [junit4] Suite: org.apache.lucene.search.TestIndexOrDocValuesQuery
   [smoker]    [junit4] Completed [117/459] on J0 in 2.84s, 1 test
   [smoker]    [junit4] 
   [smoker]    [junit4] Suite: org.apache.lucene.search.TestMatchNoDocsQuery
   [smoker]    [junit4] Completed [118/459] on J0 in 0.28s, 3 tests
   [smoker]    [junit4] 
   [smoker]    [junit4] Suite: org.apache.lucene.search.TestPositionIncrement
   [smoker]    [junit4] Completed [119/459] on J1 in 7.29s, 2 tests
   [smoker]    [junit4] 
   [smoker]    [junit4] Suite: org.apache.lucene.analysis.TestToken
   [smoker]    [junit4] Completed [120/459] on J1 in 0.43s, 5 tests
   [smoker]    [junit4] 
   [smoker]    [junit4] Suite: org.apache.lucene.util.TestCharsRefBuilder
   [smoker]    [junit4] Completed [121/459] on J1 in 0.45s, 2 tests
   [smoker]    [junit4] 
   [smoker]    [junit4] Suite: org.apache.lucene.index.TestSumDocFreq
   [smoker]    [junit4] Completed [122/459] on J1 in 3.42s, 1 test
   [smoker]    [junit4] 
   [smoker]    [junit4] Suite: org.apache.lucene.codecs.lucene50.TestLucene50StoredFieldsFormat
   [smoker]    [junit4] IGNOR/A 0.00s J1 | TestLucene50StoredFieldsFormat.testBigDocuments
   [smoker]    [junit4]    > Assumption #1: 'nightly' test group is disabled (@Nightly())
   [smoker]    [junit4] IGNOR/A 0.00s J1 | TestLucene50StoredFieldsFormat.testRamBytesUsed
   [smoker]    [junit4]    > Assumption #1: 'slow' test group is disabled (@Slow())
   [smoker]    [junit4] Completed [123/459] on J1 in 46.25s, 17 tests, 2 skipped
   [smoker]    [junit4] 
   [smoker]    [junit4] Suite: org.apache.lucene.codecs.lucene50.TestBlockPostingsFormat
   [smoker]    [junit4] IGNOR/A 0.00s J2 | TestBlockPostingsFormat.testRamBytesUsed
   [smoker]    [junit4]    > Assumption #1: 'slow' test group is disabled (@Slow())
   [smoker]    [junit4] Completed [124/459] on J2 in 57.04s, 27 tests, 1 skipped
   [smoker]    [junit4] 
   [smoker]    [junit4] Suite: org.apache.lucene.analysis.tokenattributes.TestCharTermAttributeImpl
   [smoker]    [junit4] Completed [125/459] on J2 in 8.38s, 13 tests
   [smoker]    [junit4] 
   [smoker]    [junit4] Suite: org.apache.lucene.TestMergeSchedulerExternal
   [smoker]    [junit4] Completed [126/459] on J1 in 13.97s, 2 tests
   [smoker]    [junit4] 
   [smoker]    [junit4] Suite: org.apache.lucene.util.TestVirtualMethod
   [smoker]    [junit4] Completed [127/459] on J1 in 0.25s, 2 tests
   [smoker]    [junit4] 
   [smoker]    [junit4] Suite: org.apache.lucene.search.TestMultiset
   [smoker]    [junit4] Completed [128/459] on J1 in 0.49s, 2 tests
   [smoker]    [junit4] 
   [smoker]    [junit4] Suite: org.apache.lucene.util.bkd.Test2BBKDPoints
   [smoker]    [junit4] IGNOR/A 0.00s J1 | Test2BBKDPoints.test1D
   [smoker]    [junit4]    > Assumption #1: 'monster' test group is disabled (@Monster(value=takes at least 4 hours and consumes many GB of temp disk space))
   [smoker]    [junit4] IGNOR/A 0.00s J1 | Test2BBKDPoints.test2D
   [smoker]    [junit4]    > Assumption #1: 'monster' test group is disabled (@Monster(value=takes at least 4 hours and consumes many GB of temp disk space))
   [smoker]    [junit4] Completed [129/459] on J1 in 0.01s, 2 tests, 2 skipped
   [smoker]    [junit4] 
   [smoker]    [junit4] HEARTBEAT J0 PID(2119@localhost): 2018-02-01T07:16:24, stalled for 68.5s at: TestStandardAnalyzer.testRandomHugeStringsGraphAfter
   [smoker]    [junit4] Suite: org.apache.lucene.index.TestIndexManyDocuments
   [smoker]    [junit4] Completed [130/459] on J2 in 20.09s, 1 test
   [smoker]    [junit4] 
   [smoker]    [junit4] Suite: org.apache.lucene.util.TestSloppyMath
   [smoker]    [junit4] Completed [131/459] on J1 in 24.30s, 8 tests
   [smoker]    [junit4] 
   [smoker]    [junit4] Suite: org.apache.lucene.index.TestParallelTermEnum
   [smoker]    [junit4] Completed [132/459] on J1 in 0.59s, 1 test
   [smoker]    [junit4] 
   [smoker]    [junit4] Suite: org.apache.lucene.index.TestTransactionRollback
   [smoker]    [junit4] Completed [133/459] on J1 in 3.07s, 2 tests
   [smoker]    [junit4] 
   [smoker]    [junit4] Suite: org.apache.lucene.codecs.compressing.TestHighCompressionMode
   [smoker]    [junit4] Completed [134/459] on J2 in 14.21s, 7 tests
   [smoker]    [junit4] 
   [smoker]    [junit4] Suite: org.apache.lucene.util.TestIntroSelector
   [smoker]    [junit4] Completed [135/459] on J2 in 12.42s, 2 tests
   [smoker]    [junit4] 
   [smoker]    [junit4] Suite: org.apache.lucene.index.TestAtomicUpdate
   [smoker]    [junit4] Completed [136/459] on J1 in 19.20s, 1 test
   [smoker]    [junit4] 
   [smoker]    [junit4] Suite: org.apache.lucene.search.TestPhrasePrefixQuery
   [smoker]    [junit4] Completed [137/459] on J1 in 0.17s, 1 test
   [smoker]    [junit4] 
   [smoker]    [junit4] Suite: org.apache.lucene.util.TestCloseableThreadLocal
   [smoker]    [junit4] Completed [138/459] on J1 in 0.44s, 3 tests
   [smoker]    [junit4] 
   [smoker]    [junit4] Suite: org.apache.lucene.document.TestFieldType
   [smoker]    [junit4] Completed [139/459] on J1 in 0.22s, 3 tests
   [smoker]    [junit4] 
   [smoker]    [junit4] Suite: org.apache.lucene.index.TestDocInverterPerFieldErrorInfo
   [smoker]    [junit4] Completed [140/459] on J1 in 0.66s, 2 tests
   [smoker]    [junit4] 
   [smoker]    [junit4] Suite: org.apache.lucene.analysis.standard.TestStandardAnalyzer
   [smoker]    [junit4] IGNOR/A 0.00s J0 | TestStandardAnalyzer.testLargePartiallyMatchingToken
   [smoker]    [junit4]    > Assumption #1: 'slow' test group is disabled (@Slow())
   [smoker]    [junit4] Completed [141/459] on J0 in 116.20s, 36 tests, 1 skipped
   [smoker]    [junit4] 
   [smoker]    [junit4] Suite: org.apache.lucene.search.spans.TestSpanOrQuery
   [smoker]    [junit4] Completed [142/459] on J0 in 0.27s, 3 tests
   [smoker]    [junit4] 
   [smoker]    [junit4] Suite: org.apache.lucene.search.TestMatchAllDocsQuery
   [smoker]    [junit4] Completed [143/459] on J0 in 0.32s, 2 tests
   [smoker]    [junit4] 
   [smoker]    [junit4] Suite: org.apache.lucene.index.Test2BPoints
   [smoker]    [junit4] IGNOR/A 0.00s J0 | Test2BPoints.test1D
   [smoker]    [junit4]    > Assumption #1: 'monster' test group is disabled (@Monster(value=takes at least 4 hours and consumes many GB of temp disk space))
   [smoker]    [junit4] IGNOR/A 0.00s J0 | Test2BPoints.test2D
   [smoker]    [junit4]    > Assumption #1: 'monster' test group is disabled (@Monster(value=takes at least 4 hours and consumes many GB of temp disk space))
   [smoker]    [junit4] Completed [144/459] on J0 in 0.02s, 2 tests, 2 skipped
   [smoker]    [junit4] 
   [smoker]    [junit4] Suite: org.apache.lucene.search.TestBlendedTermQuery
   [smoker]    [junit4] Completed [145/459] on J0 in 0.35s, 3 tests
   [smoker]    [junit4] 
   [smoker]    [junit4] Suite: org.apache.lucene.index.TestOmitTf
   [smoker]    [junit4] Completed [146/459] on J1 in 7.98s, 6 tests
   [smoker]    [junit4] 
   [smoker]    [junit4] Suite: org.apache.lucene.codecs.lucene50.TestLucene60FieldInfoFormat
   [smoker]    [junit4] Completed [147/459] on J1 in 11.26s, 11 tests
   [smoker]    [junit4] 
   [smoker]    [junit4] Suite: org.apache.lucene.TestDemo
   [smoker]    [junit4] Completed [148/459] on J1 in 0.41s, 1 test
   [smoker]    [junit4] 
   [smoker]    [junit4] Suite: org.apache.lucene.index.TestFlushByRamOrCountsPolicy
   [smoker]    [junit4] Completed [149/459] on J0 in 26.26s, 5 tests
   [smoker]    [junit4] 
   [smoker]    [junit4] Suite: org.apache.lucene.codecs.lucene50.TestBlockPostingsFormat3
   [smoker]    [junit4] Completed [150/459] on J1 in 30.79s, 1 test
   [smoker]    [junit4] 
   [smoker]    [junit4] Suite: org.apache.lucene.index.TestCustomTermFreq
   [smoker]    [junit4] Completed [151/459] on J1 in 0.97s, 12 tests
   [smoker]    [junit4] 
   [smoker]    [junit4] Suite: org.apache.lucene.index.TestIndexFileDeleter
   [smoker]    [junit4] Completed [152/459] on J1 in 10.49s, 10 tests
   [smoker]    [junit4] 
   [smoker]    [junit4] Suite: org.apache.lucene.search.TestBooleanMinShouldMatch
   [smoker]    [junit4] Completed [153/459] on J0 in 44.05s, 17 tests
   [smoker]    [junit4] 
   [smoker]    [junit4] Suite: org.apache.lucene.search.spans.TestFieldMaskingSpanQuery
   [smoker]    [junit4] IGNOR/A 0.00s J0 | TestFieldMaskingSpanQuery.testSimple2
   [smoker]    [junit4]    > Assumption #1: Broken scoring: LUCENE-3723
   [smoker]    [junit4] IGNOR/A 0.02s J0 | TestFieldMaskingSpanQuery.testSpans2
   [smoker]    [junit4]    > Assumption #1: Broken scoring: LUCENE-3723
   [smoker]    [junit4] Completed [154/459] on J0 in 3.82s, 11 tests, 2 skipped
   [smoker]    [junit4] 
   [smoker]    [junit4] Suite: org.apache.lucene.index.TestIndexInput
   [smoker]    [junit4] Completed [155/459] on J0 in 8.32s, 2 tests
   [smoker]    [junit4] 
   [smoker]    [junit4] Suite: org.apache.lucene.search.TestNGramPhraseQuery
   [smoker]    [junit4] Completed [156/459] on J0 in 0.23s, 1 test
   [smoker]    [junit4] 
   [smoker]    [junit4] Suite: org.apache.lucene.search.TestConstantScoreQuery
   [smoker]    [junit4] Completed [157/459] on J0 in 2.50s, 5 tests
   [smoker]    [junit4] 
   [smoker]    [junit4] Suite: org.apache.lucene.util.packed.TestPackedInts
   [smoker]    [junit4] IGNOR/A 0.00s J2 | TestPackedInts.testBlockReaderOverflow
   [smoker]    [junit4]    > Assumption #1: 'nightly' test group is disabled (@Nightly())
   [smoker]    [junit4] Completed [158/459] on J2 in 107.65s, 28 tests, 3 skipped
   [smoker]    [junit4] 
   [smoker]    [junit4] HEARTBEAT J1 PID(2117@localhost): 2018-02-01T07:19:13, stalled for 67.4s at: TestEarlyTerminatingSortingCollector.testEarlyTermination
   [smoker]    [junit4] Suite: org.apache.lucene.util.TestPagedBytes
   [smoker]    [junit4] Completed [159/459] on J0 in 54.24s, 4 tests, 1 skipped
   [smoker]    [junit4] 
   [smoker]    [junit4] Suite: org.apache.lucene.util.TestBytesRefArray
   [smoker]    [junit4] Completed [160/459] on J0 in 2.16s, 2 tests
   [smoker]    [junit4] 
   [smoker]    [junit4] Suite: org.apache.lucene.index.TestDocsWithFieldSet
   [smoker]    [junit4] Completed [161/459] on J0 in 0.33s, 3 tests
   [smoker]    [junit4] 
   [smoker]    [junit4] Suite: org.apache.lucene.index.TestDemoParallelLeafReader
   [smoker]    [junit4] Completed [162/459] on J2 in 65.04s, 5 tests
   [smoker]    [junit4] 
   [smoker]    [junit4] Suite: org.apache.lucene.store.TestTrackingDirectoryWrapper
   [smoker]    [junit4] IGNOR/A 0.00s J2 | TestTrackingDirectoryWrapper.testPendingDeletions
   [smoker]    [junit4]    > Assumption #1: we can only install VirusCheckingFS on an FSDirectory
   [smoker]    [junit4] IGNOR/A 0.01s J2 | TestTrackingDirectoryWrapper.testFsyncDoesntCreateNewFiles
   [smoker]    [junit4]    > Assumption #1: test only works for FSDirectory subclasses
   [smoker]    [junit4] Completed [163/459] on J2 in 8.41s, 47 tests, 2 skipped
   [smoker]    [junit4] 
   [smoker]    [junit4] Suite: org.apache.lucene.util.TestMSBRadixSorter
   [smoker]    [junit4] Completed [164/459] on J0 in 34.73s, 8 tests
   [smoker]    [junit4] 
   [smoker]    [junit4] Suite: org.apache.lucene.index.TestUniqueTermCount
   [smoker]    [junit4] Completed [165/459] on J0 in 0.47s, 1 test
   [smoker]    [junit4] 
   [smoker]    [junit4] Suite: org.apache.lucene.store.TestBufferedIndexInput
   [smoker]    [junit4] Completed [166/459] on J2 in 4.18s, 4 tests
   [smoker]    [junit4] 
   [smoker]    [junit4] Suite: org.apache.lucene.util.TestFrequencyTrackingRingBuffer
   [smoker]    [junit4] Completed [167/459] on J2 in 6.19s, 2 tests
   [smoker]    [junit4] 
   [smoker]    [junit4] Suite: org.apache.lucene.util.TestFixedBitDocIdSet
   [smoker]    [junit4] Completed [168/459] on J0 in 10.39s, 5 tests
   [smoker]    [junit4] 
   [smoker]    [junit4] Suite: org.apache.lucene.index.TestDocValuesIndexing
   [smoker]    [junit4] Completed [169/459] on J0 in 6.59s, 34 tests
   [smoker]    [junit4] 
   [smoker]    [junit4] Suite: org.apache.lucene.index.TestIndexWriterDeleteByQuery
   [smoker]    [junit4] Completed [170/459] on J0 in 0.32s, 1 test
   [smoker]    [junit4] 
   [smoker]    [junit4] Suite: org.apache.lucene.index.TestPerSegmentDeletes
   [smoker]    [junit4] Completed [171/459] on J0 in 0.56s, 1 test
   [smoker]    [junit4] 
   [smoker]    [junit4] Suite: org.apache.lucene.search.spans.TestSpanSearchEquivalence
   [smoker]    [junit4] Completed [172/459] on J2 in 33.08s, 33 tests
   [smoker]    [junit4] 
   [smoker]    [junit4] Suite: org.apache.lucene.search.TestTermRangeQuery
   [smoker]    [junit4] Completed [173/459] on J2 in 1.32s, 7 tests
   [smoker]    [junit4] 
   [smoker]    [junit4] Suite: org.apache.lucene.util.TestDocIdSetBuilder
   [smoker]    [junit4] Completed [174/459] on J2 in 24.14s, 7 tests
   [smoker]    [junit4] 
   [smoker]    [junit4] Suite: org.apache.lucene.search.similarities.TestSimilarity2
   [smoker]    [junit4] Completed [175/459] on J2 in 1.92s, 8 tests
   [smoker]    [junit4] 
   [smoker]    [junit4] Suite: org.apache.lucene.index.TestBinaryDocValuesUpdates
   [smoker]    [junit4] IGNOR/A 0.00s J0 | TestBinaryDocValuesUpdates.testTonsOfUpdates
   [smoker]    [junit4]    > Assumption #1: 'nightly' test group is disabled (@Nightly())
   [smoker]    [junit4] Completed [176/459] on J0 in 52.46s, 29 tests, 1 skipped
   [smoker]    [junit4] 
   [smoker]    [junit4] HEARTBEAT J1 PID(2117@localhost): 2018-02-01T07:21:13, stalled for 62.7s at: TestEarlyTerminatingSortingCollector.testTerminatedEarly
   [smoker]    [junit4] Suite: org.apache.lucene.util.packed.TestDirectPacked
   [smoker]    [junit4] Completed [177/459] on J2 in 12.16s, 4 tests
   [smoker]    [junit4] 
   [smoker]    [junit4] Suite: org.apache.lucene.search.TestSloppyPhraseQuery
   [smoker]    [junit4] Completed [178/459] on J0 in 13.68s, 9 tests
   [smoker]    [junit4] 
   [smoker]    [junit4] Suite: org.apache.lucene.search.TestEarlyTerminatingSortingCollector
   [smoker]    [junit4] Completed [179/459] on J1 in 200.16s, 4 tests
   [smoker]    [junit4] 
   [smoker]    [junit4] Suite: org.apache.lucene.store.TestSingleInstanceLockFactory
   [smoker]    [junit4] Completed [180/459] on J0 in 9.08s, 7 tests
   [smoker]    [junit4] 
   [smoker]    [junit4] Suite: org.apache.lucene.index.TestCheckIndex
   [smoker]    [junit4] Completed [181/459] on J1 in 11.96s, 4 tests
   [smoker]    [junit4] 
   [smoker]    [junit4] Suite: org.apache.lucene.index.TestForceMergeForever
   [smoker]    [junit4] Completed [182/459] on J0 in 7.87s, 1 test
   [smoker]    [junit4] 
   [smoker]    [junit4] Suite: org.apache.lucene.search.TestTotalHitCountCollector
   [smoker]    [junit4] Completed [183/459] on J0 in 0.17s, 1 test
   [smoker]    [junit4] 
   [smoker]    [junit4] Suite: org.apache.lucene.index.TestCrash
   [smoker]    [junit4] Completed [184/459] on J1 in 4.63s, 5 tests
   [smoker]    [junit4] 
   [smoker]    [junit4] Suite: org.apache.lucene.search.TestSimpleSearchEquivalence
   [smoker]    [junit4] Completed [185/459] on J0 in 11.96s, 17 tests
   [smoker]    [junit4] 
   [smoker]    [junit4] Suite: org.apache.lucene.index.TestExitableDirectoryReader
   [smoker]    [junit4] Completed [186/459] on J0 in 0.00s, 1 test, 1 skipped
   [smoker]    [junit4] 
   [smoker]    [junit4] Suite: org.apache.lucene.analysis.TestDelegatingAnalyzerWrapper
   [smoker]    [junit4] Completed [187/459] on J0 in 0.17s, 3 tests
   [smoker]    [junit4] 
   [smoker]    [junit4] Suite: org.apache.lucene.util.TestNamedSPILoader
   [smoker]    [junit4] Completed [188/459] on J0 in 0.29s, 3 tests
   [smoker]    [junit4] 
   [smoker]    [junit4] Suite: org.apache.lucene.store.TestSimpleFSLockFactory
   [smoker]    [junit4] Completed [189/459] on J2 in 57.69s, 7 tests
   [smoker]    [junit4] 
   [smoker]    [junit4] Suite: org.apache.lucene.index.TestTieredMergePolicy
   [smoker]    [junit4] Completed [190/459] on J1 in 45.22s, 6 tests
   [smoker]    [junit4] 
   [smoker]    [junit4] Suite: org.apache.lucene.index.TestNoMergeScheduler
   [smoker]    [junit4] Completed [191/459] on J1 in 0.16s, 3 tests
   [smoker]    [junit4] 
   [smoker]    [junit4] Suite: org.apache.lucene.index.TestParallelReaderEmptyIndex
   [smoker]    [junit4] Completed [192/459] on J1 in 0.46s, 2 tests
   [smoker]    [junit4] 
   [smoker]    [junit4] Suite: org.apache.lucene.index.TestParallelLeafReader
   [smoker]    [junit4] Completed [193/459] on J1 in 3.09s, 10 tests
   [smoker]    [junit4] 
   [smoker]    [junit4] Suite: org.apache.lucene.search.TestIndexSearcher
   [smoker]    [junit4] Completed [194/459] on J1 in 2.47s, 5 tests
   [smoker]    [junit4] 
   [smoker]    [junit4] Suite: org.apache.lucene.search.TestMultiTermConstantScore
   [smoker]    [junit4] Completed [195/459] on J1 in 7.48s, 7 tests
   [smoker]    [junit4] 
   [smoker]    [junit4] Suite: org.apache.lucene.index.TestIndexWriter
   [smoker]    [junit4] Completed [196/459] on J0 in 63.56s, 76 tests, 1 skipped
   [smoker]    [junit4] 
   [smoker]    [junit4] Suite: org.apache.lucene.codecs.lucene60.TestLucene60PointsFormat
   [smoker]    [junit4] IGNOR/A 0.05s J2 | TestLucene60PointsFormat.testMergeStability
   [smoker]    [junit4]    > Assumption #1: TODO: mess with the parameters and test gets angry!
   [smoker]    [junit4] IGNOR/A 0.00s J2 | TestLucene60PointsFormat.testRamBytesUsed
   [smoker]    [junit4]    > Assumption #1: 'slow' test group is disabled (@Slow())
   [smoker]    [junit4] IGNOR/A 0.00s J2 | TestLucene60PointsFormat.testRandomBinaryBig
   [smoker]    [junit4]    > Assumption #1: 'nightly' test group is disabled (@Nightly())
   [smoker]    [junit4] Completed [197/459] on J2 in 69.32s, 20 tests, 3 skipped
   [smoker]    [junit4] 
   [smoker]    [junit4] Suite: org.apache.lucene.util.TestByteBlockPool
   [smoker]    [junit4] Completed [198/459] on J2 in 0.95s, 2 tests
   [smoker]    [junit4] 
   [smoker]    [junit4] Suite: org.apache.lucene.search.spans.TestSpans
   [smoker]    [junit4] Completed [199/459] on J2 in 5.75s, 26 tests
   [smoker]    [junit4] 
   [smoker]    [junit4] Suite: org.apache.lucene.search.TestPointQueries
   [smoker]    [junit4] IGNOR/A 0.00s J1 | TestPointQueries.testRandomBinaryBig
   [smoker]    [junit4]    > Assumption #1: 'nightly' test group is disabled (@Nightly())
   [smoker]    [junit4] IGNOR/A 0.00s J1 | TestPointQueries.testRandomLongsBig
   [smoker]    [junit4]    > Assumption #1: 'nightly' test group is disabled (@Nightly())
   [smoker]    [junit4] Completed [200/459] on J1 in 101.46s, 49 tests, 2 skipped
   [smoker]    [junit4] 
   [smoker]    [junit4] Suite: org.apache.lucene.analysis.TestReusableStringReader
   [smoker]    [junit4] Completed [201/459] on J1 in 0.12s, 1 test
   [smoker]    [junit4] 
   [smoker]    [junit4] Suite: org.apache.lucene.codecs.lucene50.TestLucene50StoredFieldsFormatHighCompression
   [smoker]    [junit4] IGNOR/A 0.00s J2 | TestLucene50StoredFieldsFormatHighCompression.testRamBytesUsed
   [smoker]    [junit4]    > Assumption #1: 'slow' test group is disabled (@Slow())
   [smoker]    [junit4] IGNOR/A 0.00s J2 | TestLucene50StoredFieldsFormatHighCompression.testBigDocuments
   [smoker]    [junit4]    > Assumption #1: 'nightly' test group is disabled (@Nightly())
   [smoker]    [junit4] Completed [202/459] on J2 in 57.55s, 19 tests, 2 skipped
   [smoker]    [junit4] 
   [smoker]    [junit4] Suite: org.apache.lucene.store.TestRAMDirectory
   [smoker]    [junit4] IGNOR/A 0.00s J1 | TestRAMDirectory.testFsyncDoesntCreateNewFiles
   [smoker]    [junit4]    > Assumption #1: test only works for FSDirectory subclasses
   [smoker]    [junit4] IGNOR/A 0.04s J1 | TestRAMDirectory.testPendingDeletions
   [smoker]    [junit4]    > Assumption #1: we can only install VirusCheckingFS on an FSDirectory
   [smoker]    [junit4] Completed [203/459] on J1 in 10.79s, 46 tests, 2 skipped
   [smoker]    [junit4] 
   [smoker]    [junit4] Suite: org.apache.lucene.search.TestPhraseQuery
   [smoker

[...truncated too long message...]

test-stats/classification
   [smoker]    [junit4] <JUnit4> says ᐊᐃ! Master seed: 9416F094989F2A2A
   [smoker]    [junit4] Executing 11 suites with 3 JVMs.
   [smoker]    [junit4] 
   [smoker]    [junit4] Started J1 PID(20749@localhost).
   [smoker]    [junit4] Started J2 PID(20750@localhost).
   [smoker]    [junit4] Started J0 PID(20755@localhost).
   [smoker]    [junit4] Suite: org.apache.lucene.classification.document.KNearestNeighborDocumentClassifierTest
   [smoker]    [junit4] Completed [1/11] on J1 in 27.56s, 4 tests
   [smoker]    [junit4] 
   [smoker]    [junit4] Suite: org.apache.lucene.classification.utils.DocToDoubleVectorUtilsTest
   [smoker]    [junit4] Completed [2/11] on J1 in 5.06s, 2 tests
   [smoker]    [junit4] 
   [smoker]    [junit4] Suite: org.apache.lucene.classification.utils.ConfusionMatrixGeneratorTest
   [smoker]    [junit4] Completed [3/11] on J0 in 35.19s, 7 tests
   [smoker]    [junit4] 
   [smoker]    [junit4] HEARTBEAT J2 PID(20750@localhost): 2018-02-01T08:39:22, stalled for 71.0s at: CachingNaiveBayesClassifierTest.testPerformance
   [smoker]    [junit4] Suite: org.apache.lucene.classification.CachingNaiveBayesClassifierTest
   [smoker]    [junit4]   2> NOTE: reproduce with: ant test  -Dtestcase=CachingNaiveBayesClassifierTest -Dtests.method=testPerformance -Dtests.seed=9416F094989F2A2A -Dtests.multiplier=2 -Dtests.locale=ro -Dtests.timezone=Asia/Jerusalem -Dtests.asserts=true -Dtests.file.encoding=UTF-8
   [smoker]    [junit4] FAILURE 73.8s J2 | CachingNaiveBayesClassifierTest.testPerformance <<<
   [smoker]    [junit4]    > Throwable #1: java.lang.AssertionError: evaluation took more than 1m: 65s
   [smoker]    [junit4]    > 	at __randomizedtesting.SeedInfo.seed([9416F094989F2A2A:53F702B6F32B1285]:0)
   [smoker]    [junit4]    > 	at org.apache.lucene.classification.CachingNaiveBayesClassifierTest.testPerformance(CachingNaiveBayesClassifierTest.java:111)
   [smoker]    [junit4]    > 	at java.lang.Thread.run(Thread.java:748)
   [smoker]    [junit4]   2> NOTE: test params are: codec=Asserting(Lucene70): {bool=BlockTreeOrds(blocksize=128), cat=BlockTreeOrds(blocksize=128), text=PostingsFormat(name=Memory)}, docValues:{}, maxPointsInLeafNode=896, maxMBSortInHeap=7.551523209041403, sim=RandomSimilarity(queryNorm=false): {bool=DFR I(n)Z(0.3), cat=DFR I(n)BZ(0.3), text=DFR I(F)2}, locale=ro, timezone=Asia/Jerusalem
   [smoker]    [junit4]   2> NOTE: Linux 3.13.0-88-generic amd64/Oracle Corporation 1.8.0_144 (64-bit)/cpus=4,threads=1,free=207291576,total=340262912
   [smoker]    [junit4]   2> NOTE: All tests run in this JVM: [CachingNaiveBayesClassifierTest]
   [smoker]    [junit4] Completed [4/11 (1!)] on J2 in 91.00s, 4 tests, 1 failure <<< FAILURES!
   [smoker]    [junit4] 
   [smoker]    [junit4] HEARTBEAT J1 PID(20749@localhost): 2018-02-01T08:39:34, stalled for 64.4s at: SimpleNaiveBayesClassifierTest.testPerformance
   [smoker]    [junit4] Suite: org.apache.lucene.classification.document.SimpleNaiveBayesDocumentClassifierTest
   [smoker]    [junit4] Completed [5/11 (1!)] on J2 in 7.31s, 3 tests
   [smoker]    [junit4] 
   [smoker]    [junit4] Suite: org.apache.lucene.classification.KNearestNeighborClassifierTest
   [smoker]    [junit4] Completed [6/11 (1!)] on J2 in 14.60s, 5 tests
   [smoker]    [junit4] 
   [smoker]    [junit4] Suite: org.apache.lucene.classification.SimpleNaiveBayesClassifierTest
   [smoker]    [junit4] Completed [7/11 (1!)] on J1 in 89.21s, 4 tests
   [smoker]    [junit4] 
   [smoker]    [junit4] Suite: org.apache.lucene.classification.BooleanPerceptronClassifierTest
   [smoker]    [junit4]   2> NOTE: reproduce with: ant test  -Dtestcase=BooleanPerceptronClassifierTest -Dtests.method=testPerformance -Dtests.seed=9416F094989F2A2A -Dtests.multiplier=2 -Dtests.locale=es-GT -Dtests.timezone=Asia/Kuching -Dtests.asserts=true -Dtests.file.encoding=UTF-8
   [smoker]    [junit4] FAILURE 13.6s J1 | BooleanPerceptronClassifierTest.testPerformance <<<
   [smoker]    [junit4]    > Throwable #1: java.lang.AssertionError: training took more than 10s: 12s
   [smoker]    [junit4]    > 	at __randomizedtesting.SeedInfo.seed([9416F094989F2A2A:53F702B6F32B1285]:0)
   [smoker]    [junit4]    > 	at org.apache.lucene.classification.BooleanPerceptronClassifierTest.testPerformance(BooleanPerceptronClassifierTest.java:93)
   [smoker]    [junit4]    > 	at java.lang.Thread.run(Thread.java:748)
   [smoker]    [junit4]   2> NOTE: test params are: codec=Asserting(Lucene70): {bool=FST50, cat=FST50, text=FSTOrd50}, docValues:{}, maxPointsInLeafNode=2031, maxMBSortInHeap=5.887454642926567, sim=RandomSimilarity(queryNorm=false): {bool=IB LL-L3(800.0), cat=IB SPL-L2, text=DFR I(F)L2}, locale=es-GT, timezone=Asia/Kuching
   [smoker]    [junit4]   2> NOTE: Linux 3.13.0-88-generic amd64/Oracle Corporation 1.8.0_144 (64-bit)/cpus=4,threads=1,free=227123256,total=338690048
   [smoker]    [junit4]   2> NOTE: All tests run in this JVM: [KNearestNeighborDocumentClassifierTest, DocToDoubleVectorUtilsTest, SimpleNaiveBayesClassifierTest, BooleanPerceptronClassifierTest]
   [smoker]    [junit4] Completed [8/11 (2!)] on J1 in 18.57s, 4 tests, 1 failure <<< FAILURES!
   [smoker]    [junit4] 
   [smoker]    [junit4] Suite: org.apache.lucene.classification.KNearestFuzzyClassifierTest
   [smoker]    [junit4] Completed [9/11 (2!)] on J1 in 15.10s, 3 tests
   [smoker]    [junit4] 
   [smoker]    [junit4] Suite: org.apache.lucene.classification.utils.DataSplitterTest
   [smoker]    [junit4] Completed [10/11 (2!)] on J0 in 130.00s, 2 tests
   [smoker]    [junit4] 
   [smoker]    [junit4] Suite: org.apache.lucene.classification.BM25NBClassifierTest
   [smoker]    [junit4] Completed [11/11 (2!)] on J2 in 63.33s, 4 tests
   [smoker]    [junit4] 
   [smoker]    [junit4] 
   [smoker]    [junit4] Tests with failures [seed: 9416F094989F2A2A]:
   [smoker]    [junit4]   - org.apache.lucene.classification.CachingNaiveBayesClassifierTest.testPerformance
   [smoker]    [junit4]   - org.apache.lucene.classification.BooleanPerceptronClassifierTest.testPerformance
   [smoker]    [junit4] 
   [smoker]    [junit4] 
   [smoker]    [junit4] JVM J0:     6.20 ..   180.29 =   174.09s
   [smoker]    [junit4] JVM J1:     4.93 ..   166.68 =   161.75s
   [smoker]    [junit4] JVM J2:     5.94 ..   188.79 =   182.85s
   [smoker]    [junit4] Execution time total: 3 minutes 8 seconds
   [smoker]    [junit4] Tests summary: 11 suites, 42 tests, 2 failures
   [smoker] 
   [smoker] BUILD FAILED
   [smoker] /x1/jenkins/jenkins-slave/workspace/Lucene-Solr-SmokeRelease-7.x/lucene/build/smokeTestRelease/tmp/unpack/lucene-7.3.0/build.xml:495: The following error occurred while executing this line:
   [smoker] /x1/jenkins/jenkins-slave/workspace/Lucene-Solr-SmokeRelease-7.x/lucene/build/smokeTestRelease/tmp/unpack/lucene-7.3.0/common-build.xml:2281: The following error occurred while executing this line:
   [smoker] /x1/jenkins/jenkins-slave/workspace/Lucene-Solr-SmokeRelease-7.x/lucene/build/smokeTestRelease/tmp/unpack/lucene-7.3.0/module-build.xml:58: The following error occurred while executing this line:
   [smoker] /x1/jenkins/jenkins-slave/workspace/Lucene-Solr-SmokeRelease-7.x/lucene/build/smokeTestRelease/tmp/unpack/lucene-7.3.0/common-build.xml:1513: The following error occurred while executing this line:
   [smoker] /x1/jenkins/jenkins-slave/workspace/Lucene-Solr-SmokeRelease-7.x/lucene/build/smokeTestRelease/tmp/unpack/lucene-7.3.0/common-build.xml:1038: There were test failures: 11 suites, 42 tests, 2 failures [seed: 9416F094989F2A2A]
   [smoker] 
   [smoker] Total time: 106 minutes 33 seconds
   [smoker] 
   [smoker] 
   [smoker] Traceback (most recent call last):
   [smoker]   File "/x1/jenkins/jenkins-slave/workspace/Lucene-Solr-SmokeRelease-7.x/dev-tools/scripts/smokeTestRelease.py", line 1484, in <module>
   [smoker]     main()
   [smoker]   File "/x1/jenkins/jenkins-slave/workspace/Lucene-Solr-SmokeRelease-7.x/dev-tools/scripts/smokeTestRelease.py", line 1428, in main
   [smoker]     smokeTest(c.java, c.url, c.revision, c.version, c.tmp_dir, c.is_signed, ' '.join(c.test_args))
   [smoker]   File "/x1/jenkins/jenkins-slave/workspace/Lucene-Solr-SmokeRelease-7.x/dev-tools/scripts/smokeTestRelease.py", line 1466, in smokeTest
   [smoker]     unpackAndVerify(java, 'lucene', tmpDir, 'lucene-%s-src.tgz' % version, gitRevision, version, testArgs, baseURL)
   [smoker]   File "/x1/jenkins/jenkins-slave/workspace/Lucene-Solr-SmokeRelease-7.x/dev-tools/scripts/smokeTestRelease.py", line 622, in unpackAndVerify
   [smoker]     verifyUnpacked(java, project, artifact, unpackPath, gitRevision, version, testArgs, tmpDir, baseURL)
   [smoker]   File "/x1/jenkins/jenkins-slave/workspace/Lucene-Solr-SmokeRelease-7.x/dev-tools/scripts/smokeTestRelease.py", line 721, in verifyUnpacked
   [smoker]     java.run_java8('ant clean test %s' % testArgs, '%s/test.log' % unpackPath)
   [smoker]   File "/x1/jenkins/jenkins-slave/workspace/Lucene-Solr-SmokeRelease-7.x/dev-tools/scripts/smokeTestRelease.py", line 1233, in run_java
   [smoker]     run('%s; %s' % (cmd_prefix, cmd), logfile)
   [smoker]   File "/x1/jenkins/jenkins-slave/workspace/Lucene-Solr-SmokeRelease-7.x/dev-tools/scripts/smokeTestRelease.py", line 547, in run
   [smoker]     raise RuntimeError('command "%s" failed; see log file %s' % (command, logPath))
   [smoker] RuntimeError: command "export JAVA_HOME="/home/jenkins/tools/java/latest1.8" PATH="/home/jenkins/tools/java/latest1.8/bin:$PATH" JAVACMD="/home/jenkins/tools/java/latest1.8/bin/java"; ant clean test -Dtests.slow=false" failed; see log file /x1/jenkins/jenkins-slave/workspace/Lucene-Solr-SmokeRelease-7.x/lucene/build/smokeTestRelease/tmp/unpack/lucene-7.3.0/test.log

BUILD FAILED
/x1/jenkins/jenkins-slave/workspace/Lucene-Solr-SmokeRelease-7.x/build.xml:632: exec returned: 1

Total time: 150 minutes 55 seconds
Build step 'Invoke Ant' marked build as failure
Email was triggered for: Failure - Any
Sending email for trigger: Failure - Any

Mime
View raw message