lucene-dev mailing list archives

Site index · List index
Message view « Date » · « Thread »
Top « Date » · « Thread »
From Policeman Jenkins Server <jenk...@thetaphi.de>
Subject [JENKINS] Lucene-Solr-7.x-Linux (32bit/jdk1.8.0_144) - Build # 1270 - Still Unstable!
Date Thu, 01 Feb 2018 00:24:12 GMT
Build: https://jenkins.thetaphi.de/job/Lucene-Solr-7.x-Linux/1270/
Java: 32bit/jdk1.8.0_144 -client -XX:+UseG1GC

3 tests failed.
FAILED:  org.apache.solr.cloud.ReplaceNodeNoTargetTest.test

Error Message:


Stack Trace:
java.lang.AssertionError
	at __randomizedtesting.SeedInfo.seed([96E1DD2C3A0CCDED:1EB5E2F694F0A015]:0)
	at org.junit.Assert.fail(Assert.java:92)
	at org.junit.Assert.assertTrue(Assert.java:43)
	at org.junit.Assert.assertTrue(Assert.java:54)
	at org.apache.solr.cloud.ReplaceNodeNoTargetTest.test(ReplaceNodeNoTargetTest.java:92)
	at sun.reflect.NativeMethodAccessorImpl.invoke0(Native Method)
	at sun.reflect.NativeMethodAccessorImpl.invoke(NativeMethodAccessorImpl.java:62)
	at sun.reflect.DelegatingMethodAccessorImpl.invoke(DelegatingMethodAccessorImpl.java:43)
	at java.lang.reflect.Method.invoke(Method.java:498)
	at com.carrotsearch.randomizedtesting.RandomizedRunner.invoke(RandomizedRunner.java:1737)
	at com.carrotsearch.randomizedtesting.RandomizedRunner$8.evaluate(RandomizedRunner.java:934)
	at com.carrotsearch.randomizedtesting.RandomizedRunner$9.evaluate(RandomizedRunner.java:970)
	at com.carrotsearch.randomizedtesting.RandomizedRunner$10.evaluate(RandomizedRunner.java:984)
	at com.carrotsearch.randomizedtesting.rules.SystemPropertiesRestoreRule$1.evaluate(SystemPropertiesRestoreRule.java:57)
	at org.apache.lucene.util.TestRuleSetupTeardownChained$1.evaluate(TestRuleSetupTeardownChained.java:49)
	at org.apache.lucene.util.AbstractBeforeAfterRule$1.evaluate(AbstractBeforeAfterRule.java:45)
	at org.apache.lucene.util.TestRuleThreadAndTestName$1.evaluate(TestRuleThreadAndTestName.java:48)
	at org.apache.lucene.util.TestRuleIgnoreAfterMaxFailures$1.evaluate(TestRuleIgnoreAfterMaxFailures.java:64)
	at org.apache.lucene.util.TestRuleMarkFailure$1.evaluate(TestRuleMarkFailure.java:47)
	at com.carrotsearch.randomizedtesting.rules.StatementAdapter.evaluate(StatementAdapter.java:36)
	at com.carrotsearch.randomizedtesting.ThreadLeakControl$StatementRunner.run(ThreadLeakControl.java:368)
	at com.carrotsearch.randomizedtesting.ThreadLeakControl.forkTimeoutingTask(ThreadLeakControl.java:817)
	at com.carrotsearch.randomizedtesting.ThreadLeakControl$3.evaluate(ThreadLeakControl.java:468)
	at com.carrotsearch.randomizedtesting.RandomizedRunner.runSingleTest(RandomizedRunner.java:943)
	at com.carrotsearch.randomizedtesting.RandomizedRunner$5.evaluate(RandomizedRunner.java:829)
	at com.carrotsearch.randomizedtesting.RandomizedRunner$6.evaluate(RandomizedRunner.java:879)
	at com.carrotsearch.randomizedtesting.RandomizedRunner$7.evaluate(RandomizedRunner.java:890)
	at com.carrotsearch.randomizedtesting.rules.StatementAdapter.evaluate(StatementAdapter.java:36)
	at com.carrotsearch.randomizedtesting.rules.SystemPropertiesRestoreRule$1.evaluate(SystemPropertiesRestoreRule.java:57)
	at org.apache.lucene.util.AbstractBeforeAfterRule$1.evaluate(AbstractBeforeAfterRule.java:45)
	at com.carrotsearch.randomizedtesting.rules.StatementAdapter.evaluate(StatementAdapter.java:36)
	at org.apache.lucene.util.TestRuleStoreClassName$1.evaluate(TestRuleStoreClassName.java:41)
	at com.carrotsearch.randomizedtesting.rules.NoShadowingOrOverridesOnMethodsRule$1.evaluate(NoShadowingOrOverridesOnMethodsRule.java:40)
	at com.carrotsearch.randomizedtesting.rules.NoShadowingOrOverridesOnMethodsRule$1.evaluate(NoShadowingOrOverridesOnMethodsRule.java:40)
	at com.carrotsearch.randomizedtesting.rules.StatementAdapter.evaluate(StatementAdapter.java:36)
	at com.carrotsearch.randomizedtesting.rules.StatementAdapter.evaluate(StatementAdapter.java:36)
	at com.carrotsearch.randomizedtesting.rules.StatementAdapter.evaluate(StatementAdapter.java:36)
	at org.apache.lucene.util.TestRuleAssertionsRequired$1.evaluate(TestRuleAssertionsRequired.java:53)
	at org.apache.lucene.util.TestRuleMarkFailure$1.evaluate(TestRuleMarkFailure.java:47)
	at org.apache.lucene.util.TestRuleIgnoreAfterMaxFailures$1.evaluate(TestRuleIgnoreAfterMaxFailures.java:64)
	at org.apache.lucene.util.TestRuleIgnoreTestSuites$1.evaluate(TestRuleIgnoreTestSuites.java:54)
	at com.carrotsearch.randomizedtesting.rules.StatementAdapter.evaluate(StatementAdapter.java:36)
	at com.carrotsearch.randomizedtesting.ThreadLeakControl$StatementRunner.run(ThreadLeakControl.java:368)
	at java.lang.Thread.run(Thread.java:748)


FAILED:  org.apache.solr.cloud.autoscaling.TriggerIntegrationTest.testSetProperties

Error Message:
Expected 8 triggers but found: [x0, x1, x2, x3, x4, x5, x6] expected:<8> but was:<7>

Stack Trace:
java.lang.AssertionError: Expected 8 triggers but found: [x0, x1, x2, x3, x4, x5, x6] expected:<8> but was:<7>
	at __randomizedtesting.SeedInfo.seed([96E1DD2C3A0CCDED:FD850A6589215869]:0)
	at org.junit.Assert.fail(Assert.java:93)
	at org.junit.Assert.failNotEquals(Assert.java:647)
	at org.junit.Assert.assertEquals(Assert.java:128)
	at org.junit.Assert.assertEquals(Assert.java:472)
	at org.apache.solr.cloud.autoscaling.TriggerIntegrationTest.testSetProperties(TriggerIntegrationTest.java:1322)
	at sun.reflect.NativeMethodAccessorImpl.invoke0(Native Method)
	at sun.reflect.NativeMethodAccessorImpl.invoke(NativeMethodAccessorImpl.java:62)
	at sun.reflect.DelegatingMethodAccessorImpl.invoke(DelegatingMethodAccessorImpl.java:43)
	at java.lang.reflect.Method.invoke(Method.java:498)
	at com.carrotsearch.randomizedtesting.RandomizedRunner.invoke(RandomizedRunner.java:1737)
	at com.carrotsearch.randomizedtesting.RandomizedRunner$8.evaluate(RandomizedRunner.java:934)
	at com.carrotsearch.randomizedtesting.RandomizedRunner$9.evaluate(RandomizedRunner.java:970)
	at com.carrotsearch.randomizedtesting.RandomizedRunner$10.evaluate(RandomizedRunner.java:984)
	at com.carrotsearch.randomizedtesting.rules.SystemPropertiesRestoreRule$1.evaluate(SystemPropertiesRestoreRule.java:57)
	at org.apache.lucene.util.TestRuleSetupTeardownChained$1.evaluate(TestRuleSetupTeardownChained.java:49)
	at org.apache.lucene.util.AbstractBeforeAfterRule$1.evaluate(AbstractBeforeAfterRule.java:45)
	at org.apache.lucene.util.TestRuleThreadAndTestName$1.evaluate(TestRuleThreadAndTestName.java:48)
	at org.apache.lucene.util.TestRuleIgnoreAfterMaxFailures$1.evaluate(TestRuleIgnoreAfterMaxFailures.java:64)
	at org.apache.lucene.util.TestRuleMarkFailure$1.evaluate(TestRuleMarkFailure.java:47)
	at com.carrotsearch.randomizedtesting.rules.StatementAdapter.evaluate(StatementAdapter.java:36)
	at com.carrotsearch.randomizedtesting.ThreadLeakControl$StatementRunner.run(ThreadLeakControl.java:368)
	at com.carrotsearch.randomizedtesting.ThreadLeakControl.forkTimeoutingTask(ThreadLeakControl.java:817)
	at com.carrotsearch.randomizedtesting.ThreadLeakControl$3.evaluate(ThreadLeakControl.java:468)
	at com.carrotsearch.randomizedtesting.RandomizedRunner.runSingleTest(RandomizedRunner.java:943)
	at com.carrotsearch.randomizedtesting.RandomizedRunner$5.evaluate(RandomizedRunner.java:829)
	at com.carrotsearch.randomizedtesting.RandomizedRunner$6.evaluate(RandomizedRunner.java:879)
	at com.carrotsearch.randomizedtesting.RandomizedRunner$7.evaluate(RandomizedRunner.java:890)
	at com.carrotsearch.randomizedtesting.rules.StatementAdapter.evaluate(StatementAdapter.java:36)
	at com.carrotsearch.randomizedtesting.rules.SystemPropertiesRestoreRule$1.evaluate(SystemPropertiesRestoreRule.java:57)
	at org.apache.lucene.util.AbstractBeforeAfterRule$1.evaluate(AbstractBeforeAfterRule.java:45)
	at com.carrotsearch.randomizedtesting.rules.StatementAdapter.evaluate(StatementAdapter.java:36)
	at org.apache.lucene.util.TestRuleStoreClassName$1.evaluate(TestRuleStoreClassName.java:41)
	at com.carrotsearch.randomizedtesting.rules.NoShadowingOrOverridesOnMethodsRule$1.evaluate(NoShadowingOrOverridesOnMethodsRule.java:40)
	at com.carrotsearch.randomizedtesting.rules.NoShadowingOrOverridesOnMethodsRule$1.evaluate(NoShadowingOrOverridesOnMethodsRule.java:40)
	at com.carrotsearch.randomizedtesting.rules.StatementAdapter.evaluate(StatementAdapter.java:36)
	at com.carrotsearch.randomizedtesting.rules.StatementAdapter.evaluate(StatementAdapter.java:36)
	at com.carrotsearch.randomizedtesting.rules.StatementAdapter.evaluate(StatementAdapter.java:36)
	at org.apache.lucene.util.TestRuleAssertionsRequired$1.evaluate(TestRuleAssertionsRequired.java:53)
	at org.apache.lucene.util.TestRuleMarkFailure$1.evaluate(TestRuleMarkFailure.java:47)
	at org.apache.lucene.util.TestRuleIgnoreAfterMaxFailures$1.evaluate(TestRuleIgnoreAfterMaxFailures.java:64)
	at org.apache.lucene.util.TestRuleIgnoreTestSuites$1.evaluate(TestRuleIgnoreTestSuites.java:54)
	at com.carrotsearch.randomizedtesting.rules.StatementAdapter.evaluate(StatementAdapter.java:36)
	at com.carrotsearch.randomizedtesting.ThreadLeakControl$StatementRunner.run(ThreadLeakControl.java:368)
	at java.lang.Thread.run(Thread.java:748)


FAILED:  org.apache.solr.handler.admin.AutoscalingHistoryHandlerTest.testHistory

Error Message:
expected:<5> but was:<0>

Stack Trace:
java.lang.AssertionError: expected:<5> but was:<0>
	at __randomizedtesting.SeedInfo.seed([96E1DD2C3A0CCDED:FB1D79D1804432EA]:0)
	at org.junit.Assert.fail(Assert.java:93)
	at org.junit.Assert.failNotEquals(Assert.java:647)
	at org.junit.Assert.assertEquals(Assert.java:128)
	at org.junit.Assert.assertEquals(Assert.java:472)
	at org.junit.Assert.assertEquals(Assert.java:456)
	at org.apache.solr.handler.admin.AutoscalingHistoryHandlerTest.testHistory(AutoscalingHistoryHandlerTest.java:241)
	at sun.reflect.NativeMethodAccessorImpl.invoke0(Native Method)
	at sun.reflect.NativeMethodAccessorImpl.invoke(NativeMethodAccessorImpl.java:62)
	at sun.reflect.DelegatingMethodAccessorImpl.invoke(DelegatingMethodAccessorImpl.java:43)
	at java.lang.reflect.Method.invoke(Method.java:498)
	at com.carrotsearch.randomizedtesting.RandomizedRunner.invoke(RandomizedRunner.java:1737)
	at com.carrotsearch.randomizedtesting.RandomizedRunner$8.evaluate(RandomizedRunner.java:934)
	at com.carrotsearch.randomizedtesting.RandomizedRunner$9.evaluate(RandomizedRunner.java:970)
	at com.carrotsearch.randomizedtesting.RandomizedRunner$10.evaluate(RandomizedRunner.java:984)
	at com.carrotsearch.randomizedtesting.rules.SystemPropertiesRestoreRule$1.evaluate(SystemPropertiesRestoreRule.java:57)
	at org.apache.lucene.util.TestRuleSetupTeardownChained$1.evaluate(TestRuleSetupTeardownChained.java:49)
	at org.apache.lucene.util.AbstractBeforeAfterRule$1.evaluate(AbstractBeforeAfterRule.java:45)
	at org.apache.lucene.util.TestRuleThreadAndTestName$1.evaluate(TestRuleThreadAndTestName.java:48)
	at org.apache.lucene.util.TestRuleIgnoreAfterMaxFailures$1.evaluate(TestRuleIgnoreAfterMaxFailures.java:64)
	at org.apache.lucene.util.TestRuleMarkFailure$1.evaluate(TestRuleMarkFailure.java:47)
	at com.carrotsearch.randomizedtesting.rules.StatementAdapter.evaluate(StatementAdapter.java:36)
	at com.carrotsearch.randomizedtesting.ThreadLeakControl$StatementRunner.run(ThreadLeakControl.java:368)
	at com.carrotsearch.randomizedtesting.ThreadLeakControl.forkTimeoutingTask(ThreadLeakControl.java:817)
	at com.carrotsearch.randomizedtesting.ThreadLeakControl$3.evaluate(ThreadLeakControl.java:468)
	at com.carrotsearch.randomizedtesting.RandomizedRunner.runSingleTest(RandomizedRunner.java:943)
	at com.carrotsearch.randomizedtesting.RandomizedRunner$5.evaluate(RandomizedRunner.java:829)
	at com.carrotsearch.randomizedtesting.RandomizedRunner$6.evaluate(RandomizedRunner.java:879)
	at com.carrotsearch.randomizedtesting.RandomizedRunner$7.evaluate(RandomizedRunner.java:890)
	at com.carrotsearch.randomizedtesting.rules.StatementAdapter.evaluate(StatementAdapter.java:36)
	at com.carrotsearch.randomizedtesting.rules.SystemPropertiesRestoreRule$1.evaluate(SystemPropertiesRestoreRule.java:57)
	at org.apache.lucene.util.AbstractBeforeAfterRule$1.evaluate(AbstractBeforeAfterRule.java:45)
	at com.carrotsearch.randomizedtesting.rules.StatementAdapter.evaluate(StatementAdapter.java:36)
	at org.apache.lucene.util.TestRuleStoreClassName$1.evaluate(TestRuleStoreClassName.java:41)
	at com.carrotsearch.randomizedtesting.rules.NoShadowingOrOverridesOnMethodsRule$1.evaluate(NoShadowingOrOverridesOnMethodsRule.java:40)
	at com.carrotsearch.randomizedtesting.rules.NoShadowingOrOverridesOnMethodsRule$1.evaluate(NoShadowingOrOverridesOnMethodsRule.java:40)
	at com.carrotsearch.randomizedtesting.rules.StatementAdapter.evaluate(StatementAdapter.java:36)
	at com.carrotsearch.randomizedtesting.rules.StatementAdapter.evaluate(StatementAdapter.java:36)
	at com.carrotsearch.randomizedtesting.rules.StatementAdapter.evaluate(StatementAdapter.java:36)
	at org.apache.lucene.util.TestRuleAssertionsRequired$1.evaluate(TestRuleAssertionsRequired.java:53)
	at org.apache.lucene.util.TestRuleMarkFailure$1.evaluate(TestRuleMarkFailure.java:47)
	at org.apache.lucene.util.TestRuleIgnoreAfterMaxFailures$1.evaluate(TestRuleIgnoreAfterMaxFailures.java:64)
	at org.apache.lucene.util.TestRuleIgnoreTestSuites$1.evaluate(TestRuleIgnoreTestSuites.java:54)
	at com.carrotsearch.randomizedtesting.rules.StatementAdapter.evaluate(StatementAdapter.java:36)
	at com.carrotsearch.randomizedtesting.ThreadLeakControl$StatementRunner.run(ThreadLeakControl.java:368)
	at java.lang.Thread.run(Thread.java:748)




Build Log:
[...truncated 12638 lines...]
   [junit4] Suite: org.apache.solr.cloud.ReplaceNodeNoTargetTest
   [junit4]   2> 1124116 INFO  (SUITE-ReplaceNodeNoTargetTest-seed#[96E1DD2C3A0CCDED]-worker) [    ] o.a.s.SolrTestCaseJ4 SecureRandom sanity checks: test.solr.allowed.securerandom=null & java.security.egd=file:/dev/./urandom
   [junit4]   2> Creating dataDir: /home/jenkins/workspace/Lucene-Solr-7.x-Linux/solr/build/solr-core/test/J1/temp/solr.cloud.ReplaceNodeNoTargetTest_96E1DD2C3A0CCDED-001/init-core-data-001
   [junit4]   2> 1124117 WARN  (SUITE-ReplaceNodeNoTargetTest-seed#[96E1DD2C3A0CCDED]-worker) [    ] o.a.s.SolrTestCaseJ4 startTrackingSearchers: numOpens=1 numCloses=1
   [junit4]   2> 1124118 INFO  (SUITE-ReplaceNodeNoTargetTest-seed#[96E1DD2C3A0CCDED]-worker) [    ] o.a.s.SolrTestCaseJ4 Using PointFields (NUMERIC_POINTS_SYSPROP=true) w/NUMERIC_DOCVALUES_SYSPROP=true
   [junit4]   2> 1124120 INFO  (SUITE-ReplaceNodeNoTargetTest-seed#[96E1DD2C3A0CCDED]-worker) [    ] o.a.s.SolrTestCaseJ4 Randomized ssl (true) and clientAuth (false) via: @org.apache.solr.util.RandomizeSSL(reason=, ssl=NaN, value=NaN, clientAuth=NaN)
   [junit4]   2> 1124121 INFO  (SUITE-ReplaceNodeNoTargetTest-seed#[96E1DD2C3A0CCDED]-worker) [    ] o.a.s.c.MiniSolrCloudCluster Starting cluster of 6 servers in /home/jenkins/workspace/Lucene-Solr-7.x-Linux/solr/build/solr-core/test/J1/temp/solr.cloud.ReplaceNodeNoTargetTest_96E1DD2C3A0CCDED-001/tempDir-001
   [junit4]   2> 1124121 INFO  (SUITE-ReplaceNodeNoTargetTest-seed#[96E1DD2C3A0CCDED]-worker) [    ] o.a.s.c.ZkTestServer STARTING ZK TEST SERVER
   [junit4]   2> 1124121 INFO  (Thread-3071) [    ] o.a.s.c.ZkTestServer client port:0.0.0.0/0.0.0.0:0
   [junit4]   2> 1124121 INFO  (Thread-3071) [    ] o.a.s.c.ZkTestServer Starting server
   [junit4]   2> 1124123 ERROR (Thread-3071) [    ] o.a.z.s.ZooKeeperServer ZKShutdownHandler is not registered, so ZooKeeper server won't take any action on ERROR or SHUTDOWN server state changes
   [junit4]   2> 1124221 INFO  (SUITE-ReplaceNodeNoTargetTest-seed#[96E1DD2C3A0CCDED]-worker) [    ] o.a.s.c.ZkTestServer start zk server on port:45523
   [junit4]   2> 1124223 INFO  (zkConnectionManagerCallback-1719-thread-1) [    ] o.a.s.c.c.ConnectionManager zkClient has connected
   [junit4]   2> 1124226 WARN  (NIOServerCxn.Factory:0.0.0.0/0.0.0.0:0) [    ] o.a.z.s.NIOServerCnxn Unable to read additional data from client sessionid 0x1000c2a66730000, likely client has closed socket
   [junit4]   2> 1124231 INFO  (jetty-launcher-1716-thread-4) [    ] o.e.j.s.Server jetty-9.4.8.v20171121, build timestamp: 2017-11-22T03:27:37+06:00, git hash: 82b8fb23f757335bb3329d540ce37a2a2615f0a8
   [junit4]   2> 1124231 INFO  (jetty-launcher-1716-thread-5) [    ] o.e.j.s.Server jetty-9.4.8.v20171121, build timestamp: 2017-11-22T03:27:37+06:00, git hash: 82b8fb23f757335bb3329d540ce37a2a2615f0a8
   [junit4]   2> 1124231 INFO  (jetty-launcher-1716-thread-6) [    ] o.e.j.s.Server jetty-9.4.8.v20171121, build timestamp: 2017-11-22T03:27:37+06:00, git hash: 82b8fb23f757335bb3329d540ce37a2a2615f0a8
   [junit4]   2> 1124233 INFO  (jetty-launcher-1716-thread-1) [    ] o.e.j.s.Server jetty-9.4.8.v20171121, build timestamp: 2017-11-22T03:27:37+06:00, git hash: 82b8fb23f757335bb3329d540ce37a2a2615f0a8
   [junit4]   2> 1124235 INFO  (jetty-launcher-1716-thread-2) [    ] o.e.j.s.Server jetty-9.4.8.v20171121, build timestamp: 2017-11-22T03:27:37+06:00, git hash: 82b8fb23f757335bb3329d540ce37a2a2615f0a8
   [junit4]   2> 1124235 INFO  (jetty-launcher-1716-thread-3) [    ] o.e.j.s.Server jetty-9.4.8.v20171121, build timestamp: 2017-11-22T03:27:37+06:00, git hash: 82b8fb23f757335bb3329d540ce37a2a2615f0a8
   [junit4]   2> 1124238 INFO  (jetty-launcher-1716-thread-4) [    ] o.e.j.s.session DefaultSessionIdManager workerName=node0
   [junit4]   2> 1124238 INFO  (jetty-launcher-1716-thread-5) [    ] o.e.j.s.session DefaultSessionIdManager workerName=node0
   [junit4]   2> 1124238 INFO  (jetty-launcher-1716-thread-4) [    ] o.e.j.s.session No SessionScavenger set, using defaults
   [junit4]   2> 1124238 INFO  (jetty-launcher-1716-thread-2) [    ] o.e.j.s.session DefaultSessionIdManager workerName=node0
   [junit4]   2> 1124238 INFO  (jetty-launcher-1716-thread-5) [    ] o.e.j.s.session No SessionScavenger set, using defaults
   [junit4]   2> 1124238 INFO  (jetty-launcher-1716-thread-5) [    ] o.e.j.s.session Scavenging every 660000ms
   [junit4]   2> 1124238 INFO  (jetty-launcher-1716-thread-4) [    ] o.e.j.s.session Scavenging every 660000ms
   [junit4]   2> 1124238 INFO  (jetty-launcher-1716-thread-6) [    ] o.e.j.s.session DefaultSessionIdManager workerName=node0
   [junit4]   2> 1124238 INFO  (jetty-launcher-1716-thread-2) [    ] o.e.j.s.session No SessionScavenger set, using defaults
   [junit4]   2> 1124238 INFO  (jetty-launcher-1716-thread-1) [    ] o.e.j.s.session DefaultSessionIdManager workerName=node0
   [junit4]   2> 1124238 INFO  (jetty-launcher-1716-thread-1) [    ] o.e.j.s.session No SessionScavenger set, using defaults
   [junit4]   2> 1124238 INFO  (jetty-launcher-1716-thread-1) [    ] o.e.j.s.session Scavenging every 660000ms
   [junit4]   2> 1124238 INFO  (jetty-launcher-1716-thread-6) [    ] o.e.j.s.session No SessionScavenger set, using defaults
   [junit4]   2> 1124238 INFO  (jetty-launcher-1716-thread-2) [    ] o.e.j.s.session Scavenging every 660000ms
   [junit4]   2> 1124238 INFO  (jetty-launcher-1716-thread-6) [    ] o.e.j.s.session Scavenging every 660000ms
   [junit4]   2> 1124239 INFO  (jetty-launcher-1716-thread-3) [    ] o.e.j.s.session DefaultSessionIdManager workerName=node0
   [junit4]   2> 1124239 INFO  (jetty-launcher-1716-thread-3) [    ] o.e.j.s.session No SessionScavenger set, using defaults
   [junit4]   2> 1124239 INFO  (jetty-launcher-1716-thread-3) [    ] o.e.j.s.session Scavenging every 600000ms
   [junit4]   2> 1124239 INFO  (jetty-launcher-1716-thread-4) [    ] o.e.j.s.h.ContextHandler Started o.e.j.s.ServletContextHandler@2456b2{/solr,null,AVAILABLE}
   [junit4]   2> 1124239 INFO  (jetty-launcher-1716-thread-3) [    ] o.e.j.s.h.ContextHandler Started o.e.j.s.ServletContextHandler@c4428c{/solr,null,AVAILABLE}
   [junit4]   2> 1124240 INFO  (jetty-launcher-1716-thread-5) [    ] o.e.j.s.h.ContextHandler Started o.e.j.s.ServletContextHandler@127d7ae{/solr,null,AVAILABLE}
   [junit4]   2> 1124240 INFO  (jetty-launcher-1716-thread-6) [    ] o.e.j.s.h.ContextHandler Started o.e.j.s.ServletContextHandler@1bfb564{/solr,null,AVAILABLE}
   [junit4]   2> 1124240 INFO  (jetty-launcher-1716-thread-1) [    ] o.e.j.s.h.ContextHandler Started o.e.j.s.ServletContextHandler@1602d24{/solr,null,AVAILABLE}
   [junit4]   2> 1124241 INFO  (jetty-launcher-1716-thread-2) [    ] o.e.j.s.h.ContextHandler Started o.e.j.s.ServletContextHandler@17d583a{/solr,null,AVAILABLE}
   [junit4]   2> 1124242 INFO  (jetty-launcher-1716-thread-6) [    ] o.e.j.s.AbstractConnector Started ServerConnector@13e73bc{SSL,[ssl, http/1.1]}{127.0.0.1:44971}
   [junit4]   2> 1124242 INFO  (jetty-launcher-1716-thread-4) [    ] o.e.j.s.AbstractConnector Started ServerConnector@1dcb567{SSL,[ssl, http/1.1]}{127.0.0.1:46399}
   [junit4]   2> 1124242 INFO  (jetty-launcher-1716-thread-6) [    ] o.e.j.s.Server Started @1126459ms
   [junit4]   2> 1124242 INFO  (jetty-launcher-1716-thread-4) [    ] o.e.j.s.Server Started @1126459ms
   [junit4]   2> 1124242 INFO  (jetty-launcher-1716-thread-6) [    ] o.a.s.c.s.e.JettySolrRunner Jetty properties: {hostContext=/solr, hostPort=44971}
   [junit4]   2> 1124242 INFO  (jetty-launcher-1716-thread-4) [    ] o.a.s.c.s.e.JettySolrRunner Jetty properties: {hostContext=/solr, hostPort=46399}
   [junit4]   2> 1124242 ERROR (jetty-launcher-1716-thread-6) [    ] o.a.s.u.StartupLoggingUtils Missing Java Option solr.log.dir. Logging may be missing or incomplete.
   [junit4]   2> 1124242 ERROR (jetty-launcher-1716-thread-4) [    ] o.a.s.u.StartupLoggingUtils Missing Java Option solr.log.dir. Logging may be missing or incomplete.
   [junit4]   2> 1124242 INFO  (jetty-launcher-1716-thread-6) [    ] o.a.s.s.SolrDispatchFilter  ___      _       Welcome to Apache Solr? version 7.3.0
   [junit4]   2> 1124242 INFO  (jetty-launcher-1716-thread-4) [    ] o.a.s.s.SolrDispatchFilter  ___      _       Welcome to Apache Solr? version 7.3.0
   [junit4]   2> 1124242 INFO  (jetty-launcher-1716-thread-6) [    ] o.a.s.s.SolrDispatchFilter / __| ___| |_ _   Starting in cloud mode on port null
   [junit4]   2> 1124242 INFO  (jetty-launcher-1716-thread-4) [    ] o.a.s.s.SolrDispatchFilter / __| ___| |_ _   Starting in cloud mode on port null
   [junit4]   2> 1124242 INFO  (jetty-launcher-1716-thread-6) [    ] o.a.s.s.SolrDispatchFilter \__ \/ _ \ | '_|  Install dir: null
   [junit4]   2> 1124242 INFO  (jetty-launcher-1716-thread-4) [    ] o.a.s.s.SolrDispatchFilter \__ \/ _ \ | '_|  Install dir: null
   [junit4]   2> 1124242 INFO  (jetty-launcher-1716-thread-6) [    ] o.a.s.s.SolrDispatchFilter |___/\___/_|_|    Start time: 2018-01-31T23:22:25.014Z
   [junit4]   2> 1124242 INFO  (jetty-launcher-1716-thread-4) [    ] o.a.s.s.SolrDispatchFilter |___/\___/_|_|    Start time: 2018-01-31T23:22:25.014Z
   [junit4]   2> 1124243 INFO  (jetty-launcher-1716-thread-3) [    ] o.e.j.s.AbstractConnector Started ServerConnector@176fefd{SSL,[ssl, http/1.1]}{127.0.0.1:46505}
   [junit4]   2> 1124243 INFO  (jetty-launcher-1716-thread-3) [    ] o.e.j.s.Server Started @1126460ms
   [junit4]   2> 1124243 INFO  (jetty-launcher-1716-thread-3) [    ] o.a.s.c.s.e.JettySolrRunner Jetty properties: {hostContext=/solr, hostPort=46505}
   [junit4]   2> 1124243 ERROR (jetty-launcher-1716-thread-3) [    ] o.a.s.u.StartupLoggingUtils Missing Java Option solr.log.dir. Logging may be missing or incomplete.
   [junit4]   2> 1124243 INFO  (jetty-launcher-1716-thread-3) [    ] o.a.s.s.SolrDispatchFilter  ___      _       Welcome to Apache Solr? version 7.3.0
   [junit4]   2> 1124243 INFO  (jetty-launcher-1716-thread-3) [    ] o.a.s.s.SolrDispatchFilter / __| ___| |_ _   Starting in cloud mode on port null
   [junit4]   2> 1124244 INFO  (jetty-launcher-1716-thread-3) [    ] o.a.s.s.SolrDispatchFilter \__ \/ _ \ | '_|  Install dir: null
   [junit4]   2> 1124244 INFO  (jetty-launcher-1716-thread-3) [    ] o.a.s.s.SolrDispatchFilter |___/\___/_|_|    Start time: 2018-01-31T23:22:25.016Z
   [junit4]   2> 1124244 INFO  (zkConnectionManagerCallback-1721-thread-1) [    ] o.a.s.c.c.ConnectionManager zkClient has connected
   [junit4]   2> 1124244 INFO  (jetty-launcher-1716-thread-6) [    ] o.a.s.s.SolrDispatchFilter solr.xml found in ZooKeeper. Loading...
   [junit4]   2> 1124245 INFO  (zkConnectionManagerCallback-1725-thread-1) [    ] o.a.s.c.c.ConnectionManager zkClient has connected
   [junit4]   2> 1124245 INFO  (zkConnectionManagerCallback-1723-thread-1) [    ] o.a.s.c.c.ConnectionManager zkClient has connected
   [junit4]   2> 1124245 INFO  (jetty-launcher-1716-thread-3) [    ] o.a.s.s.SolrDispatchFilter solr.xml found in ZooKeeper. Loading...
   [junit4]   2> 1124246 INFO  (jetty-launcher-1716-thread-4) [    ] o.a.s.s.SolrDispatchFilter solr.xml found in ZooKeeper. Loading...
   [junit4]   2> 1124246 INFO  (jetty-launcher-1716-thread-1) [    ] o.e.j.s.AbstractConnector Started ServerConnector@1b2f302{SSL,[ssl, http/1.1]}{127.0.0.1:44369}
   [junit4]   2> 1124246 INFO  (jetty-launcher-1716-thread-1) [    ] o.e.j.s.Server Started @1126464ms
   [junit4]   2> 1124246 INFO  (jetty-launcher-1716-thread-1) [    ] o.a.s.c.s.e.JettySolrRunner Jetty properties: {hostContext=/solr, hostPort=44369}
   [junit4]   2> 1124247 ERROR (jetty-launcher-1716-thread-1) [    ] o.a.s.u.StartupLoggingUtils Missing Java Option solr.log.dir. Logging may be missing or incomplete.
   [junit4]   2> 1124247 INFO  (jetty-launcher-1716-thread-1) [    ] o.a.s.s.SolrDispatchFilter  ___      _       Welcome to Apache Solr? version 7.3.0
   [junit4]   2> 1124247 INFO  (jetty-launcher-1716-thread-1) [    ] o.a.s.s.SolrDispatchFilter / __| ___| |_ _   Starting in cloud mode on port null
   [junit4]   2> 1124247 INFO  (jetty-launcher-1716-thread-1) [    ] o.a.s.s.SolrDispatchFilter \__ \/ _ \ | '_|  Install dir: null
   [junit4]   2> 1124247 INFO  (jetty-launcher-1716-thread-1) [    ] o.a.s.s.SolrDispatchFilter |___/\___/_|_|    Start time: 2018-01-31T23:22:25.019Z
   [junit4]   2> 1124247 INFO  (jetty-launcher-1716-thread-5) [    ] o.e.j.s.AbstractConnector Started ServerConnector@90d7a{SSL,[ssl, http/1.1]}{127.0.0.1:42189}
   [junit4]   2> 1124247 INFO  (jetty-launcher-1716-thread-5) [    ] o.e.j.s.Server Started @1126465ms
   [junit4]   2> 1124248 INFO  (jetty-launcher-1716-thread-5) [    ] o.a.s.c.s.e.JettySolrRunner Jetty properties: {hostContext=/solr, hostPort=42189}
   [junit4]   2> 1124249 ERROR (jetty-launcher-1716-thread-5) [    ] o.a.s.u.StartupLoggingUtils Missing Java Option solr.log.dir. Logging may be missing or incomplete.
   [junit4]   2> 1124250 INFO  (jetty-launcher-1716-thread-5) [    ] o.a.s.s.SolrDispatchFilter  ___      _       Welcome to Apache Solr? version 7.3.0
   [junit4]   2> 1124250 INFO  (jetty-launcher-1716-thread-5) [    ] o.a.s.s.SolrDispatchFilter / __| ___| |_ _   Starting in cloud mode on port null
   [junit4]   2> 1124250 INFO  (jetty-launcher-1716-thread-5) [    ] o.a.s.s.SolrDispatchFilter \__ \/ _ \ | '_|  Install dir: null
   [junit4]   2> 1124250 INFO  (jetty-launcher-1716-thread-5) [    ] o.a.s.s.SolrDispatchFilter |___/\___/_|_|    Start time: 2018-01-31T23:22:25.022Z
   [junit4]   2> 1124251 INFO  (jetty-launcher-1716-thread-2) [    ] o.e.j.s.AbstractConnector Started ServerConnector@408338{SSL,[ssl, http/1.1]}{127.0.0.1:41123}
   [junit4]   2> 1124251 INFO  (jetty-launcher-1716-thread-2) [    ] o.e.j.s.Server Started @1126468ms
   [junit4]   2> 1124251 INFO  (jetty-launcher-1716-thread-2) [    ] o.a.s.c.s.e.JettySolrRunner Jetty properties: {hostContext=/solr, hostPort=41123}
   [junit4]   2> 1124251 ERROR (jetty-launcher-1716-thread-2) [    ] o.a.s.u.StartupLoggingUtils Missing Java Option solr.log.dir. Logging may be missing or incomplete.
   [junit4]   2> 1124251 INFO  (jetty-launcher-1716-thread-2) [    ] o.a.s.s.SolrDispatchFilter  ___      _       Welcome to Apache Solr? version 7.3.0
   [junit4]   2> 1124251 INFO  (jetty-launcher-1716-thread-2) [    ] o.a.s.s.SolrDispatchFilter / __| ___| |_ _   Starting in cloud mode on port null
   [junit4]   2> 1124251 INFO  (jetty-launcher-1716-thread-2) [    ] o.a.s.s.SolrDispatchFilter \__ \/ _ \ | '_|  Install dir: null
   [junit4]   2> 1124251 INFO  (jetty-launcher-1716-thread-2) [    ] o.a.s.s.SolrDispatchFilter |___/\___/_|_|    Start time: 2018-01-31T23:22:25.023Z
   [junit4]   2> 1124252 INFO  (zkConnectionManagerCallback-1729-thread-1) [    ] o.a.s.c.c.ConnectionManager zkClient has connected
   [junit4]   2> 1124253 INFO  (jetty-launcher-1716-thread-5) [    ] o.a.s.s.SolrDispatchFilter solr.xml found in ZooKeeper. Loading...
   [junit4]   2> 1124253 WARN  (NIOServerCxn.Factory:0.0.0.0/0.0.0.0:0) [    ] o.a.z.s.NIOServerCnxn Unable to read additional data from client sessionid 0x1000c2a66730002, likely client has closed socket
   [junit4]   2> 1124257 INFO  (zkConnectionManagerCallback-1727-thread-1) [    ] o.a.s.c.c.ConnectionManager zkClient has connected
   [junit4]   2> 1124258 INFO  (jetty-launcher-1716-thread-1) [    ] o.a.s.s.SolrDispatchFilter solr.xml found in ZooKeeper. Loading...
   [junit4]   2> 1124258 INFO  (zkConnectionManagerCallback-1731-thread-1) [    ] o.a.s.c.c.ConnectionManager zkClient has connected
   [junit4]   2> 1124259 INFO  (jetty-launcher-1716-thread-2) [    ] o.a.s.s.SolrDispatchFilter solr.xml found in ZooKeeper. Loading...
   [junit4]   2> 1124261 INFO  (jetty-launcher-1716-thread-6) [    ] o.a.s.c.ZkContainer Zookeeper client=127.0.0.1:45523/solr
   [junit4]   2> 1124265 INFO  (jetty-launcher-1716-thread-4) [    ] o.a.s.c.ZkContainer Zookeeper client=127.0.0.1:45523/solr
   [junit4]   2> 1124265 INFO  (zkConnectionManagerCallback-1735-thread-1) [    ] o.a.s.c.c.ConnectionManager zkClient has connected
   [junit4]   2> 1124271 INFO  (jetty-launcher-1716-thread-5) [    ] o.a.s.c.ZkContainer Zookeeper client=127.0.0.1:45523/solr
   [junit4]   2> 1124271 INFO  (jetty-launcher-1716-thread-3) [    ] o.a.s.c.ZkContainer Zookeeper client=127.0.0.1:45523/solr
   [junit4]   2> 1124276 INFO  (zkConnectionManagerCallback-1740-thread-1) [    ] o.a.s.c.c.ConnectionManager zkClient has connected
   [junit4]   2> 1124282 INFO  (jetty-launcher-1716-thread-2) [    ] o.a.s.c.ZkContainer Zookeeper client=127.0.0.1:45523/solr
   [junit4]   2> 1124283 WARN  (NIOServerCxn.Factory:0.0.0.0/0.0.0.0:0) [    ] o.a.z.s.NIOServerCnxn Unable to read additional data from client sessionid 0x1000c2a66730007, likely client has closed socket
   [junit4]   2> 1124287 INFO  (zkConnectionManagerCallback-1748-thread-1) [    ] o.a.s.c.c.ConnectionManager zkClient has connected
   [junit4]   2> 1124287 INFO  (zkConnectionManagerCallback-1745-thread-1) [    ] o.a.s.c.c.ConnectionManager zkClient has connected
   [junit4]   2> 1124287 INFO  (jetty-launcher-1716-thread-1) [    ] o.a.s.c.ZkContainer Zookeeper client=127.0.0.1:45523/solr
   [junit4]   2> 1124290 INFO  (zkConnectionManagerCallback-1751-thread-1) [    ] o.a.s.c.c.ConnectionManager zkClient has connected
   [junit4]   2> 1124291 INFO  (zkConnectionManagerCallback-1753-thread-1-processing-n:127.0.0.1:44971_solr) [n:127.0.0.1:44971_solr    ] o.a.s.c.c.ConnectionManager zkClient has connected
   [junit4]   2> 1124291 WARN  (NIOServerCxn.Factory:0.0.0.0/0.0.0.0:0) [    ] o.a.z.s.NIOServerCnxn Unable to read additional data from client sessionid 0x1000c2a6673000a, likely client has closed socket
   [junit4]   2> 1124291 WARN  (NIOServerCxn.Factory:0.0.0.0/0.0.0.0:0) [    ] o.a.z.s.NIOServerCnxn Unable to read additional data from client sessionid 0x1000c2a66730009, likely client has closed socket
   [junit4]   2> 1124294 INFO  (zkConnectionManagerCallback-1757-thread-1) [    ] o.a.s.c.c.ConnectionManager zkClient has connected
   [junit4]   2> 1124296 INFO  (zkConnectionManagerCallback-1759-thread-1-processing-n:127.0.0.1:42189_solr) [n:127.0.0.1:42189_solr    ] o.a.s.c.c.ConnectionManager zkClient has connected
   [junit4]   2> 1124296 INFO  (zkConnectionManagerCallback-1761-thread-1-processing-n:127.0.0.1:46505_solr) [n:127.0.0.1:46505_solr    ] o.a.s.c.c.ConnectionManager zkClient has connected
   [junit4]   2> 1124296 INFO  (zkConnectionManagerCallback-1765-thread-1-processing-n:127.0.0.1:41123_solr) [n:127.0.0.1:41123_solr    ] o.a.s.c.c.ConnectionManager zkClient has connected
   [junit4]   2> 1124297 INFO  (zkConnectionManagerCallback-1763-thread-1-processing-n:127.0.0.1:46399_solr) [n:127.0.0.1:46399_solr    ] o.a.s.c.c.ConnectionManager zkClient has connected
   [junit4]   2> 1124299 INFO  (zkConnectionManagerCallback-1767-thread-1-processing-n:127.0.0.1:44369_solr) [n:127.0.0.1:44369_solr    ] o.a.s.c.c.ConnectionManager zkClient has connected
   [junit4]   2> 1124333 INFO  (jetty-launcher-1716-thread-1) [n:127.0.0.1:44369_solr    ] o.a.s.c.Overseer Overseer (id=null) closing
   [junit4]   2> 1124335 INFO  (jetty-launcher-1716-thread-1) [n:127.0.0.1:44369_solr    ] o.a.s.c.OverseerElectionContext I am going to be the leader 127.0.0.1:44369_solr
   [junit4]   2> 1124337 INFO  (jetty-launcher-1716-thread-1) [n:127.0.0.1:44369_solr    ] o.a.s.c.Overseer Overseer (id=72070970284900370-127.0.0.1:44369_solr-n_0000000000) starting
   [junit4]   2> 1124355 INFO  (jetty-launcher-1716-thread-1) [n:127.0.0.1:44369_solr    ] o.a.s.c.ZkController Register node as live in ZooKeeper:/live_nodes/127.0.0.1:44369_solr
   [junit4]   2> 1124368 INFO  (zkCallback-1766-thread-1-processing-n:127.0.0.1:44369_solr) [n:127.0.0.1:44369_solr    ] o.a.s.c.c.ZkStateReader Updated live nodes from ZooKeeper... (0) -> (1)
   [junit4]   2> 1124433 INFO  (jetty-launcher-1716-thread-5) [n:127.0.0.1:42189_solr    ] o.a.s.c.c.ZkStateReader Updated live nodes from ZooKeeper... (0) -> (1)
   [junit4]   2> 1124435 INFO  (jetty-launcher-1716-thread-2) [n:127.0.0.1:41123_solr    ] o.a.s.c.c.ZkStateReader Updated live nodes from ZooKeeper... (0) -> (1)
   [junit4]   2> 1124435 INFO  (jetty-launcher-1716-thread-3) [n:127.0.0.1:46505_solr    ] o.a.s.c.c.ZkStateReader Updated live nodes from ZooKeeper... (0) -> (1)
   [junit4]   2> 1124436 INFO  (jetty-launcher-1716-thread-6) [n:127.0.0.1:44971_solr    ] o.a.s.c.c.ZkStateReader Updated live nodes from ZooKeeper... (0) -> (1)
   [junit4]   2> 1124437 INFO  (jetty-launcher-1716-thread-4) [n:127.0.0.1:46399_solr    ] o.a.s.c.c.ZkStateReader Updated live nodes from ZooKeeper... (0) -> (1)
   [junit4]   2> 1124437 INFO  (jetty-launcher-1716-thread-5) [n:127.0.0.1:42189_solr    ] o.a.s.c.Overseer Overseer (id=null) closing
   [junit4]   2> 1124439 INFO  (jetty-launcher-1716-thread-6) [n:127.0.0.1:44971_solr    ] o.a.s.c.Overseer Overseer (id=null) closing
   [junit4]   2> 1124439 INFO  (jetty-launcher-1716-thread-2) [n:127.0.0.1:41123_solr    ] o.a.s.c.Overseer Overseer (id=null) closing
   [junit4]   2> 1124439 INFO  (jetty-launcher-1716-thread-3) [n:127.0.0.1:46505_solr    ] o.a.s.c.Overseer Overseer (id=null) closing
   [junit4]   2> 1124440 INFO  (jetty-launcher-1716-thread-4) [n:127.0.0.1:46399_solr    ] o.a.s.c.Overseer Overseer (id=null) closing
   [junit4]   2> 1124442 INFO  (jetty-launcher-1716-thread-5) [n:127.0.0.1:42189_solr    ] o.a.s.c.ZkController Register node as live in ZooKeeper:/live_nodes/127.0.0.1:42189_solr
   [junit4]   2> 1124459 INFO  (zkCallback-1766-thread-1-processing-n:127.0.0.1:44369_solr) [n:127.0.0.1:44369_solr    ] o.a.s.c.c.ZkStateReader Updated live nodes from ZooKeeper... (1) -> (2)
   [junit4]   2> 1124463 INFO  (zkCallback-1758-thread-1-processing-n:127.0.0.1:42189_solr) [n:127.0.0.1:42189_solr    ] o.a.s.c.c.ZkStateReader Updated live nodes from ZooKeeper... (1) -> (2)
   [junit4]   2> 1124467 INFO  (zkCallback-1760-thread-1-processing-n:127.0.0.1:46505_solr) [n:127.0.0.1:46505_solr    ] o.a.s.c.c.ZkStateReader Updated live nodes from ZooKeeper... (1) -> (2)
   [junit4]   2> 1124474 INFO  (zkCallback-1764-thread-1-processing-n:127.0.0.1:41123_solr) [n:127.0.0.1:41123_solr    ] o.a.s.c.c.ZkStateReader Updated live nodes from ZooKeeper... (1) -> (2)
   [junit4]   2> 1124474 INFO  (zkCallback-1762-thread-1-processing-n:127.0.0.1:46399_solr) [n:127.0.0.1:46399_solr    ] o.a.s.c.c.ZkStateReader Updated live nodes from ZooKeeper... (1) -> (2)
   [junit4]   2> 1124478 INFO  (zkCallback-1752-thread-1-processing-n:127.0.0.1:44971_solr) [n:127.0.0.1:44971_solr    ] o.a.s.c.c.ZkStateReader Updated live nodes from ZooKeeper... (1) -> (2)
   [junit4]   2> 1124479 INFO  (jetty-launcher-1716-thread-3) [n:127.0.0.1:46505_solr    ] o.a.s.c.ZkController Register node as live in ZooKeeper:/live_nodes/127.0.0.1:46505_solr
   [junit4]   2> 1124479 INFO  (jetty-launcher-1716-thread-6) [n:127.0.0.1:44971_solr    ] o.a.s.c.ZkController Register node as live in ZooKeeper:/live_nodes/127.0.0.1:44971_solr
   [junit4]   2> 1124479 INFO  (jetty-launcher-1716-thread-2) [n:127.0.0.1:41123_solr    ] o.a.s.c.ZkController Register node as live in ZooKeeper:/live_nodes/127.0.0.1:41123_solr
   [junit4]   2> 1124498 INFO  (jetty-launcher-1716-thread-4) [n:127.0.0.1:46399_solr    ] o.a.s.c.ZkController Register node as live in ZooKeeper:/live_nodes/127.0.0.1:46399_solr
   [junit4]   2> 1124499 INFO  (zkCallback-1766-thread-1-processing-n:127.0.0.1:44369_solr) [n:127.0.0.1:44369_solr    ] o.a.s.c.c.ZkStateReader Updated live nodes from ZooKeeper... (2) -> (5)
   [junit4]   2> 1124499 INFO  (zkCallback-1762-thread-1-processing-n:127.0.0.1:46399_solr) [n:127.0.0.1:46399_solr    ] o.a.s.c.c.ZkStateReader Updated live nodes from ZooKeeper... (2) -> (5)
   [junit4]   2> 1124498 INFO  (zkCallback-1760-thread-1-processing-n:127.0.0.1:46505_solr) [n:127.0.0.1:46505_solr    ] o.a.s.c.c.ZkStateReader Updated live nodes from ZooKeeper... (2) -> (5)
   [junit4]   2> 1124514 INFO  (zkCallback-1758-thread-1-processing-n:127.0.0.1:42189_solr) [n:127.0.0.1:42189_solr    ] o.a.s.c.c.ZkStateReader Updated live nodes from ZooKeeper... (2) -> (5)
   [junit4]   2> 1124518 INFO  (zkCallback-1764-thread-1-processing-n:127.0.0.1:41123_solr) [n:127.0.0.1:41123_solr    ] o.a.s.c.c.ZkStateReader Updated live nodes from ZooKeeper... (2) -> (5)
   [junit4]   2> 1124534 INFO  (zkCallback-1762-thread-1-processing-n:127.0.0.1:46399_solr) [n:127.0.0.1:46399_solr    ] o.a.s.c.c.ZkStateReader Updated live nodes from ZooKeeper... (5) -> (6)
   [junit4]   2> 1124534 INFO  (zkCallback-1758-thread-1-processing-n:127.0.0.1:42189_solr) [n:127.0.0.1:42189_solr    ] o.a.s.c.c.ZkStateReader Updated live nodes from ZooKeeper... (5) -> (6)
   [junit4]   2> 1124534 INFO  (zkCallback-1766-thread-2-processing-n:127.0.0.1:44369_solr) [n:127.0.0.1:44369_solr    ] o.a.s.c.c.ZkStateReader Updated live nodes from ZooKeeper... (5) -> (6)
   [junit4]   2> 1124534 INFO  (zkCallback-1760-thread-1-processing-n:127.0.0.1:46505_solr) [n:127.0.0.1:46505_solr    ] o.a.s.c.c.ZkStateReader Updated live nodes from ZooKeeper... (5) -> (6)
   [junit4]   2> 1124535 INFO  (zkCallback-1764-thread-1-processing-n:127.0.0.1:41123_solr) [n:127.0.0.1:41123_solr    ] o.a.s.c.c.ZkStateReader Updated live nodes from ZooKeeper... (5) -> (6)
   [junit4]   2> 1124546 INFO  (zkCallback-1752-thread-1-processing-n:127.0.0.1:44971_solr) [n:127.0.0.1:44971_solr    ] o.a.s.c.c.ZkStateReader Updated live nodes from ZooKeeper... (2) -> (5)
   [junit4]   2> 1124550 INFO  (zkCallback-1752-thread-2-processing-n:127.0.0.1:44971_solr) [n:127.0.0.1:44971_solr    ] o.a.s.c.c.ZkStateReader Updated live nodes from ZooKeeper... (5) -> (6)
   [junit4]   2> 1124584 INFO  (jetty-launcher-1716-thread-1) [n:127.0.0.1:44369_solr    ] o.a.s.m.r.SolrJmxReporter JMX monitoring for 'solr_44369.solr.node' (registry 'solr.node') enabled at server: com.sun.jmx.mbeanserver.JmxMBeanServer@167038
   [junit4]   2> 1124600 INFO  (jetty-launcher-1716-thread-1) [n:127.0.0.1:44369_solr    ] o.a.s.m.r.SolrJmxReporter JMX monitoring for 'solr_44369.solr.jvm' (registry 'solr.jvm') enabled at server: com.sun.jmx.mbeanserver.JmxMBeanServer@167038
   [junit4]   2> 1124600 INFO  (jetty-launcher-1716-thread-1) [n:127.0.0.1:44369_solr    ] o.a.s.m.r.SolrJmxReporter JMX monitoring for 'solr_44369.solr.jetty' (registry 'solr.jetty') enabled at server: com.sun.jmx.mbeanserver.JmxMBeanServer@167038
   [junit4]   2> 1124602 INFO  (jetty-launcher-1716-thread-1) [n:127.0.0.1:44369_solr    ] o.a.s.c.CorePropertiesLocator Found 0 core definitions underneath /home/jenkins/workspace/Lucene-Solr-7.x-Linux/solr/build/solr-core/test/J1/temp/solr.cloud.ReplaceNodeNoTargetTest_96E1DD2C3A0CCDED-001/tempDir-001/node1/.
   [junit4]   2> 1124765 INFO  (jetty-launcher-1716-thread-5) [n:127.0.0.1:42189_solr    ] o.a.s.m.r.SolrJmxReporter JMX monitoring for 'solr_42189.solr.node' (registry 'solr.node') enabled at server: com.sun.jmx.mbeanserver.JmxMBeanServer@167038
   [junit4]   2> 1124767 INFO  (jetty-launcher-1716-thread-2) [n:127.0.0.1:41123_solr    ] o.a.s.m.r.SolrJmxReporter JMX monitoring for 'solr_41123.solr.node' (registry 'solr.node') enabled at server: com.sun.jmx.mbeanserver.JmxMBeanServer@167038
   [junit4]   2> 1124781 INFO  (jetty-launcher-1716-thread-3) [n:127.0.0.1:46505_solr    ] o.a.s.m.r.SolrJmxReporter JMX monitoring for 'solr_46505.solr.node' (registry 'solr.node') enabled at server: com.sun.jmx.mbeanserver.JmxMBeanServer@167038
   [junit4]   2> 1124790 INFO  (jetty-launcher-1716-thread-5) [n:127.0.0.1:42189_solr    ] o.a.s.m.r.SolrJmxReporter JMX monitoring for 'solr_42189.solr.jvm' (registry 'solr.jvm') enabled at server: com.sun.jmx.mbeanserver.JmxMBeanServer@167038
   [junit4]   2> 1124790 INFO  (jetty-launcher-1716-thread-5) [n:127.0.0.1:42189_solr    ] o.a.s.m.r.SolrJmxReporter JMX monitoring for 'solr_42189.solr.jetty' (registry 'solr.jetty') enabled at server: com.sun.jmx.mbeanserver.JmxMBeanServer@167038
   [junit4]   2> 1124792 INFO  (jetty-launcher-1716-thread-5) [n:127.0.0.1:42189_solr    ] o.a.s.c.CorePropertiesLocator Found 0 core definitions underneath /home/jenkins/workspace/Lucene-Solr-7.x-Linux/solr/build/solr-core/test/J1/temp/solr.cloud.ReplaceNodeNoTargetTest_96E1DD2C3A0CCDED-001/tempDir-001/node5/.
   [junit4]   2> 1124793 INFO  (jetty-launcher-1716-thread-2) [n:127.0.0.1:41123_solr    ] o.a.s.m.r.SolrJmxReporter JMX monitoring for 'solr_41123.solr.jvm' (registry 'solr.jvm') enabled at server: com.sun.jmx.mbeanserver.JmxMBeanServer@167038
   [junit4]   2> 1124793 INFO  (jetty-launcher-1716-thread-2) [n:127.0.0.1:41123_solr    ] o.a.s.m.r.SolrJmxReporter JMX monitoring for 'solr_41123.solr.jetty' (registry 'solr.jetty') enabled at server: com.sun.jmx.mbeanserver.JmxMBeanServer@167038
   [junit4]   2> 1124795 INFO  (jetty-launcher-1716-thread-2) [n:127.0.0.1:41123_solr    ] o.a.s.c.CorePropertiesLocator Found 0 core definitions underneath /home/jenkins/workspace/Lucene-Solr-7.x-Linux/solr/build/solr-core/test/J1/temp/solr.cloud.ReplaceNodeNoTargetTest_96E1DD2C3A0CCDED-001/tempDir-001/node2/.
   [junit4]   2> 1124797 INFO  (jetty-launcher-1716-thread-3) [n:127.0.0.1:46505_solr    ] o.a.s.m.r.SolrJmxReporter JMX monitoring for 'solr_46505.solr.jvm' (registry 'solr.jvm') enabled at server: com.sun.jmx.mbeanserver.JmxMBeanServer@167038
   [junit4]   2> 1124797 INFO  (jetty-launcher-1716-thread-3) [n:127.0.0.1:46505_solr    ] o.a.s.m.r.SolrJmxReporter JMX monitoring for 'solr_46505.solr.jetty' (registry 'solr.jetty') enabled at server: com.sun.jmx.mbeanserver.JmxMBeanServer@167038
   [junit4]   2> 1124806 INFO  (jetty-launcher-1716-thread-3) [n:127.0.0.1:46505_solr    ] o.a.s.c.CorePropertiesLocator Found 0 core definitions underneath /home/jenkins/workspace/Lucene-Solr-7.x-Linux/solr/build/solr-core/test/J1/temp/solr.cloud.ReplaceNodeNoTargetTest_96E1DD2C3A0CCDED-001/tempDir-001/node3/.
   [junit4]   2> 1124895 INFO  (jetty-launcher-1716-thread-4) [n:127.0.0.1:46399_solr    ] o.a.s.m.r.SolrJmxReporter JMX monitoring for 'solr_46399.solr.node' (registry 'solr.node') enabled at server: com.sun.jmx.mbeanserver.JmxMBeanServer@167038
   [junit4]   2> 1124910 INFO  (jetty-launcher-1716-thread-4) [n:127.0.0.1:46399_solr    ] o.a.s.m.r.SolrJmxReporter JMX monitoring for 'solr_46399.solr.jvm' (registry 'solr.jvm') enabled at server: com.sun.jmx.mbeanserver.JmxMBeanServer@167038
   [junit4]   2> 1124911 INFO  (jetty-launcher-1716-thread-4) [n:127.0.0.1:46399_solr    ] o.a.s.m.r.SolrJmxReporter JMX monitoring for 'solr_46399.solr.jetty' (registry 'solr.jetty') enabled at server: com.sun.jmx.mbeanserver.JmxMBeanServer@167038
   [junit4]   2> 1124912 INFO  (jetty-launcher-1716-thread-4) [n:127.0.0.1:46399_solr    ] o.a.s.c.CorePropertiesLocator Found 0 core definitions underneath /home/jenkins/workspace/Lucene-Solr-7.x-Linux/solr/build/solr-core/test/J1/temp/solr.cloud.ReplaceNodeNoTargetTest_96E1DD2C3A0CCDED-001/tempDir-001/node4/.
   [junit4]   2> 1125013 INFO  (jetty-launcher-1716-thread-6) [n:127.0.0.1:44971_solr    ] o.a.s.m.r.SolrJmxReporter JMX monitoring for 'solr_44971.solr.node' (registry 'solr.node') enabled at server: com.sun.jmx.mbeanserver.JmxMBeanServer@167038
   [junit4]   2> 1125023 INFO  (jetty-launcher-1716-thread-6) [n:127.0.0.1:44971_solr    ] o.a.s.m.r.SolrJmxReporter JMX monitoring for 'solr_44971.solr.jvm' (registry 'solr.jvm') enabled at server: com.sun.jmx.mbeanserver.JmxMBeanServer@167038
   [junit4]   2> 1125023 INFO  (jetty-launcher-1716-thread-6) [n:127.0.0.1:44971_solr    ] o.a.s.m.r.SolrJmxReporter JMX monitoring for 'solr_44971.solr.jetty' (registry 'solr.jetty') enabled at server: com.sun.jmx.mbeanserver.JmxMBeanServer@167038
   [junit4]   2> 1125024 INFO  (jetty-launcher-1716-thread-6) [n:127.0.0.1:44971_solr    ] o.a.s.c.CorePropertiesLocator Found 0 core definitions underneath /home/jenkins/workspace/Lucene-Solr-7.x-Linux/solr/build/solr-core/test/J1/temp/solr.cloud.ReplaceNodeNoTargetTest_96E1DD2C3A0CCDED-001/tempDir-001/node6/.
   [junit4]   2> 1125232 INFO  (zkConnectionManagerCallback-1781-thread-1) [    ] o.a.s.c.c.ConnectionManager zkClient has connected
   [junit4]   2> 1125235 INFO  (zkConnectionManagerCallback-1785-thread-1) [    ] o.a.s.c.c.ConnectionManager zkClient has connected
   [junit4]   2> 1125236 INFO  (SUITE-ReplaceNodeNoTargetTest-seed#[96E1DD2C3A0CCDED]-worker) [    ] o.a.s.c.c.ZkStateReader Updated live nodes from ZooKeeper... (0) -> (6)
   [junit4]   2> 1125237 INFO  (SUITE-ReplaceNodeNoTargetTest-seed#[96E1DD2C3A0CCDED]-worker) [    ] o.a.s.c.s.i.ZkClientClusterStateProvider Cluster at 127.0.0.1:45523/solr ready
   [junit4]   2> 1125289 INFO  (TEST-ReplaceNodeNoTargetTest.test-seed#[96E1DD2C3A0CCDED]) [    ] o.a.s.SolrTestCaseJ4 ###Starting test
   [junit4]   2> 1125291 INFO  (zkConnectionManagerCallback-1787-thread-1) [    ] o.a.s.c.c.ConnectionManager zkClient has connected
   [junit4]   2> 1125292 INFO  (TEST-ReplaceNodeNoTargetTest.test-seed#[96E1DD2C3A0CCDED]) [    ] o.a.s.c.ReplaceNodeNoTargetTest total_jettys: 6
   [junit4]   2> 1125402 INFO  (qtp10348306-10075) [n:127.0.0.1:41123_solr    ] o.a.s.s.HttpSolrCall [admin] webapp=null path=/admin/metrics params={prefix=CONTAINER.fs.usableSpace,CORE.coreName&wt=javabin&version=2&group=solr.node,solr.core} status=0 QTime=1
   [junit4]   2> 1125446 INFO  (qtp5920918-10057) [n:127.0.0.1:42189_solr    ] o.a.s.s.HttpSolrCall [admin] webapp=null path=/admin/metrics params={prefix=CONTAINER.fs.usableSpace,CORE.coreName&wt=javabin&version=2&group=solr.node,solr.core} status=0 QTime=1
   [junit4]   2> 1125507 INFO  (qtp28123253-10082) [n:127.0.0.1:44369_solr    ] o.a.s.s.HttpSolrCall [admin] webapp=null path=/admin/metrics params={prefix=CONTAINER.fs.usableSpace,CORE.coreName&wt=javabin&version=2&group=solr.node,solr.core} status=0 QTime=0
   [junit4]   2> 1125550 INFO  (qtp25501926-10072) [n:127.0.0.1:44971_solr    ] o.a.s.s.HttpSolrCall [admin] webapp=null path=/admin/metrics params={prefix=CONTAINER.fs.usableSpace,CORE.coreName&wt=javabin&version=2&group=solr.node,solr.core} status=0 QTime=0
   [junit4]   2> 1125556 INFO  (qtp8598256-10063) [n:127.0.0.1:46399_solr    ] o.a.s.s.HttpSolrCall [admin] webapp=null path=/admin/metrics params={prefix=CONTAINER.fs.usableSpace,CORE.coreName&wt=javabin&version=2&group=solr.node,solr.core} status=0 QTime=0
   [junit4]   2> 1125618 INFO  (qtp15660202-10084) [n:127.0.0.1:46505_solr    ] o.a.s.s.HttpSolrCall [admin] webapp=null path=/admin/metrics params={prefix=CONTAINER.fs.usableSpace,CORE.coreName&wt=javabin&version=2&group=solr.node,solr.core} status=0 QTime=0
   [junit4]   2> 1125619 INFO  (qtp8598256-10056) [n:127.0.0.1:46399_solr    ] o.a.s.s.HttpSolrCall [admin] webapp=null path=/cluster/autoscaling params={wt=javabin&version=2} status=0 QTime=281
   [junit4]   2> 1125621 INFO  (qtp8598256-10069) [n:127.0.0.1:46399_solr    ] o.a.s.h.a.CollectionsHandler Invoked Collection Action :create with params pullReplicas=0&replicationFactor=2&collection.configName=conf1&name=replacenodetest_coll_notarget&nrtReplicas=2&action=CREATE&numShards=5&tlogReplicas=0&wt=javabin&version=2 and sendToOCPQueue=true
   [junit4]   2> 1125623 INFO  (OverseerThreadFactory-3325-thread-1-processing-n:127.0.0.1:44369_solr) [n:127.0.0.1:44369_solr    ] o.a.s.c.a.c.CreateCollectionCmd Create collection replacenodetest_coll_notarget
   [junit4]   2> 1125631 INFO  (qtp10348306-10071) [n:127.0.0.1:41123_solr    ] o.a.s.s.HttpSolrCall [admin] webapp=null path=/admin/metrics params={prefix=CONTAINER.fs.usableSpace,CORE.coreName&wt=javabin&version=2&group=solr.node,solr.core} status=0 QTime=0
   [junit4]   2> 1125637 INFO  (qtp5920918-10060) [n:127.0.0.1:42189_solr    ] o.a.s.s.HttpSolrCall [admin] webapp=null path=/admin/metrics params={prefix=CONTAINER.fs.usableSpace,CORE.coreName&wt=javabin&version=2&group=solr.node,solr.core} status=0 QTime=0
   [junit4]   2> 1125642 INFO  (qtp28123253-10078) [n:127.0.0.1:44369_solr    ] o.a.s.s.HttpSolrCall [admin] webapp=null path=/admin/metrics params={prefix=CONTAINER.fs.usableSpace,CORE.coreName&wt=javabin&version=2&group=solr.node,solr.core} status=0 QTime=0
   [junit4]   2> 1125648 INFO  (qtp25501926-10076) [n:127.0.0.1:44971_solr    ] o.a.s.s.HttpSolrCall [admin] webapp=null path=/admin/metrics params={prefix=CONTAINER.fs.usableSpace,CORE.coreName&wt=javabin&version=2&group=solr.node,solr.core} status=0 QTime=0
   [junit4]   2> 1125653 INFO  (qtp8598256-10042) [n:127.0.0.1:46399_solr    ] o.a.s.s.HttpSolrCall [admin] webapp=null path=/admin/metrics params={prefix=CONTAINER.fs.usableSpace,CORE.coreName&wt=javabin&version=2&group=solr.node,solr.core} status=0 QTime=0
   [junit4]   2> 1125658 INFO  (qtp15660202-10083) [n:127.0.0.1:46505_solr    ] o.a.s.s.HttpSolrCall [admin] webapp=null path=/admin/metrics params={prefix=CONTAINER.fs.usableSpace,CORE.coreName&wt=javabin&version=2&group=solr.node,solr.core} status=0 QTime=0
   [junit4]   2> 1125670 INFO  (OverseerThreadFactory-3325-thread-1-processing-n:127.0.0.1:44369_solr) [n:127.0.0.1:44369_solr    ] o.a.s.c.s.c.a.PolicyHelper returnSession, curr-time 204106879 sessionWrapper.createTime 204106868975140, this.sessionWrapper.createTime 204106868975140 
   [junit4]   2> 1125777 INFO  (OverseerStateUpdate-72070970284900370-127.0.0.1:44369_solr-n_0000000000) [n:127.0.0.1:44369_solr    ] o.a.s.c.o.SliceMutator createReplica() {
   [junit4]   2>   "operation":"ADDREPLICA",
   [junit4]   2>   "collection":"replacenodetest_coll_notarget",
   [junit4]   2>   "shard":"shard1",
   [junit4]   2>   "core":"replacenodetest_coll_notarget_shard1_replica_n1",
   [junit4]   2>   "state":"down",
   [junit4]   2>   "base_url":"https://127.0.0.1:46505/solr",
   [junit4]   2>   "type":"NRT",
   [junit4]   2>   "waitForFinalState":"false"} 
   [junit4]   2> 1125779 INFO  (OverseerStateUpdate-72070970284900370-127.0.0.1:44369_solr-n_0000000000) [n:127.0.0.1:44369_solr    ] o.a.s.c.o.SliceMutator createReplica() {
   [junit4]   2>   "operation":"ADDREPLICA",
   [junit4]   2>   "collection":"replacenodetest_coll_notarget",
   [junit4]   2>   "shard":"shard1",
   [junit4]   2>   "core":"replacenodetest_coll_notarget_shard1_replica_n2",
   [junit4]   2>   "state":"down",
   [junit4]   2>   "base_url":"https://127.0.0.1:46399/solr",
   [junit4]   2>   "type":"NRT",
   [junit4]   2>   "waitForFinalState":"false"} 
   [junit4]   2> 1125781 INFO  (OverseerStateUpdate-72070970284900370-127.0.0.1:44369_solr-n_0000000000) [n:127.0.0.1:44369_solr    ] o.a.s.c.o.SliceMutator createReplica() {
   [junit4]   2>   "operation":"ADDREPLICA",
   [junit4]   2>   "collection":"replacenodetest_coll_notarget",
   [junit4]   2>   "shard":"shard2",
   [junit4]   2>   "core":"replacenodetest_coll_notarget_shard2_replica_n4",
   [junit4]   2>   "state":"down",
   [junit4]   2>   "base_url":"https://127.0.0.1:44971/solr",
   [junit4]   2>   "type":"NRT",
   [junit4]   2>   "waitForFinalState":"false"} 
   [junit4]   2> 1125782 INFO  (OverseerStateUpdate-72070970284900370-127.0.0.1:44369_solr-n_0000000000) [n:127.0.0.1:44369_solr    ] o.a.s.c.o.SliceMutator createReplica() {
   [junit4]   2>   "operation":"ADDREPLICA",
   [junit4]   2>   "collection":"replacenodetest_coll_notarget",
   [junit4]   2>   "shard":"shard2",
   [junit4]   2>   "core":"replacenodetest_coll_notarget_shard2_replica_n6",
   [junit4]   2>   "state":"down",
   [junit4]   2>   "base_url":"https://127.0.0.1:44369/solr",
   [junit4]   2>   "type":"NRT",
   [junit4]   2>   "waitForFinalState":"false"} 
   [junit4]   2> 1125784 INFO  (OverseerStateUpdate-72070970284900370-127.0.0.1:44369_solr-n_0000000000) [n:127.0.0.1:44369_solr    ] o.a.s.c.o.SliceMutator createReplica() {
   [junit4]   2>   "operation":"ADDREPLICA",
   [junit4]   2>   "collection":"replacenodetest_coll_notarget",
   [junit4]   2>   "shard":"shard3",
   [junit4]   2>   "core":"replacenodetest_coll_notarget_shard3_replica_n8",
   [junit4]   2>   "state":"down",
   [junit4]   2>   "base_url":"https://127.0.0.1:42189/solr",
   [junit4]   2>   "type":"NRT",
   [junit4]   2>   "waitForFinalState":"false"} 
   [junit4]   2> 1125785 INFO  (OverseerStateUpdate-72070970284900370-127.0.0.1:44369_solr-n_0000000000) [n:127.0.0.1:44369_solr    ] o.a.s.c.o.SliceMutator createReplica() {
   [junit4]   2>   "operation":"ADDREPLICA",
   [junit4]   2>   "collection":"replacenodetest_coll_notarget",
   [junit4]   2>   "shard":"shard3",
   [junit4]   2>   "core":"replacenodetest_coll_notarget_shard3_replica_n10",
   [junit4]   2>   "state":"down",
   [junit4]   2>   "base_url":"https://127.0.0.1:41123/solr",
   [junit4]   2>   "type":"NRT",
   [junit4]   2>   "waitForFinalState":"false"} 
   [junit4]   2> 1125787 INFO  (OverseerStateUpdate-72070970284900370-127.0.0.1:44369_solr-n_0000000000) [n:127.0.0.1:44369_solr    ] o.a.s.c.o.SliceMutator createReplica() {
   [junit4]   2>   "operation":"ADDREPLICA",
   [junit4]   2>   "collection":"replacenodetest_coll_notarget",
   [junit4]   2>   "shard":"shard4",
   [junit4]   2>   "core":"replacenodetest_coll_notarget_shard4_replica_n12",
   [junit4]   2>   "state":"down",
   [junit4]   2>   "base_url":"https://127.0.0.1:41123/solr",
   [junit4]   2>   "type":"NRT",
   [junit4]   2>   "waitForFinalState":"false"} 
   [junit4]   2> 1125788 INFO  (OverseerStateUpdate-72070970284900370-127.0.0.1:44369_solr-n_0000000000) [n:127.0.0.1:44369_solr    ] o.a.s.c.o.SliceMutator createReplica() {
   [junit4]   2>   "operation":"ADDREPLICA",
   [junit4]   2>   "collection":"replacenodetest_coll_notarget",
   [junit4]   2>   "shard":"shard4",
   [junit4]   2>   "core":"replacenodetest_coll_notarget_shard4_replica_n14",
   [junit4]   2>   "state":"down",
   [junit4]   2>   "base_url":"https://127.0.0.1:42189/solr",
   [junit4]   2>   "type":"NRT",
   [junit4]   2>   "waitForFinalState":"false"} 
   [junit4]   2> 1125790 INFO  (OverseerStateUpdate-72070970284900370-127.0.0.1:44369_solr-n_0000000000) [n:127.0.0.1:44369_solr    ] o.a.s.c.o.SliceMutator createReplica() {
   [junit4]   2>   "operation":"ADDREPLICA",
   [junit4]   2>   "collection":"replacenodetest_coll_notarget",
   [junit4]   2>   "shard":"shard5",
   [junit4]   2>   "core":"replacenodetest_coll_notarget_shard5_replica_n16",
   [junit4]   2>   "state":"down",
   [junit4]   2>   "base_url":"https://127.0.0.1:44369/solr",
   [junit4]   2>   "type":"NRT",
   [junit4]   2>   "waitForFinalState":"false"} 
   [junit4]   2> 1125791 INFO  (OverseerStateUpdate-72070970284900370-127.0.0.1:44369_solr-n_0000000000) [n:127.0.0.1:44369_solr    ] o.a.s.c.o.SliceMutator createReplica() {
   [junit4]   2>   "operation":"ADDREPLICA",
   [junit4]   2>   "collection":"replacenodetest_coll_notarget",
   [junit4]   2>   "shard":"shard5",
   [junit4]   2>   "core":"replacenodetest_coll_notarget_shard5_replica_n18",
   [junit4]   2>   "state":"down",
   [junit4]   2>   "base_url":"https://127.0.0.1:44971/solr",
   [junit4]   2>   "type":"NRT",
   [junit4]   2>   "waitForFinalState":"false"} 
   [junit4]   2> 1126005 INFO  (qtp15660202-10053) [n:127.0.0.1:46505_solr    ] o.a.s.h.a.CoreAdminOperation core create command qt=/admin/cores&coreNodeName=core_node3&collection.configName=conf1&newCollection=true&name=replacenodetest_coll_notarget_shard1_replica_n1&action=CREATE&numShards=5&collection=replacenodetest_coll_notarget&shard=shard1&wt=javabin&version=2&replicaType=NRT
   [junit4]   2> 1126006 INFO  (qtp15660202-10053) [n:127.0.0.1:46505_solr    ] o.a.s.c.TransientSolrCoreCacheDefault Allocating transient cache for 2147483647 transient cores
   [junit4]   2> 1126016 INFO  (qtp25501926-10039) [n:127.0.0.1:44971_solr    ] o.a.s.h.a.CoreAdminOperation core create command qt=/admin/cores&coreNodeName=core_node20&collection.configName=conf1&newCollection=true&name=replacenodetest_coll_notarget_shard5_replica_n18&action=CREATE&numShards=5&collection=replacenodetest_coll_notarget&shard=shard5&wt=javabin&version=2&replicaType=NRT
   [junit4]   2> 1126016 INFO  (qtp25501926-10039) [n:127.0.0.1:44971_solr    ] o.a.s.c.TransientSolrCoreCacheDefault Allocating transient cache for 2147483647 transient cores
   [junit4]   2> 1126021 INFO  (qtp10348306-10061) [n:127.0.0.1:41123_solr    ] o.a.s.h.a.CoreAdminOperation core create command qt=/admin/cores&coreNodeName=core_node13&collection.configName=conf1&newCollection=true&name=replacenodetest_coll_notarget_shard3_replica_n10&action=CREATE&numShards=5&collection=replacenodetest_coll_notarget&shard=shard3&wt=javabin&version=2&replicaType=NRT
   [junit4]   2> 1126021 INFO  (qtp10348306-10061) [n:127.0.0.1:41123_solr    ] o.a.s.c.TransientSolrCoreCacheDefault Allocating transient cache for 2147483647 transient cores
   [junit4]   2> 1126017 INFO  (qtp8598256-10203) [n:127.0.0.1:46399_solr    ] o.a.s.h.a.CoreAdminOperation core create command qt=/admin/cores&coreNodeName=core_node5&collection.configName=conf1&newCollection=true&name=replacenodetest_coll_notarget_shard1_replica_n2&action=CREATE&numShards=5&collection=replacenodetest_coll_notarget&shard=shard1&wt=javabin&version=2&replicaType=NRT
   [junit4]   2> 1126022 INFO  (qtp8598256-10203) [n:127.0.0.1:46399_solr    ] o.a.s.c.TransientSolrCoreCacheDefault Allocating transient cache for 2147483647 transient cores
   [junit4]   2> 1126017 INFO  (qtp28123253-10038) [n:127.0.0.1:44369_solr    ] o.a.s.h.a.CoreAdminOperation core create command qt=/admin/cores&coreNodeName=core_node9&collection.configName=conf1&newCollection=true&name=replacenodetest_coll_notarget_shard2_replica_n6&action=CREATE&numShards=5&collection=replacenodetest_coll_notarget&shard=shard2&wt=javabin&version=2&replicaType=NRT
   [junit4]   2> 1126022 INFO  (qtp28123253-10038) [n:127.0.0.1:44369_solr    ] o.a.s.c.TransientSolrCoreCacheDefault Allocating transient cache for 2147483647 transient cores
   [junit4]   2> 1126022 INFO  (qtp28123253-10036) [n:127.0.0.1:44369_solr    ] o.a.s.h.a.CoreAdminOperation core create command qt=/admin/cores&coreNodeName=core_node19&collection.configName=conf1&newCollection=true&name=replacenodetest_coll_notarget_shard5_replica_n16&action=CREATE&numShards=5&collection=replacenodetest_coll_notarget&shard=shard5&wt=javabin&version=2&replicaType=NRT
   [junit4]   2> 1126021 INFO  (qtp5920918-10043) [n:127.0.0.1:42189_solr    ] o.a.s.h.a.CoreAdminOperation core create command qt=/admin/cores&coreNodeName=core_node11&collection.configName=conf1&newCollection=true&name=replacenodetest_coll_notarget_shard3_replica_n8&action=CREATE&numShards=5&collection=replacenodetest_coll_notarget&shard=shard3&wt=javabin&version=2&replicaType=NRT
   [junit4]   2> 1126023 INFO  (qtp5920918-10043) [n:127.0.0.1:42189_solr    ] o.a.s.c.TransientSolrCoreCacheDefault Allocating transient cache for 2147483647 transient cores
   [junit4]   2> 1126024 INFO  (qtp25501926-10076) [n:127.0.0.1:44971_solr    ] o.a.s.h.a.CoreAdminOperation core create command qt=/admin/cores&coreNodeName=core_node7&collection.configName=conf1&newCollection=true&name=replacenodetest_coll_notarget_shard2_replica_n4&action=CREATE&numShards=5&collection=replacenodetest_coll_notarget&shard=shard2&wt=javabin&version=2&replicaType=NRT
   [junit4]   2> 1126046 INFO  (qtp10348306-10050) [n:127.0.0.1:41123_solr    ] o.a.s.h.a.CoreAdminOperation core create command qt=/admin/cores&coreNodeName=core_node15&collection.configName=conf1&newCollection=true&name=replacenodetest_coll_notarget_shard4_replica_n12&action=CREATE&numShards=5&collection=replacenodetest_coll_notarget&shard=shard4&wt=javabin&version=2&replicaType=NRT
   [junit4]   2> 1126046 INFO  (qtp5920918-10040) [n:127.0.0.1:42189_solr    ] o.a.s.h.a.CoreAdminOperation core create command qt=/admin/cores&coreNodeName=core_node17&collection.configName=conf1&newCollection=true&name=replacenodetest_coll_notarget_shard4_replica_n14&action=CREATE&numShards=5&collection=replacenodetest_coll_notarget&shard=shard4&wt=javabin&version=2&replicaType=NRT
   [junit4]   2> 1126160 INFO  (zkCallback-1758-thread-1-processing-n:127.0.0.1:42189_solr) [n:127.0.0.1:42189_solr    ] o.a.s.c.c.ZkStateReader A cluster state change: [WatchedEvent state:SyncConnected type:NodeDataChanged path:/collections/replacenodetest_coll_notarget/state.json] for collection [replacenodetest_coll_notarget] has occurred - updating... (live nodes size: [6])
   [junit4]   2> 1126160 INFO  (zkCallback-1760-thread-1-processing-n:127.0.0.1:46505_solr) [n:127.0.0.1:46505_solr    ] o.a.s.c.c.ZkStateReader A cluster state change: [WatchedEvent state:SyncConnected type:NodeDataChanged path:/collections/replacenodetest_coll_notarget/state.json] for collection [replacenodetest_coll_notarget] has occurred - updating... (live nodes size: [6])
   [junit4]   2> 1126160 INFO  (zkCallback-1752-thread-2-processing-n:127.0.0.1:44971_solr) [n:127.0.0.1:44971_solr    ] o.a.s.c.c.ZkStateReader A cluster state change: [WatchedEvent state:SyncConnected type:NodeDataChanged path:/collections/replacenodetest_coll_notarget/state.json] for collection [replacenodetest_coll_notarget] has occurred - updating... (live nodes size: [6])
   [junit4]   2> 1126160 INFO  (zkCallback-1762-thread-1-processing-n:127.0.0.1:46399_solr) [n:127.0.0.1:46399_solr    ] o.a.s.c.c.ZkStateReader A cluster state change: [WatchedEvent state:SyncConnected type:NodeDataChanged path:/collections/replacenodetest_coll_notarget/state.json] for collection [replacenodetest_coll_notarget] has occurred - updating... (live nodes size: [6])
   [junit4]   2> 1126160 INFO  (zkCallback-1764-thread-1-processing-n:127.0.0.1:41123_solr) [n:127.0.0.1:41123_solr    ] o.a.s.c.c.ZkStateReader A cluster state change: [WatchedEvent state:SyncConnected type:NodeDataChanged path:/collections/replacenodetest_coll_notarget/state.json] for collection [replacenodetest_coll_notarget] has occurred - updating... (live nodes size: [6])
   [junit4]   2> 1126160 INFO  (zkCallback-1766-thread-2-processing-n:127.0.0.1:44369_solr) [n:127.0.0.1:44369_solr    ] o.a.s.c.c.ZkStateReader A cluster state change: [WatchedEvent state:SyncConnected type:NodeDataChanged path:/collections/replacenodetest_coll_notarget/state.json] for collection [replacenodetest_coll_notarget] has occurred - updating... (live nodes size: [6])
   [junit4]   2> 1126161 INFO  (zkCallback-1762-thread-2-processing-n:127.0.0.1:46399_solr) [n:127.0.0.1:46399_solr    ] o.a.s.c.c.ZkStateReader A cluster state change: [WatchedEvent state:SyncConnected type:NodeDataChanged path:/collections/replacenodetest_coll_notarget/state.json] for collection [replacenodetest_coll_notarget] has occurred - updating... (live nodes size: [6])
   [junit4]   2> 1126161 INFO  (zkCallback-1760-thread-2-processing-n:127.0.0.1:46505_solr) [n:127.0.0.1:46505_solr    ] o.a.s.c.c.ZkStateReader A cluster state change: [WatchedEvent state:SyncConnected type:NodeDataChanged path:/collections/replacenodetest_coll_notarget/state.json] for collection [replacenodetest_coll_notarget] has occurred - updating... (live nodes size: [6])
   [junit4]   2> 1126162 INFO  (zkCallback-1764-thread-2-processing-n:127.0.0.1:41123_solr) [n:127.0.0.1:41123_solr    ] o.a.s.c.c.ZkStateReader A cluster state change: [WatchedEvent state:SyncConnected type:NodeDataChanged path:/collections/replacenodetest_coll_notarget/state.json] for collection [replacenodetest_coll_notarget] has occurred - updating... (live nodes size: [6])
   [junit4]   2> 1126162 INFO  (zkCallback-1758-thread-2-processing-n:127.0.0.1:42189_solr) [n:127.0.0.1:42189_solr    ] o.a.s.c.c.ZkStateReader A cluster state change: [WatchedEvent state:SyncConnected type:NodeDataChanged path:/collections/replacenodetest_coll_notarget/state.json] for collection [replacenodetest_coll_notarget] has occurred - updating... (live nodes size: [6])
   [junit4]   2> 1127042 INFO  (qtp25501926-10076) [n:127.0.0.1:44971_solr c:replacenodetest_coll_notarget s:shard2 r:core_node7 x:replacenodetest_coll_notarget_shard2_replica_n4] o.a.s.c.SolrConfig Using Lucene MatchVersion: 7.3.0
   [junit4]   2> 1127047 INFO  (qtp28123253-10038) [n:127.0.0.1:44369_solr c:replacenodetest_coll_notarget s:shard2 r:core_node9 x:replacenodetest_coll_notarget_shard2_replica_n6] o.a.s.c.SolrConfig Using Lucene MatchVersion: 7.3.0
   [junit4]   2> 1127048 INFO  (qtp28123253-10036) [n:127.0.0.1:44369_solr c:replacenodetest_coll_notarget s:shard5 r:core_node19 x:replacenodetest_coll_notarget_shard5_replica_n16] o.a.s.c.SolrConfig Using Lucene MatchVersion: 7.3.0
   [junit4]   2> 1127084 INFO  (qtp10348306-10061) [n:127.0.0.1:41123_solr c:replacenodetest_coll_notarget s:shard3 r:core_node13 x:replacenodetest_coll_notarget_shard3_replica_n10] o.a.s.c.SolrConfig Using Lucene MatchVersion: 7.3.0
   [junit4]   2> 1127085 INFO  (qtp8598256-10203) [n:127.0.0.1:46399_solr c:replacenodetest_coll_notarget s:shard1 r:core_node5 x:replacenodetest_coll_notarget_shard1_replica_n2] o.a.s.c.SolrConfig Using Lucene MatchVersion: 7.3.0
   [junit4]   2> 1127088 INFO  (qtp10348306-10050) [n:127.0.0.1:41123_solr c:replacenodetest_coll_notarget s:shard4 r:core_node15 x:replacenodetest_coll_notarget_shard4_replica_n12] o.a.s.c.SolrConfig Using Lucene MatchVersion: 7.3.0
   [junit4]   2> 1127093 INFO  (qtp5920918-10040) [n:127.0.0.1:42189_solr c:replacenodetest_coll_notarget s:shard4 r:core_node17 x:replacenodetest_coll_notarget_shard4_replica_n14] o.a.s.c.SolrConfig Using Lucene MatchVersion: 7.3.0
   [junit4]   2> 1127118 INFO  (qtp25501926-10076) [n:127.0.0.1:44971_solr c:replacenodetest_coll_notarget s:shard2 r:core_node7 x:replacenodetest_coll_notarget_shard2_replica_n4] o.a.s.s.IndexSchema [replacenodetest_coll_notarget_shard2_replica_n4] Schema name=cloud-dynamic
   [junit4]   2> 1127119 INFO  (qtp15660202-10053) [n:127.0.0.1:46505_solr c:replacenodetest_coll_notarget s:shard1 r:core_node3 x:replacenodetest_coll_notarget_shard1_replica_n1] o.a.s.c.SolrConfig Using Lucene MatchVersion: 7.3.0
   [junit4]   2> 1127121 INFO  (qtp5920918-10043) [n:127.0.0.1:42189_solr c:replacenodetest_coll_notarget s:shard3 r:core_node11 x:replacenodetest_coll_notarget_shard3_replica_n8] o.a.s.c.SolrConfig Using Lucene MatchVersion: 7.3.0
   [junit4]   2> 1127123 INFO  (qtp25501926-10039) [n:127.0.0.1:44971_solr c:replacenodetest_coll_notarget s:shard5 r:core_node20 x:replacenodetest_coll_notarget_shard5_replica_n18] o.a.s.c.SolrConfig Using Lucene MatchVersion: 7.3.0
   [junit4]   2> 1127132 INFO  (qtp28123253-10038) [n:127.0.0.1:44369_solr c:replacenodetest_coll_notarget s:shard2 r:core_node9 x:replacenodetest_coll_notarget_shard2_replica_n6] o.a.s.s.IndexSchema [replacenodetest_coll_notarget_shard2_replica_n6] Schema name=cloud-dynamic
   [junit4]   2> 1127145 INFO  (qtp5920918-10043) [n:127.0.0.1:42189_solr c:replacenodetest_coll_notarget s:shard3 r:core_node11 x:replacenodetest_coll_notarget_shard3_replica_n8] o.a.s.s.IndexSchema [replacenodetest_coll_notarget_shard3_replica_n8] Schema name=cloud-dynamic
   [junit4]   2> 1127151 INFO  (qtp10348306-10050) [n:127.0.0.1:41123_solr c:replacenodetest_coll_notarget s:shard4 r:core_node15 x:replacenodetest_coll_notarget_shard4_replica_n12] o.a.s.s.IndexSchema [replacenodetest_coll_notarget_shard4_replica_n12] Schema name=cloud-dynamic
   [junit4]   2> 1127159 INFO  (qtp10348306-10061) [n:127.0.0.1:41123_solr c:replacenodetest_coll_notarget s:shard3 r:core_node13 x:replacenodetest_coll_notarget_shard3_replica_n10] o.a.s.s.IndexSchema [replacenodetest_coll_notarget_shard3_replica_n10] Schema name=cloud-dynamic
   [junit4]   2> 1127226 INFO  (qtp28123253-10036) [n:127.0.0.1:44369_solr c:replacenodetest_coll_notarget s:shard5 r:core_node19 x:replacenodetest_coll_notarget_shard5_replica_n16] o.a.s.s.IndexSchema [replacenodetest_coll_notarget_shard5_replica_n16] Schema name=cloud-dynamic
   [junit4]   2> 1127226 INFO  (qtp25501926-10076) [n:127.0.0.1:44971_solr c:replacenodetest_coll_notarget s:shard2 r:core_node7 x:replacenodetest_coll_notarget_shard2_replica_n4] o.a.s.s.IndexSchema Loaded schema cloud-dynamic/1.6 with uniqueid field id
   [junit4]   2> 1127226 INFO  (qtp25501926-10076) [n:127.0.0.1:44971_solr c:replacenodetest_coll_notarget s:shard2 r:core_node7 x:replacenodetest_coll_notarget_shard2_replica_n4] o.a.s.c.CoreContainer Creating SolrCore 'replacenodetest_coll_notarget_shard2_replica_n4' using configuration from collection replacenodetest_coll_notarget, trusted=true
   [junit4]   2> 1127227 INFO  (qtp25501926-10076) [n:127.0.0.1:44971_solr c:replacenodetest_coll_notarget s:shard2 r:core_node7 x:replacenodetest_coll_notarget_shard2_replica_n4] o.a.s.m.r.SolrJmxReporter JMX monitoring for 'solr_44971.solr.core.replacenodetest_coll_notarget.shard2.replica_n4' (registry 'solr.core.replacenodetest_coll_notarget.shard2.replica_n4') enabled at server: com.sun.jmx.mbeanserver.JmxMBeanServer@167038
   [junit4]   2> 1127228 INFO  (qtp25501926-10076) [n:127.0.0.1:44971_solr c:replacenodetest_coll_notarget s:shard2 r:core_node7 x:replacenodetest_coll_notarget_shard2_replica_n4] o.a.s.c.SolrCore solr.RecoveryStrategy.Builder
   [junit4]   2> 1127228 INFO  (qtp25501926-10076) [n:127.0.0.1:44971_solr c:replacenodetest_coll_notarget s:shard2 r:core_node7 x:replacenodetest_coll_notarget_shard2_replica_n4] o.a.s.c.SolrCore [[replacenodetest_coll_notarget_shard2_replica_n4] ] Opening new SolrCore at [/home/jenkins/workspace/Lucene-Solr-7.x-Linux/solr/build/solr-core/test/J1/temp/solr.cloud.ReplaceNodeNoTargetTest_96E1DD2C3A0CCDED-001/tempDir-001/node6/replacenodetest_coll_notarget_shard2_replica_n4], dataDir=[/home/jenkins/workspace/Lucene-Solr-7.x-Linux/solr/build/solr-core/test/J1/temp/solr.cloud.ReplaceNodeNoTargetTest_96E1DD2C3A0CCDED-001/tempDir-001/node6/./replacenodetest_coll_notarget_shard2_replica_n4/data/]
   [junit4]   2> 1127250 INFO  (qtp28123253-10038) [n:127.0.0.1:44369_solr c:replacenodetest_coll_notarget s:shard2 r:core_node9 x:replacenodetest_coll_notarget_shard2_replica_n6] o.a.s.s.IndexSchema Loaded schema cloud-dynamic/1.6 with uniqueid field id
   [junit4]   2> 1127250 INFO  (qtp28123253-10038) [n:127.0.0.1:44369_solr c:replacenodetest_coll_notarget s:shard2 r:core_node9 x:replacenodetest_coll_notarget_shard2_replica_n6] o.a.s.c.CoreContainer Creating SolrCore 'replacenodetest_coll_notarget_shard2_replica_n6' using configuration from collection replacenodetest_coll_notarget, trusted=true
   [junit4]   2> 1127251 INFO  (qtp28123253-10038) [n:127.0.0.1:44369_solr c:replacenodetest_coll_notarget s:shard2 r:core_node9 x:replacenodetest_coll_notarget_shard2_replica_n6] o.a.s.m.r.SolrJmxReporter JMX monitoring for 'solr_44369.solr.core.replacenodetest_coll_notarget.shard2.replica_n6' (registry 'solr.core.replacenodetest_coll_notarget.shard2.replica_n6') enabled at server: com.sun.jmx.mbeanserver.JmxMBeanServer@167038
   [junit4]   2> 1127251 INFO  (qtp28123253-10038) [n:127.0.0.1:44369_solr c:replacenodetest_coll_notarget s:shard2 r:core_node9 x:replacenodetest_coll_notarget_shard2_replica_n6] o.a.s.c.SolrCore solr.RecoveryStrategy.Builder
   [junit4]   2> 1127251 INFO  (qtp28123253-10038) [n:127.0.0.1:44369_solr c:replacenodetest_coll_notarget s:shard2 r:core_node9 x:replacenodetest_coll_notarget_shard2_replica_n6] o.a.s.c.SolrCore [[replacenodetest_coll_notarget_shard2_replica_n6] ] Opening new SolrCore at [/home/jenkins/workspace/Lucene-Solr-7.x-Linux/solr/build/solr-core/test/J1/temp/solr.cloud.ReplaceNodeNoTargetTest_96E1DD2C3A0CCDED-001/tempDir-001/node1/replacenodetest_coll_notarget_shard2_replica_n6], dataDir=[/home/jenkins/workspace/Lucene-Solr-7.x-Linux/solr/build/solr-core/test/J1/temp/solr.cloud.ReplaceNodeNoTargetTest_96E1DD2C3A0CCDED-001/tempDir-001/node1/./replacenodetest_coll_notarget_shard2_replica_n6/data/]
   [junit4]   2> 1127256 INFO  (qtp10348306-10061) [n:127.0.0.1:41123_solr c:replacenodetest_coll_notarget s:shard3 r:core_node13 x:replacenodetest_coll_notarget_shard3_replica_n10] o.a.s.s.IndexSchema Loaded schema cloud-dynamic/1.6 with uniqueid field id
   [junit4]   2> 1127256 INFO  (qtp10348306-10061) [n:127.0.0.1:41123_solr c:replacenodetest_coll_notarget s:shard3 r:core_node13 x:replacenodetest_coll_notarget_shard3_replica_n10] o.a.s.c.CoreContainer Creating SolrCore 'replacenodetest_coll_notarget_shard3_replica_n10' using configuration from collection replacenodetest_coll_notarget, trusted=true
   [junit4]   2> 1127257 INFO  (qtp10348306-10061) [n:127.0.0.1:41123_solr c:replacenodetest_coll_notarget s:shard3 r:core_node13 x:replacenodetest_coll_notarget_shard3_replica_n10] o.a.s.m.r.SolrJmxReporter JMX monitoring for 'solr_41123.solr.core.replacenodetest_coll_notarget.shard3.replica_n10' (registry 'solr.core.replacenodetest_coll_notarget.shard3.replica_n10') enabled at server: com.sun.jmx.mbeanserver.JmxMBeanServer@167038
   [junit4]   2> 1127257 INFO  (qtp10348306-10061) [n:127.0.0.1:41123_solr c:replacenodetest_coll_notarget s:shard3 r:core_node13 x:replacenodetest_coll_notarget_shard3_replica_n10] o.a.s.c.SolrCore solr.RecoveryStrategy.Builder
   [junit4]   2> 1127257 INFO  (qtp10348306-10061) [n:127.0.0.1:41123_solr c:replacenodetest_coll_notarget s:shard3 r:core_node13 x:replacenodetest_coll_notarget_shard3_replica_n10] o.a.s.c.SolrCore [[replacenodetest_coll_notarget_shard3_replica_n10] ] Opening new SolrCore at [/home/jenkins/workspace/Lucene-Solr-7.x-Linux/solr/build/solr-core/test/J1/temp/solr.cloud.ReplaceNodeNoTargetTest_96E1DD2C3A0CCDED-001/tempDir-001/node2/replacenodetest_coll_notarget_shard3_replica_n10], dataDir=[/home/jenkins/workspace/Lucene-Solr-7.x-Linux/solr/build/solr-core/test/J1/temp/solr.cloud.ReplaceNodeNoTargetTest_96E1DD2C3A0CCDED-001/tempDir-001/node2/./replacenodetest_coll_notarget_shard3_replica_n10/data/]
   [junit4]   2> 1127261 INFO  (qtp25501926-10039) [n:127.0.0.1:44971_solr c:replacenodetest_coll_notarget s:shard5 r:core_node20 x:replacenodetest_coll_notarget_shard5_replica_n18] o.a.s.s.IndexSchema [replacenodetest_coll_notarget_shard5_replica_n18] Schema name=cloud-dynamic
   [junit4]   2> 1127265 INFO  (qtp5920918-10043) [n:127.0.0.1:42189_solr c:replacenodetest_coll_notarget s:shard3 r:core_node11 x:replacenodetest_coll_notarget_shard3_replica_n8] o.a.s.s.IndexSchema Loaded schema cloud-dynamic/1.6 with uniqueid field id
   [junit4]   2> 1127265 INFO  (qtp5920918-10043) [n:127.0.0.1:42189_solr c:replacenodetest_coll_notarget s:shard3 r:core_node11 x:replacenodetest_coll_notarget_shard3_replica_n8] o.a.s.c.CoreContainer Creating SolrCore 'replacenodetest_coll_notarget_shard3_replica_n8' using configuration from collection replacenodetest_coll_notarget, trusted=true
   [junit4]   2> 1127266 INFO  (qtp5920918-10043) [n:127.0.0.1:42189_solr c:replacenodetest_coll_notarget s:shard3 r:core_node11 x:replacenodetest_coll_notarget_shard3_replica_n8] o.a.s.m.r.SolrJmxReporter JMX monitoring for 'solr_42189.solr.core.replacenodetest_coll_notarget.shard3.replica_n8' (registry 'solr.core.replacenodetest_coll_notarget.shard3.replica_n8') enabled at server: com.sun.jmx.mbeanserver.JmxMBeanServer@167038
   [junit4]   2> 1127266 INFO  (qtp5920918-10043) [n:127.0.0.1:42189_solr c:replacenodetest_coll_notarget s:shard3 r:core_node11 x:replacenodetest_coll_notarget_shard3_replica_n8] o.a.s.c.SolrCore solr.RecoveryStrategy.Builder
   [junit4]   2> 1127266 INFO  (qtp5920918-10043) [n:127.0.0.1:42189_solr c:replacenodetest_coll_notarget s:shard3 r:core_node11 x:replacenodetest_coll_notarget_shard3_replica_n8] o.a.s.c.SolrCore [[replacenodetest_coll_notarget_shard3_replica_n8] ] Opening new SolrCore at [/home/jenkins/workspace/Lucene-Solr-7.x-Linux/solr/build/solr-core/test/J1/temp/solr.cloud.ReplaceNodeNoTargetTest_96E1DD2C3A0CCDED-001/tempDir-001/node5/replacenodetest_coll_notarget_shard3_replica_n8], dataDir=[/home/jenkins/workspace/Lucene-Solr-7.x-Linux/solr/build/solr-core/test/J1/temp/solr.cloud.ReplaceNodeNoTargetTest_96E1DD2C3A0CCDED-001/tempDir-001/node5/./replacenodetest_coll_notarget_shard3_replica_n8/data/]
   [junit4]   2> 1127271 INFO  (qtp10348306-10050) [n:127.0.0.1:41123_solr c:replacenodetest_coll_notarget s:shard4 r:core_node15 x:replacenodetest_coll_notarget_shard4_replica_n12] o.a.s.s.IndexSchema Loaded schema cloud-dynamic/1.6 with uniqueid field id
   [junit4]   2> 1127271 INFO  (qtp10348306-10050) [n:127.0.0.1:41123_solr c:replacenodetest_coll_notarget s:shard4 r:core_node15 x:replacenodetest_coll_notarget_shard4_replica_n12] o.a.s.c.CoreContainer Creating SolrCore 'replacenodetest_coll_notarget_shard4_replica_n12' using configuration from collection replacenodetest_coll_notarget, trusted=true
   [junit4]   2> 1127274 INFO  (qtp10348306-10050) [n:127.0.0.1:41123_solr c:replacenodetest_coll_notarget s:shard4 r:core_node15 x:replacenodetest_coll_notarget_shard4_replica_n12] o.a.s.m.r.SolrJmxReporter JMX monitoring for 'solr_41123.solr.core.replacenodetest_coll_notarget.shard4.replica_n12' (registry 'solr.core.replacenodetest_coll_notarget.shard4.replica_n12') enabled at server: com.sun.jmx.mbeanserver.JmxMBeanServer@167038
   [junit4]   2> 1127274 INFO  (qtp10348306-10050) [n:127.0.0.1:41123_solr c:replacenodetest_coll_notarget s:shard4 r:core_node15 x:replacenodetest_coll_notarget_shard4_replica_n12] o.a.s.c.SolrCore solr.RecoveryStrategy.Builder
   [junit4]   2> 1127274 INFO  (qtp10348306-10050) [n:127.0.0.1:41123_solr c:replacenodetest_coll_notarget s:shard4 r:core_node15 x:replacenodetest_coll_notarget_shard4_replica_n12] o.a.s.c.SolrCore [[replacenodetest_coll_notarget_shard4_replica_n12] ] Opening new SolrCore at [/home/jenkins/workspace/Lucene-Solr-7.x-Linux/solr/build/solr-core/test/J1/temp/solr.cloud.ReplaceNodeNoTargetTest_96E1DD2C3A0CCDED-001/tempDir-001/node2/replacenodetest_coll_notarget_shard4_replica_n12], dataDir=[/home/jenkins/workspace/Lucene-Solr-7.x-Linux/solr/build/solr-core/test/J1/temp/solr.cloud.ReplaceNodeNoTargetTest_96E1DD2C3A0CCDED-001/tempDir-001/node2/./replacenodetest_coll_notarget_shard4_replica_n12/data/]
   [junit4]   2> 1127280 INFO  (qtp5920918-10040) [n:127.0.0.1:42189_solr c:replacenodetest_coll_notarget s:shard4 r:core_node17 x:replacenodetest_coll_notarget_shard4_replica_n14] o.a.s.s.IndexSchema [replacenodetest_coll_notarget_shard4_replica_n14] Schema name=cloud-dynamic
   [junit4]   2> 1127270 INFO  (qtp8598256-10203) [n:127.0.0.1:46399_solr c:replacenodetest_coll_notarget s:shard1 r:core_node5 x:replacenodetest_coll_notarget_shard1_replica_n2] o.a.s.s.IndexSchema [replacenodetest_coll_notarget_shard1_replica_n2] Schema name=cloud-dynamic
   [junit4]   2> 1127295 INFO  (qtp15660202-10053) [n:127.0.0.1:46505_solr c:replacenodetest_coll_notarget s:shard1 r:core_node3 x:replacenodetest_coll_notarget_shard1_replica_n1] o.a.s.s.IndexSchema [replacenodetest_coll_notarget_shard1_replica_n1] Schema name=cloud-dynamic
   [junit4]   2> 1127377 INFO  (qtp5920918-10040) [n:127.0.0.1:42189_solr c:replacenodetest_coll_notarget s:shard4 r:core_node17 x:replacenodetest_coll_notarget_shard4_replica_n14] o.a.s.s.IndexSchema Loaded schema cloud-dynamic/1.6 with uniqueid field id
   [junit4]   2> 1127377 INFO  (qtp5920918-10040) [n:127.0.0.1:42189_solr c:replacenodetest_coll_notarget s:shard4 r:core_node17 x:replacenodetest_coll_notarget_shard4_replica_n14] o.a.s.c.CoreContainer Creating SolrCore 'replacenodetest_coll_notarget_shard4_replica_n14' using configuration from collection replacenodetest_coll_notarget, trusted=true
   [junit4]   2> 1127378 INFO  (qtp5920918-10040) [n:127.0.0.1:42189_solr c:replacenodetest_coll_notarget s:shard4 r:core_node17 x:replacenodetest_coll_notarget_shard4_replica_n14] o.a.s.m.r.SolrJmxReporter JMX monitoring for 'solr_42189.solr.core.replacenodetest_coll_notarget.shard4.replica_n14' (registry 'solr.core.replacenodetest_coll_notarget.shard4.replica_n14') enabled at server: com.sun.jmx.mbeanserver.JmxMBeanServer@167038
   [junit4]   2> 1127378 INFO  (qtp5920918-10040) [n:127.0.0.1:42189_solr c:replacenodetest_coll_notarget s:shard4 r:core_node17 x:replacenodetest_coll_notarget_shard4_replica_n14] o.a.s.c.SolrCore solr.RecoveryStrategy.Builder
   [junit4]   2> 1127378 INFO  (qtp5920918-10040) [n:127.0.0.1:42189_solr c:replacenodetest_coll_notarget s:shard4 r:core_node17 x:replacenodetest_coll_notarget_shard4_replica_n14] o.a.s.c.SolrCore [[replacenodetest_coll_notarget_shard4_replica_n14] ] Opening new SolrCore at [/home/jenkins/workspace/Lucene-Solr-7.x-Linux/solr/build/solr-core/test/J1/temp/solr.cloud.ReplaceNodeNoTargetTest_96E1DD2C3A0CCDED-001/tempDir-001/node5/replacenodetest_coll_notarget_shard4_replica_n14], dataDir=[/home/jenkins/workspace/Lucene-Solr-7.x-Linux/solr/build/solr-core/test/J1/temp/solr.cloud.ReplaceNodeNoTargetTest_96E1DD2C3A0CCDED-001/tempDir-001/node5/./replacenodetest_coll_notarget_shard4_replica_n14/data/]
   [junit4]   2> 1127399 INFO  (qtp8598256-10203) [n:127.0.0.1:46399_solr c:replacenodetest_coll_notarget s:shard1 r:core_node5 x:replacenodetest_coll_notarget_shard1_replica_n2] o.a.s.s.IndexSchema Loaded schema cloud-dynamic/1.6 with uniqueid field id
   [junit4]   2> 1127399 INFO  (qtp8598256-10203) [n:127.0.0.1:46399_solr c:replacenodetest_coll_notarget s:shard1 r:core_node5 x:replacenodetest_coll_notarget_shard1_replica_n2] o.a.s.c.CoreContainer Creating SolrCore 'replacenodetest_coll_notarget_shard1_replica_n2' using configuration from collection replacenodetest_coll_notarget, trusted=true
   [junit4]   2> 1127400 INFO  (qtp8598256-10203) [n:127.0.0.1:46399_solr c:replacenodetest_coll_notarget s:shard1 r:core_node5 x:replacenodetest_coll_notarget_shard1_replica_n2] o.a.s.m.r.SolrJmxReporter JMX monitoring for 'solr_46399.solr.core.replacenodetest_coll_notarget.shard1.replica_n2' (registry 'solr.core.replacenodetest_coll_notarget.shard1.replica_n2') enabled at server: com.sun.jmx.mbeanserver.JmxMBeanServer@167038
   [junit4]   2> 1127400 INFO  (qtp8598256-10203) [n:127.0.0.1:46399_solr c:replacenodetest_coll_notarget s:shard1 r:core_node5 x:replacenodetest_coll_notarget_shard1_replica_n2] o.a.s.c.SolrCore solr.RecoveryStrategy.Builder
   [junit4]   2> 1127400 INFO  (qtp8598256-10203) [n:127.0.0.1:46399_solr c:replacenodetest_coll_notarget s:shard1 r:core_node5 x:replacenodetest_coll_notarget_shard1_replica_n2] o.a.s.c.SolrCore [[replacenodetest_coll_notarget_shard1_replica_n2] ] Opening new SolrCore at [/home/jenkins/workspace/Lucene-Solr-7.x-Linux/solr/build/solr-core/test/J1/temp/solr.cloud.ReplaceNodeNoTargetTest_96E1DD2C3A0CCDED-001/tempDir-001/node4/replacenodetest_coll_notarget_shard1_replica_n2], dataDir=[/home/jenkins/workspace/Lucene-Solr-7.x-Linux/solr/build/solr-core/test/J1/temp/solr.cloud.ReplaceNodeNoTargetTest_96E1DD2C3A0CCDED-001/tempDir-001/node4/./replacenodetest_coll_notarget_shard1_replica_n2/data/]
   [junit4]   2> 1127402 INFO  (qtp15660202-10053) [n:127.0.0.1:46505_solr c:replacenodetest_coll_notarget s:shard1 r:core_node3 x:replacenodetest_coll_notarget_shard1_replica_n1] o.a.s.s.IndexSchema Loaded schema cloud-dynamic/1.6 with uniqueid field id
   [junit4]   2> 1127402 INFO  (qtp15660202-10053) [n:127.0.0.1:46505_solr c:replacenodetest_coll_notarget s:shard1 r:core_node3 x:replacenodetest_coll_notarget_shard1_replica_n1] o.a.s.c.CoreContainer Creating SolrCore 'replacenodetest_coll_notarget_shard1_replica_n1' using configuration from collection replacenodetest_coll_notarget, trusted=true
   [junit4]   2> 1127403 INFO  (qtp15660202-10053) [n:127.0.0.1:46505_solr c:replacenodetest_coll_notarget s:shard1 r:core_node3 x:replacenodetest_coll_notarget_shard1_replica_n1] o.a.s.m.r.SolrJmxReporter JMX monitoring for 'solr_46505.solr.core.replacenodetest_coll_notarget.shard1.replica_n1' (registry 'solr.core.replacenodetest_coll_notarget.shard1.replica_n1') enabled at server: com.sun.jmx.mbeanserver.JmxMBeanServer@167038
   [junit4]   2> 1127403 INFO  (qtp15660202-10053) [n:127.0.0.1:46505_solr c:replacenodetest_coll_notarget s:shard1 r:core_node3 x:replacenodetest_coll_notarget_shard1_replica_n1] o.a.s.c.SolrCore solr.RecoveryStrategy.Builder
   [junit4]   2> 1127403 INFO  (qtp15660202-10053) [n:127.0.0.1:46505_solr c:replacenodetest_coll_notarget s:shard1 r:core_node3 x:replacenodetest_coll_notarget_shard1_replica_n1] o.a.s.c.SolrCore [[replacenodetest_coll_notarget_shard1_replica_n1] ] Opening new SolrCore at [/home/jenkins/workspace/Lucene-Solr-7.x-Linux/solr/build/solr-core/test/J1/temp/solr.cloud.ReplaceNodeNoTargetTest_96E1DD2C3A0CCDED-001/tempDir-001/node3/replacenodetest_coll_notarget_shard1_replica_n1], dataDir=[/home/jenkins/workspace/Lucene-Solr-7.x-Linux/solr/build/solr-core/test/J1/temp/solr.cloud.ReplaceNodeNoTargetTest_96E1DD2C3A0CCDED-001/tempDir-001/node3/./replacenodetest_coll_notarget_shard1_replica_n1/data/]
   [junit4]   2> 1127413 INFO  (qtp28123253-10036) [n:127.0.0.1:44369_solr c:replacenodetest_coll_notarget s:shard5 r:core_node19 x:replacenodetest_coll_notarget_shard5_replica_n16] o.a.s.s.IndexSchema Loaded schema cloud-dynamic/1.6 with uniqueid field id
   [junit4]   2> 1127413 INFO  (qtp28123253-10036) [n:127.0.0.1:44369_solr c:replacenodetest_coll_notarget s:shard5 r:core_node19 x:replacenodetest_coll_notarget_shard5_replica_n16] o.a.s.c.CoreContainer Creating SolrCore 'replacenodetest_coll_notarget_shard5_replica_n16' using configuration from collection replacenodetest_coll_notarget, trusted=true
   [junit4]   2> 1127414 INFO  (qtp25501926-10039) [n:127.0.0.1:44971_solr c:replacenodetest_coll_notarget s:shard5 r:core_node20 x:replacenodetest_coll_notarget_shard5_replica_n18] o.a.s.s.IndexSchema Loaded schema cloud-dynamic/1.6 with uniqueid field id
   [junit4]   2> 1127414 INFO  (qtp28123253-10036) [n:127.0.0.1:44369_solr c:replacenodetest_coll_notarget s:shard5 r:core_node19 x:replacenodetest_coll_notarget_shard5_replica_n16] o.a.s.m.r.SolrJmxReporter JMX monitoring for 'solr_44369.solr.core.replacenodetest_coll_notarget.shard5.replica_n16' (registry 'solr.core.replacenodetest_coll_notarget.shard5.replica_n16') enabled at server: com.sun.jmx.mbeanserver.JmxMBeanServer@167038
   [junit4]   2> 1127414 INFO  (qtp25501926-10039) [n:127.0.0.1:44971_solr c:replacenodetest_coll_notarget s:shard5 r:core_node20 x:replacenodetest_coll_notarget_shard5_replica_n18] o.a.s.c.CoreContainer Creating SolrCore 'replacenodetest_coll_notarget_shard5_replica_n18' using configuration from collection replacenodetest_coll_notarget, trusted=true
   [junit4]   2> 1127414 INFO  (qtp28123253-10036) [n:127.0.0.1:44369_solr c:replacenodetest_coll_notarget s:shard5 r:core_node19 x:replacenodetest_coll_notarget_shard5_replica_n16] o.a.s.c.SolrCore solr.RecoveryStrategy.Builder
   [junit4]   2> 1127414 INFO  (qtp28123253-10036) [n:127.0.0.1:44369_solr c:replacenodetest_coll_notarget s:shard5 r:core_node19 x:replacenodetest_coll_notarget_shard5_replica_n16] o.a.s.c.SolrCore [[replacenodetest_coll_notarget_shard5_replica_n16] ] Opening new SolrCore at [/home/jenkins/workspace/Lucene-Solr-7.x-Linux/solr/build/solr-core/test/J1/temp/solr.cloud.ReplaceNodeNoTargetTest_96E1DD2C3A0CCDED-001/tempDir-001/node1/replacenodetest_coll_notarget_shard5_replica_n16], dataDir=[/home/jenkins/workspace/Lucene-Solr-7.x-Linux/solr/build/solr-core/test/J1/temp/solr.cloud.ReplaceNodeNoTargetTest_96E1DD2C3A0CCDED-001/tempDir-001/node1/./replacenodetest_coll_notarget_shard5_replica_n16/data/]
   [junit4]   2> 1127422 INFO  (qtp25501926-10039) [n:127.0.0.1:44971_solr c:replacenodetest_coll_notarget s:shard5 r:core_node20 x:replacenodetest_coll_notarget_shard5_replica_n18] o.a.s.m.r.SolrJmxReporter JMX monitoring for 'solr_44971.solr.core.replacenodetest_coll_notarget.shard5.replica_n18' (registry 'solr.core.replacenodetest_coll_notarget.shard5.replica_n18') enabled at server: com.sun.jmx.mbeanserver.JmxMBeanServer@167038
   [junit4]   2> 1127423 INFO  (qtp25501926-10039) [n:127.0.0.1:44971_solr c:replacenodetest_coll_notarget s:shard5 r:core_node20 x:replacenodetest_coll_notarget_shard5_replica_n18] o.a.s.c.SolrCore solr.RecoveryStrategy.Builder
   [junit4]   2> 1127423 INFO  (qtp25501926-10039) [n:127.0.0.1:44971_solr c:replacenodetest_coll_notarget s:shard5 r:core_node20 x:replacenodetest_coll_notarget_shard5_replica_n18] o.a.s.c.SolrCore [[replacenodetest_coll_notarget_shard5_replica_n18] ] Opening new SolrCore at [/home/jenkins/workspace/Lucene-Solr-7.x-Linux/solr/build/solr-core/test/J1/temp/solr.cloud.ReplaceNodeNoTargetTest_96E1DD2C3A0CCDED-001/tempDir-001/node6/replacenodetest_coll_notarget_shard5_replica_n18], dataDir=[/home/jenkins/workspace/Lucene-Solr-7.x-Linux/solr/build/solr-core/test/J1/temp/solr.cloud.ReplaceNodeNoTargetTest_96E1DD2C3A0CCDED-001/tempDir-001/node6/./replacenodetest_coll_notarget_shard5_replica_n18/data/]
   [junit4]   2> 1127568 INFO  (qtp25501926-10076) [n:127.0.0.1:44971_solr c:replacenodetest_coll_notarget s:shard2 r:core_node7 x:replacenodetest_coll_notarget_shard2_replica_n4] o.a.s.u.UpdateHandler Using UpdateLog implementation: org.apache.solr.upda

[...truncated too long message...]

127.0.0.1:39977_solr
   [junit4]   2> 3551520 WARN  (OverseerAutoScalingTriggerThread-72071128471961607-127.0.0.1:39977_solr-n_0000000000) [n:127.0.0.1:39977_solr    ] o.a.s.c.a.OverseerTriggerThread OverseerTriggerThread woken up but we are closed, exiting.
   [junit4]   2> 3551521 DEBUG (jetty-closer-7729-thread-3) [    ] o.a.s.c.a.OverseerTriggerThread OverseerTriggerThread has been closed explicitly
   [junit4]   2> 3551521 WARN  (NIOServerCxn.Factory:0.0.0.0/0.0.0.0:0) [    ] o.a.z.s.NIOServerCnxn Unable to read additional data from client sessionid 0x1000c4f3b220007, likely client has closed socket
   [junit4]   2> 3551522 INFO  (zkCallback-7754-thread-1-processing-n:127.0.0.1:36551_solr) [n:127.0.0.1:36551_solr    ] o.a.s.c.OverseerElectionContext I am going to be the leader 127.0.0.1:36551_solr
   [junit4]   2> 3551522 INFO  (jetty-closer-7729-thread-3) [    ] o.e.j.s.h.ContextHandler Stopped o.e.j.s.ServletContextHandler@1a69c4d{/solr,null,UNAVAILABLE}
   [junit4]   2> 3551523 INFO  (jetty-closer-7729-thread-3) [    ] o.e.j.s.session Stopped scavenging
   [junit4]   2> 3551523 INFO  (jetty-closer-7729-thread-1) [    ] o.e.j.s.h.ContextHandler Stopped o.e.j.s.ServletContextHandler@c811d1{/solr,null,UNAVAILABLE}
   [junit4]   2> 3551524 INFO  (jetty-closer-7729-thread-1) [    ] o.e.j.s.session Stopped scavenging
   [junit4]   2> 3551529 INFO  (coreCloseExecutor-7826-thread-1) [n:127.0.0.1:36551_solr c:AutoscalingHistoryHandlerTest_collection s:shard1 r:core_node6 x:AutoscalingHistoryHandlerTest_collection_shard1_replica_n4] o.a.s.m.SolrMetricManager Closing metric reporters for registry=solr.collection.AutoscalingHistoryHandlerTest_collection.shard1.leader, tag=30293559
   [junit4]   2> 3551529 INFO  (coreCloseExecutor-7826-thread-2) [n:127.0.0.1:36551_solr c:.system s:shard1 r:core_node6 x:.system_shard1_replica_n4] o.a.s.m.SolrMetricManager Closing metric reporters for registry=solr.collection..system.shard1.leader, tag=22490902
   [junit4]   2> 3551534 INFO  (jetty-closer-7729-thread-2) [    ] o.e.j.s.h.ContextHandler Stopped o.e.j.s.ServletContextHandler@1f3aab6{/solr,null,UNAVAILABLE}
   [junit4]   2> 3551535 INFO  (jetty-closer-7729-thread-2) [    ] o.e.j.s.session Stopped scavenging
   [junit4]   2> 3551535 ERROR (SUITE-AutoscalingHistoryHandlerTest-seed#[96E1DD2C3A0CCDED]-worker) [    ] o.a.z.s.ZooKeeperServer ZKShutdownHandler is not registered, so ZooKeeper server won't take any action on ERROR or SHUTDOWN server state changes
   [junit4]   2> 3551535 INFO  (SUITE-AutoscalingHistoryHandlerTest-seed#[96E1DD2C3A0CCDED]-worker) [    ] o.a.s.c.ZkTestServer connecting to 127.0.0.1:35429 35429
   [junit4]   2> 3558463 INFO  (Thread-7881) [    ] o.a.s.c.ZkTestServer connecting to 127.0.0.1:35429 35429
   [junit4]   2> 3558465 WARN  (Thread-7881) [    ] o.a.s.c.ZkTestServer Watch limit violations: 
   [junit4]   2> Maximum concurrent create/delete watches above limit:
   [junit4]   2> 
   [junit4]   2> 	11	/solr/aliases.json
   [junit4]   2> 	9	/solr/collections/AutoscalingHistoryHandlerTest_collection/terms/shard1
   [junit4]   2> 	9	/solr/collections/.system/terms/shard1
   [junit4]   2> 	4	/solr/security.json
   [junit4]   2> 	3	/solr/configs/.system
   [junit4]   2> 	3	/solr/configs/AutoscalingHistoryHandlerTest_collection.AUTOCREATED/managed-schema
   [junit4]   2> 	3	/solr/configs/AutoscalingHistoryHandlerTest_collection.AUTOCREATED
   [junit4]   2> 	3	/solr/configs/.system/managed-schema
   [junit4]   2> 
   [junit4]   2> Maximum concurrent data watches above limit:
   [junit4]   2> 
   [junit4]   2> 	22	/solr/collections/.system/state.json
   [junit4]   2> 	22	/solr/collections/AutoscalingHistoryHandlerTest_collection/state.json
   [junit4]   2> 	11	/solr/clusterprops.json
   [junit4]   2> 	11	/solr/clusterstate.json
   [junit4]   2> 	2	/solr/collections/AutoscalingHistoryHandlerTest_collection/leader_elect/shard1/election/72071128471961607-core_node3-n_0000000000
   [junit4]   2> 	2	/solr/overseer_elect/election/72071128471961607-127.0.0.1:39977_solr-n_0000000000
   [junit4]   2> 
   [junit4]   2> Maximum concurrent children watches above limit:
   [junit4]   2> 
   [junit4]   2> 	11	/solr/live_nodes
   [junit4]   2> 	11	/solr/collections
   [junit4]   2> 
   [junit4]   2> NOTE: leaving temporary files on disk at: /home/jenkins/workspace/Lucene-Solr-7.x-Linux/solr/build/solr-core/test/J2/temp/solr.handler.admin.AutoscalingHistoryHandlerTest_96E1DD2C3A0CCDED-001
   [junit4]   2> NOTE: test params are: codec=Asserting(Lucene70): {action_s=PostingsFormat(name=LuceneVarGapFixedInterval), event.source_s=BlockTreeOrds(blocksize=128), type=PostingsFormat(name=LuceneVarGapFixedInterval), before.actions_ss=BlockTreeOrds(blocksize=128), event.property._enqueue_time__ss=PostingsFormat(name=LuceneVarGapFixedInterval), after.actions_ss=PostingsFormat(name=LuceneFixedGap), stage_s=PostingsFormat(name=LuceneVarGapFixedInterval), event.id_s=PostingsFormat(name=LuceneVarGapDocFreqInterval), event.property.eventTimes_ss=PostingsFormat(name=LuceneVarGapFixedInterval), source_s=PostingsFormat(name=LuceneVarGapDocFreqInterval), event.type_s=PostingsFormat(name=LuceneVarGapFixedInterval), id=PostingsFormat(name=LuceneVarGapDocFreqInterval), event.property.nodeNames_ss=PostingsFormat(name=LuceneVarGapFixedInterval)}, docValues:{_version_=DocValuesFormat(name=Direct), event.time_l=DocValuesFormat(name=Direct), timestamp=DocValuesFormat(name=Direct)}, maxPointsInLeafNode=2001, maxMBSortInHeap=6.514971942014253, sim=RandomSimilarity(queryNorm=false): {}, locale=es-HN, timezone=America/Knox_IN
   [junit4]   2> NOTE: Linux 4.13.0-32-generic i386/Oracle Corporation 1.8.0_144 (32-bit)/cpus=8,threads=1,free=181253264,total=536870912
   [junit4]   2> NOTE: All tests run in this JVM: [TestClusterStateProvider, ImplicitSnitchTest, ConnectionReuseTest, TestTrackingShardHandlerFactory, TestCloudManagedSchema, TestCoreDiscovery, ClusterStateUpdateTest, SpatialFilterTest, TestQueryTypes, TestNonDefinedSimilarityFactory, AddSchemaFieldsUpdateProcessorFactoryTest, LukeRequestHandlerTest, WordBreakSolrSpellCheckerTest, AnalyticsMergeStrategyTest, DocValuesMultiTest, CacheHeaderTest, SolrMetricReporterTest, TermVectorComponentTest, DistributedSuggestComponentTest, ClassificationUpdateProcessorFactoryTest, StatelessScriptUpdateProcessorFactoryTest, TestDefaultStatsCache, DisMaxRequestHandlerTest, TestTolerantSearch, PeerSyncWithIndexFingerprintCachingTest, ConjunctionSolrSpellCheckerTest, NumericFieldsTest, VMParamsZkACLAndCredentialsProvidersTest, DateMathParserTest, TestApiFramework, TestFieldCacheWithThreads, V2ApiIntegrationTest, TestCoreAdminApis, RegexBytesRefFilterTest, TestBlobHandler, TestLMJelinekMercerSimilarityFactory, ReturnFieldsTest, AnalysisErrorHandlingTest, TestLockTree, DateFieldTest, LeaderElectionTest, TestNodeAddedTrigger, TestMacros, TestManagedResource, MoveReplicaHDFSTest, TestSerializedLuceneMatchVersion, TestRequestStatusCollectionAPI, BooleanFieldTest, ParsingFieldUpdateProcessorsTest, TestDynamicFieldResource, TestFieldTypeCollectionResource, SpellPossibilityIteratorTest, TestDistributedMissingSort, SharedFSAutoReplicaFailoverTest, TestShortCircuitedRequests, HdfsChaosMonkeyNothingIsSafeTest, TestTlogReplica, BasicAuthStandaloneTest, ExitableDirectoryReaderTest, LIRRollingUpdatesTest, BigEndianAscendingWordSerializerTest, TestZkAclsWithHadoopAuth, TestNumericTokenStream, MigrateRouteKeyTest, SuggestComponentContextFilterQueryTest, TestFieldCacheSort, TestRandomCollapseQParserPlugin, TestAnalyzedSuggestions, MultiTermTest, SolrCmdDistributorTest, TemplateUpdateProcessorTest, TestBackupRepositoryFactory, TestValueSourceCache, TestRecoveryHdfs, TestFiltering, AutoScalingHandlerTest, ConnectionManagerTest, TestSchemalessBufferedUpdates, TestUtilizeNode, TestScoreJoinQPScore, TestExecutePlanAction, OverseerStatusTest, DirectSolrSpellCheckerTest, TestCoreContainer, CloneFieldUpdateProcessorFactoryTest, TestExpandComponent, RollingRestartTest, RecoveryZkTest, NodeAddedTriggerTest, DistanceFunctionTest, TestExactStatsCache, SuggesterTSTTest, TestSimDistributedQueue, TestClusterProperties, TestAtomicUpdateErrorCases, TestRandomDVFaceting, ShowFileRequestHandlerTest, TestSolrCoreParser, DeleteInactiveReplicaTest, TestInfoStreamLogging, DistribCursorPagingTest, NotRequiredUniqueKeyTest, TestBlendedInfixSuggestions, UnloadDistributedZkTest, TestDelegationWithHadoopAuth, TestConfigSetProperties, BasicDistributedZk2Test, TestFastWriter, TestReloadAndDeleteDocs, DistributedFacetPivotLongTailTest, RecoveryAfterSoftCommitTest, PreAnalyzedFieldTest, CoreAdminHandlerTest, TestCloudPseudoReturnFields, TestRangeQuery, SolrSlf4jReporterTest, HDFSCollectionsAPITest, NoCacheHeaderTest, TestClusterStateMutator, TestSolrDeletionPolicy2, TestCloudInspectUtil, TestJmxIntegration, UniqFieldsUpdateProcessorFactoryTest, PingRequestHandlerTest, BasicDistributedZkTest, TestConfigSetsAPIZkFailure, TestDistribDocBasedVersion, TestLeaderElectionWithEmptyReplica, TestOnReconnectListenerSupport, TestRandomRequestDistribution, TestRebalanceLeaders, TestSolrCloudWithKerberosAlt, TestStressLiveNodes, TestTolerantUpdateProcessorCloud, TlogReplayBufferedWhileIndexingTest, AssignTest, CollectionsAPIDistributedZkTest, HdfsAutoAddReplicasIntegrationTest, CdcrReplicationDistributedZkTest, CdcrReplicationHandlerTest, CdcrRequestHandlerTest, CdcrVersionReplicationTest, HdfsBasicDistributedZkTest, HdfsRecoverLeaseTest, HdfsSyncSliceTest, HdfsUnloadDistributedZkTest, RuleEngineTest, BlobRepositoryCloudTest, CachingDirectoryFactoryTest, TestCorePropertiesReload, TestImplicitCoreProperties, TestInitParams, TestNRTOpen, TestShardHandlerFactory, TestSolrConfigHandler, TestSolrXml, TestSolrCoreSnapshots, TestCoreBackup, TestHdfsBackupRestoreCore, TestSQLHandlerNonCloud, TestSolrConfigHandlerCloud, V2StandaloneTest, AutoscalingHistoryHandlerTest]
   [junit4] Completed [628/773 (3!)] on J2 in 20.66s, 1 test, 1 failure <<< FAILURES!

[...truncated 44504 lines...]

Mime
View raw message