lucene-dev mailing list archives

Site index · List index
Message view « Date » · « Thread »
Top « Date » · « Thread »
From Policeman Jenkins Server <jenk...@thetaphi.de>
Subject [JENKINS] Lucene-Solr-master-Linux (64bit/jdk-9.0.1) - Build # 21375 - Still Unstable!
Date Thu, 01 Feb 2018 11:55:09 GMT
Build: https://jenkins.thetaphi.de/job/Lucene-Solr-master-Linux/21375/
Java: 64bit/jdk-9.0.1 -XX:-UseCompressedOops -XX:+UseG1GC

3 tests failed.
FAILED:  org.apache.solr.cloud.ReplaceNodeNoTargetTest.test

Error Message:


Stack Trace:
java.lang.AssertionError
	at __randomizedtesting.SeedInfo.seed([E3701F59287F00B5:6B24208386836D4D]:0)
	at org.junit.Assert.fail(Assert.java:92)
	at org.junit.Assert.assertTrue(Assert.java:43)
	at org.junit.Assert.assertTrue(Assert.java:54)
	at org.apache.solr.cloud.ReplaceNodeNoTargetTest.test(ReplaceNodeNoTargetTest.java:92)
	at java.base/jdk.internal.reflect.NativeMethodAccessorImpl.invoke0(Native Method)
	at java.base/jdk.internal.reflect.NativeMethodAccessorImpl.invoke(NativeMethodAccessorImpl.java:62)
	at java.base/jdk.internal.reflect.DelegatingMethodAccessorImpl.invoke(DelegatingMethodAccessorImpl.java:43)
	at java.base/java.lang.reflect.Method.invoke(Method.java:564)
	at com.carrotsearch.randomizedtesting.RandomizedRunner.invoke(RandomizedRunner.java:1737)
	at com.carrotsearch.randomizedtesting.RandomizedRunner$8.evaluate(RandomizedRunner.java:934)
	at com.carrotsearch.randomizedtesting.RandomizedRunner$9.evaluate(RandomizedRunner.java:970)
	at com.carrotsearch.randomizedtesting.RandomizedRunner$10.evaluate(RandomizedRunner.java:984)
	at com.carrotsearch.randomizedtesting.rules.SystemPropertiesRestoreRule$1.evaluate(SystemPropertiesRestoreRule.java:57)
	at org.apache.lucene.util.TestRuleSetupTeardownChained$1.evaluate(TestRuleSetupTeardownChained.java:49)
	at org.apache.lucene.util.AbstractBeforeAfterRule$1.evaluate(AbstractBeforeAfterRule.java:45)
	at org.apache.lucene.util.TestRuleThreadAndTestName$1.evaluate(TestRuleThreadAndTestName.java:48)
	at org.apache.lucene.util.TestRuleIgnoreAfterMaxFailures$1.evaluate(TestRuleIgnoreAfterMaxFailures.java:64)
	at org.apache.lucene.util.TestRuleMarkFailure$1.evaluate(TestRuleMarkFailure.java:47)
	at com.carrotsearch.randomizedtesting.rules.StatementAdapter.evaluate(StatementAdapter.java:36)
	at com.carrotsearch.randomizedtesting.ThreadLeakControl$StatementRunner.run(ThreadLeakControl.java:368)
	at com.carrotsearch.randomizedtesting.ThreadLeakControl.forkTimeoutingTask(ThreadLeakControl.java:817)
	at com.carrotsearch.randomizedtesting.ThreadLeakControl$3.evaluate(ThreadLeakControl.java:468)
	at com.carrotsearch.randomizedtesting.RandomizedRunner.runSingleTest(RandomizedRunner.java:943)
	at com.carrotsearch.randomizedtesting.RandomizedRunner$5.evaluate(RandomizedRunner.java:829)
	at com.carrotsearch.randomizedtesting.RandomizedRunner$6.evaluate(RandomizedRunner.java:879)
	at com.carrotsearch.randomizedtesting.RandomizedRunner$7.evaluate(RandomizedRunner.java:890)
	at com.carrotsearch.randomizedtesting.rules.StatementAdapter.evaluate(StatementAdapter.java:36)
	at com.carrotsearch.randomizedtesting.rules.SystemPropertiesRestoreRule$1.evaluate(SystemPropertiesRestoreRule.java:57)
	at org.apache.lucene.util.AbstractBeforeAfterRule$1.evaluate(AbstractBeforeAfterRule.java:45)
	at com.carrotsearch.randomizedtesting.rules.StatementAdapter.evaluate(StatementAdapter.java:36)
	at org.apache.lucene.util.TestRuleStoreClassName$1.evaluate(TestRuleStoreClassName.java:41)
	at com.carrotsearch.randomizedtesting.rules.NoShadowingOrOverridesOnMethodsRule$1.evaluate(NoShadowingOrOverridesOnMethodsRule.java:40)
	at com.carrotsearch.randomizedtesting.rules.NoShadowingOrOverridesOnMethodsRule$1.evaluate(NoShadowingOrOverridesOnMethodsRule.java:40)
	at com.carrotsearch.randomizedtesting.rules.StatementAdapter.evaluate(StatementAdapter.java:36)
	at com.carrotsearch.randomizedtesting.rules.StatementAdapter.evaluate(StatementAdapter.java:36)
	at org.apache.lucene.util.TestRuleAssertionsRequired$1.evaluate(TestRuleAssertionsRequired.java:53)
	at org.apache.lucene.util.TestRuleMarkFailure$1.evaluate(TestRuleMarkFailure.java:47)
	at org.apache.lucene.util.TestRuleIgnoreAfterMaxFailures$1.evaluate(TestRuleIgnoreAfterMaxFailures.java:64)
	at org.apache.lucene.util.TestRuleIgnoreTestSuites$1.evaluate(TestRuleIgnoreTestSuites.java:54)
	at com.carrotsearch.randomizedtesting.rules.StatementAdapter.evaluate(StatementAdapter.java:36)
	at com.carrotsearch.randomizedtesting.ThreadLeakControl$StatementRunner.run(ThreadLeakControl.java:368)
	at java.base/java.lang.Thread.run(Thread.java:844)


FAILED:  org.apache.solr.cloud.autoscaling.TriggerIntegrationTest.testNodeLostTriggerRestoreState

Error Message:
The trigger did not fire at all

Stack Trace:
java.lang.AssertionError: The trigger did not fire at all
	at __randomizedtesting.SeedInfo.seed([E3701F59287F00B5:C88FCA02B2071565]:0)
	at org.junit.Assert.fail(Assert.java:93)
	at org.junit.Assert.assertTrue(Assert.java:43)
	at org.apache.solr.cloud.autoscaling.TriggerIntegrationTest.testNodeLostTriggerRestoreState(TriggerIntegrationTest.java:368)
	at java.base/jdk.internal.reflect.NativeMethodAccessorImpl.invoke0(Native Method)
	at java.base/jdk.internal.reflect.NativeMethodAccessorImpl.invoke(NativeMethodAccessorImpl.java:62)
	at java.base/jdk.internal.reflect.DelegatingMethodAccessorImpl.invoke(DelegatingMethodAccessorImpl.java:43)
	at java.base/java.lang.reflect.Method.invoke(Method.java:564)
	at com.carrotsearch.randomizedtesting.RandomizedRunner.invoke(RandomizedRunner.java:1737)
	at com.carrotsearch.randomizedtesting.RandomizedRunner$8.evaluate(RandomizedRunner.java:934)
	at com.carrotsearch.randomizedtesting.RandomizedRunner$9.evaluate(RandomizedRunner.java:970)
	at com.carrotsearch.randomizedtesting.RandomizedRunner$10.evaluate(RandomizedRunner.java:984)
	at com.carrotsearch.randomizedtesting.rules.SystemPropertiesRestoreRule$1.evaluate(SystemPropertiesRestoreRule.java:57)
	at org.apache.lucene.util.TestRuleSetupTeardownChained$1.evaluate(TestRuleSetupTeardownChained.java:49)
	at org.apache.lucene.util.AbstractBeforeAfterRule$1.evaluate(AbstractBeforeAfterRule.java:45)
	at org.apache.lucene.util.TestRuleThreadAndTestName$1.evaluate(TestRuleThreadAndTestName.java:48)
	at org.apache.lucene.util.TestRuleIgnoreAfterMaxFailures$1.evaluate(TestRuleIgnoreAfterMaxFailures.java:64)
	at org.apache.lucene.util.TestRuleMarkFailure$1.evaluate(TestRuleMarkFailure.java:47)
	at com.carrotsearch.randomizedtesting.rules.StatementAdapter.evaluate(StatementAdapter.java:36)
	at com.carrotsearch.randomizedtesting.ThreadLeakControl$StatementRunner.run(ThreadLeakControl.java:368)
	at com.carrotsearch.randomizedtesting.ThreadLeakControl.forkTimeoutingTask(ThreadLeakControl.java:817)
	at com.carrotsearch.randomizedtesting.ThreadLeakControl$3.evaluate(ThreadLeakControl.java:468)
	at com.carrotsearch.randomizedtesting.RandomizedRunner.runSingleTest(RandomizedRunner.java:943)
	at com.carrotsearch.randomizedtesting.RandomizedRunner$5.evaluate(RandomizedRunner.java:829)
	at com.carrotsearch.randomizedtesting.RandomizedRunner$6.evaluate(RandomizedRunner.java:879)
	at com.carrotsearch.randomizedtesting.RandomizedRunner$7.evaluate(RandomizedRunner.java:890)
	at com.carrotsearch.randomizedtesting.rules.StatementAdapter.evaluate(StatementAdapter.java:36)
	at com.carrotsearch.randomizedtesting.rules.SystemPropertiesRestoreRule$1.evaluate(SystemPropertiesRestoreRule.java:57)
	at org.apache.lucene.util.AbstractBeforeAfterRule$1.evaluate(AbstractBeforeAfterRule.java:45)
	at com.carrotsearch.randomizedtesting.rules.StatementAdapter.evaluate(StatementAdapter.java:36)
	at org.apache.lucene.util.TestRuleStoreClassName$1.evaluate(TestRuleStoreClassName.java:41)
	at com.carrotsearch.randomizedtesting.rules.NoShadowingOrOverridesOnMethodsRule$1.evaluate(NoShadowingOrOverridesOnMethodsRule.java:40)
	at com.carrotsearch.randomizedtesting.rules.NoShadowingOrOverridesOnMethodsRule$1.evaluate(NoShadowingOrOverridesOnMethodsRule.java:40)
	at com.carrotsearch.randomizedtesting.rules.StatementAdapter.evaluate(StatementAdapter.java:36)
	at com.carrotsearch.randomizedtesting.rules.StatementAdapter.evaluate(StatementAdapter.java:36)
	at org.apache.lucene.util.TestRuleAssertionsRequired$1.evaluate(TestRuleAssertionsRequired.java:53)
	at org.apache.lucene.util.TestRuleMarkFailure$1.evaluate(TestRuleMarkFailure.java:47)
	at org.apache.lucene.util.TestRuleIgnoreAfterMaxFailures$1.evaluate(TestRuleIgnoreAfterMaxFailures.java:64)
	at org.apache.lucene.util.TestRuleIgnoreTestSuites$1.evaluate(TestRuleIgnoreTestSuites.java:54)
	at com.carrotsearch.randomizedtesting.rules.StatementAdapter.evaluate(StatementAdapter.java:36)
	at com.carrotsearch.randomizedtesting.ThreadLeakControl$StatementRunner.run(ThreadLeakControl.java:368)
	at java.base/java.lang.Thread.run(Thread.java:844)


FAILED:  org.apache.solr.handler.admin.AutoscalingHistoryHandlerTest.testHistory

Error Message:
expected:<5> but was:<0>

Stack Trace:
java.lang.AssertionError: expected:<5> but was:<0>
	at __randomizedtesting.SeedInfo.seed([E3701F59287F00B5:8E8CBBA49237FFB2]:0)
	at org.junit.Assert.fail(Assert.java:93)
	at org.junit.Assert.failNotEquals(Assert.java:647)
	at org.junit.Assert.assertEquals(Assert.java:128)
	at org.junit.Assert.assertEquals(Assert.java:472)
	at org.junit.Assert.assertEquals(Assert.java:456)
	at org.apache.solr.handler.admin.AutoscalingHistoryHandlerTest.testHistory(AutoscalingHistoryHandlerTest.java:244)
	at java.base/jdk.internal.reflect.NativeMethodAccessorImpl.invoke0(Native Method)
	at java.base/jdk.internal.reflect.NativeMethodAccessorImpl.invoke(NativeMethodAccessorImpl.java:62)
	at java.base/jdk.internal.reflect.DelegatingMethodAccessorImpl.invoke(DelegatingMethodAccessorImpl.java:43)
	at java.base/java.lang.reflect.Method.invoke(Method.java:564)
	at com.carrotsearch.randomizedtesting.RandomizedRunner.invoke(RandomizedRunner.java:1737)
	at com.carrotsearch.randomizedtesting.RandomizedRunner$8.evaluate(RandomizedRunner.java:934)
	at com.carrotsearch.randomizedtesting.RandomizedRunner$9.evaluate(RandomizedRunner.java:970)
	at com.carrotsearch.randomizedtesting.RandomizedRunner$10.evaluate(RandomizedRunner.java:984)
	at com.carrotsearch.randomizedtesting.rules.SystemPropertiesRestoreRule$1.evaluate(SystemPropertiesRestoreRule.java:57)
	at org.apache.lucene.util.TestRuleSetupTeardownChained$1.evaluate(TestRuleSetupTeardownChained.java:49)
	at org.apache.lucene.util.AbstractBeforeAfterRule$1.evaluate(AbstractBeforeAfterRule.java:45)
	at org.apache.lucene.util.TestRuleThreadAndTestName$1.evaluate(TestRuleThreadAndTestName.java:48)
	at org.apache.lucene.util.TestRuleIgnoreAfterMaxFailures$1.evaluate(TestRuleIgnoreAfterMaxFailures.java:64)
	at org.apache.lucene.util.TestRuleMarkFailure$1.evaluate(TestRuleMarkFailure.java:47)
	at com.carrotsearch.randomizedtesting.rules.StatementAdapter.evaluate(StatementAdapter.java:36)
	at com.carrotsearch.randomizedtesting.ThreadLeakControl$StatementRunner.run(ThreadLeakControl.java:368)
	at com.carrotsearch.randomizedtesting.ThreadLeakControl.forkTimeoutingTask(ThreadLeakControl.java:817)
	at com.carrotsearch.randomizedtesting.ThreadLeakControl$3.evaluate(ThreadLeakControl.java:468)
	at com.carrotsearch.randomizedtesting.RandomizedRunner.runSingleTest(RandomizedRunner.java:943)
	at com.carrotsearch.randomizedtesting.RandomizedRunner$5.evaluate(RandomizedRunner.java:829)
	at com.carrotsearch.randomizedtesting.RandomizedRunner$6.evaluate(RandomizedRunner.java:879)
	at com.carrotsearch.randomizedtesting.RandomizedRunner$7.evaluate(RandomizedRunner.java:890)
	at com.carrotsearch.randomizedtesting.rules.StatementAdapter.evaluate(StatementAdapter.java:36)
	at com.carrotsearch.randomizedtesting.rules.SystemPropertiesRestoreRule$1.evaluate(SystemPropertiesRestoreRule.java:57)
	at org.apache.lucene.util.AbstractBeforeAfterRule$1.evaluate(AbstractBeforeAfterRule.java:45)
	at com.carrotsearch.randomizedtesting.rules.StatementAdapter.evaluate(StatementAdapter.java:36)
	at org.apache.lucene.util.TestRuleStoreClassName$1.evaluate(TestRuleStoreClassName.java:41)
	at com.carrotsearch.randomizedtesting.rules.NoShadowingOrOverridesOnMethodsRule$1.evaluate(NoShadowingOrOverridesOnMethodsRule.java:40)
	at com.carrotsearch.randomizedtesting.rules.NoShadowingOrOverridesOnMethodsRule$1.evaluate(NoShadowingOrOverridesOnMethodsRule.java:40)
	at com.carrotsearch.randomizedtesting.rules.StatementAdapter.evaluate(StatementAdapter.java:36)
	at com.carrotsearch.randomizedtesting.rules.StatementAdapter.evaluate(StatementAdapter.java:36)
	at org.apache.lucene.util.TestRuleAssertionsRequired$1.evaluate(TestRuleAssertionsRequired.java:53)
	at org.apache.lucene.util.TestRuleMarkFailure$1.evaluate(TestRuleMarkFailure.java:47)
	at org.apache.lucene.util.TestRuleIgnoreAfterMaxFailures$1.evaluate(TestRuleIgnoreAfterMaxFailures.java:64)
	at org.apache.lucene.util.TestRuleIgnoreTestSuites$1.evaluate(TestRuleIgnoreTestSuites.java:54)
	at com.carrotsearch.randomizedtesting.rules.StatementAdapter.evaluate(StatementAdapter.java:36)
	at com.carrotsearch.randomizedtesting.ThreadLeakControl$StatementRunner.run(ThreadLeakControl.java:368)
	at java.base/java.lang.Thread.run(Thread.java:844)




Build Log:
[...truncated 11801 lines...]
   [junit4] Suite: org.apache.solr.handler.admin.AutoscalingHistoryHandlerTest
   [junit4]   2> Creating dataDir: /home/jenkins/workspace/Lucene-Solr-master-Linux/solr/build/solr-core/test/J2/temp/solr.handler.admin.AutoscalingHistoryHandlerTest_E3701F59287F00B5-001/init-core-data-001
   [junit4]   2> 149124 WARN  (SUITE-AutoscalingHistoryHandlerTest-seed#[E3701F59287F00B5]-worker) [    ] o.a.s.SolrTestCaseJ4 startTrackingSearchers: numOpens=16 numCloses=16
   [junit4]   2> 149127 INFO  (SUITE-AutoscalingHistoryHandlerTest-seed#[E3701F59287F00B5]-worker) [    ] o.a.s.SolrTestCaseJ4 Using PointFields (NUMERIC_POINTS_SYSPROP=true) w/NUMERIC_DOCVALUES_SYSPROP=true
   [junit4]   2> 149127 INFO  (SUITE-AutoscalingHistoryHandlerTest-seed#[E3701F59287F00B5]-worker) [    ] o.a.s.SolrTestCaseJ4 Randomized ssl (false) and clientAuth (false) via: @org.apache.solr.util.RandomizeSSL(reason="", ssl=0.0/0.0, value=0.0/0.0, clientAuth=0.0/0.0)
   [junit4]   2> 149128 INFO  (SUITE-AutoscalingHistoryHandlerTest-seed#[E3701F59287F00B5]-worker) [    ] o.a.s.SolrTestCaseJ4 SecureRandom sanity checks: test.solr.allowed.securerandom=null & java.security.egd=file:/dev/./urandom
   [junit4]   2> 149129 INFO  (SUITE-AutoscalingHistoryHandlerTest-seed#[E3701F59287F00B5]-worker) [    ] o.a.s.c.MiniSolrCloudCluster Starting cluster of 3 servers in /home/jenkins/workspace/Lucene-Solr-master-Linux/solr/build/solr-core/test/J2/temp/solr.handler.admin.AutoscalingHistoryHandlerTest_E3701F59287F00B5-001/tempDir-001
   [junit4]   2> 149129 INFO  (SUITE-AutoscalingHistoryHandlerTest-seed#[E3701F59287F00B5]-worker) [    ] o.a.s.c.ZkTestServer STARTING ZK TEST SERVER
   [junit4]   2> 149129 INFO  (Thread-5697) [    ] o.a.s.c.ZkTestServer client port:0.0.0.0/0.0.0.0:0
   [junit4]   2> 149129 INFO  (Thread-5697) [    ] o.a.s.c.ZkTestServer Starting server
   [junit4]   2> 149139 ERROR (Thread-5697) [    ] o.a.z.s.ZooKeeperServer ZKShutdownHandler is not registered, so ZooKeeper server won't take any action on ERROR or SHUTDOWN server state changes
   [junit4]   2> 149229 INFO  (SUITE-AutoscalingHistoryHandlerTest-seed#[E3701F59287F00B5]-worker) [    ] o.a.s.c.ZkTestServer start zk server on port:32771
   [junit4]   2> 149231 INFO  (zkConnectionManagerCallback-136-thread-1) [    ] o.a.s.c.c.ConnectionManager zkClient has connected
   [junit4]   2> 149234 INFO  (jetty-launcher-133-thread-1) [    ] o.e.j.s.Server jetty-9.4.8.v20171121, build timestamp: 2017-11-21T16:27:37-05:00, git hash: 82b8fb23f757335bb3329d540ce37a2a2615f0a8
   [junit4]   2> 149234 INFO  (jetty-launcher-133-thread-3) [    ] o.e.j.s.Server jetty-9.4.8.v20171121, build timestamp: 2017-11-21T16:27:37-05:00, git hash: 82b8fb23f757335bb3329d540ce37a2a2615f0a8
   [junit4]   2> 149234 INFO  (jetty-launcher-133-thread-2) [    ] o.e.j.s.Server jetty-9.4.8.v20171121, build timestamp: 2017-11-21T16:27:37-05:00, git hash: 82b8fb23f757335bb3329d540ce37a2a2615f0a8
   [junit4]   2> 149262 INFO  (jetty-launcher-133-thread-3) [    ] o.e.j.s.session DefaultSessionIdManager workerName=node0
   [junit4]   2> 149262 INFO  (jetty-launcher-133-thread-3) [    ] o.e.j.s.session No SessionScavenger set, using defaults
   [junit4]   2> 149263 INFO  (jetty-launcher-133-thread-1) [    ] o.e.j.s.session DefaultSessionIdManager workerName=node0
   [junit4]   2> 149263 INFO  (jetty-launcher-133-thread-1) [    ] o.e.j.s.session No SessionScavenger set, using defaults
   [junit4]   2> 149263 INFO  (jetty-launcher-133-thread-3) [    ] o.e.j.s.session Scavenging every 660000ms
   [junit4]   2> 149263 INFO  (jetty-launcher-133-thread-1) [    ] o.e.j.s.session Scavenging every 660000ms
   [junit4]   2> 149265 INFO  (jetty-launcher-133-thread-2) [    ] o.e.j.s.session DefaultSessionIdManager workerName=node0
   [junit4]   2> 149265 INFO  (jetty-launcher-133-thread-2) [    ] o.e.j.s.session No SessionScavenger set, using defaults
   [junit4]   2> 149265 INFO  (jetty-launcher-133-thread-2) [    ] o.e.j.s.session Scavenging every 660000ms
   [junit4]   2> 149267 INFO  (jetty-launcher-133-thread-3) [    ] o.e.j.s.h.ContextHandler Started o.e.j.s.ServletContextHandler@52bcadd3{/solr,null,AVAILABLE}
   [junit4]   2> 149271 INFO  (jetty-launcher-133-thread-2) [    ] o.e.j.s.h.ContextHandler Started o.e.j.s.ServletContextHandler@6daff5{/solr,null,AVAILABLE}
   [junit4]   2> 149271 INFO  (jetty-launcher-133-thread-1) [    ] o.e.j.s.h.ContextHandler Started o.e.j.s.ServletContextHandler@70515996{/solr,null,AVAILABLE}
   [junit4]   2> 149273 INFO  (jetty-launcher-133-thread-1) [    ] o.e.j.s.AbstractConnector Started ServerConnector@7b765d08{HTTP/1.1,[http/1.1]}{127.0.0.1:37591}
   [junit4]   2> 149273 INFO  (jetty-launcher-133-thread-1) [    ] o.e.j.s.Server Started @151237ms
   [junit4]   2> 149273 INFO  (jetty-launcher-133-thread-1) [    ] o.a.s.c.s.e.JettySolrRunner Jetty properties: {hostContext=/solr, hostPort=37591}
   [junit4]   2> 149273 ERROR (jetty-launcher-133-thread-1) [    ] o.a.s.u.StartupLoggingUtils Missing Java Option solr.log.dir. Logging may be missing or incomplete.
   [junit4]   2> 149273 INFO  (jetty-launcher-133-thread-1) [    ] o.a.s.s.SolrDispatchFilter  ___      _       Welcome to Apache Solr™ version 8.0.0
   [junit4]   2> 149273 INFO  (jetty-launcher-133-thread-1) [    ] o.a.s.s.SolrDispatchFilter / __| ___| |_ _   Starting in cloud mode on port null
   [junit4]   2> 149273 INFO  (jetty-launcher-133-thread-1) [    ] o.a.s.s.SolrDispatchFilter \__ \/ _ \ | '_|  Install dir: null
   [junit4]   2> 149273 INFO  (jetty-launcher-133-thread-1) [    ] o.a.s.s.SolrDispatchFilter |___/\___/_|_|    Start time: 2018-02-01T10:57:42.716922Z
   [junit4]   2> 149274 INFO  (jetty-launcher-133-thread-3) [    ] o.e.j.s.AbstractConnector Started ServerConnector@30c7124d{HTTP/1.1,[http/1.1]}{127.0.0.1:42829}
   [junit4]   2> 149274 INFO  (jetty-launcher-133-thread-3) [    ] o.e.j.s.Server Started @151238ms
   [junit4]   2> 149274 INFO  (jetty-launcher-133-thread-3) [    ] o.a.s.c.s.e.JettySolrRunner Jetty properties: {hostContext=/solr, hostPort=42829}
   [junit4]   2> 149274 ERROR (jetty-launcher-133-thread-3) [    ] o.a.s.u.StartupLoggingUtils Missing Java Option solr.log.dir. Logging may be missing or incomplete.
   [junit4]   2> 149274 INFO  (jetty-launcher-133-thread-3) [    ] o.a.s.s.SolrDispatchFilter  ___      _       Welcome to Apache Solr™ version 8.0.0
   [junit4]   2> 149274 INFO  (jetty-launcher-133-thread-3) [    ] o.a.s.s.SolrDispatchFilter / __| ___| |_ _   Starting in cloud mode on port null
   [junit4]   2> 149274 INFO  (jetty-launcher-133-thread-3) [    ] o.a.s.s.SolrDispatchFilter \__ \/ _ \ | '_|  Install dir: null
   [junit4]   2> 149274 INFO  (jetty-launcher-133-thread-3) [    ] o.a.s.s.SolrDispatchFilter |___/\___/_|_|    Start time: 2018-02-01T10:57:42.717529Z
   [junit4]   2> 149274 INFO  (jetty-launcher-133-thread-2) [    ] o.e.j.s.AbstractConnector Started ServerConnector@222cf335{HTTP/1.1,[http/1.1]}{127.0.0.1:33369}
   [junit4]   2> 149275 INFO  (jetty-launcher-133-thread-2) [    ] o.e.j.s.Server Started @151239ms
   [junit4]   2> 149275 INFO  (jetty-launcher-133-thread-2) [    ] o.a.s.c.s.e.JettySolrRunner Jetty properties: {hostContext=/solr, hostPort=33369}
   [junit4]   2> 149275 ERROR (jetty-launcher-133-thread-2) [    ] o.a.s.u.StartupLoggingUtils Missing Java Option solr.log.dir. Logging may be missing or incomplete.
   [junit4]   2> 149275 INFO  (jetty-launcher-133-thread-2) [    ] o.a.s.s.SolrDispatchFilter  ___      _       Welcome to Apache Solr™ version 8.0.0
   [junit4]   2> 149275 INFO  (jetty-launcher-133-thread-2) [    ] o.a.s.s.SolrDispatchFilter / __| ___| |_ _   Starting in cloud mode on port null
   [junit4]   2> 149275 INFO  (jetty-launcher-133-thread-2) [    ] o.a.s.s.SolrDispatchFilter \__ \/ _ \ | '_|  Install dir: null
   [junit4]   2> 149275 INFO  (jetty-launcher-133-thread-2) [    ] o.a.s.s.SolrDispatchFilter |___/\___/_|_|    Start time: 2018-02-01T10:57:42.718502Z
   [junit4]   2> 149292 INFO  (zkConnectionManagerCallback-140-thread-1) [    ] o.a.s.c.c.ConnectionManager zkClient has connected
   [junit4]   2> 149292 INFO  (zkConnectionManagerCallback-138-thread-1) [    ] o.a.s.c.c.ConnectionManager zkClient has connected
   [junit4]   2> 149292 INFO  (jetty-launcher-133-thread-3) [    ] o.a.s.s.SolrDispatchFilter solr.xml found in ZooKeeper. Loading...
   [junit4]   2> 149293 INFO  (zkConnectionManagerCallback-142-thread-1) [    ] o.a.s.c.c.ConnectionManager zkClient has connected
   [junit4]   2> 149293 INFO  (jetty-launcher-133-thread-1) [    ] o.a.s.s.SolrDispatchFilter solr.xml found in ZooKeeper. Loading...
   [junit4]   2> 149296 INFO  (jetty-launcher-133-thread-2) [    ] o.a.s.s.SolrDispatchFilter solr.xml found in ZooKeeper. Loading...
   [junit4]   2> 149306 WARN  (NIOServerCxn.Factory:0.0.0.0/0.0.0.0:0) [    ] o.a.z.s.NIOServerCnxn Unable to read additional data from client sessionid 0x1000ea6f6230003, likely client has closed socket
   [junit4]   2> 149311 INFO  (jetty-launcher-133-thread-2) [    ] o.a.s.c.ZkContainer Zookeeper client=127.0.0.1:32771/solr
   [junit4]   2> 149311 INFO  (jetty-launcher-133-thread-3) [    ] o.a.s.c.ZkContainer Zookeeper client=127.0.0.1:32771/solr
   [junit4]   2> 149312 INFO  (jetty-launcher-133-thread-1) [    ] o.a.s.c.ZkContainer Zookeeper client=127.0.0.1:32771/solr
   [junit4]   2> 149313 INFO  (zkConnectionManagerCallback-150-thread-1) [    ] o.a.s.c.c.ConnectionManager zkClient has connected
   [junit4]   2> 149313 INFO  (zkConnectionManagerCallback-154-thread-1) [    ] o.a.s.c.c.ConnectionManager zkClient has connected
   [junit4]   2> 149313 INFO  (zkConnectionManagerCallback-152-thread-1) [    ] o.a.s.c.c.ConnectionManager zkClient has connected
   [junit4]   2> 149314 WARN  (NIOServerCxn.Factory:0.0.0.0/0.0.0.0:0) [    ] o.a.z.s.NIOServerCnxn Unable to read additional data from client sessionid 0x1000ea6f6230006, likely client has closed socket
   [junit4]   2> 149319 INFO  (zkConnectionManagerCallback-158-thread-1-processing-n:127.0.0.1:42829_solr) [n:127.0.0.1:42829_solr    ] o.a.s.c.c.ConnectionManager zkClient has connected
   [junit4]   2> 149322 INFO  (zkConnectionManagerCallback-157-thread-1-processing-n:127.0.0.1:37591_solr) [n:127.0.0.1:37591_solr    ] o.a.s.c.c.ConnectionManager zkClient has connected
   [junit4]   2> 149322 INFO  (zkConnectionManagerCallback-160-thread-1-processing-n:127.0.0.1:33369_solr) [n:127.0.0.1:33369_solr    ] o.a.s.c.c.ConnectionManager zkClient has connected
   [junit4]   2> 149358 INFO  (jetty-launcher-133-thread-2) [n:127.0.0.1:33369_solr    ] o.a.s.c.Overseer Overseer (id=null) closing
   [junit4]   2> 149359 INFO  (jetty-launcher-133-thread-2) [n:127.0.0.1:33369_solr    ] o.a.s.c.OverseerElectionContext I am going to be the leader 127.0.0.1:33369_solr
   [junit4]   2> 149359 INFO  (jetty-launcher-133-thread-2) [n:127.0.0.1:33369_solr    ] o.a.s.c.Overseer Overseer (id=72073704294776841-127.0.0.1:33369_solr-n_0000000000) starting
   [junit4]   2> 149383 DEBUG (OverseerStateUpdate-72073704294776841-127.0.0.1:33369_solr-n_0000000000) [n:127.0.0.1:33369_solr    ] o.a.s.c.Overseer Starting to work on the main queue
   [junit4]   2> 149383 INFO  (jetty-launcher-133-thread-2) [n:127.0.0.1:33369_solr    ] o.a.s.c.ZkController Register node as live in ZooKeeper:/live_nodes/127.0.0.1:33369_solr
   [junit4]   2> 149384 DEBUG (OverseerAutoScalingTriggerThread-72073704294776841-127.0.0.1:33369_solr-n_0000000000) [n:127.0.0.1:33369_solr    ] o.a.s.c.a.OverseerTriggerThread Adding .autoAddReplicas trigger
   [junit4]   2> 149387 INFO  (OverseerStateUpdate-72073704294776841-127.0.0.1:33369_solr-n_0000000000) [n:127.0.0.1:33369_solr    ] o.a.s.c.c.ZkStateReader Updated live nodes from ZooKeeper... (0) -> (1)
   [junit4]   2> 149389 DEBUG (OverseerAutoScalingTriggerThread-72073704294776841-127.0.0.1:33369_solr-n_0000000000) [n:127.0.0.1:33369_solr    ] o.a.s.c.a.OverseerTriggerThread Refreshing /autoscaling.json with znode version 1
   [junit4]   2> 149389 DEBUG (OverseerAutoScalingTriggerThread-72073704294776841-127.0.0.1:33369_solr-n_0000000000) [n:127.0.0.1:33369_solr    ] o.a.s.c.a.NodeLostTrigger Initial livenodes: [127.0.0.1:33369_solr]
   [junit4]   2> 149389 DEBUG (OverseerAutoScalingTriggerThread-72073704294776841-127.0.0.1:33369_solr-n_0000000000) [n:127.0.0.1:33369_solr    ] o.a.s.c.a.OverseerTriggerThread Current znodeVersion 1, lastZnodeVersion -1
   [junit4]   2> 149390 DEBUG (OverseerAutoScalingTriggerThread-72073704294776841-127.0.0.1:33369_solr-n_0000000000) [n:127.0.0.1:33369_solr    ] o.a.s.c.a.OverseerTriggerThread Processed trigger updates upto znodeVersion 1
   [junit4]   2> 149392 DEBUG (OverseerAutoScalingTriggerThread-72073704294776841-127.0.0.1:33369_solr-n_0000000000) [n:127.0.0.1:33369_solr    ] o.a.s.c.a.OverseerTriggerThread -- clean old nodeAdded markers
   [junit4]   2> 149392 DEBUG (OverseerAutoScalingTriggerThread-72073704294776841-127.0.0.1:33369_solr-n_0000000000) [n:127.0.0.1:33369_solr    ] o.a.s.c.a.OverseerTriggerThread Current znodeVersion 1, lastZnodeVersion 1
   [junit4]   2> 149393 DEBUG (ScheduledTrigger-257-thread-1) [n:127.0.0.1:33369_solr    ] o.a.s.c.a.NodeLostTrigger Running NodeLostTrigger: .auto_add_replicas with currently live nodes: 1
   [junit4]   2> 149406 INFO  (jetty-launcher-133-thread-1) [n:127.0.0.1:37591_solr    ] o.a.s.c.c.ZkStateReader Updated live nodes from ZooKeeper... (0) -> (1)
   [junit4]   2> 149407 INFO  (jetty-launcher-133-thread-3) [n:127.0.0.1:42829_solr    ] o.a.s.c.c.ZkStateReader Updated live nodes from ZooKeeper... (0) -> (1)
   [junit4]   2> 149407 INFO  (jetty-launcher-133-thread-1) [n:127.0.0.1:37591_solr    ] o.a.s.c.Overseer Overseer (id=null) closing
   [junit4]   2> 149408 INFO  (jetty-launcher-133-thread-3) [n:127.0.0.1:42829_solr    ] o.a.s.c.Overseer Overseer (id=null) closing
   [junit4]   2> 149409 INFO  (jetty-launcher-133-thread-1) [n:127.0.0.1:37591_solr    ] o.a.s.c.ZkController Register node as live in ZooKeeper:/live_nodes/127.0.0.1:37591_solr
   [junit4]   2> 149410 DEBUG (OverseerStateUpdate-72073704294776841-127.0.0.1:33369_solr-n_0000000000) [n:127.0.0.1:33369_solr    ] o.a.s.c.Overseer processMessage: queueSize: 1, message = {
   [junit4]   2>   "operation":"downnode",
   [junit4]   2>   "node_name":"127.0.0.1:37591_solr"} current state version: 0
   [junit4]   2> 149410 DEBUG (OverseerStateUpdate-72073704294776841-127.0.0.1:33369_solr-n_0000000000) [n:127.0.0.1:33369_solr    ] o.a.s.c.o.NodeMutator DownNode state invoked for node: 127.0.0.1:37591_solr
   [junit4]   2> 149412 INFO  (zkCallback-159-thread-1-processing-n:127.0.0.1:33369_solr) [n:127.0.0.1:33369_solr    ] o.a.s.c.c.ZkStateReader Updated live nodes from ZooKeeper... (1) -> (2)
   [junit4]   2> 149413 INFO  (jetty-launcher-133-thread-3) [n:127.0.0.1:42829_solr    ] o.a.s.c.ZkController Register node as live in ZooKeeper:/live_nodes/127.0.0.1:42829_solr
   [junit4]   2> 149413 DEBUG (OverseerStateUpdate-72073704294776841-127.0.0.1:33369_solr-n_0000000000) [n:127.0.0.1:33369_solr    ] o.a.s.c.Overseer processMessage: queueSize: 2, message = {
   [junit4]   2>   "operation":"downnode",
   [junit4]   2>   "node_name":"127.0.0.1:42829_solr"} current state version: 0
   [junit4]   2> 149413 DEBUG (OverseerStateUpdate-72073704294776841-127.0.0.1:33369_solr-n_0000000000) [n:127.0.0.1:33369_solr    ] o.a.s.c.o.NodeMutator DownNode state invoked for node: 127.0.0.1:42829_solr
   [junit4]   2> 149419 INFO  (zkCallback-159-thread-1-processing-n:127.0.0.1:33369_solr) [n:127.0.0.1:33369_solr    ] o.a.s.c.c.ZkStateReader Updated live nodes from ZooKeeper... (2) -> (3)
   [junit4]   2> 149420 INFO  (zkCallback-156-thread-1-processing-n:127.0.0.1:37591_solr) [n:127.0.0.1:37591_solr    ] o.a.s.c.c.ZkStateReader Updated live nodes from ZooKeeper... (1) -> (3)
   [junit4]   2> 149420 INFO  (zkCallback-155-thread-1-processing-n:127.0.0.1:42829_solr) [n:127.0.0.1:42829_solr    ] o.a.s.c.c.ZkStateReader Updated live nodes from ZooKeeper... (1) -> (3)
   [junit4]   2> 149486 INFO  (jetty-launcher-133-thread-1) [n:127.0.0.1:37591_solr    ] o.a.s.m.r.SolrJmxReporter JMX monitoring for 'solr_37591.solr.node' (registry 'solr.node') enabled at server: com.sun.jmx.mbeanserver.JmxMBeanServer@1d92a4dd
   [junit4]   2> 149491 INFO  (jetty-launcher-133-thread-2) [n:127.0.0.1:33369_solr    ] o.a.s.m.r.SolrJmxReporter JMX monitoring for 'solr_33369.solr.node' (registry 'solr.node') enabled at server: com.sun.jmx.mbeanserver.JmxMBeanServer@1d92a4dd
   [junit4]   2> 149492 INFO  (jetty-launcher-133-thread-3) [n:127.0.0.1:42829_solr    ] o.a.s.m.r.SolrJmxReporter JMX monitoring for 'solr_42829.solr.node' (registry 'solr.node') enabled at server: com.sun.jmx.mbeanserver.JmxMBeanServer@1d92a4dd
   [junit4]   2> 149495 INFO  (jetty-launcher-133-thread-1) [n:127.0.0.1:37591_solr    ] o.a.s.m.r.SolrJmxReporter JMX monitoring for 'solr_37591.solr.jvm' (registry 'solr.jvm') enabled at server: com.sun.jmx.mbeanserver.JmxMBeanServer@1d92a4dd
   [junit4]   2> 149495 INFO  (jetty-launcher-133-thread-1) [n:127.0.0.1:37591_solr    ] o.a.s.m.r.SolrJmxReporter JMX monitoring for 'solr_37591.solr.jetty' (registry 'solr.jetty') enabled at server: com.sun.jmx.mbeanserver.JmxMBeanServer@1d92a4dd
   [junit4]   2> 149497 INFO  (jetty-launcher-133-thread-1) [n:127.0.0.1:37591_solr    ] o.a.s.c.CorePropertiesLocator Found 0 core definitions underneath /home/jenkins/workspace/Lucene-Solr-master-Linux/solr/build/solr-core/test/J2/temp/solr.handler.admin.AutoscalingHistoryHandlerTest_E3701F59287F00B5-001/tempDir-001/node1/.
   [junit4]   2> 149501 INFO  (jetty-launcher-133-thread-2) [n:127.0.0.1:33369_solr    ] o.a.s.m.r.SolrJmxReporter JMX monitoring for 'solr_33369.solr.jvm' (registry 'solr.jvm') enabled at server: com.sun.jmx.mbeanserver.JmxMBeanServer@1d92a4dd
   [junit4]   2> 149501 INFO  (jetty-launcher-133-thread-3) [n:127.0.0.1:42829_solr    ] o.a.s.m.r.SolrJmxReporter JMX monitoring for 'solr_42829.solr.jvm' (registry 'solr.jvm') enabled at server: com.sun.jmx.mbeanserver.JmxMBeanServer@1d92a4dd
   [junit4]   2> 149501 INFO  (jetty-launcher-133-thread-2) [n:127.0.0.1:33369_solr    ] o.a.s.m.r.SolrJmxReporter JMX monitoring for 'solr_33369.solr.jetty' (registry 'solr.jetty') enabled at server: com.sun.jmx.mbeanserver.JmxMBeanServer@1d92a4dd
   [junit4]   2> 149502 INFO  (jetty-launcher-133-thread-2) [n:127.0.0.1:33369_solr    ] o.a.s.c.CorePropertiesLocator Found 0 core definitions underneath /home/jenkins/workspace/Lucene-Solr-master-Linux/solr/build/solr-core/test/J2/temp/solr.handler.admin.AutoscalingHistoryHandlerTest_E3701F59287F00B5-001/tempDir-001/node2/.
   [junit4]   2> 149502 INFO  (jetty-launcher-133-thread-3) [n:127.0.0.1:42829_solr    ] o.a.s.m.r.SolrJmxReporter JMX monitoring for 'solr_42829.solr.jetty' (registry 'solr.jetty') enabled at server: com.sun.jmx.mbeanserver.JmxMBeanServer@1d92a4dd
   [junit4]   2> 149503 INFO  (jetty-launcher-133-thread-3) [n:127.0.0.1:42829_solr    ] o.a.s.c.CorePropertiesLocator Found 0 core definitions underneath /home/jenkins/workspace/Lucene-Solr-master-Linux/solr/build/solr-core/test/J2/temp/solr.handler.admin.AutoscalingHistoryHandlerTest_E3701F59287F00B5-001/tempDir-001/node3/.
   [junit4]   2> 149587 INFO  (zkConnectionManagerCallback-168-thread-1) [    ] o.a.s.c.c.ConnectionManager zkClient has connected
   [junit4]   2> 149592 INFO  (zkConnectionManagerCallback-172-thread-1) [    ] o.a.s.c.c.ConnectionManager zkClient has connected
   [junit4]   2> 149593 INFO  (SUITE-AutoscalingHistoryHandlerTest-seed#[E3701F59287F00B5]-worker) [    ] o.a.s.c.c.ZkStateReader Updated live nodes from ZooKeeper... (0) -> (3)
   [junit4]   2> 149594 INFO  (SUITE-AutoscalingHistoryHandlerTest-seed#[E3701F59287F00B5]-worker) [    ] o.a.s.c.s.i.ZkClientClusterStateProvider Cluster at 127.0.0.1:32771/solr ready
   [junit4]   2> 149599 INFO  (qtp1039788209-6273) [n:127.0.0.1:33369_solr    ] o.a.s.h.a.CollectionsHandler Invoked Collection Action :create with params replicationFactor=3&name=AutoscalingHistoryHandlerTest_collection&nrtReplicas=3&action=CREATE&numShards=1&wt=javabin&version=2 and sendToOCPQueue=true
   [junit4]   2> 149601 INFO  (OverseerThreadFactory-259-thread-1-processing-n:127.0.0.1:33369_solr) [n:127.0.0.1:33369_solr    ] o.a.s.c.a.c.CreateCollectionCmd Create collection AutoscalingHistoryHandlerTest_collection
   [junit4]   2> 149601 INFO  (OverseerThreadFactory-259-thread-1-processing-n:127.0.0.1:33369_solr) [n:127.0.0.1:33369_solr    ] o.a.s.c.c.ZkConfigManager Copying zk node /configs/_default/protwords.txt to /configs/AutoscalingHistoryHandlerTest_collection.AUTOCREATED/protwords.txt
   [junit4]   2> 149602 INFO  (OverseerThreadFactory-259-thread-1-processing-n:127.0.0.1:33369_solr) [n:127.0.0.1:33369_solr    ] o.a.s.c.c.ZkConfigManager Copying zk node /configs/_default/managed-schema to /configs/AutoscalingHistoryHandlerTest_collection.AUTOCREATED/managed-schema
   [junit4]   2> 149603 INFO  (OverseerThreadFactory-259-thread-1-processing-n:127.0.0.1:33369_solr) [n:127.0.0.1:33369_solr    ] o.a.s.c.c.ZkConfigManager Copying zk node /configs/_default/solrconfig.xml to /configs/AutoscalingHistoryHandlerTest_collection.AUTOCREATED/solrconfig.xml
   [junit4]   2> 149604 INFO  (OverseerThreadFactory-259-thread-1-processing-n:127.0.0.1:33369_solr) [n:127.0.0.1:33369_solr    ] o.a.s.c.c.ZkConfigManager Copying zk node /configs/_default/synonyms.txt to /configs/AutoscalingHistoryHandlerTest_collection.AUTOCREATED/synonyms.txt
   [junit4]   2> 149606 INFO  (OverseerThreadFactory-259-thread-1-processing-n:127.0.0.1:33369_solr) [n:127.0.0.1:33369_solr    ] o.a.s.c.c.ZkConfigManager Copying zk node /configs/_default/stopwords.txt to /configs/AutoscalingHistoryHandlerTest_collection.AUTOCREATED/stopwords.txt
   [junit4]   2> 149606 INFO  (OverseerThreadFactory-259-thread-1-processing-n:127.0.0.1:33369_solr) [n:127.0.0.1:33369_solr    ] o.a.s.c.c.ZkConfigManager Copying zk node /configs/_default/lang/contractions_it.txt to /configs/AutoscalingHistoryHandlerTest_collection.AUTOCREATED/lang/contractions_it.txt
   [junit4]   2> 149607 INFO  (OverseerThreadFactory-259-thread-1-processing-n:127.0.0.1:33369_solr) [n:127.0.0.1:33369_solr    ] o.a.s.c.c.ZkConfigManager Copying zk node /configs/_default/lang/stemdict_nl.txt to /configs/AutoscalingHistoryHandlerTest_collection.AUTOCREATED/lang/stemdict_nl.txt
   [junit4]   2> 149608 INFO  (OverseerThreadFactory-259-thread-1-processing-n:127.0.0.1:33369_solr) [n:127.0.0.1:33369_solr    ] o.a.s.c.c.ZkConfigManager Copying zk node /configs/_default/lang/stopwords_hy.txt to /configs/AutoscalingHistoryHandlerTest_collection.AUTOCREATED/lang/stopwords_hy.txt
   [junit4]   2> 149609 INFO  (OverseerThreadFactory-259-thread-1-processing-n:127.0.0.1:33369_solr) [n:127.0.0.1:33369_solr    ] o.a.s.c.c.ZkConfigManager Copying zk node /configs/_default/lang/stopwords_no.txt to /configs/AutoscalingHistoryHandlerTest_collection.AUTOCREATED/lang/stopwords_no.txt
   [junit4]   2> 149609 INFO  (OverseerThreadFactory-259-thread-1-processing-n:127.0.0.1:33369_solr) [n:127.0.0.1:33369_solr    ] o.a.s.c.c.ZkConfigManager Copying zk node /configs/_default/lang/contractions_ca.txt to /configs/AutoscalingHistoryHandlerTest_collection.AUTOCREATED/lang/contractions_ca.txt
   [junit4]   2> 149610 INFO  (OverseerThreadFactory-259-thread-1-processing-n:127.0.0.1:33369_solr) [n:127.0.0.1:33369_solr    ] o.a.s.c.c.ZkConfigManager Copying zk node /configs/_default/lang/stopwords_id.txt to /configs/AutoscalingHistoryHandlerTest_collection.AUTOCREATED/lang/stopwords_id.txt
   [junit4]   2> 149610 INFO  (OverseerThreadFactory-259-thread-1-processing-n:127.0.0.1:33369_solr) [n:127.0.0.1:33369_solr    ] o.a.s.c.c.ZkConfigManager Copying zk node /configs/_default/lang/stopwords_ga.txt to /configs/AutoscalingHistoryHandlerTest_collection.AUTOCREATED/lang/stopwords_ga.txt
   [junit4]   2> 149611 INFO  (OverseerThreadFactory-259-thread-1-processing-n:127.0.0.1:33369_solr) [n:127.0.0.1:33369_solr    ] o.a.s.c.c.ZkConfigManager Copying zk node /configs/_default/lang/stopwords_hi.txt to /configs/AutoscalingHistoryHandlerTest_collection.AUTOCREATED/lang/stopwords_hi.txt
   [junit4]   2> 149612 INFO  (OverseerThreadFactory-259-thread-1-processing-n:127.0.0.1:33369_solr) [n:127.0.0.1:33369_solr    ] o.a.s.c.c.ZkConfigManager Copying zk node /configs/_default/lang/stopwords_da.txt to /configs/AutoscalingHistoryHandlerTest_collection.AUTOCREATED/lang/stopwords_da.txt
   [junit4]   2> 149612 INFO  (OverseerThreadFactory-259-thread-1-processing-n:127.0.0.1:33369_solr) [n:127.0.0.1:33369_solr    ] o.a.s.c.c.ZkConfigManager Copying zk node /configs/_default/lang/stopwords_ja.txt to /configs/AutoscalingHistoryHandlerTest_collection.AUTOCREATED/lang/stopwords_ja.txt
   [junit4]   2> 149613 INFO  (OverseerThreadFactory-259-thread-1-processing-n:127.0.0.1:33369_solr) [n:127.0.0.1:33369_solr    ] o.a.s.c.c.ZkConfigManager Copying zk node /configs/_default/lang/stopwords_pt.txt to /configs/AutoscalingHistoryHandlerTest_collection.AUTOCREATED/lang/stopwords_pt.txt
   [junit4]   2> 149614 INFO  (OverseerThreadFactory-259-thread-1-processing-n:127.0.0.1:33369_solr) [n:127.0.0.1:33369_solr    ] o.a.s.c.c.ZkConfigManager Copying zk node /configs/_default/lang/stopwords_hu.txt to /configs/AutoscalingHistoryHandlerTest_collection.AUTOCREATED/lang/stopwords_hu.txt
   [junit4]   2> 149614 INFO  (OverseerThreadFactory-259-thread-1-processing-n:127.0.0.1:33369_solr) [n:127.0.0.1:33369_solr    ] o.a.s.c.c.ZkConfigManager Copying zk node /configs/_default/lang/stopwords_el.txt to /configs/AutoscalingHistoryHandlerTest_collection.AUTOCREATED/lang/stopwords_el.txt
   [junit4]   2> 149615 INFO  (OverseerThreadFactory-259-thread-1-processing-n:127.0.0.1:33369_solr) [n:127.0.0.1:33369_solr    ] o.a.s.c.c.ZkConfigManager Copying zk node /configs/_default/lang/stopwords_ru.txt to /configs/AutoscalingHistoryHandlerTest_collection.AUTOCREATED/lang/stopwords_ru.txt
   [junit4]   2> 149615 INFO  (OverseerThreadFactory-259-thread-1-processing-n:127.0.0.1:33369_solr) [n:127.0.0.1:33369_solr    ] o.a.s.c.c.ZkConfigManager Copying zk node /configs/_default/lang/stopwords_tr.txt to /configs/AutoscalingHistoryHandlerTest_collection.AUTOCREATED/lang/stopwords_tr.txt
   [junit4]   2> 149616 INFO  (OverseerThreadFactory-259-thread-1-processing-n:127.0.0.1:33369_solr) [n:127.0.0.1:33369_solr    ] o.a.s.c.c.ZkConfigManager Copying zk node /configs/_default/lang/stopwords_ar.txt to /configs/AutoscalingHistoryHandlerTest_collection.AUTOCREATED/lang/stopwords_ar.txt
   [junit4]   2> 149616 INFO  (OverseerThreadFactory-259-thread-1-processing-n:127.0.0.1:33369_solr) [n:127.0.0.1:33369_solr    ] o.a.s.c.c.ZkConfigManager Copying zk node /configs/_default/lang/userdict_ja.txt to /configs/AutoscalingHistoryHandlerTest_collection.AUTOCREATED/lang/userdict_ja.txt
   [junit4]   2> 149617 INFO  (OverseerThreadFactory-259-thread-1-processing-n:127.0.0.1:33369_solr) [n:127.0.0.1:33369_solr    ] o.a.s.c.c.ZkConfigManager Copying zk node /configs/_default/lang/stopwords_eu.txt to /configs/AutoscalingHistoryHandlerTest_collection.AUTOCREATED/lang/stopwords_eu.txt
   [junit4]   2> 149618 INFO  (OverseerThreadFactory-259-thread-1-processing-n:127.0.0.1:33369_solr) [n:127.0.0.1:33369_solr    ] o.a.s.c.c.ZkConfigManager Copying zk node /configs/_default/lang/stopwords_it.txt to /configs/AutoscalingHistoryHandlerTest_collection.AUTOCREATED/lang/stopwords_it.txt
   [junit4]   2> 149618 INFO  (OverseerThreadFactory-259-thread-1-processing-n:127.0.0.1:33369_solr) [n:127.0.0.1:33369_solr    ] o.a.s.c.c.ZkConfigManager Copying zk node /configs/_default/lang/stopwords_cz.txt to /configs/AutoscalingHistoryHandlerTest_collection.AUTOCREATED/lang/stopwords_cz.txt
   [junit4]   2> 149620 INFO  (OverseerThreadFactory-259-thread-1-processing-n:127.0.0.1:33369_solr) [n:127.0.0.1:33369_solr    ] o.a.s.c.c.ZkConfigManager Copying zk node /configs/_default/lang/stoptags_ja.txt to /configs/AutoscalingHistoryHandlerTest_collection.AUTOCREATED/lang/stoptags_ja.txt
   [junit4]   2> 149620 INFO  (OverseerThreadFactory-259-thread-1-processing-n:127.0.0.1:33369_solr) [n:127.0.0.1:33369_solr    ] o.a.s.c.c.ZkConfigManager Copying zk node /configs/_default/lang/contractions_fr.txt to /configs/AutoscalingHistoryHandlerTest_collection.AUTOCREATED/lang/contractions_fr.txt
   [junit4]   2> 149622 INFO  (OverseerThreadFactory-259-thread-1-processing-n:127.0.0.1:33369_solr) [n:127.0.0.1:33369_solr    ] o.a.s.c.c.ZkConfigManager Copying zk node /configs/_default/lang/stopwords_de.txt to /configs/AutoscalingHistoryHandlerTest_collection.AUTOCREATED/lang/stopwords_de.txt
   [junit4]   2> 149623 INFO  (OverseerThreadFactory-259-thread-1-processing-n:127.0.0.1:33369_solr) [n:127.0.0.1:33369_solr    ] o.a.s.c.c.ZkConfigManager Copying zk node /configs/_default/lang/stopwords_fa.txt to /configs/AutoscalingHistoryHandlerTest_collection.AUTOCREATED/lang/stopwords_fa.txt
   [junit4]   2> 149625 INFO  (OverseerThreadFactory-259-thread-1-processing-n:127.0.0.1:33369_solr) [n:127.0.0.1:33369_solr    ] o.a.s.c.c.ZkConfigManager Copying zk node /configs/_default/lang/contractions_ga.txt to /configs/AutoscalingHistoryHandlerTest_collection.AUTOCREATED/lang/contractions_ga.txt
   [junit4]   2> 149626 INFO  (OverseerThreadFactory-259-thread-1-processing-n:127.0.0.1:33369_solr) [n:127.0.0.1:33369_solr    ] o.a.s.c.c.ZkConfigManager Copying zk node /configs/_default/lang/stopwords_ca.txt to /configs/AutoscalingHistoryHandlerTest_collection.AUTOCREATED/lang/stopwords_ca.txt
   [junit4]   2> 149626 INFO  (OverseerThreadFactory-259-thread-1-processing-n:127.0.0.1:33369_solr) [n:127.0.0.1:33369_solr    ] o.a.s.c.c.ZkConfigManager Copying zk node /configs/_default/lang/stopwords_nl.txt to /configs/AutoscalingHistoryHandlerTest_collection.AUTOCREATED/lang/stopwords_nl.txt
   [junit4]   2> 149627 INFO  (OverseerThreadFactory-259-thread-1-processing-n:127.0.0.1:33369_solr) [n:127.0.0.1:33369_solr    ] o.a.s.c.c.ZkConfigManager Copying zk node /configs/_default/lang/stopwords_bg.txt to /configs/AutoscalingHistoryHandlerTest_collection.AUTOCREATED/lang/stopwords_bg.txt
   [junit4]   2> 149627 INFO  (OverseerThreadFactory-259-thread-1-processing-n:127.0.0.1:33369_solr) [n:127.0.0.1:33369_solr    ] o.a.s.c.c.ZkConfigManager Copying zk node /configs/_default/lang/stopwords_lv.txt to /configs/AutoscalingHistoryHandlerTest_collection.AUTOCREATED/lang/stopwords_lv.txt
   [junit4]   2> 149628 INFO  (OverseerThreadFactory-259-thread-1-processing-n:127.0.0.1:33369_solr) [n:127.0.0.1:33369_solr    ] o.a.s.c.c.ZkConfigManager Copying zk node /configs/_default/lang/stopwords_en.txt to /configs/AutoscalingHistoryHandlerTest_collection.AUTOCREATED/lang/stopwords_en.txt
   [junit4]   2> 149631 INFO  (OverseerThreadFactory-259-thread-1-processing-n:127.0.0.1:33369_solr) [n:127.0.0.1:33369_solr    ] o.a.s.c.c.ZkConfigManager Copying zk node /configs/_default/lang/stopwords_es.txt to /configs/AutoscalingHistoryHandlerTest_collection.AUTOCREATED/lang/stopwords_es.txt
   [junit4]   2> 149632 INFO  (OverseerThreadFactory-259-thread-1-processing-n:127.0.0.1:33369_solr) [n:127.0.0.1:33369_solr    ] o.a.s.c.c.ZkConfigManager Copying zk node /configs/_default/lang/stopwords_th.txt to /configs/AutoscalingHistoryHandlerTest_collection.AUTOCREATED/lang/stopwords_th.txt
   [junit4]   2> 149633 INFO  (OverseerThreadFactory-259-thread-1-processing-n:127.0.0.1:33369_solr) [n:127.0.0.1:33369_solr    ] o.a.s.c.c.ZkConfigManager Copying zk node /configs/_default/lang/stopwords_ro.txt to /configs/AutoscalingHistoryHandlerTest_collection.AUTOCREATED/lang/stopwords_ro.txt
   [junit4]   2> 149633 INFO  (OverseerThreadFactory-259-thread-1-processing-n:127.0.0.1:33369_solr) [n:127.0.0.1:33369_solr    ] o.a.s.c.c.ZkConfigManager Copying zk node /configs/_default/lang/stopwords_fr.txt to /configs/AutoscalingHistoryHandlerTest_collection.AUTOCREATED/lang/stopwords_fr.txt
   [junit4]   2> 149634 INFO  (OverseerThreadFactory-259-thread-1-processing-n:127.0.0.1:33369_solr) [n:127.0.0.1:33369_solr    ] o.a.s.c.c.ZkConfigManager Copying zk node /configs/_default/lang/stopwords_sv.txt to /configs/AutoscalingHistoryHandlerTest_collection.AUTOCREATED/lang/stopwords_sv.txt
   [junit4]   2> 149634 INFO  (OverseerThreadFactory-259-thread-1-processing-n:127.0.0.1:33369_solr) [n:127.0.0.1:33369_solr    ] o.a.s.c.c.ZkConfigManager Copying zk node /configs/_default/lang/stopwords_fi.txt to /configs/AutoscalingHistoryHandlerTest_collection.AUTOCREATED/lang/stopwords_fi.txt
   [junit4]   2> 149635 INFO  (OverseerThreadFactory-259-thread-1-processing-n:127.0.0.1:33369_solr) [n:127.0.0.1:33369_solr    ] o.a.s.c.c.ZkConfigManager Copying zk node /configs/_default/lang/hyphenations_ga.txt to /configs/AutoscalingHistoryHandlerTest_collection.AUTOCREATED/lang/hyphenations_ga.txt
   [junit4]   2> 149636 INFO  (OverseerThreadFactory-259-thread-1-processing-n:127.0.0.1:33369_solr) [n:127.0.0.1:33369_solr    ] o.a.s.c.c.ZkConfigManager Copying zk node /configs/_default/lang/stopwords_gl.txt to /configs/AutoscalingHistoryHandlerTest_collection.AUTOCREATED/lang/stopwords_gl.txt
   [junit4]   2> 149637 INFO  (OverseerThreadFactory-259-thread-1-processing-n:127.0.0.1:33369_solr) [n:127.0.0.1:33369_solr    ] o.a.s.c.c.ZkConfigManager Copying zk node /configs/_default/params.json to /configs/AutoscalingHistoryHandlerTest_collection.AUTOCREATED/params.json
   [junit4]   2> 149641 DEBUG (OverseerStateUpdate-72073704294776841-127.0.0.1:33369_solr-n_0000000000) [n:127.0.0.1:33369_solr    ] o.a.s.c.Overseer processMessage: queueSize: 1, message = {
   [junit4]   2>   "name":"AutoscalingHistoryHandlerTest_collection",
   [junit4]   2>   "fromApi":"true",
   [junit4]   2>   "replicationFactor":"3",
   [junit4]   2>   "numShards":"1",
   [junit4]   2>   "nrtReplicas":"3",
   [junit4]   2>   "stateFormat":"2",
   [junit4]   2>   "operation":"create"} current state version: 0
   [junit4]   2> 149641 DEBUG (OverseerStateUpdate-72073704294776841-127.0.0.1:33369_solr-n_0000000000) [n:127.0.0.1:33369_solr    ] o.a.s.c.o.ClusterStateMutator building a new cName: AutoscalingHistoryHandlerTest_collection
   [junit4]   2> 149641 DEBUG (OverseerStateUpdate-72073704294776841-127.0.0.1:33369_solr-n_0000000000) [n:127.0.0.1:33369_solr    ] o.a.s.c.o.ZkStateWriter going to create_collection /collections/AutoscalingHistoryHandlerTest_collection/state.json
   [junit4]   2> 149744 DEBUG (OverseerStateUpdate-72073704294776841-127.0.0.1:33369_solr-n_0000000000) [n:127.0.0.1:33369_solr    ] o.a.s.c.Overseer processMessage: queueSize: 1, message = {
   [junit4]   2>   "operation":"ADDREPLICA",
   [junit4]   2>   "collection":"AutoscalingHistoryHandlerTest_collection",
   [junit4]   2>   "shard":"shard1",
   [junit4]   2>   "core":"AutoscalingHistoryHandlerTest_collection_shard1_replica_n1",
   [junit4]   2>   "state":"down",
   [junit4]   2>   "base_url":"http://127.0.0.1:37591/solr",
   [junit4]   2>   "type":"NRT",
   [junit4]   2>   "waitForFinalState":"false"} current state version: 0
   [junit4]   2> 149744 INFO  (OverseerStateUpdate-72073704294776841-127.0.0.1:33369_solr-n_0000000000) [n:127.0.0.1:33369_solr    ] o.a.s.c.o.SliceMutator createReplica() {
   [junit4]   2>   "operation":"ADDREPLICA",
   [junit4]   2>   "collection":"AutoscalingHistoryHandlerTest_collection",
   [junit4]   2>   "shard":"shard1",
   [junit4]   2>   "core":"AutoscalingHistoryHandlerTest_collection_shard1_replica_n1",
   [junit4]   2>   "state":"down",
   [junit4]   2>   "base_url":"http://127.0.0.1:37591/solr",
   [junit4]   2>   "type":"NRT",
   [junit4]   2>   "waitForFinalState":"false"} 
   [junit4]   2> 149745 DEBUG (OverseerStateUpdate-72073704294776841-127.0.0.1:33369_solr-n_0000000000) [n:127.0.0.1:33369_solr    ] o.a.s.c.o.SliceMutator Old Slice: shard1:{
   [junit4]   2>   "range":"80000000-7fffffff",
   [junit4]   2>   "state":"active",
   [junit4]   2>   "replicas":{}}
   [junit4]   2> 149745 DEBUG (OverseerStateUpdate-72073704294776841-127.0.0.1:33369_solr-n_0000000000) [n:127.0.0.1:33369_solr    ] o.a.s.c.o.SliceMutator New Slice: shard1:{
   [junit4]   2>   "range":"80000000-7fffffff",
   [junit4]   2>   "state":"active",
   [junit4]   2>   "replicas":{"core_node3":{
   [junit4]   2>       "core":"AutoscalingHistoryHandlerTest_collection_shard1_replica_n1",
   [junit4]   2>       "base_url":"http://127.0.0.1:37591/solr",
   [junit4]   2>       "state":"down",
   [junit4]   2>       "node_name":null,
   [junit4]   2>       "type":"NRT"}}}
   [junit4]   2> 149746 DEBUG (OverseerStateUpdate-72073704294776841-127.0.0.1:33369_solr-n_0000000000) [n:127.0.0.1:33369_solr    ] o.a.s.c.Overseer processMessage: queueSize: 2, message = {
   [junit4]   2>   "operation":"ADDREPLICA",
   [junit4]   2>   "collection":"AutoscalingHistoryHandlerTest_collection",
   [junit4]   2>   "shard":"shard1",
   [junit4]   2>   "core":"AutoscalingHistoryHandlerTest_collection_shard1_replica_n2",
   [junit4]   2>   "state":"down",
   [junit4]   2>   "base_url":"http://127.0.0.1:42829/solr",
   [junit4]   2>   "type":"NRT",
   [junit4]   2>   "waitForFinalState":"false"} current state version: 0
   [junit4]   2> 149746 INFO  (OverseerStateUpdate-72073704294776841-127.0.0.1:33369_solr-n_0000000000) [n:127.0.0.1:33369_solr    ] o.a.s.c.o.SliceMutator createReplica() {
   [junit4]   2>   "operation":"ADDREPLICA",
   [junit4]   2>   "collection":"AutoscalingHistoryHandlerTest_collection",
   [junit4]   2>   "shard":"shard1",
   [junit4]   2>   "core":"AutoscalingHistoryHandlerTest_collection_shard1_replica_n2",
   [junit4]   2>   "state":"down",
   [junit4]   2>   "base_url":"http://127.0.0.1:42829/solr",
   [junit4]   2>   "type":"NRT",
   [junit4]   2>   "waitForFinalState":"false"} 
   [junit4]   2> 149747 DEBUG (OverseerStateUpdate-72073704294776841-127.0.0.1:33369_solr-n_0000000000) [n:127.0.0.1:33369_solr    ] o.a.s.c.o.SliceMutator Old Slice: shard1:{
   [junit4]   2>   "range":"80000000-7fffffff",
   [junit4]   2>   "state":"active",
   [junit4]   2>   "replicas":{"core_node3":{
   [junit4]   2>       "core":"AutoscalingHistoryHandlerTest_collection_shard1_replica_n1",
   [junit4]   2>       "base_url":"http://127.0.0.1:37591/solr",
   [junit4]   2>       "state":"down",
   [junit4]   2>       "node_name":null,
   [junit4]   2>       "type":"NRT"}}}
   [junit4]   2> 149748 DEBUG (OverseerStateUpdate-72073704294776841-127.0.0.1:33369_solr-n_0000000000) [n:127.0.0.1:33369_solr    ] o.a.s.c.o.SliceMutator New Slice: shard1:{
   [junit4]   2>   "range":"80000000-7fffffff",
   [junit4]   2>   "state":"active",
   [junit4]   2>   "replicas":{
   [junit4]   2>     "core_node3":{
   [junit4]   2>       "core":"AutoscalingHistoryHandlerTest_collection_shard1_replica_n1",
   [junit4]   2>       "base_url":"http://127.0.0.1:37591/solr",
   [junit4]   2>       "state":"down",
   [junit4]   2>       "node_name":null,
   [junit4]   2>       "type":"NRT"},
   [junit4]   2>     "core_node5":{
   [junit4]   2>       "core":"AutoscalingHistoryHandlerTest_collection_shard1_replica_n2",
   [junit4]   2>       "base_url":"http://127.0.0.1:42829/solr",
   [junit4]   2>       "state":"down",
   [junit4]   2>       "node_name":null,
   [junit4]   2>       "type":"NRT"}}}
   [junit4]   2> 149748 DEBUG (OverseerStateUpdate-72073704294776841-127.0.0.1:33369_solr-n_0000000000) [n:127.0.0.1:33369_solr    ] o.a.s.c.Overseer processMessage: queueSize: 3, message = {
   [junit4]   2>   "operation":"ADDREPLICA",
   [junit4]   2>   "collection":"AutoscalingHistoryHandlerTest_collection",
   [junit4]   2>   "shard":"shard1",
   [junit4]   2>   "core":"AutoscalingHistoryHandlerTest_collection_shard1_replica_n4",
   [junit4]   2>   "state":"down",
   [junit4]   2>   "base_url":"http://127.0.0.1:33369/solr",
   [junit4]   2>   "type":"NRT",
   [junit4]   2>   "waitForFinalState":"false"} current state version: 0
   [junit4]   2> 149749 INFO  (OverseerStateUpdate-72073704294776841-127.0.0.1:33369_solr-n_0000000000) [n:127.0.0.1:33369_solr    ] o.a.s.c.o.SliceMutator createReplica() {
   [junit4]   2>   "operation":"ADDREPLICA",
   [junit4]   2>   "collection":"AutoscalingHistoryHandlerTest_collection",
   [junit4]   2>   "shard":"shard1",
   [junit4]   2>   "core":"AutoscalingHistoryHandlerTest_collection_shard1_replica_n4",
   [junit4]   2>   "state":"down",
   [junit4]   2>   "base_url":"http://127.0.0.1:33369/solr",
   [junit4]   2>   "type":"NRT",
   [junit4]   2>   "waitForFinalState":"false"} 
   [junit4]   2> 149749 DEBUG (OverseerStateUpdate-72073704294776841-127.0.0.1:33369_solr-n_0000000000) [n:127.0.0.1:33369_solr    ] o.a.s.c.o.SliceMutator Old Slice: shard1:{
   [junit4]   2>   "range":"80000000-7fffffff",
   [junit4]   2>   "state":"active",
   [junit4]   2>   "replicas":{
   [junit4]   2>     "core_node3":{
   [junit4]   2>       "core":"AutoscalingHistoryHandlerTest_collection_shard1_replica_n1",
   [junit4]   2>       "base_url":"http://127.0.0.1:37591/solr",
   [junit4]   2>       "state":"down",
   [junit4]   2>       "node_name":null,
   [junit4]   2>       "type":"NRT"},
   [junit4]   2>     "core_node5":{
   [junit4]   2>       "core":"AutoscalingHistoryHandlerTest_collection_shard1_replica_n2",
   [junit4]   2>       "base_url":"http://127.0.0.1:42829/solr",
   [junit4]   2>       "state":"down",
   [junit4]   2>       "node_name":null,
   [junit4]   2>       "type":"NRT"}}}
   [junit4]   2> 149749 DEBUG (OverseerStateUpdate-72073704294776841-127.0.0.1:33369_solr-n_0000000000) [n:127.0.0.1:33369_solr    ] o.a.s.c.o.SliceMutator New Slice: shard1:{
   [junit4]   2>   "range":"80000000-7fffffff",
   [junit4]   2>   "state":"active",
   [junit4]   2>   "replicas":{
   [junit4]   2>     "core_node3":{
   [junit4]   2>       "core":"AutoscalingHistoryHandlerTest_collection_shard1_replica_n1",
   [junit4]   2>       "base_url":"http://127.0.0.1:37591/solr",
   [junit4]   2>       "state":"down",
   [junit4]   2>       "node_name":null,
   [junit4]   2>       "type":"NRT"},
   [junit4]   2>     "core_node5":{
   [junit4]   2>       "core":"AutoscalingHistoryHandlerTest_collection_shard1_replica_n2",
   [junit4]   2>       "base_url":"http://127.0.0.1:42829/solr",
   [junit4]   2>       "state":"down",
   [junit4]   2>       "node_name":null,
   [junit4]   2>       "type":"NRT"},
   [junit4]   2>     "core_node6":{
   [junit4]   2>       "core":"AutoscalingHistoryHandlerTest_collection_shard1_replica_n4",
   [junit4]   2>       "base_url":"http://127.0.0.1:33369/solr",
   [junit4]   2>       "state":"down",
   [junit4]   2>       "node_name":null,
   [junit4]   2>       "type":"NRT"}}}
   [junit4]   2> 149850 DEBUG (OverseerStateUpdate-72073704294776841-127.0.0.1:33369_solr-n_0000000000) [n:127.0.0.1:33369_solr    ] o.a.s.c.o.ZkStateWriter going to update_collection /collections/AutoscalingHistoryHandlerTest_collection/state.json version: 0
   [junit4]   2> 149953 INFO  (qtp1600870910-6272) [n:127.0.0.1:42829_solr    ] o.a.s.h.a.CoreAdminOperation core create command qt=/admin/cores&coreNodeName=core_node5&collection.configName=AutoscalingHistoryHandlerTest_collection.AUTOCREATED&newCollection=true&name=AutoscalingHistoryHandlerTest_collection_shard1_replica_n2&action=CREATE&numShards=1&collection=AutoscalingHistoryHandlerTest_collection&shard=shard1&wt=javabin&version=2&replicaType=NRT
   [junit4]   2> 149953 INFO  (qtp824660260-6271) [n:127.0.0.1:37591_solr    ] o.a.s.h.a.CoreAdminOperation core create command qt=/admin/cores&coreNodeName=core_node3&collection.configName=AutoscalingHistoryHandlerTest_collection.AUTOCREATED&newCollection=true&name=AutoscalingHistoryHandlerTest_collection_shard1_replica_n1&action=CREATE&numShards=1&collection=AutoscalingHistoryHandlerTest_collection&shard=shard1&wt=javabin&version=2&replicaType=NRT
   [junit4]   2> 149953 INFO  (qtp1600870910-6272) [n:127.0.0.1:42829_solr    ] o.a.s.c.TransientSolrCoreCacheDefault Allocating transient cache for 2147483647 transient cores
   [junit4]   2> 149953 INFO  (qtp824660260-6271) [n:127.0.0.1:37591_solr    ] o.a.s.c.TransientSolrCoreCacheDefault Allocating transient cache for 2147483647 transient cores
   [junit4]   2> 149953 INFO  (qtp1039788209-6291) [n:127.0.0.1:33369_solr    ] o.a.s.h.a.CoreAdminOperation core create command qt=/admin/cores&coreNodeName=core_node6&collection.configName=AutoscalingHistoryHandlerTest_collection.AUTOCREATED&newCollection=true&name=AutoscalingHistoryHandlerTest_collection_shard1_replica_n4&action=CREATE&numShards=1&collection=AutoscalingHistoryHandlerTest_collection&shard=shard1&wt=javabin&version=2&replicaType=NRT
   [junit4]   2> 149953 INFO  (qtp1039788209-6291) [n:127.0.0.1:33369_solr    ] o.a.s.c.TransientSolrCoreCacheDefault Allocating transient cache for 2147483647 transient cores
   [junit4]   2> 149961 DEBUG (OverseerStateUpdate-72073704294776841-127.0.0.1:33369_solr-n_0000000000) [n:127.0.0.1:33369_solr    ] o.a.s.c.Overseer processMessage: queueSize: 3, message = {
   [junit4]   2>   "core":"AutoscalingHistoryHandlerTest_collection_shard1_replica_n1",
   [junit4]   2>   "core_node_name":"core_node3",
   [junit4]   2>   "roles":null,
   [junit4]   2>   "base_url":"http://127.0.0.1:37591/solr",
   [junit4]   2>   "node_name":"127.0.0.1:37591_solr",
   [junit4]   2>   "numShards":"1",
   [junit4]   2>   "state":"down",
   [junit4]   2>   "shard":"shard1",
   [junit4]   2>   "collection":"AutoscalingHistoryHandlerTest_collection",
   [junit4]   2>   "type":"NRT",
   [junit4]   2>   "operation":"state"} current state version: 0
   [junit4]   2> 149961 DEBUG (OverseerStateUpdate-72073704294776841-127.0.0.1:33369_solr-n_0000000000) [n:127.0.0.1:33369_solr    ] o.a.s.c.o.ReplicaMutator Update state numShards=1 message={
   [junit4]   2>   "core":"AutoscalingHistoryHandlerTest_collection_shard1_replica_n1",
   [junit4]   2>   "core_node_name":"core_node3",
   [junit4]   2>   "roles":null,
   [junit4]   2>   "base_url":"http://127.0.0.1:37591/solr",
   [junit4]   2>   "node_name":"127.0.0.1:37591_solr",
   [junit4]   2>   "numShards":"1",
   [junit4]   2>   "state":"down",
   [junit4]   2>   "shard":"shard1",
   [junit4]   2>   "collection":"AutoscalingHistoryHandlerTest_collection",
   [junit4]   2>   "type":"NRT",
   [junit4]   2>   "operation":"state"}
   [junit4]   2> 149961 DEBUG (OverseerStateUpdate-72073704294776841-127.0.0.1:33369_solr-n_0000000000) [n:127.0.0.1:33369_solr    ] o.a.s.c.o.ReplicaMutator Will update state for replica: core_node3:{"core":"AutoscalingHistoryHandlerTest_collection_shard1_replica_n1","base_url":"http://127.0.0.1:37591/solr","node_name":"127.0.0.1:37591_solr","state":"down","type":"NRT"}
   [junit4]   2> 149961 DEBUG (OverseerStateUpdate-72073704294776841-127.0.0.1:33369_solr-n_0000000000) [n:127.0.0.1:33369_solr    ] o.a.s.c.o.ReplicaMutator Collection is now: DocCollection(AutoscalingHistoryHandlerTest_collection//collections/AutoscalingHistoryHandlerTest_collection/state.json/1)={
   [junit4]   2>   "pullReplicas":"0",
   [junit4]   2>   "replicationFactor":"3",
   [junit4]   2>   "router":{"name":"compositeId"},
   [junit4]   2>   "maxShardsPerNode":"1",
   [junit4]   2>   "autoAddReplicas":"false",
   [junit4]   2>   "nrtReplicas":"3",
   [junit4]   2>   "tlogReplicas":"0",
   [junit4]   2>   "shards":{"shard1":{
   [junit4]   2>       "range":"80000000-7fffffff",
   [junit4]   2>       "state":"active",
   [junit4]   2>       "replicas":{
   [junit4]   2>         "core_node3":{
   [junit4]   2>           "core":"AutoscalingHistoryHandlerTest_collection_shard1_replica_n1",
   [junit4]   2>           "base_url":"http://127.0.0.1:37591/solr",
   [junit4]   2>           "node_name":"127.0.0.1:37591_solr",
   [junit4]   2>           "state":"down",
   [junit4]   2>           "type":"NRT"},
   [junit4]   2>         "core_node5":{
   [junit4]   2>           "core":"AutoscalingHistoryHandlerTest_collection_shard1_replica_n2",
   [junit4]   2>           "base_url":"http://127.0.0.1:42829/solr",
   [junit4]   2>           "state":"down",
   [junit4]   2>           "node_name":null,
   [junit4]   2>           "type":"NRT"},
   [junit4]   2>         "core_node6":{
   [junit4]   2>           "core":"AutoscalingHistoryHandlerTest_collection_shard1_replica_n4",
   [junit4]   2>           "base_url":"http://127.0.0.1:33369/solr",
   [junit4]   2>           "state":"down",
   [junit4]   2>           "node_name":null,
   [junit4]   2>           "type":"NRT"}}}}}
   [junit4]   2> 149961 DEBUG (OverseerStateUpdate-72073704294776841-127.0.0.1:33369_solr-n_0000000000) [n:127.0.0.1:33369_solr    ] o.a.s.c.Overseer processMessage: queueSize: 3, message = {
   [junit4]   2>   "core":"AutoscalingHistoryHandlerTest_collection_shard1_replica_n2",
   [junit4]   2>   "core_node_name":"core_node5",
   [junit4]   2>   "roles":null,
   [junit4]   2>   "base_url":"http://127.0.0.1:42829/solr",
   [junit4]   2>   "node_name":"127.0.0.1:42829_solr",
   [junit4]   2>   "numShards":"1",
   [junit4]   2>   "state":"down",
   [junit4]   2>   "shard":"shard1",
   [junit4]   2>   "collection":"AutoscalingHistoryHandlerTest_collection",
   [junit4]   2>   "type":"NRT",
   [junit4]   2>   "operation":"state"} current state version: 0
   [junit4]   2> 149961 DEBUG (OverseerStateUpdate-72073704294776841-127.0.0.1:33369_solr-n_0000000000) [n:127.0.0.1:33369_solr    ] o.a.s.c.o.ReplicaMutator Update state numShards=1 message={
   [junit4]   2>   "core":"AutoscalingHistoryHandlerTest_collection_shard1_replica_n2",
   [junit4]   2>   "core_node_name":"core_node5",
   [junit4]   2>   "roles":null,
   [junit4]   2>   "base_url":"http://127.0.0.1:42829/solr",
   [junit4]   2>   "node_name":"127.0.0.1:42829_solr",
   [junit4]   2>   "numShards":"1",
   [junit4]   2>   "state":"down",
   [junit4]   2>   "shard":"shard1",
   [junit4]   2>   "collection":"AutoscalingHistoryHandlerTest_collection",
   [junit4]   2>   "type":"NRT",
   [junit4]   2>   "operation":"state"}
   [junit4]   2> 149961 DEBUG (OverseerStateUpdate-72073704294776841-127.0.0.1:33369_solr-n_0000000000) [n:127.0.0.1:33369_solr    ] o.a.s.c.o.ReplicaMutator Will update state for replica: core_node5:{"core":"AutoscalingHistoryHandlerTest_collection_shard1_replica_n2","base_url":"http://127.0.0.1:42829/solr","node_name":"127.0.0.1:42829_solr","state":"down","type":"NRT"}
   [junit4]   2> 149961 DEBUG (OverseerStateUpdate-72073704294776841-127.0.0.1:33369_solr-n_0000000000) [n:127.0.0.1:33369_solr    ] o.a.s.c.o.ReplicaMutator Collection is now: DocCollection(AutoscalingHistoryHandlerTest_collection//collections/AutoscalingHistoryHandlerTest_collection/state.json/1)={
   [junit4]   2>   "pullReplicas":"0",
   [junit4]   2>   "replicationFactor":"3",
   [junit4]   2>   "router":{"name":"compositeId"},
   [junit4]   2>   "maxShardsPerNode":"1",
   [junit4]   2>   "autoAddReplicas":"false",
   [junit4]   2>   "nrtReplicas":"3",
   [junit4]   2>   "tlogReplicas":"0",
   [junit4]   2>   "shards":{"shard1":{
   [junit4]   2>       "range":"80000000-7fffffff",
   [junit4]   2>       "state":"active",
   [junit4]   2>       "replicas":{
   [junit4]   2>         "core_node3":{
   [junit4]   2>           "core":"AutoscalingHistoryHandlerTest_collection_shard1_replica_n1",
   [junit4]   2>           "base_url":"http://127.0.0.1:37591/solr",
   [junit4]   2>           "node_name":"127.0.0.1:37591_solr",
   [junit4]   2>           "state":"down",
   [junit4]   2>           "type":"NRT"},
   [junit4]   2>         "core_node5":{
   [junit4]   2>           "core":"AutoscalingHistoryHandlerTest_collection_shard1_replica_n2",
   [junit4]   2>           "base_url":"http://127.0.0.1:42829/solr",
   [junit4]   2>           "node_name":"127.0.0.1:42829_solr",
   [junit4]   2>           "state":"down",
   [junit4]   2>           "type":"NRT"},
   [junit4]   2>         "core_node6":{
   [junit4]   2>           "core":"AutoscalingHistoryHandlerTest_collection_shard1_replica_n4",
   [junit4]   2>           "base_url":"http://127.0.0.1:33369/solr",
   [junit4]   2>           "state":"down",
   [junit4]   2>           "node_name":null,
   [junit4]   2>           "type":"NRT"}}}}}
   [junit4]   2> 149962 DEBUG (OverseerStateUpdate-72073704294776841-127.0.0.1:33369_solr-n_0000000000) [n:127.0.0.1:33369_solr    ] o.a.s.c.Overseer processMessage: queueSize: 3, message = {
   [junit4]   2>   "core":"AutoscalingHistoryHandlerTest_collection_shard1_replica_n4",
   [junit4]   2>   "core_node_name":"core_node6",
   [junit4]   2>   "roles":null,
   [junit4]   2>   "base_url":"http://127.0.0.1:33369/solr",
   [junit4]   2>   "node_name":"127.0.0.1:33369_solr",
   [junit4]   2>   "numShards":"1",
   [junit4]   2>   "state":"down",
   [junit4]   2>   "shard":"shard1",
   [junit4]   2>   "collection":"AutoscalingHistoryHandlerTest_collection",
   [junit4]   2>   "type":"NRT",
   [junit4]   2>   "operation":"state"} current state version: 0
   [junit4]   2> 149962 DEBUG (OverseerStateUpdate-72073704294776841-127.0.0.1:33369_solr-n_0000000000) [n:127.0.0.1:33369_solr    ] o.a.s.c.o.ReplicaMutator Update state numShards=1 message={
   [junit4]   2>   "core":"AutoscalingHistoryHandlerTest_collection_shard1_replica_n4",
   [junit4]   2>   "core_node_name":"core_node6",
   [junit4]   2>   "roles":null,
   [junit4]   2>   "base_url":"http://127.0.0.1:33369/solr",
   [junit4]   2>   "node_name":"127.0.0.1:33369_solr",
   [junit4]   2>   "numShards":"1",
   [junit4]   2>   "state":"down",
   [junit4]   2>   "shard":"shard1",
   [junit4]   2>   "collection":"AutoscalingHistoryHandlerTest_collection",
   [junit4]   2>   "type":"NRT",
   [junit4]   2>   "operation":"state"}
   [junit4]   2> 149962 DEBUG (OverseerStateUpdate-72073704294776841-127.0.0.1:33369_solr-n_0000000000) [n:127.0.0.1:33369_solr    ] o.a.s.c.o.ReplicaMutator Will update state for replica: core_node6:{"core":"AutoscalingHistoryHandlerTest_collection_shard1_replica_n4","base_url":"http://127.0.0.1:33369/solr","node_name":"127.0.0.1:33369_solr","state":"down","type":"NRT"}
   [junit4]   2> 149962 DEBUG (OverseerStateUpdate-72073704294776841-127.0.0.1:33369_solr-n_0000000000) [n:127.0.0.1:33369_solr    ] o.a.s.c.o.ReplicaMutator Collection is now: DocCollection(AutoscalingHistoryHandlerTest_collection//collections/AutoscalingHistoryHandlerTest_collection/state.json/1)={
   [junit4]   2>   "pullReplicas":"0",
   [junit4]   2>   "replicationFactor":"3",
   [junit4]   2>   "router":{"name":"compositeId"},
   [junit4]   2>   "maxShardsPerNode":"1",
   [junit4]   2>   "autoAddReplicas":"false",
   [junit4]   2>   "nrtReplicas":"3",
   [junit4]   2>   "tlogReplicas":"0",
   [junit4]   2>   "shards":{"shard1":{
   [junit4]   2>       "range":"80000000-7fffffff",
   [junit4]   2>       "state":"active",
   [junit4]   2>       "replicas":{
   [junit4]   2>         "core_node3":{
   [junit4]   2>           "core":"AutoscalingHistoryHandlerTest_collection_shard1_replica_n1",
   [junit4]   2>           "base_url":"http://127.0.0.1:37591/solr",
   [junit4]   2>           "node_name":"127.0.0.1:37591_solr",
   [junit4]   2>           "state":"down",
   [junit4]   2>           "type":"NRT"},
   [junit4]   2>         "core_node5":{
   [junit4]   2>           "core":"AutoscalingHistoryHandlerTest_collection_shard1_replica_n2",
   [junit4]   2>           "base_url":"http://127.0.0.1:42829/solr",
   [junit4]   2>           "node_name":"127.0.0.1:42829_solr",
   [junit4]   2>           "state":"down",
   [junit4]   2>           "type":"NRT"},
   [junit4]   2>         "core_node6":{
   [junit4]   2>           "core":"AutoscalingHistoryHandlerTest_collection_shard1_replica_n4",
   [junit4]   2>           "base_url":"http://127.0.0.1:33369/solr",
   [junit4]   2>           "node_name":"127.0.0.1:33369_solr",
   [junit4]   2>           "state":"down",
   [junit4]   2>           "type":"NRT"}}}}}
   [junit4]   2> 150062 DEBUG (OverseerStateUpdate-72073704294776841-127.0.0.1:33369_solr-n_0000000000) [n:127.0.0.1:33369_solr    ] o.a.s.c.o.ZkStateWriter going to update_collection /collections/AutoscalingHistoryHandlerTest_collection/state.json version: 1
   [junit4]   2> 150063 INFO  (zkCallback-156-thread-1-processing-n:127.0.0.1:37591_solr) [n:127.0.0.1:37591_solr    ] o.a.s.c.c.ZkStateReader A cluster state change: [WatchedEvent state:SyncConnected type:NodeDataChanged path:/collections/AutoscalingHistoryHandlerTest_collection/state.json] for collection [AutoscalingHistoryHandlerTest_collection] has occurred - updating... (live nodes size: [3])
   [junit4]   2> 150063 INFO  (zkCallback-155-thread-1-processing-n:127.0.0.1:42829_solr) [n:127.0.0.1:42829_solr    ] o.a.s.c.c.ZkStateReader A cluster state change: [WatchedEvent state:SyncConnected type:NodeDataChanged path:/collections/AutoscalingHistoryHandlerTest_collection/state.json] for collection [AutoscalingHistoryHandlerTest_collection] has occurred - updating... (live nodes size: [3])
   [junit4]   2> 150063 INFO  (zkCallback-159-thread-1-processing-n:127.0.0.1:33369_solr) [n:127.0.0.1:33369_solr    ] o.a.s.c.c.ZkStateReader A cluster state change: [WatchedEvent state:SyncConnected type:NodeDataChanged path:/collections/AutoscalingHistoryHandlerTest_collection/state.json] for collection [AutoscalingHistoryHandlerTest_collection] has occurred - updating... (live nodes size: [3])
   [junit4]   2> 150063 INFO  (zkCallback-156-thread-2-processing-n:127.0.0.1:37591_solr) [n:127.0.0.1:37591_solr    ] o.a.s.c.c.ZkStateReader A cluster state change: [WatchedEvent state:SyncConnected type:NodeDataChanged path:/collections/AutoscalingHistoryHandlerTest_collection/state.json] for collection [AutoscalingHistoryHandlerTest_collection] has occurred - updating... (live nodes size: [3])
   [junit4]   2> 150064 INFO  (zkCallback-159-thread-2-processing-n:127.0.0.1:33369_solr) [n:127.0.0.1:33369_solr    ] o.a.s.c.c.ZkStateReader A cluster state change: [WatchedEvent state:SyncConnected type:NodeDataChanged path:/collections/AutoscalingHistoryHandlerTest_collection/state.json] for collection [AutoscalingHistoryHandlerTest_collection] has occurred - updating... (live nodes size: [3])
   [junit4]   2> 150064 INFO  (zkCallback-155-thread-2-processing-n:127.0.0.1:42829_solr) [n:127.0.0.1:42829_solr    ] o.a.s.c.c.ZkStateReader A cluster state change: [WatchedEvent state:SyncConnected type:NodeDataChanged path:/collections/AutoscalingHistoryHandlerTest_collection/state.json] for collection [AutoscalingHistoryHandlerTest_collection] has occurred - updating... (live nodes size: [3])
   [junit4]   2> 150393 DEBUG (ScheduledTrigger-257-thread-1) [n:127.0.0.1:33369_solr    ] o.a.s.c.a.NodeLostTrigger Running NodeLostTrigger: .auto_add_replicas with currently live nodes: 3
   [junit4]   2> 150964 INFO  (qtp1600870910-6272) [n:127.0.0.1:42829_solr c:AutoscalingHistoryHandlerTest_collection s:shard1 r:core_node5 x:AutoscalingHistoryHandlerTest_collection_shard1_replica_n2] o.a.s.c.RequestParams conf resource params.json loaded . version : 0 
   [junit4]   2> 150965 INFO  (qtp1039788209-6291) [n:127.0.0.1:33369_solr c:AutoscalingHistoryHandlerTest_collection s:shard1 r:core_node6 x:AutoscalingHistoryHandlerTest_collection_shard1_replica_n4] o.a.s.c.RequestParams conf resource params.json loaded . version : 0 
   [junit4]   2> 150965 INFO  (qtp824660260-6271) [n:127.0.0.1:37591_solr c:AutoscalingHistoryHandlerTest_collection s:shard1 r:core_node3 x:AutoscalingHistoryHandlerTest_collection_shard1_replica_n1] o.a.s.c.RequestParams conf resource params.json loaded . version : 0 
   [junit4]   2> 150966 INFO  (qtp824660260-6271) [n:127.0.0.1:37591_solr c:AutoscalingHistoryHandlerTest_collection s:shard1 r:core_node3 x:AutoscalingHistoryHandlerTest_collection_shard1_replica_n1] o.a.s.c.RequestParams request params refreshed to version 0
   [junit4]   2> 150966 INFO  (qtp1600870910-6272) [n:127.0.0.1:42829_solr c:AutoscalingHistoryHandlerTest_collection s:shard1 r:core_node5 x:AutoscalingHistoryHandlerTest_collection_shard1_replica_n2] o.a.s.c.RequestParams request params refreshed to version 0
   [junit4]   2> 150966 INFO  (qtp1039788209-6291) [n:127.0.0.1:33369_solr c:AutoscalingHistoryHandlerTest_collection s:shard1 r:core_node6 x:AutoscalingHistoryHandlerTest_collection_shard1_replica_n4] o.a.s.c.RequestParams request params refreshed to version 0
   [junit4]   2> 150967 WARN  (qtp824660260-6271) [n:127.0.0.1:37591_solr c:AutoscalingHistoryHandlerTest_collection s:shard1 r:core_node3 x:AutoscalingHistoryHandlerTest_collection_shard1_replica_n1] o.a.s.c.SolrConfig Couldn't add files from /home/jenkins/workspace/Lucene-Solr-master-Linux/solr/build/solr-core/test/J2/temp/solr.handler.admin.AutoscalingHistoryHandlerTest_E3701F59287F00B5-001/tempDir-001/node1/AutoscalingHistoryHandlerTest_collection_shard1_replica_n1/../../../../contrib/extraction/lib filtered by .*\.jar to classpath: /home/jenkins/workspace/Lucene-Solr-master-Linux/solr/build/solr-core/test/J2/temp/solr.handler.admin.AutoscalingHistoryHandlerTest_E3701F59287F00B5-001/tempDir-001/node1/AutoscalingHistoryHandlerTest_collection_shard1_replica_n1/../../../../contrib/extraction/lib
   [junit4]   2> 150967 WARN  (qtp824660260-6271) [n:127.0.0.1:37591_solr c:AutoscalingHistoryHandlerTest_collection s:shard1 r:core_node3 x:AutoscalingHistoryHandlerTest_collection_shard1_replica_n1] o.a.s.c.SolrConfig Couldn't add files from /home/jenkins/workspace/Lucene-Solr-master-Linux/solr/build/solr-core/test/J2/temp/solr.handler.admin.AutoscalingHistoryHandlerTest_E3701F59287F00B5-001/tempDir-001/node1/AutoscalingHistoryHandlerTest_collection_shard1_replica_n1/../../../../dist filtered by solr-cell-\d.*\.jar to classpath: /home/jenkins/workspace/Lucene-Solr-master-Linux/solr/build/solr-core/test/J2/temp/solr.handler.admin.AutoscalingHistoryHandlerTest_E3701F59287F00B5-001/tempDir-001/node1/AutoscalingHistoryHandlerTest_collection_shard1_replica_n1/../../../../dist
   [junit4]   2> 150967 WARN  (qtp824660260-6271) [n:127.0.0.1:37591_solr c:AutoscalingHistoryHandlerTest_collection s:shard1 r:core_node3 x:AutoscalingHistoryHandlerTest_collection_shard1_replica_n1] o.a.s.c.SolrConfig Couldn't add files from /home/jenkins/workspace/Lucene-Solr-master-Linux/solr/build/solr-core/test/J2/temp/solr.handler.admin.AutoscalingHistoryHandlerTest_E3701F59287F00B5-001/tempDir-001/node1/AutoscalingHistoryHandlerTest_collection_shard1_replica_n1/../../../../contrib/clustering/lib filtered by .*\.jar to classpath: /home/jenkins/workspace/Lucene-Solr-master-Linux/solr/build/solr-core/test/J2/temp/solr.handler.admin.AutoscalingHistoryHandlerTest_E3701F59287F00B5-001/tempDir-001/node1/AutoscalingHistoryHandlerTest_collection_shard1_replica_n1/../../../../contrib/clustering/lib
   [junit4]   2> 150968 WARN  (qtp824660260-6271) [n:127.0.0.1:37591_solr c:AutoscalingHistoryHandlerTest_collection s:shard1 r:core_node3 x:AutoscalingHistoryHandlerTest_collection_shard1_replica_n1] o.a.s.c.SolrConfig Couldn't add files from /home/jenkins/workspace/Lucene-Solr-master-Linux/solr/build/solr-core/test/J2/temp/solr.handler.admin.AutoscalingHistoryHandlerTest_E3701F59287F00B5-001/tempDir-001/node1/AutoscalingHistoryHandlerTest_collection_shard1_replica_n1/../../../../dist filtered by solr-clustering-\d.*\.jar to classpath: /home/jenkins/workspace/Lucene-Solr-master-Linux/solr/build/solr-core/test/J2/temp/solr.handler.admin.AutoscalingHistoryHandlerTest_E3701F59287F00B5-001/tempDir-001/node1/AutoscalingHistoryHandlerTest_collection_shard1_replica_n1/../../../../dist
   [junit4]   2> 150968 WARN  (qtp824660260-6271) [n:127.0.0.1:37591_solr c:AutoscalingHistoryHandlerTest_collection s:shard1 r:core_node3 x:AutoscalingHistoryHandlerTest_collection_shard1_replica_n1] o.a.s.c.SolrConfig Couldn't add files from /home/jenkins/workspace/Lucene-Solr-master-Linux/solr/build/solr-core/test/J2/temp/solr.handler.admin.AutoscalingHistoryHandlerTest_E3701F59287F00B5-001/tempDir-001/node1/AutoscalingHistoryHandlerTest_collection_shard1_replica_n1/../../../../contrib/langid/lib filtered by .*\.jar to classpath: /home/jenkins/workspace/Lucene-Solr-master-Linux/solr/build/solr-core/test/J2/temp/solr.handler.admin.AutoscalingHistoryHandlerTest_E3701F59287F00B5-001/tempDir-001/node1/AutoscalingHistoryHandlerTest_collection_shard1_replica_n1/../../../../contrib/langid/lib
   [junit4]   2> 150968 WARN  (qtp824660260-6271) [n:127.0.0.1:37591_solr c:AutoscalingHistoryHandlerTest_collection s:shard1 r:core_node3 x:AutoscalingHistoryHandlerTest_collection_shard1_replica_n1] o.a.s.c.SolrConfig Couldn't add files from /home/jenkins/workspace/Lucene-Solr-master-Linux/solr/build/solr-core/test/J2/temp/solr.handler.admin.AutoscalingHistoryHandlerTest_E3701F59287F00B5-001/tempDir-001/node1/AutoscalingHistoryHandlerTest_collection_shard1_replica_n1/../../../../dist filtered by solr-langid-\d.*\.jar to classpath: /home/jenkins/workspace/Lucene-Solr-master-Linux/solr/build/solr-core/test/J2/temp/solr.handler.admin.AutoscalingHistoryHandlerTest_E3701F59287F00B5-001/tempDir-001/node1/AutoscalingHistoryHandlerTest_collection_shard1_replica_n1/../../../../dist
   [junit4]   2> 150968 WARN  (qtp824660260-6271) [n:127.0.0.1:37591_solr c:AutoscalingHistoryHandlerTest_collection s:shard1 r:core_node3 x:AutoscalingHistoryHandlerTest_collection_shard1_replica_n1] o.a.s.c.SolrConfig Couldn't add files from /home/jenkins/workspace/Lucene-Solr-master-Linux/solr/build/solr-core/test/J2/temp/solr.handler.admin.AutoscalingHistoryHandlerTest_E3701F59287F00B5-001/tempDir-001/node1/AutoscalingHistoryHandlerTest_collection_shard1_replica_n1/../../../../contrib/velocity/lib filtered by .*\.jar to classpath: /home/jenkins/workspace/Lucene-Solr-master-Linux/solr/build/solr-core/test/J2/temp/solr.handler.admin.AutoscalingHistoryHandlerTest_E3701F59287F00B5-001/tempDir-001/node1/AutoscalingHistoryHandlerTest_collection_shard1_replica_n1/../../../../contrib/velocity/lib
   [junit4]   2> 150968 WARN  (qtp824660260-6271) [n:127.0.0.1:37591_solr c:AutoscalingHistoryHandlerTest_collection s:shard1 r:core_node3 x:AutoscalingHistoryHandlerTest_collection_shard1_replica_n1] o.a.s.c.SolrConfig Couldn't add files from /home/jenkins/workspace/Lucene-Solr-master-Linux/solr/build/solr-core/test/J2/temp/solr.handler.admin.AutoscalingHistoryHandlerTest_E3701F59287F00B5-001/tempDir-001/node1/AutoscalingHistoryHandlerTest_collection_shard1_replica_n1/../../../../dist filtered by solr-velocity-\d.*\.jar to classpath: /home/jenkins/workspace/Lucene-Solr-master-Linux/solr/build/solr-core/test/J2/temp/solr.handler.admin.AutoscalingHistoryHandlerTest_E3701F59287F00B5-001/tempDir-001/node1/AutoscalingHistoryHandlerTest_collection_shard1_replica_n1/../../../../dist
   [junit4]   2> 150974 INFO  (qtp824660260-6271) [n:127.0.0.1:37591_solr c:AutoscalingHistoryHandlerTest_collection s:shard1 r:core_node3 x:AutoscalingHistoryHandlerTest_collection_shard1_replica_n1] o.a.s.c.SolrConfig Using Lucene MatchVersion: 8.0.0
   [junit4]   2> 150967 WARN  (qtp1600870910-6272) [n:127.0.0.1:42829_solr c:AutoscalingHistoryHandlerTest_collection s:shard1 r:core_node5 x:AutoscalingHistoryHandlerTest_collection_shard1_replica_n2] o.a.s.c.SolrConfig Couldn't add files from /home/jenkins/workspace/Lucene-Solr-master-Linux/solr/build/solr-core/test/J2/temp/solr.handler.admin.AutoscalingHistoryHandlerTest_E3701F59287F00B5-001/tempDir-001/node3/AutoscalingHistoryHandlerTest_collection_shard1_replica_n2/../../../../contrib/extraction/lib filtered by .*\.jar to classpath: /home/jenkins/workspace/Lucene-Solr-master-Linux/solr/build/solr-core/test/J2/temp/solr.handler.admin.AutoscalingHistoryHandlerTest_E3701F59287F00B5-001/tempDir-001/node3/AutoscalingHistoryHandlerTest_collection_shard1_replica_n2/../../../../contrib/extraction/lib
   [junit4]   2> 150967 WARN  (qtp1039788209-6291) [n:127.0.0.1:33369_solr c:AutoscalingHistoryHandlerTest_collection s:shard1 r:core_node6 x:AutoscalingHistoryHandlerTest_collection_shard1_replica_n4] o.a.s.c.SolrConfig Couldn't add files from /home/jenkins/workspace/Lucene-Solr-master-Linux/solr/build/solr-core/test/J2/temp/solr.handler.admin.AutoscalingHistoryHandlerTest_E3701F59287F00B5-001/tempDir-001/node2/AutoscalingHistoryHandlerTest_collection_shard1_replica_n4/../../../../contrib/extraction/lib filtered by .*\.jar to classpath: /home/jenkins/workspace/Lucene-Solr-master-Linux/solr/build/solr-core/test/J2/temp/solr.handler.admin.AutoscalingHistoryHandlerTest_E3701F59287F00B5-001/tempDir-001/node2/AutoscalingHistoryHandlerTest_collection_shard1_replica_n4/../../../../contrib/extraction/lib
   [junit4]   2> 150975 WARN  (qtp1039788209-6291) [n:127.0.0.1:33369_solr c:AutoscalingHistoryHandlerTest_collection s:shard1 r:core_node6 x:AutoscalingHistoryHandlerTest_collection_shard1_replica_n4] o.a.s.c.SolrConfig Couldn't add files from /home/jenkins/workspace/Lucene-Solr-master-Linux/solr/build/solr-core/test/J2/temp/solr.handler.admin.AutoscalingHistoryHandlerTest_E3701F59287F00B5-001/tempDir-001/node2/AutoscalingHistoryHandlerTest_collection_shard1_replica_n4/../../../../dist filtered by solr-cell-\d.*\.jar to classpath: /home/jenkins/workspace/Lucene-Solr-master-Linux/solr/build/solr-core/test/J2/temp/solr.handler.admin.AutoscalingHistoryHandlerTest_E3701F59287F00B5-001/tempDir-001/node2/AutoscalingHistoryHandlerTest_collection_shard1_replica_n4/../../../../dist
   [junit4]   2> 150975 WARN  (qtp1600870910-6272) [n:127.0.0.1:42829_solr c:AutoscalingHistoryHandlerTest_collection s:shard1 r:core_node5 x:AutoscalingHistoryHandlerTest_collection_shard1_replica_n2] o.a.s.c.SolrConfig Couldn't add files from /home/jenkins/workspace/Lucene-Solr-master-Linux/solr/build/solr-core/test/J2/temp/solr.handler.admin.AutoscalingHistoryHandlerTest_E3701F59287F00B5-001/tempDir-001/node3/AutoscalingHistoryHandlerTest_collection_shard1_replica_n2/../../../../dist filtered by solr-cell-\d.*\.jar to classpath: /home/jenkins/workspace/Lucene-Solr-master-Linux/solr/build/solr-core/test/J2/temp/solr.handler.admin.AutoscalingHistoryHandlerTest_E3701F59287F00B5-001/tempDir-001/node3/AutoscalingHistoryHandlerTest_collection_shard1_replica_n2/../../../../dist
   [junit4]   2> 150975 WARN  (qtp1039788209-6291) [n:127.0.0.1:33369_solr c:AutoscalingHistoryHandlerTest_collection s:shard1 r:core_node6 x:AutoscalingHistoryHandlerTest_collection_shard1_replica_n4] o.a.s.c.SolrConfig Couldn't add files from /home/jenkins/workspace/Lucene-Solr-master-Linux/solr/build/solr-core/test/J2/temp/solr.handler.admin.AutoscalingHistoryHandlerTest_E3701F59287F00B5-001/tempDir-001/node2/AutoscalingHistoryHandlerTest_collection_shard1_replica_n4/../../../../contrib/clustering/lib filtered by .*\.jar to classpath: /home/jenkins/workspace/Lucene-Solr-master-Linux/solr/build/solr-core/test/J2/temp/solr.handler.admin.AutoscalingHistoryHandlerTest_E3701F59287F00B5-001/tempDir-001/node2/AutoscalingHistoryHandlerTest_collection_shard1_replica_n4/../../../../contrib/clustering/lib
   [junit4]   2> 150976 WARN  (qtp1600870910-6272) [n:127.0.0.1:42829_solr c:AutoscalingHistoryHandlerTest_collection s:shard1 r:core_node5 x:AutoscalingHistoryHandlerTest_collection_shard1_replica_n2] o.a.s.c.SolrConfig Couldn't add files from /home/jenkins/workspace/Lucene-Solr-master-Linux/solr/build/solr-core/test/J2/temp/solr.handler.admin.AutoscalingHistoryHandlerTest_E3701F59287F00B5-001/tempDir-001/node3/AutoscalingHistoryHandlerTest_collection_shard1_replica_n2/../../../../contrib/clustering/lib filtered by .*\.jar to classpath: /home/jenkins/workspace/Lucene-Solr-master-Linux/solr/build/solr-core/test/J2/temp/solr.handler.admin.AutoscalingHistoryHandlerTest_E3701F59287F00B5-001/tempDir-001/node3/AutoscalingHistoryHandlerTest_collection_shard1_replica_n2/../../../../contrib/clustering/lib
   [junit4]   2> 150976 WARN  (qtp1039788209-6291) [n:127.0.0.1:33369_solr c:AutoscalingHistoryHandlerTest_collection s:shard1 r:core_node6 x:AutoscalingHistoryHandlerTest_collection_shard1_replica_n4] o.a.s.c.SolrConfig Couldn't add files from /home/jenkins/workspace/Lucene-Solr-master-Linux/solr/build/solr-core/test/J2/temp/solr.handler.admin.AutoscalingHistoryHandlerTest_E3701F59287F00B5-001/tempDir-001/node2/AutoscalingHistoryHandlerTest_collection_shard1_replica_n4/../../../../dist filtered by solr-clustering-\d.*\.jar to classpath: /home/jenkins/workspace/Lucene-Solr-master-Linux/solr/build/solr-core/test/J2/temp/solr.handler.admin.AutoscalingHistoryHandlerTest_E3701F59287F00B5-001/tempDir-001/node2/AutoscalingHistoryHandlerTest_collection_shard1_replica_n4/../../../../dist
   [junit4]   2> 150976 WARN  (qtp1600870910-6272) [n:127.0.0.1:42829_solr c:AutoscalingHistoryHandlerTest_collection s:shard1 r:core_node5 x:AutoscalingHistoryHandlerTest_collection_shard1_replica_n2] o.a.s.c.SolrConfig Couldn't add files from /home/jenkins/workspace/Lucene-Solr-master-Linux/solr/build/solr-core/test/J2/temp/solr.handler.admin.AutoscalingHistoryHandlerTest_E3701F59287F00B5-001/tempDir-001/node3/AutoscalingHistoryHandlerTest_collection_shard1_replica_n2/../../../../dist filtered by solr-clustering-\d.*\.jar to classpath: /home/jenkins/workspace/Lucene-Solr-master-Linux/solr/build/solr-core/test/J2/temp/solr.handler.admin.AutoscalingHistoryHandlerTest_E3701F59287F00B5-001/tempDir-001/node3/AutoscalingHistoryHandlerTest_collection_shard1_replica_n2/../../../../dist
   [junit4]   2> 150976 WARN  (qtp1039788209-6291) [n:127.0.0.1:33369_solr c:AutoscalingHistoryHandlerTest_collection s:shard1 r:core_node6 x:AutoscalingHistoryHandlerTest_collection_shard1_replica_n4] o.a.s.c.SolrConfig Couldn't add files from /home/jenkins/workspace/Lucene-Solr-master-Linux/solr/build/solr-core/test/J2/temp/solr.handler.admin.AutoscalingHistoryHandlerTest_E3701F59287F00B5-001/tempDir-001/node2/AutoscalingHistoryHandlerTest_collection_shard1_replica_n4/../../../../contrib/langid/lib filtered by .*\.jar to classpath: /home/jenkins/workspace/Lucene-Solr-master-Linux/solr/build/solr-core/test/J2/temp/solr.handler.admin.AutoscalingHistoryHandlerTest_E3701F59287F00B5-001/tempDir-001/node2/AutoscalingHistoryHandlerTest_collection_shard1_replica_n4/../../../../contrib/langid/lib
   [junit4]   2> 150976 WARN  (qtp1600870910-6272) [n:127.0.0.1:42829_solr c:AutoscalingHistoryHandlerTest_collection s:shard1 r:core_node5 x:AutoscalingHistoryHandlerTest_collection_shard1_replica_n2] o.a.s.c.SolrConfig Couldn't add files from /home/jenkins/workspace/Lucene-Solr-master-Linux/solr/build/solr-core/test/J2/temp/solr.handler.admin.AutoscalingHistoryHandlerTest_E3701F59287F00B5-001/tempDir-001/node3/AutoscalingHistoryHandlerTest_collection_shard1_replica_n2/../../../../contrib/langid/lib filtered by .*\.jar to classpath: /home/jenkins/workspace/Lucene-Solr-master-Linux/solr/build/solr-core/test/J2/temp/solr.handler.admin.AutoscalingHistoryHandlerTest_E3701F59287F00B5-001/tempDir-001/node3/AutoscalingHistoryHandlerTest_collection_shard1_replica_n2/../../../../contrib/langid/lib
   [junit4]   2> 150976 WARN  (qtp1039788209-6291) [n:127.0.0.1:33369_solr c:AutoscalingHistoryHandlerTest_collection s:shard1 r:core_node6 x:AutoscalingHistoryHandlerTest_collection_shard1_replica_n4] o.a.s.c.SolrConfig Couldn't add files from /home/jenkins/workspace/Lucene-Solr-master-Linux/solr/build/solr-core/test/J2/temp/solr.handler.admin.AutoscalingHistoryHandlerTest_E3701F59287F00B5-001/tempDir-001/node2/AutoscalingHistoryHandlerTest_collection_shard1_replica_n4/../../../../dist filtered by solr-langid-\d.*\.jar to classpath: /home/jenkins/workspace/Lucene-Solr-master-Linux/solr/build/solr-core/test/J2/temp/solr.handler.admin.AutoscalingHistoryHandlerTest_E3701F59287F00B5-001/tempDir-001/node2/AutoscalingHistoryHandlerTest_collection_shard1_replica_n4/../../../../dist
   [junit4]   2> 150976 WARN  (qtp1600870910-6272) [n:127.0.0.1:42829_solr c:AutoscalingHistoryHandlerTest_collection s:shard1 r:core_node5 x:AutoscalingHistoryHandlerTest_collection_shard1_replica_n2] o.a.s.c.SolrConfig Couldn't add files from /home/jenkins/workspace/Lucene-Solr-master-Linux/solr/build/solr-core/test/J2/temp/solr.handler.admin.AutoscalingHistoryHandlerTest_E3701F59287F00B5-001/tempDir-001/node3/AutoscalingHistoryHandlerTest_collection_shard1_replica_n2/../../../../dist filtered by solr-langid-\d.*\.jar to classpath: /home/jenkins/workspace/Lucene-Solr-master-Linux/solr/build/solr-core/test/J2/temp/solr.handler.admin.AutoscalingHistoryHandlerTest_E3701F59287F00B5-001/tempDir-001/node3/AutoscalingHistoryHandlerTest_collection_shard1_replica_n2/../../../../dist
   [junit4]   2> 150976 WARN  (qtp1039788209-6291) [n:127.0.0.1:33369_solr c:AutoscalingHistoryHandlerTest_collection s:shard1 r:core_node6 x:AutoscalingHistoryHandlerTest_collection_shard1_replica_n4] o.a.s.c.SolrConfig Couldn't add files from /home/jenkins/workspace/Lucene-Solr-master-Linux/solr/build/solr-core/test/J2/temp/solr.handler.admin.AutoscalingHistoryHandlerTest_E3701F59287F00B5-001/tempDir-001/node2/AutoscalingHistoryHandlerTest_collection_sh

[...truncated too long message...]

null,UNAVAILABLE}
   [junit4]   2> 2611337 INFO  (jetty-closer-4396-thread-3) [    ] o.e.j.s.session Stopped scavenging
   [junit4]   2> 2611341 INFO  (jetty-closer-4396-thread-12) [    ] o.e.j.s.h.ContextHandler Stopped o.e.j.s.ServletContextHandler@4ad91363{/solr,null,UNAVAILABLE}
   [junit4]   2> 2611341 INFO  (jetty-closer-4396-thread-12) [    ] o.e.j.s.session Stopped scavenging
   [junit4]   2> 2611345 WARN  (zkCallback-4555-thread-2-processing-n:127.0.0.1:36547_solr) [n:127.0.0.1:36547_solr    ] o.a.s.c.c.ZkStateReader ZooKeeper watch triggered, but Solr cannot talk to ZK: [KeeperErrorCode = Session expired for /live_nodes]
   [junit4]   2> 2611345 INFO  (jetty-closer-4396-thread-8) [    ] o.e.j.s.h.ContextHandler Stopped o.e.j.s.ServletContextHandler@3cee8758{/solr,null,UNAVAILABLE}
   [junit4]   2> 2611345 INFO  (jetty-closer-4396-thread-8) [    ] o.e.j.s.session Stopped scavenging
   [junit4]   2> 2611345 ERROR (SUITE-TriggerIntegrationTest-seed#[E3701F59287F00B5]-worker) [    ] o.a.z.s.ZooKeeperServer ZKShutdownHandler is not registered, so ZooKeeper server won't take any action on ERROR or SHUTDOWN server state changes
   [junit4]   2> 2611346 INFO  (SUITE-TriggerIntegrationTest-seed#[E3701F59287F00B5]-worker) [    ] o.a.s.c.ZkTestServer connecting to 127.0.0.1:37363 37363
   [junit4]   2> 2611459 INFO  (Thread-11852) [    ] o.a.s.c.ZkTestServer connecting to 127.0.0.1:37363 37363
   [junit4]   2> 2611460 WARN  (Thread-11852) [    ] o.a.s.c.ZkTestServer Watch limit violations: 
   [junit4]   2> Maximum concurrent create/delete watches above limit:
   [junit4]   2> 
   [junit4]   2> 	33	/solr/collections/collection1/terms/shard1
   [junit4]   2> 	23	/solr/aliases.json
   [junit4]   2> 	22	/solr/security.json
   [junit4]   2> 	10	/solr/configs/conf
   [junit4]   2> 	9	/solr/collections/testMetricTrigger/terms/shard1
   [junit4]   2> 	2	/solr/collections/testMetricTrigger/terms/shard2
   [junit4]   2> 
   [junit4]   2> Maximum concurrent data watches above limit:
   [junit4]   2> 
   [junit4]   2> 	95	/solr/collections/collection1/state.json
   [junit4]   2> 	43	/solr/collections/testMetricTrigger/state.json
   [junit4]   2> 	23	/solr/clusterprops.json
   [junit4]   2> 	23	/solr/clusterstate.json
   [junit4]   2> 	6	/solr/autoscaling.json
   [junit4]   2> 	3	/solr/overseer_elect/election/72073852368125973-127.0.0.1:41155_solr-n_0000000005
   [junit4]   2> 	3	/solr/overseer_elect/election/72073852368125994-127.0.0.1:36095_solr-n_0000000012
   [junit4]   2> 	2	/solr/overseer_elect/election/72073852368125976-127.0.0.1:33365_solr-n_0000000006
   [junit4]   2> 	2	/solr/overseer_elect/election/72073852368125982-127.0.0.1:44091_solr-n_0000000008
   [junit4]   2> 	2	/solr/overseer_elect/election/72073852368125985-127.0.0.1:33147_solr-n_0000000009
   [junit4]   2> 	2	/solr/collections/collection1/leader_elect/shard1/election/72073852368126015-core_node4-n_0000000001
   [junit4]   2> 	2	/solr/collections/collection1/leader_elect/shard1/election/72073852368125991-core_node8-n_0000000003
   [junit4]   2> 	2	/solr/overseer_elect/election/72073852368125991-127.0.0.1:40245_solr-n_0000000011
   [junit4]   2> 	2	/solr/overseer_elect/election/72073852368126006-127.0.0.1:42369_solr-n_0000000016
   [junit4]   2> 
   [junit4]   2> Maximum concurrent children watches above limit:
   [junit4]   2> 
   [junit4]   2> 	23	/solr/live_nodes
   [junit4]   2> 	23	/solr/collections
   [junit4]   2> 	6	/solr/overseer/queue-work
   [junit4]   2> 	6	/solr/autoscaling/events/.auto_add_replicas
   [junit4]   2> 	6	/solr/overseer/queue
   [junit4]   2> 	6	/solr/overseer/collection-queue-work
   [junit4]   2> 	2	/solr/autoscaling/events/node_lost_triggerMR
   [junit4]   2> 	2	/solr/autoscaling/events/node_added_triggerCTOOR
   [junit4]   2> 
   [junit4]   2> NOTE: leaving temporary files on disk at: /home/jenkins/workspace/Lucene-Solr-master-Linux/solr/build/solr-core/test/J2/temp/solr.cloud.autoscaling.TriggerIntegrationTest_E3701F59287F00B5-001
   [junit4]   2> Feb 01, 2018 11:38:44 AM com.carrotsearch.randomizedtesting.ThreadLeakControl checkThreadLeaks
   [junit4]   2> WARNING: Will linger awaiting termination of 1 leaked thread(s).
   [junit4]   2> NOTE: test params are: codec=FastCompressingStoredFields(storedFieldsFormat=CompressingStoredFieldsFormat(compressionMode=FAST, chunkSize=8, maxDocsPerChunk=157, blockSize=823), termVectorsFormat=CompressingTermVectorsFormat(compressionMode=FAST, chunkSize=8, blockSize=823)), sim=Asserting(org.apache.lucene.search.similarities.AssertingSimilarity@5c1ba910), locale=en-SX, timezone=Etc/GMT+7
   [junit4]   2> NOTE: Linux 4.13.0-32-generic amd64/Oracle Corporation 9.0.1 (64-bit)/cpus=8,threads=1,free=256951480,total=536870912
   [junit4]   2> NOTE: All tests run in this JVM: [TestDistribStateManager, TestJmxIntegration, TestSchemaNameResource, TestAuthorizationFramework, StressHdfsTest, StatsReloadRaceTest, AutoscalingHistoryHandlerTest, TestCloudPivotFacet, TestReRankQParserPlugin, LeaderElectionIntegrationTest, MoreLikeThisHandlerTest, ResponseLogComponentTest, TestDFISimilarityFactory, TestAnalyzedSuggestions, ConnectionManagerTest, MergeStrategyTest, BlockDirectoryTest, TestNumericTerms32, TestInPlaceUpdatesDistrib, TestSQLHandlerNonCloud, HdfsBasicDistributedZkTest, TimeZoneUtilsTest, EnumFieldTest, DistributedDebugComponentTest, TestNumericRangeQuery64, DeleteReplicaTest, TestCollectionsAPIViaSolrCloudCluster, TestDeleteCollectionOnDownNodes, TestSolrCoreProperties, SolrGangliaReporterTest, QueryResultKeyTest, SpellPossibilityIteratorTest, DocValuesMultiTest, TestLargeCluster, UnloadDistributedZkTest, CopyFieldTest, SolrJmxReporterTest, VersionInfoTest, RegexBoostProcessorTest, DistanceFunctionTest, TestCoreBackup, SearchHandlerTest, CdcrVersionReplicationTest, TestChildDocTransformer, TestQueryTypes, GraphQueryTest, TestComplexPhraseQParserPlugin, ShowFileRequestHandlerTest, SolrCmdDistributorTest, MetricTriggerTest, ConnectionReuseTest, ConvertedLegacyTest, TestRestManager, SearchHandlerTest, CoreMergeIndexesAdminHandlerTest, ReturnFieldsTest, TestSimpleTextCodec, ZkStateWriterTest, TestCloudDeleteByQuery, TestSystemCollAutoCreate, HdfsLockFactoryTest, ConcurrentDeleteAndCreateCollectionTest, BasicDistributedZk2Test, DistributedSpellCheckComponentTest, TestConfigsApi, TestJavabinTupleStreamParser, RestartWhileUpdatingTest, SmileWriterTest, DocValuesTest, TestSolrCloudWithHadoopAuthPlugin, HighlighterMaxOffsetTest, UniqFieldsUpdateProcessorFactoryTest, LeaderFailoverAfterPartitionTest, CollectionTooManyReplicasTest, TestExportWriter, TestNRTOpen, TestConfigSetImmutable, TestDistributedStatsComponentCardinality, TestTolerantSearch, OverseerRolesTest, TestMacroExpander, TestReqParamsAPI, ExplicitHLLTest, CurrencyFieldTypeTest, TestStressReorder, TestCoreDiscovery, HdfsNNFailoverTest, TestSchemaManager, TestBulkSchemaConcurrent, NoCacheHeaderTest, CollectionsAPISolrJTest, TestCollationFieldDocValues, SpatialFilterTest, TestSubQueryTransformerDistrib, TestDistributedMissingSort, TestSolrDeletionPolicy2, TestCodecSupport, OverriddenZkACLAndCredentialsProvidersTest, DistanceUnitsTest, TestDFRSimilarityFactory, TestBadConfig, HdfsTlogReplayBufferedWhileIndexingTest, DataDrivenBlockJoinTest, CachingDirectoryFactoryTest, SolrMetricManagerTest, RecoveryZkTest, URLClassifyProcessorTest, MoveReplicaHDFSFailoverTest, TestLegacyField, ChaosMonkeyNothingIsSafeWithPullReplicasTest, TestAnalyzeInfixSuggestions, TestSolrCloudSnapshots, AutoAddReplicasPlanActionTest, ZkShardTermsTest, CacheHeaderTest, TestManagedSchemaAPI, DeleteInactiveReplicaTest, TestSegmentSorting, TestFastWriter, TestStandardQParsers, IgnoreCommitOptimizeUpdateProcessorFactoryTest, TestReplicaProperties, TestSchemaVersionResource, DateFieldTest, AliasIntegrationTest, ChaosMonkeySafeLeaderTest, OpenCloseCoreStressTest, BasicZkTest, TestReplicationHandler, ZkSolrClientTest, ZkCLITest, ShardRoutingCustomTest, TestDistributedSearch, DistributedTermsComponentTest, TestCoreContainer, TestSolr4Spatial, SpellCheckComponentTest, BadIndexSchemaTest, TestFiltering, DirectUpdateHandlerTest, DistributedQueryElevationComponentTest, SimplePostToolTest, AnalysisAfterCoreReloadTest, SignatureUpdateProcessorFactoryTest, SpellCheckCollatorTest, CoreAdminHandlerTest, SolrRequestParserTest, SuggesterTSTTest, TestStressLucene, SuggesterWFSTTest, TestCSVLoader, WordBreakSolrSpellCheckerTest, SchemaVersionSpecificBehaviorTest, TestPseudoReturnFields, TestUpdate, FieldMutatingUpdateProcessorTest, TestAtomicUpdateErrorCases, TestWordDelimiterFilterFactory, QueryEqualityTest, DirectUpdateHandlerOptimizeTest, StatelessScriptUpdateProcessorFactoryTest, SortByFunctionTest, IndexBasedSpellCheckerTest, DisMaxRequestHandlerTest, DirectSolrSpellCheckerTest, TestOmitPositions, XmlUpdateRequestHandlerTest, RequestHandlersTest, TestValueSourceCache, TermVectorComponentTest, IndexSchemaRuntimeFieldTest, TestCollationField, UpdateRequestProcessorFactoryTest, TestPHPSerializedResponseWriter, TestComponentsName, TestLFUCache, ExternalFileFieldSortTest, NotRequiredUniqueKeyTest, TestCharFilters, SynonymTokenizerTest, TestLMDirichletSimilarityFactory, TestBM25SimilarityFactory, TestFastLRUCache, PreAnalyzedFieldTest, ClusterStateTest, TestUtils, SystemInfoHandlerTest, UUIDFieldTest, CircularListTest, CursorPagingTest, TestEmbeddedSolrServerConstructors, TestJettySolrRunner, AddReplicaTest, CollectionStateFormat2Test, ConcurrentCreateRoutedAliasTest, DistribJoinFromCollectionTest, DistributedQueueTest, HttpPartitionTest, NodeMutatorTest, OverseerModifyCollectionTest, PeerSyncReplicationTest, TestCloudSearcherWarming, TestLeaderInitiatedRecoveryThread, TestPullReplicaErrorHandling, TestUtilizeNode, CollectionReloadTest, CustomCollectionTest, TestHdfsCloudBackupRestore, AutoAddReplicasIntegrationTest, HdfsAutoAddReplicasIntegrationTest, TriggerIntegrationTest]
   [junit4] Completed [600/774 (3!)] on J2 in 203.67s, 14 tests, 1 failure <<< FAILURES!

[...truncated 41397 lines...]

Mime
View raw message