lucene-dev mailing list archives

Site index · List index
Message view « Date » · « Thread »
Top « Date » · « Thread »
From Apache Jenkins Server <jenk...@builds.apache.org>
Subject [JENKINS] Lucene-Solr-Tests-7.x - Build # 360 - Failure
Date Fri, 09 Feb 2018 16:28:12 GMT
Build: https://builds.apache.org/job/Lucene-Solr-Tests-7.x/360/

11 tests failed.
FAILED:  org.apache.solr.cloud.LeaderFailureAfterFreshStartTest.test

Error Message:
Could not load collection from ZK: collection1

Stack Trace:
org.apache.solr.common.SolrException: Could not load collection from ZK: collection1
	at __randomizedtesting.SeedInfo.seed([BEE0BAB69C20E091:36B4856C32DC8D69]:0)
	at org.apache.solr.common.cloud.ZkStateReader.getCollectionLive(ZkStateReader.java:1108)
	at org.apache.solr.common.cloud.ZkStateReader$LazyCollectionRef.get(ZkStateReader.java:647)
	at org.apache.solr.common.cloud.ClusterState.getCollectionOrNull(ClusterState.java:137)
	at org.apache.solr.common.cloud.ClusterState.getCollection(ClusterState.java:117)
	at org.apache.solr.cloud.LeaderFailureAfterFreshStartTest.waitTillNodesActive(LeaderFailureAfterFreshStartTest.java:209)
	at org.apache.solr.cloud.LeaderFailureAfterFreshStartTest.restartNodes(LeaderFailureAfterFreshStartTest.java:174)
	at org.apache.solr.cloud.LeaderFailureAfterFreshStartTest.test(LeaderFailureAfterFreshStartTest.java:149)
	at sun.reflect.NativeMethodAccessorImpl.invoke0(Native Method)
	at sun.reflect.NativeMethodAccessorImpl.invoke(NativeMethodAccessorImpl.java:62)
	at sun.reflect.DelegatingMethodAccessorImpl.invoke(DelegatingMethodAccessorImpl.java:43)
	at java.lang.reflect.Method.invoke(Method.java:498)
	at com.carrotsearch.randomizedtesting.RandomizedRunner.invoke(RandomizedRunner.java:1737)
	at com.carrotsearch.randomizedtesting.RandomizedRunner$8.evaluate(RandomizedRunner.java:934)
	at com.carrotsearch.randomizedtesting.RandomizedRunner$9.evaluate(RandomizedRunner.java:970)
	at com.carrotsearch.randomizedtesting.RandomizedRunner$10.evaluate(RandomizedRunner.java:984)
	at org.apache.solr.BaseDistributedSearchTestCase$ShardsRepeatRule$ShardsFixedStatement.callStatement(BaseDistributedSearchTestCase.java:993)
	at org.apache.solr.BaseDistributedSearchTestCase$ShardsRepeatRule$ShardsStatement.evaluate(BaseDistributedSearchTestCase.java:968)
	at com.carrotsearch.randomizedtesting.rules.SystemPropertiesRestoreRule$1.evaluate(SystemPropertiesRestoreRule.java:57)
	at org.apache.lucene.util.TestRuleSetupTeardownChained$1.evaluate(TestRuleSetupTeardownChained.java:49)
	at org.apache.lucene.util.AbstractBeforeAfterRule$1.evaluate(AbstractBeforeAfterRule.java:45)
	at org.apache.lucene.util.TestRuleThreadAndTestName$1.evaluate(TestRuleThreadAndTestName.java:48)
	at org.apache.lucene.util.TestRuleIgnoreAfterMaxFailures$1.evaluate(TestRuleIgnoreAfterMaxFailures.java:64)
	at org.apache.lucene.util.TestRuleMarkFailure$1.evaluate(TestRuleMarkFailure.java:47)
	at com.carrotsearch.randomizedtesting.rules.StatementAdapter.evaluate(StatementAdapter.java:36)
	at com.carrotsearch.randomizedtesting.ThreadLeakControl$StatementRunner.run(ThreadLeakControl.java:368)
	at com.carrotsearch.randomizedtesting.ThreadLeakControl.forkTimeoutingTask(ThreadLeakControl.java:817)
	at com.carrotsearch.randomizedtesting.ThreadLeakControl$3.evaluate(ThreadLeakControl.java:468)
	at com.carrotsearch.randomizedtesting.RandomizedRunner.runSingleTest(RandomizedRunner.java:943)
	at com.carrotsearch.randomizedtesting.RandomizedRunner$5.evaluate(RandomizedRunner.java:829)
	at com.carrotsearch.randomizedtesting.RandomizedRunner$6.evaluate(RandomizedRunner.java:879)
	at com.carrotsearch.randomizedtesting.RandomizedRunner$7.evaluate(RandomizedRunner.java:890)
	at com.carrotsearch.randomizedtesting.rules.StatementAdapter.evaluate(StatementAdapter.java:36)
	at com.carrotsearch.randomizedtesting.rules.SystemPropertiesRestoreRule$1.evaluate(SystemPropertiesRestoreRule.java:57)
	at org.apache.lucene.util.AbstractBeforeAfterRule$1.evaluate(AbstractBeforeAfterRule.java:45)
	at com.carrotsearch.randomizedtesting.rules.StatementAdapter.evaluate(StatementAdapter.java:36)
	at org.apache.lucene.util.TestRuleStoreClassName$1.evaluate(TestRuleStoreClassName.java:41)
	at com.carrotsearch.randomizedtesting.rules.NoShadowingOrOverridesOnMethodsRule$1.evaluate(NoShadowingOrOverridesOnMethodsRule.java:40)
	at com.carrotsearch.randomizedtesting.rules.NoShadowingOrOverridesOnMethodsRule$1.evaluate(NoShadowingOrOverridesOnMethodsRule.java:40)
	at com.carrotsearch.randomizedtesting.rules.StatementAdapter.evaluate(StatementAdapter.java:36)
	at com.carrotsearch.randomizedtesting.rules.StatementAdapter.evaluate(StatementAdapter.java:36)
	at com.carrotsearch.randomizedtesting.rules.StatementAdapter.evaluate(StatementAdapter.java:36)
	at org.apache.lucene.util.TestRuleAssertionsRequired$1.evaluate(TestRuleAssertionsRequired.java:53)
	at org.apache.lucene.util.TestRuleMarkFailure$1.evaluate(TestRuleMarkFailure.java:47)
	at org.apache.lucene.util.TestRuleIgnoreAfterMaxFailures$1.evaluate(TestRuleIgnoreAfterMaxFailures.java:64)
	at org.apache.lucene.util.TestRuleIgnoreTestSuites$1.evaluate(TestRuleIgnoreTestSuites.java:54)
	at com.carrotsearch.randomizedtesting.rules.StatementAdapter.evaluate(StatementAdapter.java:36)
	at com.carrotsearch.randomizedtesting.ThreadLeakControl$StatementRunner.run(ThreadLeakControl.java:368)
	at java.lang.Thread.run(Thread.java:748)
Caused by: org.apache.zookeeper.KeeperException$SessionExpiredException: KeeperErrorCode = Session expired for /collections/collection1/state.json
	at org.apache.zookeeper.KeeperException.create(KeeperException.java:130)
	at org.apache.zookeeper.KeeperException.create(KeeperException.java:54)
	at org.apache.zookeeper.ZooKeeper.getData(ZooKeeper.java:1215)
	at org.apache.solr.common.cloud.SolrZkClient.lambda$getData$5(SolrZkClient.java:340)
	at org.apache.solr.common.cloud.ZkCmdExecutor.retryOperation(ZkCmdExecutor.java:60)
	at org.apache.solr.common.cloud.SolrZkClient.getData(SolrZkClient.java:340)
	at org.apache.solr.common.cloud.ZkStateReader.fetchCollectionState(ZkStateReader.java:1120)
	at org.apache.solr.common.cloud.ZkStateReader.getCollectionLive(ZkStateReader.java:1106)
	... 47 more


FAILED:  org.apache.solr.cloud.LegacyCloudClusterPropTest.testCreateCollectionSwitchLegacyCloud

Error Message:
Could not find collection : legacyFalse

Stack Trace:
org.apache.solr.common.SolrException: Could not find collection : legacyFalse
	at __randomizedtesting.SeedInfo.seed([BEE0BAB69C20E091:6FE74833382F6BA3]:0)
	at org.apache.solr.common.cloud.ClusterState.getCollection(ClusterState.java:118)
	at org.apache.solr.cloud.SolrCloudTestCase.getCollectionState(SolrCloudTestCase.java:247)
	at org.apache.solr.cloud.LegacyCloudClusterPropTest.checkMandatoryProps(LegacyCloudClusterPropTest.java:153)
	at org.apache.solr.cloud.LegacyCloudClusterPropTest.createAndTest(LegacyCloudClusterPropTest.java:90)
	at org.apache.solr.cloud.LegacyCloudClusterPropTest.testCreateCollectionSwitchLegacyCloud(LegacyCloudClusterPropTest.java:70)
	at sun.reflect.NativeMethodAccessorImpl.invoke0(Native Method)
	at sun.reflect.NativeMethodAccessorImpl.invoke(NativeMethodAccessorImpl.java:62)
	at sun.reflect.DelegatingMethodAccessorImpl.invoke(DelegatingMethodAccessorImpl.java:43)
	at java.lang.reflect.Method.invoke(Method.java:498)
	at com.carrotsearch.randomizedtesting.RandomizedRunner.invoke(RandomizedRunner.java:1737)
	at com.carrotsearch.randomizedtesting.RandomizedRunner$8.evaluate(RandomizedRunner.java:934)
	at com.carrotsearch.randomizedtesting.RandomizedRunner$9.evaluate(RandomizedRunner.java:970)
	at com.carrotsearch.randomizedtesting.RandomizedRunner$10.evaluate(RandomizedRunner.java:984)
	at com.carrotsearch.randomizedtesting.rules.SystemPropertiesRestoreRule$1.evaluate(SystemPropertiesRestoreRule.java:57)
	at org.apache.lucene.util.TestRuleSetupTeardownChained$1.evaluate(TestRuleSetupTeardownChained.java:49)
	at org.apache.lucene.util.AbstractBeforeAfterRule$1.evaluate(AbstractBeforeAfterRule.java:45)
	at org.apache.lucene.util.TestRuleThreadAndTestName$1.evaluate(TestRuleThreadAndTestName.java:48)
	at org.apache.lucene.util.TestRuleIgnoreAfterMaxFailures$1.evaluate(TestRuleIgnoreAfterMaxFailures.java:64)
	at org.apache.lucene.util.TestRuleMarkFailure$1.evaluate(TestRuleMarkFailure.java:47)
	at com.carrotsearch.randomizedtesting.rules.StatementAdapter.evaluate(StatementAdapter.java:36)
	at com.carrotsearch.randomizedtesting.ThreadLeakControl$StatementRunner.run(ThreadLeakControl.java:368)
	at com.carrotsearch.randomizedtesting.ThreadLeakControl.forkTimeoutingTask(ThreadLeakControl.java:817)
	at com.carrotsearch.randomizedtesting.ThreadLeakControl$3.evaluate(ThreadLeakControl.java:468)
	at com.carrotsearch.randomizedtesting.RandomizedRunner.runSingleTest(RandomizedRunner.java:943)
	at com.carrotsearch.randomizedtesting.RandomizedRunner$5.evaluate(RandomizedRunner.java:829)
	at com.carrotsearch.randomizedtesting.RandomizedRunner$6.evaluate(RandomizedRunner.java:879)
	at com.carrotsearch.randomizedtesting.RandomizedRunner$7.evaluate(RandomizedRunner.java:890)
	at com.carrotsearch.randomizedtesting.rules.StatementAdapter.evaluate(StatementAdapter.java:36)
	at com.carrotsearch.randomizedtesting.rules.SystemPropertiesRestoreRule$1.evaluate(SystemPropertiesRestoreRule.java:57)
	at org.apache.lucene.util.AbstractBeforeAfterRule$1.evaluate(AbstractBeforeAfterRule.java:45)
	at com.carrotsearch.randomizedtesting.rules.StatementAdapter.evaluate(StatementAdapter.java:36)
	at org.apache.lucene.util.TestRuleStoreClassName$1.evaluate(TestRuleStoreClassName.java:41)
	at com.carrotsearch.randomizedtesting.rules.NoShadowingOrOverridesOnMethodsRule$1.evaluate(NoShadowingOrOverridesOnMethodsRule.java:40)
	at com.carrotsearch.randomizedtesting.rules.NoShadowingOrOverridesOnMethodsRule$1.evaluate(NoShadowingOrOverridesOnMethodsRule.java:40)
	at com.carrotsearch.randomizedtesting.rules.StatementAdapter.evaluate(StatementAdapter.java:36)
	at com.carrotsearch.randomizedtesting.rules.StatementAdapter.evaluate(StatementAdapter.java:36)
	at com.carrotsearch.randomizedtesting.rules.StatementAdapter.evaluate(StatementAdapter.java:36)
	at org.apache.lucene.util.TestRuleAssertionsRequired$1.evaluate(TestRuleAssertionsRequired.java:53)
	at org.apache.lucene.util.TestRuleMarkFailure$1.evaluate(TestRuleMarkFailure.java:47)
	at org.apache.lucene.util.TestRuleIgnoreAfterMaxFailures$1.evaluate(TestRuleIgnoreAfterMaxFailures.java:64)
	at org.apache.lucene.util.TestRuleIgnoreTestSuites$1.evaluate(TestRuleIgnoreTestSuites.java:54)
	at com.carrotsearch.randomizedtesting.rules.StatementAdapter.evaluate(StatementAdapter.java:36)
	at com.carrotsearch.randomizedtesting.ThreadLeakControl$StatementRunner.run(ThreadLeakControl.java:368)
	at java.lang.Thread.run(Thread.java:748)


FAILED:  org.apache.solr.cloud.OverseerTaskQueueTest.testDistributedQueueBlocking

Error Message:


Stack Trace:
java.util.concurrent.TimeoutException
	at __randomizedtesting.SeedInfo.seed([BEE0BAB69C20E091:FB4AC8CFD8725CE5]:0)
	at java.util.concurrent.FutureTask.get(FutureTask.java:205)
	at org.apache.solr.cloud.DistributedQueueTest.testDistributedQueueBlocking(DistributedQueueTest.java:141)
	at sun.reflect.NativeMethodAccessorImpl.invoke0(Native Method)
	at sun.reflect.NativeMethodAccessorImpl.invoke(NativeMethodAccessorImpl.java:62)
	at sun.reflect.DelegatingMethodAccessorImpl.invoke(DelegatingMethodAccessorImpl.java:43)
	at java.lang.reflect.Method.invoke(Method.java:498)
	at com.carrotsearch.randomizedtesting.RandomizedRunner.invoke(RandomizedRunner.java:1737)
	at com.carrotsearch.randomizedtesting.RandomizedRunner$8.evaluate(RandomizedRunner.java:934)
	at com.carrotsearch.randomizedtesting.RandomizedRunner$9.evaluate(RandomizedRunner.java:970)
	at com.carrotsearch.randomizedtesting.RandomizedRunner$10.evaluate(RandomizedRunner.java:984)
	at com.carrotsearch.randomizedtesting.rules.SystemPropertiesRestoreRule$1.evaluate(SystemPropertiesRestoreRule.java:57)
	at org.apache.lucene.util.TestRuleSetupTeardownChained$1.evaluate(TestRuleSetupTeardownChained.java:49)
	at org.apache.lucene.util.AbstractBeforeAfterRule$1.evaluate(AbstractBeforeAfterRule.java:45)
	at org.apache.lucene.util.TestRuleThreadAndTestName$1.evaluate(TestRuleThreadAndTestName.java:48)
	at org.apache.lucene.util.TestRuleIgnoreAfterMaxFailures$1.evaluate(TestRuleIgnoreAfterMaxFailures.java:64)
	at org.apache.lucene.util.TestRuleMarkFailure$1.evaluate(TestRuleMarkFailure.java:47)
	at com.carrotsearch.randomizedtesting.rules.StatementAdapter.evaluate(StatementAdapter.java:36)
	at com.carrotsearch.randomizedtesting.ThreadLeakControl$StatementRunner.run(ThreadLeakControl.java:368)
	at com.carrotsearch.randomizedtesting.ThreadLeakControl.forkTimeoutingTask(ThreadLeakControl.java:817)
	at com.carrotsearch.randomizedtesting.ThreadLeakControl$3.evaluate(ThreadLeakControl.java:468)
	at com.carrotsearch.randomizedtesting.RandomizedRunner.runSingleTest(RandomizedRunner.java:943)
	at com.carrotsearch.randomizedtesting.RandomizedRunner$5.evaluate(RandomizedRunner.java:829)
	at com.carrotsearch.randomizedtesting.RandomizedRunner$6.evaluate(RandomizedRunner.java:879)
	at com.carrotsearch.randomizedtesting.RandomizedRunner$7.evaluate(RandomizedRunner.java:890)
	at com.carrotsearch.randomizedtesting.rules.StatementAdapter.evaluate(StatementAdapter.java:36)
	at com.carrotsearch.randomizedtesting.rules.SystemPropertiesRestoreRule$1.evaluate(SystemPropertiesRestoreRule.java:57)
	at org.apache.lucene.util.AbstractBeforeAfterRule$1.evaluate(AbstractBeforeAfterRule.java:45)
	at com.carrotsearch.randomizedtesting.rules.StatementAdapter.evaluate(StatementAdapter.java:36)
	at org.apache.lucene.util.TestRuleStoreClassName$1.evaluate(TestRuleStoreClassName.java:41)
	at com.carrotsearch.randomizedtesting.rules.NoShadowingOrOverridesOnMethodsRule$1.evaluate(NoShadowingOrOverridesOnMethodsRule.java:40)
	at com.carrotsearch.randomizedtesting.rules.NoShadowingOrOverridesOnMethodsRule$1.evaluate(NoShadowingOrOverridesOnMethodsRule.java:40)
	at com.carrotsearch.randomizedtesting.rules.StatementAdapter.evaluate(StatementAdapter.java:36)
	at com.carrotsearch.randomizedtesting.rules.StatementAdapter.evaluate(StatementAdapter.java:36)
	at com.carrotsearch.randomizedtesting.rules.StatementAdapter.evaluate(StatementAdapter.java:36)
	at org.apache.lucene.util.TestRuleAssertionsRequired$1.evaluate(TestRuleAssertionsRequired.java:53)
	at org.apache.lucene.util.TestRuleMarkFailure$1.evaluate(TestRuleMarkFailure.java:47)
	at org.apache.lucene.util.TestRuleIgnoreAfterMaxFailures$1.evaluate(TestRuleIgnoreAfterMaxFailures.java:64)
	at org.apache.lucene.util.TestRuleIgnoreTestSuites$1.evaluate(TestRuleIgnoreTestSuites.java:54)
	at com.carrotsearch.randomizedtesting.rules.StatementAdapter.evaluate(StatementAdapter.java:36)
	at com.carrotsearch.randomizedtesting.ThreadLeakControl$StatementRunner.run(ThreadLeakControl.java:368)
	at java.lang.Thread.run(Thread.java:748)


FAILED:  org.apache.solr.cloud.TestTlogReplica.testKillLeader

Error Message:


Stack Trace:
java.lang.NullPointerException
	at org.apache.solr.cloud.SolrCloudTestCase.waitForState(SolrCloudTestCase.java:269)
	at org.apache.solr.cloud.TestTlogReplica.doReplaceLeader(TestTlogReplica.java:427)
	at org.apache.solr.cloud.TestTlogReplica.testKillLeader(TestTlogReplica.java:322)
	at sun.reflect.NativeMethodAccessorImpl.invoke0(Native Method)
	at sun.reflect.NativeMethodAccessorImpl.invoke(NativeMethodAccessorImpl.java:62)
	at sun.reflect.DelegatingMethodAccessorImpl.invoke(DelegatingMethodAccessorImpl.java:43)
	at java.lang.reflect.Method.invoke(Method.java:498)
	at com.carrotsearch.randomizedtesting.RandomizedRunner.invoke(RandomizedRunner.java:1737)
	at com.carrotsearch.randomizedtesting.RandomizedRunner$8.evaluate(RandomizedRunner.java:934)
	at com.carrotsearch.randomizedtesting.RandomizedRunner$9.evaluate(RandomizedRunner.java:970)
	at com.carrotsearch.randomizedtesting.RandomizedRunner$10.evaluate(RandomizedRunner.java:984)
	at com.carrotsearch.randomizedtesting.rules.SystemPropertiesRestoreRule$1.evaluate(SystemPropertiesRestoreRule.java:57)
	at org.apache.lucene.util.TestRuleSetupTeardownChained$1.evaluate(TestRuleSetupTeardownChained.java:49)
	at org.apache.lucene.util.AbstractBeforeAfterRule$1.evaluate(AbstractBeforeAfterRule.java:45)
	at org.apache.lucene.util.TestRuleThreadAndTestName$1.evaluate(TestRuleThreadAndTestName.java:48)
	at org.apache.lucene.util.TestRuleIgnoreAfterMaxFailures$1.evaluate(TestRuleIgnoreAfterMaxFailures.java:64)
	at org.apache.lucene.util.TestRuleMarkFailure$1.evaluate(TestRuleMarkFailure.java:47)
	at com.carrotsearch.randomizedtesting.rules.StatementAdapter.evaluate(StatementAdapter.java:36)
	at com.carrotsearch.randomizedtesting.ThreadLeakControl$StatementRunner.run(ThreadLeakControl.java:368)
	at com.carrotsearch.randomizedtesting.ThreadLeakControl.forkTimeoutingTask(ThreadLeakControl.java:817)
	at com.carrotsearch.randomizedtesting.ThreadLeakControl$3.evaluate(ThreadLeakControl.java:468)
	at com.carrotsearch.randomizedtesting.RandomizedRunner.runSingleTest(RandomizedRunner.java:943)
	at com.carrotsearch.randomizedtesting.RandomizedRunner$5.evaluate(RandomizedRunner.java:829)
	at com.carrotsearch.randomizedtesting.RandomizedRunner$6.evaluate(RandomizedRunner.java:879)
	at com.carrotsearch.randomizedtesting.RandomizedRunner$7.evaluate(RandomizedRunner.java:890)
	at com.carrotsearch.randomizedtesting.rules.StatementAdapter.evaluate(StatementAdapter.java:36)
	at com.carrotsearch.randomizedtesting.rules.SystemPropertiesRestoreRule$1.evaluate(SystemPropertiesRestoreRule.java:57)
	at org.apache.lucene.util.AbstractBeforeAfterRule$1.evaluate(AbstractBeforeAfterRule.java:45)
	at com.carrotsearch.randomizedtesting.rules.StatementAdapter.evaluate(StatementAdapter.java:36)
	at org.apache.lucene.util.TestRuleStoreClassName$1.evaluate(TestRuleStoreClassName.java:41)
	at com.carrotsearch.randomizedtesting.rules.NoShadowingOrOverridesOnMethodsRule$1.evaluate(NoShadowingOrOverridesOnMethodsRule.java:40)
	at com.carrotsearch.randomizedtesting.rules.NoShadowingOrOverridesOnMethodsRule$1.evaluate(NoShadowingOrOverridesOnMethodsRule.java:40)
	at com.carrotsearch.randomizedtesting.rules.StatementAdapter.evaluate(StatementAdapter.java:36)
	at com.carrotsearch.randomizedtesting.rules.StatementAdapter.evaluate(StatementAdapter.java:36)
	at com.carrotsearch.randomizedtesting.rules.StatementAdapter.evaluate(StatementAdapter.java:36)
	at org.apache.lucene.util.TestRuleAssertionsRequired$1.evaluate(TestRuleAssertionsRequired.java:53)
	at org.apache.lucene.util.TestRuleMarkFailure$1.evaluate(TestRuleMarkFailure.java:47)
	at org.apache.lucene.util.TestRuleIgnoreAfterMaxFailures$1.evaluate(TestRuleIgnoreAfterMaxFailures.java:64)
	at org.apache.lucene.util.TestRuleIgnoreTestSuites$1.evaluate(TestRuleIgnoreTestSuites.java:54)
	at com.carrotsearch.randomizedtesting.rules.StatementAdapter.evaluate(StatementAdapter.java:36)
	at com.carrotsearch.randomizedtesting.ThreadLeakControl$StatementRunner.run(ThreadLeakControl.java:368)
	at java.lang.Thread.run(Thread.java:748)


FAILED:  org.apache.solr.cloud.TestTlogReplica.testOutOfOrderDBQWithInPlaceUpdates

Error Message:
Error from server at https://127.0.0.1:48665/solr: Request says it is coming from leader, but we are the leader

Stack Trace:
org.apache.solr.client.solrj.impl.HttpSolrClient$RemoteSolrException: Error from server at https://127.0.0.1:48665/solr: Request says it is coming from leader, but we are the leader
	at __randomizedtesting.SeedInfo.seed([BEE0BAB69C20E091:3821425BC3713671]:0)
	at org.apache.solr.client.solrj.impl.HttpSolrClient.executeMethod(HttpSolrClient.java:643)
	at org.apache.solr.client.solrj.impl.HttpSolrClient.request(HttpSolrClient.java:255)
	at org.apache.solr.client.solrj.impl.HttpSolrClient.request(HttpSolrClient.java:244)
	at org.apache.solr.client.solrj.SolrRequest.process(SolrRequest.java:194)
	at org.apache.solr.cloud.TestTlogReplica.testOutOfOrderDBQWithInPlaceUpdates(TestTlogReplica.java:672)
	at sun.reflect.NativeMethodAccessorImpl.invoke0(Native Method)
	at sun.reflect.NativeMethodAccessorImpl.invoke(NativeMethodAccessorImpl.java:62)
	at sun.reflect.DelegatingMethodAccessorImpl.invoke(DelegatingMethodAccessorImpl.java:43)
	at java.lang.reflect.Method.invoke(Method.java:498)
	at com.carrotsearch.randomizedtesting.RandomizedRunner.invoke(RandomizedRunner.java:1737)
	at com.carrotsearch.randomizedtesting.RandomizedRunner$8.evaluate(RandomizedRunner.java:934)
	at com.carrotsearch.randomizedtesting.RandomizedRunner$9.evaluate(RandomizedRunner.java:970)
	at com.carrotsearch.randomizedtesting.RandomizedRunner$10.evaluate(RandomizedRunner.java:984)
	at com.carrotsearch.randomizedtesting.rules.SystemPropertiesRestoreRule$1.evaluate(SystemPropertiesRestoreRule.java:57)
	at org.apache.lucene.util.TestRuleSetupTeardownChained$1.evaluate(TestRuleSetupTeardownChained.java:49)
	at org.apache.lucene.util.AbstractBeforeAfterRule$1.evaluate(AbstractBeforeAfterRule.java:45)
	at org.apache.lucene.util.TestRuleThreadAndTestName$1.evaluate(TestRuleThreadAndTestName.java:48)
	at org.apache.lucene.util.TestRuleIgnoreAfterMaxFailures$1.evaluate(TestRuleIgnoreAfterMaxFailures.java:64)
	at org.apache.lucene.util.TestRuleMarkFailure$1.evaluate(TestRuleMarkFailure.java:47)
	at com.carrotsearch.randomizedtesting.rules.StatementAdapter.evaluate(StatementAdapter.java:36)
	at com.carrotsearch.randomizedtesting.ThreadLeakControl$StatementRunner.run(ThreadLeakControl.java:368)
	at com.carrotsearch.randomizedtesting.ThreadLeakControl.forkTimeoutingTask(ThreadLeakControl.java:817)
	at com.carrotsearch.randomizedtesting.ThreadLeakControl$3.evaluate(ThreadLeakControl.java:468)
	at com.carrotsearch.randomizedtesting.RandomizedRunner.runSingleTest(RandomizedRunner.java:943)
	at com.carrotsearch.randomizedtesting.RandomizedRunner$5.evaluate(RandomizedRunner.java:829)
	at com.carrotsearch.randomizedtesting.RandomizedRunner$6.evaluate(RandomizedRunner.java:879)
	at com.carrotsearch.randomizedtesting.RandomizedRunner$7.evaluate(RandomizedRunner.java:890)
	at com.carrotsearch.randomizedtesting.rules.StatementAdapter.evaluate(StatementAdapter.java:36)
	at com.carrotsearch.randomizedtesting.rules.SystemPropertiesRestoreRule$1.evaluate(SystemPropertiesRestoreRule.java:57)
	at org.apache.lucene.util.AbstractBeforeAfterRule$1.evaluate(AbstractBeforeAfterRule.java:45)
	at com.carrotsearch.randomizedtesting.rules.StatementAdapter.evaluate(StatementAdapter.java:36)
	at org.apache.lucene.util.TestRuleStoreClassName$1.evaluate(TestRuleStoreClassName.java:41)
	at com.carrotsearch.randomizedtesting.rules.NoShadowingOrOverridesOnMethodsRule$1.evaluate(NoShadowingOrOverridesOnMethodsRule.java:40)
	at com.carrotsearch.randomizedtesting.rules.NoShadowingOrOverridesOnMethodsRule$1.evaluate(NoShadowingOrOverridesOnMethodsRule.java:40)
	at com.carrotsearch.randomizedtesting.rules.StatementAdapter.evaluate(StatementAdapter.java:36)
	at com.carrotsearch.randomizedtesting.rules.StatementAdapter.evaluate(StatementAdapter.java:36)
	at com.carrotsearch.randomizedtesting.rules.StatementAdapter.evaluate(StatementAdapter.java:36)
	at org.apache.lucene.util.TestRuleAssertionsRequired$1.evaluate(TestRuleAssertionsRequired.java:53)
	at org.apache.lucene.util.TestRuleMarkFailure$1.evaluate(TestRuleMarkFailure.java:47)
	at org.apache.lucene.util.TestRuleIgnoreAfterMaxFailures$1.evaluate(TestRuleIgnoreAfterMaxFailures.java:64)
	at org.apache.lucene.util.TestRuleIgnoreTestSuites$1.evaluate(TestRuleIgnoreTestSuites.java:54)
	at com.carrotsearch.randomizedtesting.rules.StatementAdapter.evaluate(StatementAdapter.java:36)
	at com.carrotsearch.randomizedtesting.ThreadLeakControl$StatementRunner.run(ThreadLeakControl.java:368)
	at java.lang.Thread.run(Thread.java:748)


FAILED:  org.apache.solr.cloud.autoscaling.TriggerIntegrationTest.testMetricTrigger

Error Message:


Stack Trace:
java.lang.AssertionError
	at __randomizedtesting.SeedInfo.seed([BEE0BAB69C20E091:4EC8D39C3C836DE]:0)
	at org.junit.Assert.fail(Assert.java:92)
	at org.junit.Assert.assertTrue(Assert.java:43)
	at org.junit.Assert.assertNull(Assert.java:551)
	at org.junit.Assert.assertNull(Assert.java:562)
	at org.apache.solr.cloud.autoscaling.TriggerIntegrationTest.testMetricTrigger(TriggerIntegrationTest.java:1575)
	at sun.reflect.NativeMethodAccessorImpl.invoke0(Native Method)
	at sun.reflect.NativeMethodAccessorImpl.invoke(NativeMethodAccessorImpl.java:62)
	at sun.reflect.DelegatingMethodAccessorImpl.invoke(DelegatingMethodAccessorImpl.java:43)
	at java.lang.reflect.Method.invoke(Method.java:498)
	at com.carrotsearch.randomizedtesting.RandomizedRunner.invoke(RandomizedRunner.java:1737)
	at com.carrotsearch.randomizedtesting.RandomizedRunner$8.evaluate(RandomizedRunner.java:934)
	at com.carrotsearch.randomizedtesting.RandomizedRunner$9.evaluate(RandomizedRunner.java:970)
	at com.carrotsearch.randomizedtesting.RandomizedRunner$10.evaluate(RandomizedRunner.java:984)
	at com.carrotsearch.randomizedtesting.rules.SystemPropertiesRestoreRule$1.evaluate(SystemPropertiesRestoreRule.java:57)
	at org.apache.lucene.util.TestRuleSetupTeardownChained$1.evaluate(TestRuleSetupTeardownChained.java:49)
	at org.apache.lucene.util.AbstractBeforeAfterRule$1.evaluate(AbstractBeforeAfterRule.java:45)
	at org.apache.lucene.util.TestRuleThreadAndTestName$1.evaluate(TestRuleThreadAndTestName.java:48)
	at org.apache.lucene.util.TestRuleIgnoreAfterMaxFailures$1.evaluate(TestRuleIgnoreAfterMaxFailures.java:64)
	at org.apache.lucene.util.TestRuleMarkFailure$1.evaluate(TestRuleMarkFailure.java:47)
	at com.carrotsearch.randomizedtesting.rules.StatementAdapter.evaluate(StatementAdapter.java:36)
	at com.carrotsearch.randomizedtesting.ThreadLeakControl$StatementRunner.run(ThreadLeakControl.java:368)
	at com.carrotsearch.randomizedtesting.ThreadLeakControl.forkTimeoutingTask(ThreadLeakControl.java:817)
	at com.carrotsearch.randomizedtesting.ThreadLeakControl$3.evaluate(ThreadLeakControl.java:468)
	at com.carrotsearch.randomizedtesting.RandomizedRunner.runSingleTest(RandomizedRunner.java:943)
	at com.carrotsearch.randomizedtesting.RandomizedRunner$5.evaluate(RandomizedRunner.java:829)
	at com.carrotsearch.randomizedtesting.RandomizedRunner$6.evaluate(RandomizedRunner.java:879)
	at com.carrotsearch.randomizedtesting.RandomizedRunner$7.evaluate(RandomizedRunner.java:890)
	at com.carrotsearch.randomizedtesting.rules.StatementAdapter.evaluate(StatementAdapter.java:36)
	at com.carrotsearch.randomizedtesting.rules.SystemPropertiesRestoreRule$1.evaluate(SystemPropertiesRestoreRule.java:57)
	at org.apache.lucene.util.AbstractBeforeAfterRule$1.evaluate(AbstractBeforeAfterRule.java:45)
	at com.carrotsearch.randomizedtesting.rules.StatementAdapter.evaluate(StatementAdapter.java:36)
	at org.apache.lucene.util.TestRuleStoreClassName$1.evaluate(TestRuleStoreClassName.java:41)
	at com.carrotsearch.randomizedtesting.rules.NoShadowingOrOverridesOnMethodsRule$1.evaluate(NoShadowingOrOverridesOnMethodsRule.java:40)
	at com.carrotsearch.randomizedtesting.rules.NoShadowingOrOverridesOnMethodsRule$1.evaluate(NoShadowingOrOverridesOnMethodsRule.java:40)
	at com.carrotsearch.randomizedtesting.rules.StatementAdapter.evaluate(StatementAdapter.java:36)
	at com.carrotsearch.randomizedtesting.rules.StatementAdapter.evaluate(StatementAdapter.java:36)
	at com.carrotsearch.randomizedtesting.rules.StatementAdapter.evaluate(StatementAdapter.java:36)
	at org.apache.lucene.util.TestRuleAssertionsRequired$1.evaluate(TestRuleAssertionsRequired.java:53)
	at org.apache.lucene.util.TestRuleMarkFailure$1.evaluate(TestRuleMarkFailure.java:47)
	at org.apache.lucene.util.TestRuleIgnoreAfterMaxFailures$1.evaluate(TestRuleIgnoreAfterMaxFailures.java:64)
	at org.apache.lucene.util.TestRuleIgnoreTestSuites$1.evaluate(TestRuleIgnoreTestSuites.java:54)
	at com.carrotsearch.randomizedtesting.rules.StatementAdapter.evaluate(StatementAdapter.java:36)
	at com.carrotsearch.randomizedtesting.ThreadLeakControl$StatementRunner.run(ThreadLeakControl.java:368)
	at java.lang.Thread.run(Thread.java:748)


FAILED:  org.apache.solr.cloud.autoscaling.sim.TestGenericDistributedQueue.testDistributedQueue

Error Message:
Test abandoned because suite timeout was reached.

Stack Trace:
java.lang.Exception: Test abandoned because suite timeout was reached.
	at __randomizedtesting.SeedInfo.seed([BEE0BAB69C20E091]:0)


FAILED:  junit.framework.TestSuite.org.apache.solr.cloud.autoscaling.sim.TestGenericDistributedQueue

Error Message:
Suite timeout exceeded (>= 7200000 msec).

Stack Trace:
java.lang.Exception: Suite timeout exceeded (>= 7200000 msec).
	at __randomizedtesting.SeedInfo.seed([BEE0BAB69C20E091]:0)


FAILED:  org.apache.solr.cloud.autoscaling.sim.TestLargeCluster.testSearchRate

Error Message:
The trigger did not fire at all

Stack Trace:
java.lang.AssertionError: The trigger did not fire at all
	at __randomizedtesting.SeedInfo.seed([BEE0BAB69C20E091:E3A8A43F53E646DE]:0)
	at org.junit.Assert.fail(Assert.java:93)
	at org.junit.Assert.assertTrue(Assert.java:43)
	at org.apache.solr.cloud.autoscaling.sim.TestLargeCluster.testSearchRate(TestLargeCluster.java:547)
	at sun.reflect.NativeMethodAccessorImpl.invoke0(Native Method)
	at sun.reflect.NativeMethodAccessorImpl.invoke(NativeMethodAccessorImpl.java:62)
	at sun.reflect.DelegatingMethodAccessorImpl.invoke(DelegatingMethodAccessorImpl.java:43)
	at java.lang.reflect.Method.invoke(Method.java:498)
	at com.carrotsearch.randomizedtesting.RandomizedRunner.invoke(RandomizedRunner.java:1737)
	at com.carrotsearch.randomizedtesting.RandomizedRunner$8.evaluate(RandomizedRunner.java:934)
	at com.carrotsearch.randomizedtesting.RandomizedRunner$9.evaluate(RandomizedRunner.java:970)
	at com.carrotsearch.randomizedtesting.RandomizedRunner$10.evaluate(RandomizedRunner.java:984)
	at com.carrotsearch.randomizedtesting.rules.SystemPropertiesRestoreRule$1.evaluate(SystemPropertiesRestoreRule.java:57)
	at org.apache.lucene.util.TestRuleSetupTeardownChained$1.evaluate(TestRuleSetupTeardownChained.java:49)
	at org.apache.lucene.util.AbstractBeforeAfterRule$1.evaluate(AbstractBeforeAfterRule.java:45)
	at org.apache.lucene.util.TestRuleThreadAndTestName$1.evaluate(TestRuleThreadAndTestName.java:48)
	at org.apache.lucene.util.TestRuleIgnoreAfterMaxFailures$1.evaluate(TestRuleIgnoreAfterMaxFailures.java:64)
	at org.apache.lucene.util.TestRuleMarkFailure$1.evaluate(TestRuleMarkFailure.java:47)
	at com.carrotsearch.randomizedtesting.rules.StatementAdapter.evaluate(StatementAdapter.java:36)
	at com.carrotsearch.randomizedtesting.ThreadLeakControl$StatementRunner.run(ThreadLeakControl.java:368)
	at com.carrotsearch.randomizedtesting.ThreadLeakControl.forkTimeoutingTask(ThreadLeakControl.java:817)
	at com.carrotsearch.randomizedtesting.ThreadLeakControl$3.evaluate(ThreadLeakControl.java:468)
	at com.carrotsearch.randomizedtesting.RandomizedRunner.runSingleTest(RandomizedRunner.java:943)
	at com.carrotsearch.randomizedtesting.RandomizedRunner$5.evaluate(RandomizedRunner.java:829)
	at com.carrotsearch.randomizedtesting.RandomizedRunner$6.evaluate(RandomizedRunner.java:879)
	at com.carrotsearch.randomizedtesting.RandomizedRunner$7.evaluate(RandomizedRunner.java:890)
	at com.carrotsearch.randomizedtesting.rules.StatementAdapter.evaluate(StatementAdapter.java:36)
	at com.carrotsearch.randomizedtesting.rules.SystemPropertiesRestoreRule$1.evaluate(SystemPropertiesRestoreRule.java:57)
	at org.apache.lucene.util.AbstractBeforeAfterRule$1.evaluate(AbstractBeforeAfterRule.java:45)
	at com.carrotsearch.randomizedtesting.rules.StatementAdapter.evaluate(StatementAdapter.java:36)
	at org.apache.lucene.util.TestRuleStoreClassName$1.evaluate(TestRuleStoreClassName.java:41)
	at com.carrotsearch.randomizedtesting.rules.NoShadowingOrOverridesOnMethodsRule$1.evaluate(NoShadowingOrOverridesOnMethodsRule.java:40)
	at com.carrotsearch.randomizedtesting.rules.NoShadowingOrOverridesOnMethodsRule$1.evaluate(NoShadowingOrOverridesOnMethodsRule.java:40)
	at com.carrotsearch.randomizedtesting.rules.StatementAdapter.evaluate(StatementAdapter.java:36)
	at com.carrotsearch.randomizedtesting.rules.StatementAdapter.evaluate(StatementAdapter.java:36)
	at com.carrotsearch.randomizedtesting.rules.StatementAdapter.evaluate(StatementAdapter.java:36)
	at org.apache.lucene.util.TestRuleAssertionsRequired$1.evaluate(TestRuleAssertionsRequired.java:53)
	at org.apache.lucene.util.TestRuleMarkFailure$1.evaluate(TestRuleMarkFailure.java:47)
	at org.apache.lucene.util.TestRuleIgnoreAfterMaxFailures$1.evaluate(TestRuleIgnoreAfterMaxFailures.java:64)
	at org.apache.lucene.util.TestRuleIgnoreTestSuites$1.evaluate(TestRuleIgnoreTestSuites.java:54)
	at com.carrotsearch.randomizedtesting.rules.StatementAdapter.evaluate(StatementAdapter.java:36)
	at com.carrotsearch.randomizedtesting.ThreadLeakControl$StatementRunner.run(ThreadLeakControl.java:368)
	at java.lang.Thread.run(Thread.java:748)


FAILED:  org.apache.solr.cloud.autoscaling.sim.TestTriggerIntegration.testSearchRate

Error Message:
The trigger did not fire at all

Stack Trace:
java.lang.AssertionError: The trigger did not fire at all
	at __randomizedtesting.SeedInfo.seed([BEE0BAB69C20E091:E3A8A43F53E646DE]:0)
	at org.junit.Assert.fail(Assert.java:93)
	at org.junit.Assert.assertTrue(Assert.java:43)
	at org.apache.solr.cloud.autoscaling.sim.TestTriggerIntegration.testSearchRate(TestTriggerIntegration.java:1178)
	at sun.reflect.NativeMethodAccessorImpl.invoke0(Native Method)
	at sun.reflect.NativeMethodAccessorImpl.invoke(NativeMethodAccessorImpl.java:62)
	at sun.reflect.DelegatingMethodAccessorImpl.invoke(DelegatingMethodAccessorImpl.java:43)
	at java.lang.reflect.Method.invoke(Method.java:498)
	at com.carrotsearch.randomizedtesting.RandomizedRunner.invoke(RandomizedRunner.java:1737)
	at com.carrotsearch.randomizedtesting.RandomizedRunner$8.evaluate(RandomizedRunner.java:934)
	at com.carrotsearch.randomizedtesting.RandomizedRunner$9.evaluate(RandomizedRunner.java:970)
	at com.carrotsearch.randomizedtesting.RandomizedRunner$10.evaluate(RandomizedRunner.java:984)
	at com.carrotsearch.randomizedtesting.rules.SystemPropertiesRestoreRule$1.evaluate(SystemPropertiesRestoreRule.java:57)
	at org.apache.lucene.util.TestRuleSetupTeardownChained$1.evaluate(TestRuleSetupTeardownChained.java:49)
	at org.apache.lucene.util.AbstractBeforeAfterRule$1.evaluate(AbstractBeforeAfterRule.java:45)
	at org.apache.lucene.util.TestRuleThreadAndTestName$1.evaluate(TestRuleThreadAndTestName.java:48)
	at org.apache.lucene.util.TestRuleIgnoreAfterMaxFailures$1.evaluate(TestRuleIgnoreAfterMaxFailures.java:64)
	at org.apache.lucene.util.TestRuleMarkFailure$1.evaluate(TestRuleMarkFailure.java:47)
	at com.carrotsearch.randomizedtesting.rules.StatementAdapter.evaluate(StatementAdapter.java:36)
	at com.carrotsearch.randomizedtesting.ThreadLeakControl$StatementRunner.run(ThreadLeakControl.java:368)
	at com.carrotsearch.randomizedtesting.ThreadLeakControl.forkTimeoutingTask(ThreadLeakControl.java:817)
	at com.carrotsearch.randomizedtesting.ThreadLeakControl$3.evaluate(ThreadLeakControl.java:468)
	at com.carrotsearch.randomizedtesting.RandomizedRunner.runSingleTest(RandomizedRunner.java:943)
	at com.carrotsearch.randomizedtesting.RandomizedRunner$5.evaluate(RandomizedRunner.java:829)
	at com.carrotsearch.randomizedtesting.RandomizedRunner$6.evaluate(RandomizedRunner.java:879)
	at com.carrotsearch.randomizedtesting.RandomizedRunner$7.evaluate(RandomizedRunner.java:890)
	at com.carrotsearch.randomizedtesting.rules.StatementAdapter.evaluate(StatementAdapter.java:36)
	at com.carrotsearch.randomizedtesting.rules.SystemPropertiesRestoreRule$1.evaluate(SystemPropertiesRestoreRule.java:57)
	at org.apache.lucene.util.AbstractBeforeAfterRule$1.evaluate(AbstractBeforeAfterRule.java:45)
	at com.carrotsearch.randomizedtesting.rules.StatementAdapter.evaluate(StatementAdapter.java:36)
	at org.apache.lucene.util.TestRuleStoreClassName$1.evaluate(TestRuleStoreClassName.java:41)
	at com.carrotsearch.randomizedtesting.rules.NoShadowingOrOverridesOnMethodsRule$1.evaluate(NoShadowingOrOverridesOnMethodsRule.java:40)
	at com.carrotsearch.randomizedtesting.rules.NoShadowingOrOverridesOnMethodsRule$1.evaluate(NoShadowingOrOverridesOnMethodsRule.java:40)
	at com.carrotsearch.randomizedtesting.rules.StatementAdapter.evaluate(StatementAdapter.java:36)
	at com.carrotsearch.randomizedtesting.rules.StatementAdapter.evaluate(StatementAdapter.java:36)
	at com.carrotsearch.randomizedtesting.rules.StatementAdapter.evaluate(StatementAdapter.java:36)
	at org.apache.lucene.util.TestRuleAssertionsRequired$1.evaluate(TestRuleAssertionsRequired.java:53)
	at org.apache.lucene.util.TestRuleMarkFailure$1.evaluate(TestRuleMarkFailure.java:47)
	at org.apache.lucene.util.TestRuleIgnoreAfterMaxFailures$1.evaluate(TestRuleIgnoreAfterMaxFailures.java:64)
	at org.apache.lucene.util.TestRuleIgnoreTestSuites$1.evaluate(TestRuleIgnoreTestSuites.java:54)
	at com.carrotsearch.randomizedtesting.rules.StatementAdapter.evaluate(StatementAdapter.java:36)
	at com.carrotsearch.randomizedtesting.ThreadLeakControl$StatementRunner.run(ThreadLeakControl.java:368)
	at java.lang.Thread.run(Thread.java:748)


FAILED:  org.apache.solr.cloud.autoscaling.sim.TestTriggerIntegration.testNodeMarkersRegistration

Error Message:
Path /autoscaling/nodeAdded/127.0.0.1:10020_solr should have been deleted

Stack Trace:
java.lang.AssertionError: Path /autoscaling/nodeAdded/127.0.0.1:10020_solr should have been deleted
	at __randomizedtesting.SeedInfo.seed([BEE0BAB69C20E091:A65A32BA92152D7E]:0)
	at org.junit.Assert.fail(Assert.java:93)
	at org.junit.Assert.assertTrue(Assert.java:43)
	at org.junit.Assert.assertFalse(Assert.java:68)
	at org.apache.solr.cloud.autoscaling.sim.TestTriggerIntegration.testNodeMarkersRegistration(TestTriggerIntegration.java:844)
	at sun.reflect.NativeMethodAccessorImpl.invoke0(Native Method)
	at sun.reflect.NativeMethodAccessorImpl.invoke(NativeMethodAccessorImpl.java:62)
	at sun.reflect.DelegatingMethodAccessorImpl.invoke(DelegatingMethodAccessorImpl.java:43)
	at java.lang.reflect.Method.invoke(Method.java:498)
	at com.carrotsearch.randomizedtesting.RandomizedRunner.invoke(RandomizedRunner.java:1737)
	at com.carrotsearch.randomizedtesting.RandomizedRunner$8.evaluate(RandomizedRunner.java:934)
	at com.carrotsearch.randomizedtesting.RandomizedRunner$9.evaluate(RandomizedRunner.java:970)
	at com.carrotsearch.randomizedtesting.RandomizedRunner$10.evaluate(RandomizedRunner.java:984)
	at com.carrotsearch.randomizedtesting.rules.SystemPropertiesRestoreRule$1.evaluate(SystemPropertiesRestoreRule.java:57)
	at org.apache.lucene.util.TestRuleSetupTeardownChained$1.evaluate(TestRuleSetupTeardownChained.java:49)
	at org.apache.lucene.util.AbstractBeforeAfterRule$1.evaluate(AbstractBeforeAfterRule.java:45)
	at org.apache.lucene.util.TestRuleThreadAndTestName$1.evaluate(TestRuleThreadAndTestName.java:48)
	at org.apache.lucene.util.TestRuleIgnoreAfterMaxFailures$1.evaluate(TestRuleIgnoreAfterMaxFailures.java:64)
	at org.apache.lucene.util.TestRuleMarkFailure$1.evaluate(TestRuleMarkFailure.java:47)
	at com.carrotsearch.randomizedtesting.rules.StatementAdapter.evaluate(StatementAdapter.java:36)
	at com.carrotsearch.randomizedtesting.ThreadLeakControl$StatementRunner.run(ThreadLeakControl.java:368)
	at com.carrotsearch.randomizedtesting.ThreadLeakControl.forkTimeoutingTask(ThreadLeakControl.java:817)
	at com.carrotsearch.randomizedtesting.ThreadLeakControl$3.evaluate(ThreadLeakControl.java:468)
	at com.carrotsearch.randomizedtesting.RandomizedRunner.runSingleTest(RandomizedRunner.java:943)
	at com.carrotsearch.randomizedtesting.RandomizedRunner$5.evaluate(RandomizedRunner.java:829)
	at com.carrotsearch.randomizedtesting.RandomizedRunner$6.evaluate(RandomizedRunner.java:879)
	at com.carrotsearch.randomizedtesting.RandomizedRunner$7.evaluate(RandomizedRunner.java:890)
	at com.carrotsearch.randomizedtesting.rules.StatementAdapter.evaluate(StatementAdapter.java:36)
	at com.carrotsearch.randomizedtesting.rules.SystemPropertiesRestoreRule$1.evaluate(SystemPropertiesRestoreRule.java:57)
	at org.apache.lucene.util.AbstractBeforeAfterRule$1.evaluate(AbstractBeforeAfterRule.java:45)
	at com.carrotsearch.randomizedtesting.rules.StatementAdapter.evaluate(StatementAdapter.java:36)
	at org.apache.lucene.util.TestRuleStoreClassName$1.evaluate(TestRuleStoreClassName.java:41)
	at com.carrotsearch.randomizedtesting.rules.NoShadowingOrOverridesOnMethodsRule$1.evaluate(NoShadowingOrOverridesOnMethodsRule.java:40)
	at com.carrotsearch.randomizedtesting.rules.NoShadowingOrOverridesOnMethodsRule$1.evaluate(NoShadowingOrOverridesOnMethodsRule.java:40)
	at com.carrotsearch.randomizedtesting.rules.StatementAdapter.evaluate(StatementAdapter.java:36)
	at com.carrotsearch.randomizedtesting.rules.StatementAdapter.evaluate(StatementAdapter.java:36)
	at com.carrotsearch.randomizedtesting.rules.StatementAdapter.evaluate(StatementAdapter.java:36)
	at org.apache.lucene.util.TestRuleAssertionsRequired$1.evaluate(TestRuleAssertionsRequired.java:53)
	at org.apache.lucene.util.TestRuleMarkFailure$1.evaluate(TestRuleMarkFailure.java:47)
	at org.apache.lucene.util.TestRuleIgnoreAfterMaxFailures$1.evaluate(TestRuleIgnoreAfterMaxFailures.java:64)
	at org.apache.lucene.util.TestRuleIgnoreTestSuites$1.evaluate(TestRuleIgnoreTestSuites.java:54)
	at com.carrotsearch.randomizedtesting.rules.StatementAdapter.evaluate(StatementAdapter.java:36)
	at com.carrotsearch.randomizedtesting.ThreadLeakControl$StatementRunner.run(ThreadLeakControl.java:368)
	at java.lang.Thread.run(Thread.java:748)




Build Log:
[...truncated 12361 lines...]
   [junit4] Suite: org.apache.solr.cloud.LegacyCloudClusterPropTest
   [junit4]   2> 1071431 INFO  (SUITE-LegacyCloudClusterPropTest-seed#[BEE0BAB69C20E091]-worker) [    ] o.a.s.SolrTestCaseJ4 SecureRandom sanity checks: test.solr.allowed.securerandom=null & java.security.egd=file:/dev/./urandom
   [junit4]   2> Creating dataDir: /x1/jenkins/jenkins-slave/workspace/Lucene-Solr-Tests-7.x/solr/build/solr-core/test/J1/temp/solr.cloud.LegacyCloudClusterPropTest_BEE0BAB69C20E091-001/init-core-data-001
   [junit4]   2> 1071432 WARN  (SUITE-LegacyCloudClusterPropTest-seed#[BEE0BAB69C20E091]-worker) [    ] o.a.s.SolrTestCaseJ4 startTrackingSearchers: numOpens=1 numCloses=1
   [junit4]   2> 1071442 INFO  (SUITE-LegacyCloudClusterPropTest-seed#[BEE0BAB69C20E091]-worker) [    ] o.a.s.SolrTestCaseJ4 Using TrieFields (NUMERIC_POINTS_SYSPROP=false) w/NUMERIC_DOCVALUES_SYSPROP=false
   [junit4]   2> 1071454 INFO  (SUITE-LegacyCloudClusterPropTest-seed#[BEE0BAB69C20E091]-worker) [    ] o.a.s.SolrTestCaseJ4 Randomized ssl (false) and clientAuth (true) via: @org.apache.solr.util.RandomizeSSL(reason=, ssl=NaN, value=NaN, clientAuth=NaN)
   [junit4]   2> 1071454 INFO  (SUITE-LegacyCloudClusterPropTest-seed#[BEE0BAB69C20E091]-worker) [    ] o.a.s.c.MiniSolrCloudCluster Starting cluster of 1 servers in /x1/jenkins/jenkins-slave/workspace/Lucene-Solr-Tests-7.x/solr/build/solr-core/test/J1/temp/solr.cloud.LegacyCloudClusterPropTest_BEE0BAB69C20E091-001/tempDir-001
   [junit4]   2> 1071454 INFO  (SUITE-LegacyCloudClusterPropTest-seed#[BEE0BAB69C20E091]-worker) [    ] o.a.s.c.ZkTestServer STARTING ZK TEST SERVER
   [junit4]   2> 1072354 INFO  (Thread-684) [    ] o.a.s.c.ZkTestServer client port:0.0.0.0/0.0.0.0:0
   [junit4]   2> 1072354 INFO  (Thread-684) [    ] o.a.s.c.ZkTestServer Starting server
   [junit4]   2> 1072423 ERROR (Thread-684) [    ] o.a.z.s.ZooKeeperServer ZKShutdownHandler is not registered, so ZooKeeper server won't take any action on ERROR or SHUTDOWN server state changes
   [junit4]   2> 1072458 INFO  (SUITE-LegacyCloudClusterPropTest-seed#[BEE0BAB69C20E091]-worker) [    ] o.a.s.c.ZkTestServer start zk server on port:46602
   [junit4]   2> 1072498 INFO  (zkConnectionManagerCallback-404-thread-1) [    ] o.a.s.c.c.ConnectionManager zkClient has connected
   [junit4]   2> 1072542 WARN  (NIOServerCxn.Factory:0.0.0.0/0.0.0.0:0) [    ] o.a.z.s.NIOServerCnxn Unable to read additional data from client sessionid 0x1044a8629310000, likely client has closed socket
   [junit4]   2> 1072702 INFO  (jetty-launcher-401-thread-1) [    ] o.e.j.s.Server jetty-9.4.8.v20171121, build timestamp: 2017-11-21T22:27:37+01:00, git hash: 82b8fb23f757335bb3329d540ce37a2a2615f0a8
   [junit4]   2> 1072702 INFO  (jetty-launcher-401-thread-1) [    ] o.e.j.s.session DefaultSessionIdManager workerName=node0
   [junit4]   2> 1072702 INFO  (jetty-launcher-401-thread-1) [    ] o.e.j.s.session No SessionScavenger set, using defaults
   [junit4]   2> 1072703 INFO  (jetty-launcher-401-thread-1) [    ] o.e.j.s.session Scavenging every 600000ms
   [junit4]   2> 1072703 INFO  (jetty-launcher-401-thread-1) [    ] o.e.j.s.h.ContextHandler Started o.e.j.s.ServletContextHandler@13e56c7f{/solr,null,AVAILABLE}
   [junit4]   2> 1072722 INFO  (jetty-launcher-401-thread-1) [    ] o.e.j.s.AbstractConnector Started ServerConnector@4bff3d3d{HTTP/1.1,[http/1.1]}{127.0.0.1:36013}
   [junit4]   2> 1072722 INFO  (jetty-launcher-401-thread-1) [    ] o.e.j.s.Server Started @1095572ms
   [junit4]   2> 1072722 INFO  (jetty-launcher-401-thread-1) [    ] o.a.s.c.s.e.JettySolrRunner Jetty properties: {hostContext=/solr, hostPort=36013}
   [junit4]   2> 1072723 ERROR (jetty-launcher-401-thread-1) [    ] o.a.s.u.StartupLoggingUtils Missing Java Option solr.log.dir. Logging may be missing or incomplete.
   [junit4]   2> 1072723 INFO  (jetty-launcher-401-thread-1) [    ] o.a.s.s.SolrDispatchFilter  ___      _       Welcome to Apache Solr™ version 7.3.0
   [junit4]   2> 1072723 INFO  (jetty-launcher-401-thread-1) [    ] o.a.s.s.SolrDispatchFilter / __| ___| |_ _   Starting in cloud mode on port null
   [junit4]   2> 1072723 INFO  (jetty-launcher-401-thread-1) [    ] o.a.s.s.SolrDispatchFilter \__ \/ _ \ | '_|  Install dir: null
   [junit4]   2> 1072723 INFO  (jetty-launcher-401-thread-1) [    ] o.a.s.s.SolrDispatchFilter |___/\___/_|_|    Start time: 2018-02-09T12:11:05.242Z
   [junit4]   2> 1072798 INFO  (zkConnectionManagerCallback-406-thread-1) [    ] o.a.s.c.c.ConnectionManager zkClient has connected
   [junit4]   2> 1072798 INFO  (jetty-launcher-401-thread-1) [    ] o.a.s.s.SolrDispatchFilter solr.xml found in ZooKeeper. Loading...
   [junit4]   2> 1072900 INFO  (jetty-launcher-401-thread-1) [    ] o.a.s.c.ZkContainer Zookeeper client=127.0.0.1:46602/solr
   [junit4]   2> 1073120 INFO  (zkConnectionManagerCallback-410-thread-1) [    ] o.a.s.c.c.ConnectionManager zkClient has connected
   [junit4]   2> 1073128 INFO  (zkConnectionManagerCallback-412-thread-1-processing-n:127.0.0.1:36013_solr) [n:127.0.0.1:36013_solr    ] o.a.s.c.c.ConnectionManager zkClient has connected
   [junit4]   2> 1074258 INFO  (jetty-launcher-401-thread-1) [n:127.0.0.1:36013_solr    ] o.a.s.c.Overseer Overseer (id=null) closing
   [junit4]   2> 1074258 INFO  (jetty-launcher-401-thread-1) [n:127.0.0.1:36013_solr    ] o.a.s.c.OverseerElectionContext I am going to be the leader 127.0.0.1:36013_solr
   [junit4]   2> 1074259 INFO  (jetty-launcher-401-thread-1) [n:127.0.0.1:36013_solr    ] o.a.s.c.Overseer Overseer (id=73265434021920771-127.0.0.1:36013_solr-n_0000000000) starting
   [junit4]   2> 1074355 INFO  (jetty-launcher-401-thread-1) [n:127.0.0.1:36013_solr    ] o.a.s.c.ZkController Register node as live in ZooKeeper:/live_nodes/127.0.0.1:36013_solr
   [junit4]   2> 1074382 INFO  (OverseerStateUpdate-73265434021920771-127.0.0.1:36013_solr-n_0000000000) [n:127.0.0.1:36013_solr    ] o.a.s.c.c.ZkStateReader Updated live nodes from ZooKeeper... (0) -> (1)
   [junit4]   2> 1075581 INFO  (jetty-launcher-401-thread-1) [n:127.0.0.1:36013_solr    ] o.a.s.m.r.SolrJmxReporter JMX monitoring for 'solr_36013.solr.node' (registry 'solr.node') enabled at server: com.sun.jmx.mbeanserver.JmxMBeanServer@1d2ac7b9
   [junit4]   2> 1075745 INFO  (jetty-launcher-401-thread-1) [n:127.0.0.1:36013_solr    ] o.a.s.m.r.SolrJmxReporter JMX monitoring for 'solr_36013.solr.jvm' (registry 'solr.jvm') enabled at server: com.sun.jmx.mbeanserver.JmxMBeanServer@1d2ac7b9
   [junit4]   2> 1075764 INFO  (jetty-launcher-401-thread-1) [n:127.0.0.1:36013_solr    ] o.a.s.m.r.SolrJmxReporter JMX monitoring for 'solr_36013.solr.jetty' (registry 'solr.jetty') enabled at server: com.sun.jmx.mbeanserver.JmxMBeanServer@1d2ac7b9
   [junit4]   2> 1075810 INFO  (jetty-launcher-401-thread-1) [n:127.0.0.1:36013_solr    ] o.a.s.c.CorePropertiesLocator Found 0 core definitions underneath /x1/jenkins/jenkins-slave/workspace/Lucene-Solr-Tests-7.x/solr/build/solr-core/test/J1/temp/solr.cloud.LegacyCloudClusterPropTest_BEE0BAB69C20E091-001/tempDir-001/node1/.
   [junit4]   2> 1076455 INFO  (zkConnectionManagerCallback-416-thread-1) [    ] o.a.s.c.c.ConnectionManager zkClient has connected
   [junit4]   2> 1076534 INFO  (zkConnectionManagerCallback-420-thread-1) [    ] o.a.s.c.c.ConnectionManager zkClient has connected
   [junit4]   2> 1076556 INFO  (SUITE-LegacyCloudClusterPropTest-seed#[BEE0BAB69C20E091]-worker) [    ] o.a.s.c.c.ZkStateReader Updated live nodes from ZooKeeper... (0) -> (1)
   [junit4]   2> 1076556 INFO  (SUITE-LegacyCloudClusterPropTest-seed#[BEE0BAB69C20E091]-worker) [    ] o.a.s.c.s.i.ZkClientClusterStateProvider Cluster at 127.0.0.1:46602/solr ready
   [junit4]   2> 1076595 INFO  (TEST-LegacyCloudClusterPropTest.testCreateCollectionSwitchLegacyCloud-seed#[BEE0BAB69C20E091]) [    ] o.a.s.SolrTestCaseJ4 ###Starting testCreateCollectionSwitchLegacyCloud
   [junit4]   2> 1076655 INFO  (qtp2023301172-2277) [n:127.0.0.1:36013_solr    ] o.a.s.h.a.CollectionsHandler Invoked Collection Action :clusterprop with params val=true&name=legacyCloud&action=CLUSTERPROP&wt=javabin&version=2 and sendToOCPQueue=true
   [junit4]   2> 1076677 INFO  (qtp2023301172-2277) [n:127.0.0.1:36013_solr    ] o.a.s.s.HttpSolrCall [admin] webapp=null path=/admin/collections params={val=true&name=legacyCloud&action=CLUSTERPROP&wt=javabin&version=2} status=0 QTime=22
   [junit4]   2> 1076705 INFO  (qtp2023301172-2279) [n:127.0.0.1:36013_solr    ] o.a.s.h.a.CollectionsHandler Invoked Collection Action :create with params replicationFactor=1&collection.configName=conf&maxShardsPerNode=1&name=legacyTrue&nrtReplicas=1&action=CREATE&numShards=1&wt=javabin&version=2 and sendToOCPQueue=true
   [junit4]   2> 1077271 INFO  (OverseerThreadFactory-742-thread-1-processing-n:127.0.0.1:36013_solr) [n:127.0.0.1:36013_solr    ] o.a.s.c.a.c.CreateCollectionCmd Create collection legacyTrue
   [junit4]   2> 1077433 INFO  (qtp2023301172-2282) [n:127.0.0.1:36013_solr    ] o.a.s.h.a.CoreAdminOperation core create command qt=/admin/cores&collection.configName=conf&newCollection=true&name=legacyTrue_shard1_replica_n1&action=CREATE&numShards=1&collection=legacyTrue&shard=shard1&wt=javabin&version=2&replicaType=NRT
   [junit4]   2> 1077446 INFO  (qtp2023301172-2282) [n:127.0.0.1:36013_solr    ] o.a.s.c.TransientSolrCoreCacheDefault Allocating transient cache for 2147483647 transient cores
   [junit4]   2> 1077548 INFO  (zkCallback-411-thread-1-processing-n:127.0.0.1:36013_solr) [n:127.0.0.1:36013_solr    ] o.a.s.c.c.ZkStateReader A cluster state change: [WatchedEvent state:SyncConnected type:NodeDataChanged path:/collections/legacyTrue/state.json] for collection [legacyTrue] has occurred - updating... (live nodes size: [1])
   [junit4]   2> 1078705 INFO  (qtp2023301172-2282) [n:127.0.0.1:36013_solr c:legacyTrue s:shard1  x:legacyTrue_shard1_replica_n1] o.a.s.c.SolrConfig Using Lucene MatchVersion: 7.3.0
   [junit4]   2> 1078944 INFO  (qtp2023301172-2282) [n:127.0.0.1:36013_solr c:legacyTrue s:shard1  x:legacyTrue_shard1_replica_n1] o.a.s.s.IndexSchema [legacyTrue_shard1_replica_n1] Schema name=minimal
   [junit4]   2> 1078965 INFO  (qtp2023301172-2282) [n:127.0.0.1:36013_solr c:legacyTrue s:shard1  x:legacyTrue_shard1_replica_n1] o.a.s.s.IndexSchema Loaded schema minimal/1.1 with uniqueid field id
   [junit4]   2> 1078965 INFO  (qtp2023301172-2282) [n:127.0.0.1:36013_solr c:legacyTrue s:shard1  x:legacyTrue_shard1_replica_n1] o.a.s.c.CoreContainer Creating SolrCore 'legacyTrue_shard1_replica_n1' using configuration from collection legacyTrue, trusted=true
   [junit4]   2> 1079163 INFO  (qtp2023301172-2282) [n:127.0.0.1:36013_solr c:legacyTrue s:shard1  x:legacyTrue_shard1_replica_n1] o.a.s.m.r.SolrJmxReporter JMX monitoring for 'solr_36013.solr.core.legacyTrue.shard1.replica_n1' (registry 'solr.core.legacyTrue.shard1.replica_n1') enabled at server: com.sun.jmx.mbeanserver.JmxMBeanServer@1d2ac7b9
   [junit4]   2> 1079163 INFO  (qtp2023301172-2282) [n:127.0.0.1:36013_solr c:legacyTrue s:shard1  x:legacyTrue_shard1_replica_n1] o.a.s.c.SolrCore solr.RecoveryStrategy.Builder
   [junit4]   2> 1079163 INFO  (qtp2023301172-2282) [n:127.0.0.1:36013_solr c:legacyTrue s:shard1  x:legacyTrue_shard1_replica_n1] o.a.s.c.SolrCore [[legacyTrue_shard1_replica_n1] ] Opening new SolrCore at [/x1/jenkins/jenkins-slave/workspace/Lucene-Solr-Tests-7.x/solr/build/solr-core/test/J1/temp/solr.cloud.LegacyCloudClusterPropTest_BEE0BAB69C20E091-001/tempDir-001/node1/legacyTrue_shard1_replica_n1], dataDir=[/x1/jenkins/jenkins-slave/workspace/Lucene-Solr-Tests-7.x/solr/build/solr-core/test/J1/temp/solr.cloud.LegacyCloudClusterPropTest_BEE0BAB69C20E091-001/tempDir-001/node1/./legacyTrue_shard1_replica_n1/data/]
   [junit4]   2> 1079658 INFO  (qtp2023301172-2282) [n:127.0.0.1:36013_solr c:legacyTrue s:shard1  x:legacyTrue_shard1_replica_n1] o.a.s.u.UpdateHandler Using UpdateLog implementation: org.apache.solr.update.UpdateLog
   [junit4]   2> 1079658 INFO  (qtp2023301172-2282) [n:127.0.0.1:36013_solr c:legacyTrue s:shard1  x:legacyTrue_shard1_replica_n1] o.a.s.u.UpdateLog Initializing UpdateLog: dataDir=null defaultSyncLevel=FLUSH numRecordsToKeep=100 maxNumLogsToKeep=10 numVersionBuckets=65536
   [junit4]   2> 1079659 INFO  (qtp2023301172-2282) [n:127.0.0.1:36013_solr c:legacyTrue s:shard1  x:legacyTrue_shard1_replica_n1] o.a.s.u.CommitTracker Hard AutoCommit: disabled
   [junit4]   2> 1079659 INFO  (qtp2023301172-2282) [n:127.0.0.1:36013_solr c:legacyTrue s:shard1  x:legacyTrue_shard1_replica_n1] o.a.s.u.CommitTracker Soft AutoCommit: disabled
   [junit4]   2> 1079714 INFO  (qtp2023301172-2282) [n:127.0.0.1:36013_solr c:legacyTrue s:shard1  x:legacyTrue_shard1_replica_n1] o.a.s.s.SolrIndexSearcher Opening [Searcher@a236cc0[legacyTrue_shard1_replica_n1] main]
   [junit4]   2> 1079743 INFO  (qtp2023301172-2282) [n:127.0.0.1:36013_solr c:legacyTrue s:shard1  x:legacyTrue_shard1_replica_n1] o.a.s.r.ManagedResourceStorage Configured ZooKeeperStorageIO with znodeBase: /configs/conf
   [junit4]   2> 1079744 INFO  (qtp2023301172-2282) [n:127.0.0.1:36013_solr c:legacyTrue s:shard1  x:legacyTrue_shard1_replica_n1] o.a.s.r.ManagedResourceStorage Loaded null at path _rest_managed.json using ZooKeeperStorageIO:path=/configs/conf
   [junit4]   2> 1079744 INFO  (qtp2023301172-2282) [n:127.0.0.1:36013_solr c:legacyTrue s:shard1  x:legacyTrue_shard1_replica_n1] o.a.s.h.ReplicationHandler Commits will be reserved for 10000ms.
   [junit4]   2> 1079745 INFO  (qtp2023301172-2282) [n:127.0.0.1:36013_solr c:legacyTrue s:shard1  x:legacyTrue_shard1_replica_n1] o.a.s.u.UpdateLog Could not find max version in index or recent updates, using new clock 1591925300017496064
   [junit4]   2> 1079762 INFO  (searcherExecutor-745-thread-1-processing-n:127.0.0.1:36013_solr x:legacyTrue_shard1_replica_n1 s:shard1 c:legacyTrue) [n:127.0.0.1:36013_solr c:legacyTrue s:shard1  x:legacyTrue_shard1_replica_n1] o.a.s.c.SolrCore [legacyTrue_shard1_replica_n1] Registered new searcher Searcher@a236cc0[legacyTrue_shard1_replica_n1] main{ExitableDirectoryReader(UninvertingDirectoryReader())}
   [junit4]   2> 1079846 INFO  (qtp2023301172-2282) [n:127.0.0.1:36013_solr c:legacyTrue s:shard1  x:legacyTrue_shard1_replica_n1] o.a.s.c.ShardLeaderElectionContext Enough replicas found to continue.
   [junit4]   2> 1079846 INFO  (qtp2023301172-2282) [n:127.0.0.1:36013_solr c:legacyTrue s:shard1  x:legacyTrue_shard1_replica_n1] o.a.s.c.ShardLeaderElectionContext I may be the new leader - try and sync
   [junit4]   2> 1079846 INFO  (qtp2023301172-2282) [n:127.0.0.1:36013_solr c:legacyTrue s:shard1  x:legacyTrue_shard1_replica_n1] o.a.s.c.SyncStrategy Sync replicas to http://127.0.0.1:36013/solr/legacyTrue_shard1_replica_n1/
   [junit4]   2> 1079846 INFO  (qtp2023301172-2282) [n:127.0.0.1:36013_solr c:legacyTrue s:shard1  x:legacyTrue_shard1_replica_n1] o.a.s.c.SyncStrategy Sync Success - now sync replicas to me
   [junit4]   2> 1079846 INFO  (qtp2023301172-2282) [n:127.0.0.1:36013_solr c:legacyTrue s:shard1  x:legacyTrue_shard1_replica_n1] o.a.s.c.SyncStrategy http://127.0.0.1:36013/solr/legacyTrue_shard1_replica_n1/ has no replicas
   [junit4]   2> 1079846 INFO  (qtp2023301172-2282) [n:127.0.0.1:36013_solr c:legacyTrue s:shard1  x:legacyTrue_shard1_replica_n1] o.a.s.c.ShardLeaderElectionContext Found all replicas participating in election, clear LIR
   [junit4]   2> 1079863 INFO  (zkCallback-411-thread-2-processing-n:127.0.0.1:36013_solr) [n:127.0.0.1:36013_solr    ] o.a.s.c.c.ZkStateReader A cluster state change: [WatchedEvent state:SyncConnected type:NodeDataChanged path:/collections/legacyTrue/state.json] for collection [legacyTrue] has occurred - updating... (live nodes size: [1])
   [junit4]   2> 1079864 INFO  (qtp2023301172-2282) [n:127.0.0.1:36013_solr c:legacyTrue s:shard1  x:legacyTrue_shard1_replica_n1] o.a.s.c.ShardLeaderElectionContext I am the new leader: http://127.0.0.1:36013/solr/legacyTrue_shard1_replica_n1/ shard1
   [junit4]   2> 1079865 INFO  (qtp2023301172-2282) [n:127.0.0.1:36013_solr c:legacyTrue s:shard1  x:legacyTrue_shard1_replica_n1] o.a.s.c.ZkController I am the leader, no recovery necessary
   [junit4]   2> 1079882 INFO  (qtp2023301172-2282) [n:127.0.0.1:36013_solr c:legacyTrue s:shard1  x:legacyTrue_shard1_replica_n1] o.a.s.s.HttpSolrCall [admin] webapp=null path=/admin/cores params={qt=/admin/cores&collection.configName=conf&newCollection=true&name=legacyTrue_shard1_replica_n1&action=CREATE&numShards=1&collection=legacyTrue&shard=shard1&wt=javabin&version=2&replicaType=NRT} status=0 QTime=2448
   [junit4]   2> 1079884 INFO  (qtp2023301172-2279) [n:127.0.0.1:36013_solr    ] o.a.s.h.a.CollectionsHandler Wait for new collection to be active for at most 30 seconds. Check all shard replicas
   [junit4]   2> 1079982 INFO  (zkCallback-411-thread-2-processing-n:127.0.0.1:36013_solr) [n:127.0.0.1:36013_solr    ] o.a.s.c.c.ZkStateReader A cluster state change: [WatchedEvent state:SyncConnected type:NodeDataChanged path:/collections/legacyTrue/state.json] for collection [legacyTrue] has occurred - updating... (live nodes size: [1])
   [junit4]   2> 1080904 INFO  (qtp2023301172-2279) [n:127.0.0.1:36013_solr    ] o.a.s.s.HttpSolrCall [admin] webapp=null path=/admin/collections params={replicationFactor=1&collection.configName=conf&maxShardsPerNode=1&name=legacyTrue&nrtReplicas=1&action=CREATE&numShards=1&wt=javabin&version=2} status=0 QTime=4198
   [junit4]   2> 1080933 INFO  (TEST-LegacyCloudClusterPropTest.testCreateCollectionSwitchLegacyCloud-seed#[BEE0BAB69C20E091]) [    ] o.e.j.s.AbstractConnector Stopped ServerConnector@4bff3d3d{HTTP/1.1,[http/1.1]}{127.0.0.1:0}
   [junit4]   2> 1080950 INFO  (TEST-LegacyCloudClusterPropTest.testCreateCollectionSwitchLegacyCloud-seed#[BEE0BAB69C20E091]) [    ] o.a.s.c.CoreContainer Shutting down CoreContainer instance=964961590
   [junit4]   2> 1080958 INFO  (TEST-LegacyCloudClusterPropTest.testCreateCollectionSwitchLegacyCloud-seed#[BEE0BAB69C20E091]) [    ] o.a.s.m.SolrMetricManager Closing metric reporters for registry=solr.node, tag=null
   [junit4]   2> 1080958 INFO  (TEST-LegacyCloudClusterPropTest.testCreateCollectionSwitchLegacyCloud-seed#[BEE0BAB69C20E091]) [    ] o.a.s.m.r.SolrJmxReporter Closing reporter [org.apache.solr.metrics.reporters.SolrJmxReporter@d6300d5: rootName = solr_36013, domain = solr.node, service url = null, agent id = null] for registry solr.node / com.codahale.metrics.MetricRegistry@77caa671
   [junit4]   2> 1080980 INFO  (TEST-LegacyCloudClusterPropTest.testCreateCollectionSwitchLegacyCloud-seed#[BEE0BAB69C20E091]) [    ] o.a.s.m.SolrMetricManager Closing metric reporters for registry=solr.jvm, tag=null
   [junit4]   2> 1080980 INFO  (TEST-LegacyCloudClusterPropTest.testCreateCollectionSwitchLegacyCloud-seed#[BEE0BAB69C20E091]) [    ] o.a.s.m.r.SolrJmxReporter Closing reporter [org.apache.solr.metrics.reporters.SolrJmxReporter@2cb4b48: rootName = solr_36013, domain = solr.jvm, service url = null, agent id = null] for registry solr.jvm / com.codahale.metrics.MetricRegistry@34de1aa0
   [junit4]   2> 1080996 INFO  (TEST-LegacyCloudClusterPropTest.testCreateCollectionSwitchLegacyCloud-seed#[BEE0BAB69C20E091]) [    ] o.a.s.m.SolrMetricManager Closing metric reporters for registry=solr.jetty, tag=null
   [junit4]   2> 1080996 INFO  (TEST-LegacyCloudClusterPropTest.testCreateCollectionSwitchLegacyCloud-seed#[BEE0BAB69C20E091]) [    ] o.a.s.m.r.SolrJmxReporter Closing reporter [org.apache.solr.metrics.reporters.SolrJmxReporter@cc19fac: rootName = solr_36013, domain = solr.jetty, service url = null, agent id = null] for registry solr.jetty / com.codahale.metrics.MetricRegistry@1cd34c9f
   [junit4]   2> 1081007 INFO  (TEST-LegacyCloudClusterPropTest.testCreateCollectionSwitchLegacyCloud-seed#[BEE0BAB69C20E091]) [    ] o.a.s.c.ZkController Remove node as live in ZooKeeper:/live_nodes/127.0.0.1:36013_solr
   [junit4]   2> 1081008 INFO  (zkCallback-419-thread-1) [    ] o.a.s.c.c.ZkStateReader Updated live nodes from ZooKeeper... (1) -> (0)
   [junit4]   2> 1081008 INFO  (zkCallback-411-thread-2-processing-n:127.0.0.1:36013_solr) [n:127.0.0.1:36013_solr    ] o.a.s.c.c.ZkStateReader Updated live nodes from ZooKeeper... (1) -> (0)
   [junit4]   2> 1081008 INFO  (TEST-LegacyCloudClusterPropTest.testCreateCollectionSwitchLegacyCloud-seed#[BEE0BAB69C20E091]) [    ] o.a.s.m.SolrMetricManager Closing metric reporters for registry=solr.cluster, tag=null
   [junit4]   2> 1081062 INFO  (coreCloseExecutor-750-thread-1) [n:127.0.0.1:36013_solr c:legacyTrue s:shard1 r:core_node2 x:legacyTrue_shard1_replica_n1] o.a.s.c.SolrCore [legacyTrue_shard1_replica_n1]  CLOSING SolrCore org.apache.solr.core.SolrCore@1c490e3c
   [junit4]   2> 1081063 INFO  (coreCloseExecutor-750-thread-1) [n:127.0.0.1:36013_solr c:legacyTrue s:shard1 r:core_node2 x:legacyTrue_shard1_replica_n1] o.a.s.m.SolrMetricManager Closing metric reporters for registry=solr.core.legacyTrue.shard1.replica_n1, tag=474549820
   [junit4]   2> 1081063 INFO  (coreCloseExecutor-750-thread-1) [n:127.0.0.1:36013_solr c:legacyTrue s:shard1 r:core_node2 x:legacyTrue_shard1_replica_n1] o.a.s.m.r.SolrJmxReporter Closing reporter [org.apache.solr.metrics.reporters.SolrJmxReporter@1f04b1bb: rootName = solr_36013, domain = solr.core.legacyTrue.shard1.replica_n1, service url = null, agent id = null] for registry solr.core.legacyTrue.shard1.replica_n1 / com.codahale.metrics.MetricRegistry@4cf84a26
   [junit4]   2> 1081109 INFO  (coreCloseExecutor-750-thread-1) [n:127.0.0.1:36013_solr c:legacyTrue s:shard1 r:core_node2 x:legacyTrue_shard1_replica_n1] o.a.s.m.SolrMetricManager Closing metric reporters for registry=solr.collection.legacyTrue.shard1.leader, tag=474549820
   [junit4]   2> 1081111 INFO  (zkCallback-411-thread-2-processing-n:127.0.0.1:36013_solr) [n:127.0.0.1:36013_solr    ] o.a.s.c.c.ZkStateReader A cluster state change: [WatchedEvent state:SyncConnected type:NodeDataChanged path:/collections/legacyTrue/state.json] for collection [legacyTrue] has occurred - updating... (live nodes size: [0])
   [junit4]   2> 1081201 INFO  (TEST-LegacyCloudClusterPropTest.testCreateCollectionSwitchLegacyCloud-seed#[BEE0BAB69C20E091]) [    ] o.a.s.c.Overseer Overseer (id=73265434021920771-127.0.0.1:36013_solr-n_0000000000) closing
   [junit4]   2> 1081201 INFO  (OverseerStateUpdate-73265434021920771-127.0.0.1:36013_solr-n_0000000000) [n:127.0.0.1:36013_solr    ] o.a.s.c.Overseer Overseer Loop exiting : 127.0.0.1:36013_solr
   [junit4]   2> 1081317 WARN  (OverseerAutoScalingTriggerThread-73265434021920771-127.0.0.1:36013_solr-n_0000000000) [n:127.0.0.1:36013_solr    ] o.a.s.c.a.OverseerTriggerThread OverseerTriggerThread woken up but we are closed, exiting.
   [junit4]   2> 1081370 INFO  (TEST-LegacyCloudClusterPropTest.testCreateCollectionSwitchLegacyCloud-seed#[BEE0BAB69C20E091]) [    ] o.e.j.s.h.ContextHandler Stopped o.e.j.s.ServletContextHandler@13e56c7f{/solr,null,UNAVAILABLE}
   [junit4]   2> 1081372 INFO  (TEST-LegacyCloudClusterPropTest.testCreateCollectionSwitchLegacyCloud-seed#[BEE0BAB69C20E091]) [    ] o.e.j.s.session Stopped scavenging
   [junit4]   2> 1081421 INFO  (TEST-LegacyCloudClusterPropTest.testCreateCollectionSwitchLegacyCloud-seed#[BEE0BAB69C20E091]) [    ] o.e.j.s.Server jetty-9.4.8.v20171121, build timestamp: 2017-11-21T22:27:37+01:00, git hash: 82b8fb23f757335bb3329d540ce37a2a2615f0a8
   [junit4]   2> 1081425 INFO  (TEST-LegacyCloudClusterPropTest.testCreateCollectionSwitchLegacyCloud-seed#[BEE0BAB69C20E091]) [    ] o.e.j.s.session DefaultSessionIdManager workerName=node0
   [junit4]   2> 1081425 INFO  (TEST-LegacyCloudClusterPropTest.testCreateCollectionSwitchLegacyCloud-seed#[BEE0BAB69C20E091]) [    ] o.e.j.s.session No SessionScavenger set, using defaults
   [junit4]   2> 1081425 INFO  (TEST-LegacyCloudClusterPropTest.testCreateCollectionSwitchLegacyCloud-seed#[BEE0BAB69C20E091]) [    ] o.e.j.s.session Scavenging every 660000ms
   [junit4]   2> 1081427 INFO  (TEST-LegacyCloudClusterPropTest.testCreateCollectionSwitchLegacyCloud-seed#[BEE0BAB69C20E091]) [    ] o.e.j.s.h.ContextHandler Started o.e.j.s.ServletContextHandler@41fbd312{/solr,null,AVAILABLE}
   [junit4]   2> 1081427 INFO  (TEST-LegacyCloudClusterPropTest.testCreateCollectionSwitchLegacyCloud-seed#[BEE0BAB69C20E091]) [    ] o.e.j.s.AbstractConnector Started ServerConnector@68c85bb4{HTTP/1.1,[http/1.1]}{127.0.0.1:36013}
   [junit4]   2> 1081427 INFO  (TEST-LegacyCloudClusterPropTest.testCreateCollectionSwitchLegacyCloud-seed#[BEE0BAB69C20E091]) [    ] o.e.j.s.Server Started @1104277ms
   [junit4]   2> 1081427 INFO  (TEST-LegacyCloudClusterPropTest.testCreateCollectionSwitchLegacyCloud-seed#[BEE0BAB69C20E091]) [    ] o.a.s.c.s.e.JettySolrRunner Jetty properties: {hostContext=/solr, hostPort=36013}
   [junit4]   2> 1081427 ERROR (TEST-LegacyCloudClusterPropTest.testCreateCollectionSwitchLegacyCloud-seed#[BEE0BAB69C20E091]) [    ] o.a.s.u.StartupLoggingUtils Missing Java Option solr.log.dir. Logging may be missing or incomplete.
   [junit4]   2> 1081466 INFO  (TEST-LegacyCloudClusterPropTest.testCreateCollectionSwitchLegacyCloud-seed#[BEE0BAB69C20E091]) [    ] o.a.s.s.SolrDispatchFilter  ___      _       Welcome to Apache Solr™ version 7.3.0
   [junit4]   2> 1081466 INFO  (TEST-LegacyCloudClusterPropTest.testCreateCollectionSwitchLegacyCloud-seed#[BEE0BAB69C20E091]) [    ] o.a.s.s.SolrDispatchFilter / __| ___| |_ _   Starting in cloud mode on port null
   [junit4]   2> 1081466 INFO  (TEST-LegacyCloudClusterPropTest.testCreateCollectionSwitchLegacyCloud-seed#[BEE0BAB69C20E091]) [    ] o.a.s.s.SolrDispatchFilter \__ \/ _ \ | '_|  Install dir: null
   [junit4]   2> 1081466 INFO  (TEST-LegacyCloudClusterPropTest.testCreateCollectionSwitchLegacyCloud-seed#[BEE0BAB69C20E091]) [    ] o.a.s.s.SolrDispatchFilter |___/\___/_|_|    Start time: 2018-02-09T12:11:13.985Z
   [junit4]   2> 1081535 INFO  (zkConnectionManagerCallback-422-thread-1) [    ] o.a.s.c.c.ConnectionManager zkClient has connected
   [junit4]   2> 1081535 INFO  (TEST-LegacyCloudClusterPropTest.testCreateCollectionSwitchLegacyCloud-seed#[BEE0BAB69C20E091]) [    ] o.a.s.s.SolrDispatchFilter solr.xml found in ZooKeeper. Loading...
   [junit4]   2> 1081613 INFO  (TEST-LegacyCloudClusterPropTest.testCreateCollectionSwitchLegacyCloud-seed#[BEE0BAB69C20E091]) [    ] o.a.s.c.ZkContainer Zookeeper client=127.0.0.1:46602/solr
   [junit4]   2> 1081714 INFO  (zkConnectionManagerCallback-426-thread-1) [    ] o.a.s.c.c.ConnectionManager zkClient has connected
   [junit4]   2> 1081852 INFO  (zkConnectionManagerCallback-428-thread-1-processing-n:127.0.0.1:36013_solr) [n:127.0.0.1:36013_solr    ] o.a.s.c.c.ConnectionManager zkClient has connected
   [junit4]   2> 1082065 INFO  (TEST-LegacyCloudClusterPropTest.testCreateCollectionSwitchLegacyCloud-seed#[BEE0BAB69C20E091]) [n:127.0.0.1:36013_solr    ] o.a.s.c.Overseer Overseer (id=null) closing
   [junit4]   2> 1082066 INFO  (TEST-LegacyCloudClusterPropTest.testCreateCollectionSwitchLegacyCloud-seed#[BEE0BAB69C20E091]) [n:127.0.0.1:36013_solr    ] o.a.s.c.OverseerElectionContext I am going to be the leader 127.0.0.1:36013_solr
   [junit4]   2> 1082066 INFO  (TEST-LegacyCloudClusterPropTest.testCreateCollectionSwitchLegacyCloud-seed#[BEE0BAB69C20E091]) [n:127.0.0.1:36013_solr    ] o.a.s.c.Overseer Overseer (id=73265434021920776-127.0.0.1:36013_solr-n_0000000001) starting
   [junit4]   2> 1082155 INFO  (TEST-LegacyCloudClusterPropTest.testCreateCollectionSwitchLegacyCloud-seed#[BEE0BAB69C20E091]) [n:127.0.0.1:36013_solr    ] o.a.s.c.ZkController Register node as live in ZooKeeper:/live_nodes/127.0.0.1:36013_solr
   [junit4]   2> 1082156 INFO  (zkCallback-419-thread-1) [    ] o.a.s.c.c.ZkStateReader Updated live nodes from ZooKeeper... (0) -> (1)
   [junit4]   2> 1082201 INFO  (OverseerStateUpdate-73265434021920776-127.0.0.1:36013_solr-n_0000000001) [n:127.0.0.1:36013_solr    ] o.a.s.c.c.ZkStateReader Updated live nodes from ZooKeeper... (0) -> (1)
   [junit4]   2> 1082543 INFO  (TEST-LegacyCloudClusterPropTest.testCreateCollectionSwitchLegacyCloud-seed#[BEE0BAB69C20E091]) [n:127.0.0.1:36013_solr    ] o.a.s.m.r.SolrJmxReporter JMX monitoring for 'solr_36013.solr.node' (registry 'solr.node') enabled at server: com.sun.jmx.mbeanserver.JmxMBeanServer@1d2ac7b9
   [junit4]   2> 1082624 INFO  (TEST-LegacyCloudClusterPropTest.testCreateCollectionSwitchLegacyCloud-seed#[BEE0BAB69C20E091]) [n:127.0.0.1:36013_solr    ] o.a.s.m.r.SolrJmxReporter JMX monitoring for 'solr_36013.solr.jvm' (registry 'solr.jvm') enabled at server: com.sun.jmx.mbeanserver.JmxMBeanServer@1d2ac7b9
   [junit4]   2> 1082624 INFO  (TEST-LegacyCloudClusterPropTest.testCreateCollectionSwitchLegacyCloud-seed#[BEE0BAB69C20E091]) [n:127.0.0.1:36013_solr    ] o.a.s.m.r.SolrJmxReporter JMX monitoring for 'solr_36013.solr.jetty' (registry 'solr.jetty') enabled at server: com.sun.jmx.mbeanserver.JmxMBeanServer@1d2ac7b9
   [junit4]   2> 1082662 INFO  (TEST-LegacyCloudClusterPropTest.testCreateCollectionSwitchLegacyCloud-seed#[BEE0BAB69C20E091]) [n:127.0.0.1:36013_solr    ] o.a.s.c.CorePropertiesLocator Found 1 core definitions underneath /x1/jenkins/jenkins-slave/workspace/Lucene-Solr-Tests-7.x/solr/build/solr-core/test/J1/temp/solr.cloud.LegacyCloudClusterPropTest_BEE0BAB69C20E091-001/tempDir-001/node1/.
   [junit4]   2> 1082662 INFO  (TEST-LegacyCloudClusterPropTest.testCreateCollectionSwitchLegacyCloud-seed#[BEE0BAB69C20E091]) [n:127.0.0.1:36013_solr    ] o.a.s.c.CorePropertiesLocator Cores are: [legacyTrue_shard1_replica_n1]
   [junit4]   2> 1082714 INFO  (coreLoadExecutor-761-thread-1-processing-n:127.0.0.1:36013_solr) [n:127.0.0.1:36013_solr    ] o.a.s.c.TransientSolrCoreCacheDefault Allocating transient cache for 2147483647 transient cores
   [junit4]   2> 1082860 INFO  (coreLoadExecutor-761-thread-1-processing-n:127.0.0.1:36013_solr) [n:127.0.0.1:36013_solr    ] o.a.s.c.SolrConfig Using Lucene MatchVersion: 7.3.0
   [junit4]   2> 1082983 INFO  (coreLoadExecutor-761-thread-1-processing-n:127.0.0.1:36013_solr) [n:127.0.0.1:36013_solr    ] o.a.s.s.IndexSchema [legacyTrue_shard1_replica_n1] Schema name=minimal
   [junit4]   2> 1083038 INFO  (coreLoadExecutor-761-thread-1-processing-n:127.0.0.1:36013_solr) [n:127.0.0.1:36013_solr    ] o.a.s.s.IndexSchema Loaded schema minimal/1.1 with uniqueid field id
   [junit4]   2> 1083083 INFO  (coreLoadExecutor-761-thread-1-processing-n:127.0.0.1:36013_solr) [n:127.0.0.1:36013_solr c:legacyTrue s:shard1  x:legacyTrue_shard1_replica_n1] o.a.s.c.SolrConfig Using Lucene MatchVersion: 7.3.0
   [junit4]   2> 1083137 INFO  (coreLoadExecutor-761-thread-1-processing-n:127.0.0.1:36013_solr) [n:127.0.0.1:36013_solr c:legacyTrue s:shard1  x:legacyTrue_shard1_replica_n1] o.a.s.s.IndexSchema [legacyTrue_shard1_replica_n1] Schema name=minimal
   [junit4]   2> 1083159 INFO  (coreLoadExecutor-761-thread-1-processing-n:127.0.0.1:36013_solr) [n:127.0.0.1:36013_solr c:legacyTrue s:shard1  x:legacyTrue_shard1_replica_n1] o.a.s.s.IndexSchema Loaded schema minimal/1.1 with uniqueid field id
   [junit4]   2> 1083159 INFO  (coreLoadExecutor-761-thread-1-processing-n:127.0.0.1:36013_solr) [n:127.0.0.1:36013_solr c:legacyTrue s:shard1  x:legacyTrue_shard1_replica_n1] o.a.s.c.CoreContainer Creating SolrCore 'legacyTrue_shard1_replica_n1' using configuration from collection legacyTrue, trusted=true
   [junit4]   2> 1083160 INFO  (coreLoadExecutor-761-thread-1-processing-n:127.0.0.1:36013_solr) [n:127.0.0.1:36013_solr c:legacyTrue s:shard1  x:legacyTrue_shard1_replica_n1] o.a.s.m.r.SolrJmxReporter JMX monitoring for 'solr_36013.solr.core.legacyTrue.shard1.replica_n1' (registry 'solr.core.legacyTrue.shard1.replica_n1') enabled at server: com.sun.jmx.mbeanserver.JmxMBeanServer@1d2ac7b9
   [junit4]   2> 1083160 INFO  (coreLoadExecutor-761-thread-1-processing-n:127.0.0.1:36013_solr) [n:127.0.0.1:36013_solr c:legacyTrue s:shard1  x:legacyTrue_shard1_replica_n1] o.a.s.c.SolrCore solr.RecoveryStrategy.Builder
   [junit4]   2> 1083160 INFO  (coreLoadExecutor-761-thread-1-processing-n:127.0.0.1:36013_solr) [n:127.0.0.1:36013_solr c:legacyTrue s:shard1  x:legacyTrue_shard1_replica_n1] o.a.s.c.SolrCore [[legacyTrue_shard1_replica_n1] ] Opening new SolrCore at [/x1/jenkins/jenkins-slave/workspace/Lucene-Solr-Tests-7.x/solr/build/solr-core/test/J1/temp/solr.cloud.LegacyCloudClusterPropTest_BEE0BAB69C20E091-001/tempDir-001/node1/legacyTrue_shard1_replica_n1], dataDir=[/x1/jenkins/jenkins-slave/workspace/Lucene-Solr-Tests-7.x/solr/build/solr-core/test/J1/temp/solr.cloud.LegacyCloudClusterPropTest_BEE0BAB69C20E091-001/tempDir-001/node1/./legacyTrue_shard1_replica_n1/data/]
   [junit4]   2> 1083822 INFO  (coreLoadExecutor-761-thread-1-processing-n:127.0.0.1:36013_solr) [n:127.0.0.1:36013_solr c:legacyTrue s:shard1  x:legacyTrue_shard1_replica_n1] o.a.s.u.UpdateHandler Using UpdateLog implementation: org.apache.solr.update.UpdateLog
   [junit4]   2> 1083822 INFO  (coreLoadExecutor-761-thread-1-processing-n:127.0.0.1:36013_solr) [n:127.0.0.1:36013_solr c:legacyTrue s:shard1  x:legacyTrue_shard1_replica_n1] o.a.s.u.UpdateLog Initializing UpdateLog: dataDir=null defaultSyncLevel=FLUSH numRecordsToKeep=100 maxNumLogsToKeep=10 numVersionBuckets=65536
   [junit4]   2> 1083823 INFO  (coreLoadExecutor-761-thread-1-processing-n:127.0.0.1:36013_solr) [n:127.0.0.1:36013_solr c:legacyTrue s:shard1  x:legacyTrue_shard1_replica_n1] o.a.s.u.CommitTracker Hard AutoCommit: disabled
   [junit4]   2> 1083823 INFO  (coreLoadExecutor-761-thread-1-processing-n:127.0.0.1:36013_solr) [n:127.0.0.1:36013_solr c:legacyTrue s:shard1  x:legacyTrue_shard1_replica_n1] o.a.s.u.CommitTracker Soft AutoCommit: disabled
   [junit4]   2> 1083914 INFO  (coreLoadExecutor-761-thread-1-processing-n:127.0.0.1:36013_solr) [n:127.0.0.1:36013_solr c:legacyTrue s:shard1  x:legacyTrue_shard1_replica_n1] o.a.s.s.SolrIndexSearcher Opening [Searcher@7c30e5f7[legacyTrue_shard1_replica_n1] main]
   [junit4]   2> 1083922 INFO  (coreLoadExecutor-761-thread-1-processing-n:127.0.0.1:36013_solr) [n:127.0.0.1:36013_solr c:legacyTrue s:shard1  x:legacyTrue_shard1_replica_n1] o.a.s.r.ManagedResourceStorage Configured ZooKeeperStorageIO with znodeBase: /configs/conf
   [junit4]   2> 1083922 INFO  (coreLoadExecutor-761-thread-1-processing-n:127.0.0.1:36013_solr) [n:127.0.0.1:36013_solr c:legacyTrue s:shard1  x:legacyTrue_shard1_replica_n1] o.a.s.r.ManagedResourceStorage Loaded null at path _rest_managed.json using ZooKeeperStorageIO:path=/configs/conf
   [junit4]   2> 1083923 INFO  (coreLoadExecutor-761-thread-1-processing-n:127.0.0.1:36013_solr) [n:127.0.0.1:36013_solr c:legacyTrue s:shard1  x:legacyTrue_shard1_replica_n1] o.a.s.h.ReplicationHandler Commits will be reserved for 10000ms.
   [junit4]   2> 1083923 INFO  (coreLoadExecutor-761-thread-1-processing-n:127.0.0.1:36013_solr) [n:127.0.0.1:36013_solr c:legacyTrue s:shard1  x:legacyTrue_shard1_replica_n1] o.a.s.u.UpdateLog Could not find max version in index or recent updates, using new clock 1591925304398446592
   [junit4]   2> 1083972 INFO  (searcherExecutor-762-thread-1-processing-n:127.0.0.1:36013_solr x:legacyTrue_shard1_replica_n1 s:shard1 c:legacyTrue) [n:127.0.0.1:36013_solr c:legacyTrue s:shard1  x:legacyTrue_shard1_replica_n1] o.a.s.c.SolrCore [legacyTrue_shard1_replica_n1] Registered new searcher Searcher@7c30e5f7[legacyTrue_shard1_replica_n1] main{ExitableDirectoryReader(UninvertingDirectoryReader())}
   [junit4]   2> 1083983 INFO  (coreZkRegister-752-thread-1-processing-n:127.0.0.1:36013_solr x:legacyTrue_shard1_replica_n1 s:shard1 c:legacyTrue) [n:127.0.0.1:36013_solr c:legacyTrue s:shard1 r:core_node2 x:legacyTrue_shard1_replica_n1] o.a.s.c.ShardLeaderElectionContext Enough replicas found to continue.
   [junit4]   2> 1083983 INFO  (coreZkRegister-752-thread-1-processing-n:127.0.0.1:36013_solr x:legacyTrue_shard1_replica_n1 s:shard1 c:legacyTrue) [n:127.0.0.1:36013_solr c:legacyTrue s:shard1 r:core_node2 x:legacyTrue_shard1_replica_n1] o.a.s.c.ShardLeaderElectionContext I may be the new leader - try and sync
   [junit4]   2> 1083983 INFO  (coreZkRegister-752-thread-1-processing-n:127.0.0.1:36013_solr x:legacyTrue_shard1_replica_n1 s:shard1 c:legacyTrue) [n:127.0.0.1:36013_solr c:legacyTrue s:shard1 r:core_node2 x:legacyTrue_shard1_replica_n1] o.a.s.c.SyncStrategy Sync replicas to http://127.0.0.1:36013/solr/legacyTrue_shard1_replica_n1/
   [junit4]   2> 1083983 INFO  (coreZkRegister-752-thread-1-processing-n:127.0.0.1:36013_solr x:legacyTrue_shard1_replica_n1 s:shard1 c:legacyTrue) [n:127.0.0.1:36013_solr c:legacyTrue s:shard1 r:core_node2 x:legacyTrue_shard1_replica_n1] o.a.s.c.SyncStrategy Sync Success - now sync replicas to me
   [junit4]   2> 1083983 INFO  (coreZkRegister-752-thread-1-processing-n:127.0.0.1:36013_solr x:legacyTrue_shard1_replica_n1 s:shard1 c:legacyTrue) [n:127.0.0.1:36013_solr c:legacyTrue s:shard1 r:core_node2 x:legacyTrue_shard1_replica_n1] o.a.s.c.SyncStrategy http://127.0.0.1:36013/solr/legacyTrue_shard1_replica_n1/ has no replicas
   [junit4]   2> 1083983 INFO  (coreZkRegister-752-thread-1-processing-n:127.0.0.1:36013_solr x:legacyTrue_shard1_replica_n1 s:shard1 c:legacyTrue) [n:127.0.0.1:36013_solr c:legacyTrue s:shard1 r:core_node2 x:legacyTrue_shard1_replica_n1] o.a.s.c.ShardLeaderElectionContext Found all replicas participating in election, clear LIR
   [junit4]   2> 1083992 INFO  (coreZkRegister-752-thread-1-processing-n:127.0.0.1:36013_solr x:legacyTrue_shard1_replica_n1 s:shard1 c:legacyTrue) [n:127.0.0.1:36013_solr c:legacyTrue s:shard1 r:core_node2 x:legacyTrue_shard1_replica_n1] o.a.s.c.ShardLeaderElectionContext I am the new leader: http://127.0.0.1:36013/solr/legacyTrue_shard1_replica_n1/ shard1
   [junit4]   2> 1084010 INFO  (coreZkRegister-752-thread-1-processing-n:127.0.0.1:36013_solr x:legacyTrue_shard1_replica_n1 s:shard1 c:legacyTrue) [n:127.0.0.1:36013_solr c:legacyTrue s:shard1 r:core_node2 x:legacyTrue_shard1_replica_n1] o.a.s.c.ZkController I am the leader, no recovery necessary
   [junit4]   2> 1084112 INFO  (zkCallback-427-thread-1-processing-n:127.0.0.1:36013_solr) [n:127.0.0.1:36013_solr    ] o.a.s.c.c.ZkStateReader A cluster state change: [WatchedEvent state:SyncConnected type:NodeDataChanged path:/collections/legacyTrue/state.json] for collection [legacyTrue] has occurred - updating... (live nodes size: [1])
   [junit4]   2> 1084960 INFO  (qtp1210985333-2327) [n:127.0.0.1:36013_solr    ] o.a.s.h.a.CollectionsHandler Invoked Collection Action :clusterprop with params val=false&name=legacyCloud&action=CLUSTERPROP&wt=javabin&version=2 and sendToOCPQueue=true
   [junit4]   2> 1085169 INFO  (qtp1210985333-2327) [n:127.0.0.1:36013_solr    ] o.a.s.s.HttpSolrCall [admin] webapp=null path=/admin/collections params={val=false&name=legacyCloud&action=CLUSTERPROP&wt=javabin&version=2} status=0 QTime=209
   [junit4]   2> 1085171 INFO  (qtp1210985333-2329) [n:127.0.0.1:36013_solr    ] o.a.s.h.a.CollectionsHandler Invoked Collection Action :create with params replicationFactor=1&collection.configName=conf&maxShardsPerNode=1&name=legacyFalse&nrtReplicas=1&action=CREATE&numShards=1&wt=javabin&version=2 and sendToOCPQueue=true
   [junit4]   2> 1085429 INFO  (OverseerThreadFactory-759-thread-1-processing-n:127.0.0.1:36013_solr) [n:127.0.0.1:36013_solr    ] o.a.s.c.a.c.CreateCollectionCmd Create collection legacyFalse
   [junit4]   2> 1087234 INFO  (qtp1210985333-2332) [n:127.0.0.1:36013_solr    ] o.a.s.h.a.CoreAdminOperation core create command qt=/admin/cores&collection.configName=conf&newCollection=true&name=legacyFalse_shard1_replica_n1&action=CREATE&numShards=1&collection=legacyFalse&shard=shard1&wt=javabin&version=2&replicaType=NRT
   [junit4]   2> 1087243 ERROR (qtp1210985333-2332) [n:127.0.0.1:36013_solr    ] o.a.s.h.RequestHandlerBase org.apache.solr.common.SolrException: Error CREATEing SolrCore 'legacyFalse_shard1_replica_n1': non legacy mode coreNodeName missing {collection.configName=conf, numShards=1, shard=shard1, collection=legacyFalse, replicaType=NRT}
   [junit4]   2> 	at org.apache.solr.core.CoreContainer.create(CoreContainer.java:989)
   [junit4]   2> 	at org.apache.solr.handler.admin.CoreAdminOperation.lambda$static$0(CoreAdminOperation.java:91)
   [junit4]   2> 	at org.apache.solr.handler.admin.CoreAdminOperation.execute(CoreAdminOperation.java:384)
   [junit4]   2> 	at org.apache.solr.handler.admin.CoreAdminHandler$CallInfo.call(CoreAdminHandler.java:389)
   [junit4]   2> 	at org.apache.solr.handler.admin.CoreAdminHandler.handleRequestBody(CoreAdminHandler.java:174)
   [junit4]   2> 	at org.apache.solr.handler.RequestHandlerBase.handleRequest(RequestHandlerBase.java:195)
   [junit4]   2> 	at org.apache.solr.servlet.HttpSolrCall.handleAdmin(HttpSolrCall.java:736)
   [junit4]   2> 	at org.apache.solr.servlet.HttpSolrCall.handleAdminRequest(HttpSolrCall.java:717)
   [junit4]   2> 	at org.apache.solr.servlet.HttpSolrCall.call(HttpSolrCall.java:498)
   [junit4]   2> 	at org.apache.solr.servlet.SolrDispatchFilter.doFilter(SolrDispatchFilter.java:380)
   [junit4]   2> 	at org.apache.solr.servlet.SolrDispatchFilter.doFilter(SolrDispatchFilter.java:326)
   [junit4]   2> 	at org.eclipse.jetty.servlet.ServletHandler$CachedChain.doFilter(ServletHandler.java:1637)
   [junit4]   2> 	at org.apache.solr.client.solrj.embedded.JettySolrRunner$DebugFilter.doFilter(JettySolrRunner.java:139)
   [junit4]   2> 	at org.eclipse.jetty.servlet.ServletHandler$CachedChain.doFilter(ServletHandler.java:1637)
   [junit4]   2> 	at org.eclipse.jetty.servlet.ServletHandler.doHandle(ServletHandler.java:533)
   [junit4]   2> 	at org.eclipse.jetty.server.handler.ScopedHandler.nextHandle(ScopedHandler.java:188)
   [junit4]   2> 	at org.eclipse.jetty.server.session.SessionHandler.doHandle(SessionHandler.java:1595)
   [junit4]   2> 	at org.eclipse.jetty.server.handler.ScopedHandler.nextHandle(ScopedHandler.java:188)
   [junit4]   2> 	at org.eclipse.jetty.server.handler.ContextHandler.doHandle(ContextHandler.java:1253)
   [junit4]   2> 	at org.eclipse.jetty.server.handler.ScopedHandler.nextScope(ScopedHandler.java:168)
   [junit4]   2> 	at org.eclipse.jetty.servlet.ServletHandler.doScope(ServletHandler.java:473)
   [junit4]   2> 	at org.eclipse.jetty.server.session.SessionHandler.doScope(SessionHandler.java:1564)
   [junit4]   2> 	at org.eclipse.jetty.server.handler.ScopedHandler.nextScope(ScopedHandler.java:166)
   [junit4]   2> 	at org.eclipse.jetty.server.handler.ContextHandler.doScope(ContextHandler.java:1155)
   [junit4]   2> 	at org.eclipse.jetty.server.handler.ScopedHandler.handle(ScopedHandler.java:141)
   [junit4]   2> 	at org.eclipse.jetty.server.handler.gzip.GzipHandler.handle(GzipHandler.java:455)
   [junit4]   2> 	at org.eclipse.jetty.server.handler.HandlerWrapper.handle(HandlerWrapper.java:132)
   [junit4]   2> 	at org.eclipse.jetty.server.Server.handle(Server.java:530)
   [junit4]   2> 	at org.eclipse.jetty.server.HttpChannel.handle(HttpChannel.java:347)
   [junit4]   2> 	at org.eclipse.jetty.server.HttpConnection.onFillable(HttpConnection.java:256)
   [junit4]   2> 	at org.eclipse.jetty.io.AbstractConnection$ReadCallback.succeeded(AbstractConnection.java:279)
   [junit4]   2> 	at org.eclipse.jetty.io.FillInterest.fillable(FillInterest.java:102)
   [junit4]   2> 	at org.eclipse.jetty.io.ChannelEndPoint$2.run(ChannelEndPoint.java:124)
   [junit4]   2> 	at org.eclipse.jetty.util.thread.strategy.EatWhatYouKill.doProduce(EatWhatYouKill.java:247)
   [junit4]   2> 	at org.eclipse.jetty.util.thread.strategy.EatWhatYouKill.produce(EatWhatYouKill.java:140)
   [junit4]   2> 	at org.eclipse.jetty.util.thread.strategy.EatWhatYouKill.run(EatWhatYouKill.java:131)
   [junit4]   2> 	at org.eclipse.jetty.util.thread.ReservedThreadExecutor$ReservedThread.run(ReservedThreadExecutor.java:382)
   [junit4]   2> 	at org.eclipse.jetty.util.thread.QueuedThreadPool.runJob(QueuedThreadPool.java:708)
   [junit4]   2> 	at org.eclipse.jetty.util.thread.QueuedThreadPool$2.run(QueuedThreadPool.java:626)
   [junit4]   2> 	at java.lang.Thread.run(Thread.java:748)
   [junit4]   2> Caused by: org.apache.solr.common.SolrException: non legacy mode coreNodeName missing {collection.configName=conf, numShards=1, shard=shard1, collection=legacyFalse, replicaType=NRT}
   [junit4]   2> 	at org.apache.solr.core.CoreContainer.create(CoreContainer.java:936)
   [junit4]   2> 	... 39 more
   [junit4]   2> 
   [junit4]   2> 1087243 INFO  (qtp1210985333-2332) [n:127.0.0.1:36013_solr    ] o.a.s.s.HttpSolrCall [admin] webapp=null path=/admin/cores params={qt=/admin/cores&collection.configName=conf&newCollection=true&name=legacyFalse_shard1_replica_n1&action=CREATE&numShards=1&collection=legacyFalse&shard=shard1&wt=javabin&version=2&replicaType=NRT} status=400 QTime=9
   [junit4]   2> 1087244 ERROR (OverseerThreadFactory-759-thread-1-processing-n:127.0.0.1:36013_solr) [n:127.0.0.1:36013_solr    ] o.a.s.c.a.c.OverseerCollectionMessageHandler Error from shard: http://127.0.0.1:36013/solr
   [junit4]   2> org.apache.solr.client.solrj.impl.HttpSolrClient$RemoteSolrException: Error from server at http://127.0.0.1:36013/solr: Error CREATEing SolrCore 'legacyFalse_shard1_replica_n1': non legacy mode coreNodeName missing {collection.configName=conf, numShards=1, shard=shard1, collection=legacyFalse, replicaType=NRT}
   [junit4]   2> 	at org.apache.solr.client.solrj.impl.HttpSolrClient.executeMethod(HttpSolrClient.java:643)
   [junit4]   2> 	at org.apache.solr.client.solrj.impl.HttpSolrClient.request(HttpSolrClient.java:255)
   [junit4]   2> 	at org.apache.solr.client.solrj.impl.HttpSolrClient.request(HttpSolrClient.java:244)
   [junit4]   2> 	at org.apache.solr.client.solrj.SolrClient.request(SolrClient.java:1219)
   [junit4]   2> 	at org.apache.solr.handler.component.HttpShardHandler.lambda$submit$0(HttpShardHandler.java:172)
   [junit4]   2> 	at java.util.concurrent.FutureTask.run(FutureTask.java:266)
   [junit4]   2> 	at java.util.concurrent.Executors$RunnableAdapter.call(Executors.java:511)
   [junit4]   2> 	at java.util.concurrent.FutureTask.run(FutureTask.java:266)
   [junit4]   2> 	at com.codahale.metrics.InstrumentedExecutorService$InstrumentedRunnable.run(InstrumentedExecutorService.java:176)
   [junit4]   2> 	at org.apache.solr.common.util.ExecutorUtil$MDCAwareThreadPoolExecutor.lambda$execute$0(ExecutorUtil.java:188)
   [junit4]   2> 	at java.util.concurrent.ThreadPoolExecutor.runWorker(ThreadPoolExecutor.java:1149)
   [junit4]   2> 	at java.util.concurrent.ThreadPoolExecutor$Worker.run(ThreadPoolExecutor.java:624)
   [junit4]   2> 	at java.lang.Thread.run(Thread.java:748)
   [junit4]   2> 1087245 ERROR (OverseerThreadFactory-759-thread-1-processing-n:127.0.0.1:36013_solr) [n:127.0.0.1:36013_solr    ] o.a.s.c.a.c.OverseerCollectionMessageHandler Cleaning up collection [legacyFalse].
   [junit4]   2> 1087246 INFO  (OverseerThreadFactory-759-thread-1-processing-n:127.0.0.1:36013_solr) [n:127.0.0.1:36013_solr    ] o.a.s.c.a.c.OverseerCollectionMessageHandler Executing Collection Cmd : action=UNLOAD&deleteInstanceDir=true&deleteDataDir=true
   [junit4]   2> 1088062 INFO  (OverseerThreadFactory-759-thread-1-processing-n:127.0.0.1:36013_solr) [n:127.0.0.1:36013_solr    ] o.a.s.c.a.c.CreateCollectionCmd Cleaned up artifacts for failed create collection for [legacyFalse]
   [junit4]   2> 1088066 INFO  (qtp1210985333-2329) [n:127.0.0.1:36013_solr    ] o.a.s.h.a.CollectionsHandler Wait for new collection to be active for at most 30 seconds. Check all shard replicas
   [junit4]   2> 1089442 INFO  (OverseerCollectionConfigSetProcessor-73265434021920776-127.0.0.1:36013_solr-n_0000000001) [n:127.0.0.1:36013_solr    ] o.a.s.c.OverseerTaskQueue Response ZK path: /overseer/collection-queue-work/qnr-0000000002 doesn't exist.  Requestor may have disconnected from ZooKeeper
   [junit4]   2> 1120226 ERROR (qtp1210985333-2329) [n:127.0.0.1:36013_solr    ] o.a.s.h.a.CollectionsHandler Timed out waiting for new collection's replicas to become ACTIVE with timeout=30
   [junit4]   2> 1120226 INFO  (qtp1210985333-2329) [n:127.0.0.1:36013_solr    ] o.a.s.s.HttpSolrCall [admin] webapp=null path=/admin/collections params={replicationFactor=1&collection.configName=conf&maxShardsPerNode=1&name=legacyFalse&nrtReplicas=1&action=CREATE&numShards=1&wt=javabin&version=2} status=0 QTime=35055
   [junit4]   2> 1120243 INFO  (TEST-LegacyCloudClusterPropTest.testCreateCollectionSwitchLegacyCloud-seed#[BEE0BAB69C20E091]) [    ] o.a.s.SolrTestCaseJ4 ###Ending testCreateCollectionSwitchLegacyCloud
   [junit4]   2> NOTE: reproduce with: ant test  -Dtestcase=LegacyCloudClusterPropTest -Dtests.method=testCreate

[...truncated too long message...]

e/workspace/Lucene-Solr-Tests-7.x/solr/core/test-lib/apacheds-interceptor-kerberos-2.0.0-M15.jar:/x1/jenkins/jenkins-slave/workspace/Lucene-Solr-Tests-7.x/solr/core/test-lib/apacheds-interceptors-admin-2.0.0-M15.jar:/x1/jenkins/jenkins-slave/workspace/Lucene-Solr-Tests-7.x/solr/core/test-lib/apacheds-interceptors-authn-2.0.0-M15.jar:/x1/jenkins/jenkins-slave/workspace/Lucene-Solr-Tests-7.x/solr/core/test-lib/apacheds-interceptors-authz-2.0.0-M15.jar:/x1/jenkins/jenkins-slave/workspace/Lucene-Solr-Tests-7.x/solr/core/test-lib/apacheds-interceptors-changelog-2.0.0-M15.jar:/x1/jenkins/jenkins-slave/workspace/Lucene-Solr-Tests-7.x/solr/core/test-lib/apacheds-interceptors-collective-2.0.0-M15.jar:/x1/jenkins/jenkins-slave/workspace/Lucene-Solr-Tests-7.x/solr/core/test-lib/apacheds-interceptors-event-2.0.0-M15.jar:/x1/jenkins/jenkins-slave/workspace/Lucene-Solr-Tests-7.x/solr/core/test-lib/apacheds-interceptors-exception-2.0.0-M15.jar:/x1/jenkins/jenkins-slave/workspace/Lucene-Solr-Tests-7.x/solr/core/test-lib/apacheds-interceptors-journal-2.0.0-M15.jar:/x1/jenkins/jenkins-slave/workspace/Lucene-Solr-Tests-7.x/solr/core/test-lib/apacheds-interceptors-normalization-2.0.0-M15.jar:/x1/jenkins/jenkins-slave/workspace/Lucene-Solr-Tests-7.x/solr/core/test-lib/apacheds-interceptors-operational-2.0.0-M15.jar:/x1/jenkins/jenkins-slave/workspace/Lucene-Solr-Tests-7.x/solr/core/test-lib/apacheds-interceptors-referral-2.0.0-M15.jar:/x1/jenkins/jenkins-slave/workspace/Lucene-Solr-Tests-7.x/solr/core/test-lib/apacheds-interceptors-schema-2.0.0-M15.jar:/x1/jenkins/jenkins-slave/workspace/Lucene-Solr-Tests-7.x/solr/core/test-lib/apacheds-interceptors-subtree-2.0.0-M15.jar:/x1/jenkins/jenkins-slave/workspace/Lucene-Solr-Tests-7.x/solr/core/test-lib/apacheds-interceptors-trigger-2.0.0-M15.jar:/x1/jenkins/jenkins-slave/workspace/Lucene-Solr-Tests-7.x/solr/core/test-lib/apacheds-jdbm-partition-2.0.0-M15.jar:/x1/jenkins/jenkins-slave/workspace/Lucene-Solr-Tests-7.x/solr/core/test-lib/apacheds-jdbm1-2.0.0-M2.jar:/x1/jenkins/jenkins-slave/workspace/Lucene-Solr-Tests-7.x/solr/core/test-lib/apacheds-kerberos-codec-2.0.0-M15.jar:/x1/jenkins/jenkins-slave/workspace/Lucene-Solr-Tests-7.x/solr/core/test-lib/apacheds-ldif-partition-2.0.0-M15.jar:/x1/jenkins/jenkins-slave/workspace/Lucene-Solr-Tests-7.x/solr/core/test-lib/apacheds-mavibot-partition-2.0.0-M15.jar:/x1/jenkins/jenkins-slave/workspace/Lucene-Solr-Tests-7.x/solr/core/test-lib/apacheds-protocol-kerberos-2.0.0-M15.jar:/x1/jenkins/jenkins-slave/workspace/Lucene-Solr-Tests-7.x/solr/core/test-lib/apacheds-protocol-ldap-2.0.0-M15.jar:/x1/jenkins/jenkins-slave/workspace/Lucene-Solr-Tests-7.x/solr/core/test-lib/apacheds-protocol-shared-2.0.0-M15.jar:/x1/jenkins/jenkins-slave/workspace/Lucene-Solr-Tests-7.x/solr/core/test-lib/apacheds-xdbm-partition-2.0.0-M15.jar:/x1/jenkins/jenkins-slave/workspace/Lucene-Solr-Tests-7.x/solr/core/test-lib/api-all-1.0.0-M20.jar:/x1/jenkins/jenkins-slave/workspace/Lucene-Solr-Tests-7.x/solr/core/test-lib/bcprov-jdk15on-1.54.jar:/x1/jenkins/jenkins-slave/workspace/Lucene-Solr-Tests-7.x/solr/core/test-lib/byte-buddy-1.6.2.jar:/x1/jenkins/jenkins-slave/workspace/Lucene-Solr-Tests-7.x/solr/core/test-lib/commons-collections-3.2.2.jar:/x1/jenkins/jenkins-slave/workspace/Lucene-Solr-Tests-7.x/solr/core/test-lib/commons-math3-3.6.1.jar:/x1/jenkins/jenkins-slave/workspace/Lucene-Solr-Tests-7.x/solr/core/test-lib/ehcache-core-2.4.4.jar:/x1/jenkins/jenkins-slave/workspace/Lucene-Solr-Tests-7.x/solr/core/test-lib/hadoop-common-2.7.4-tests.jar:/x1/jenkins/jenkins-slave/workspace/Lucene-Solr-Tests-7.x/solr/core/test-lib/hadoop-hdfs-2.7.4-tests.jar:/x1/jenkins/jenkins-slave/workspace/Lucene-Solr-Tests-7.x/solr/core/test-lib/hadoop-minikdc-2.7.4.jar:/x1/jenkins/jenkins-slave/workspace/Lucene-Solr-Tests-7.x/solr/core/test-lib/htrace-core-3.2.0-incubating.jar:/x1/jenkins/jenkins-slave/workspace/Lucene-Solr-Tests-7.x/solr/core/test-lib/jersey-core-1.9.jar:/x1/jenkins/jenkins-slave/workspace/Lucene-Solr-Tests-7.x/solr/core/test-lib/jersey-server-1.9.jar:/x1/jenkins/jenkins-slave/workspace/Lucene-Solr-Tests-7.x/solr/core/test-lib/jetty-6.1.26.jar:/x1/jenkins/jenkins-slave/workspace/Lucene-Solr-Tests-7.x/solr/core/test-lib/jetty-sslengine-6.1.26.jar:/x1/jenkins/jenkins-slave/workspace/Lucene-Solr-Tests-7.x/solr/core/test-lib/jetty-util-6.1.26.jar:/x1/jenkins/jenkins-slave/workspace/Lucene-Solr-Tests-7.x/solr/core/test-lib/mina-core-2.0.0-M5.jar:/x1/jenkins/jenkins-slave/workspace/Lucene-Solr-Tests-7.x/solr/core/test-lib/mockito-core-2.6.2.jar:/x1/jenkins/jenkins-slave/workspace/Lucene-Solr-Tests-7.x/solr/core/test-lib/netty-all-4.0.36.Final.jar:/x1/jenkins/jenkins-slave/workspace/Lucene-Solr-Tests-7.x/solr/core/test-lib/objenesis-2.5.jar:/x1/jenkins/jenkins-slave/workspace/Lucene-Solr-Tests-7.x/lucene/build/analysis/icu/lucene-analyzers-icu-7.3.0-SNAPSHOT.jar:/x1/jenkins/jenkins-slave/workspace/Lucene-Solr-Tests-7.x/solr/build/contrib/solr-analysis-extras/classes/java:/x1/jenkins/jenkins-slave/workspace/Lucene-Solr-Tests-7.x/lucene/build/queryparser/classes/test:/x1/jenkins/jenkins-slave/workspace/Lucene-Solr-Tests-7.x/lucene/build/backward-codecs/classes/test:/x1/jenkins/jenkins-slave/workspace/Lucene-Solr-Tests-7.x/solr/contrib/analysis-extras/lib/icu4j-60.2.jar:/home/jenkins/tools/ant/apache-ant-1.8.4/lib/ant-launcher.jar:/x1/jenkins/.ant/lib/ivy-2.4.0.jar:/home/jenkins/tools/ant/apache-ant-1.8.4/lib/ant-junit.jar:/home/jenkins/tools/ant/apache-ant-1.8.4/lib/ant-apache-log4j.jar:/home/jenkins/tools/ant/apache-ant-1.8.4/lib/ant-junit4.jar:/home/jenkins/tools/ant/apache-ant-1.8.4/lib/ant-jai.jar:/home/jenkins/tools/ant/apache-ant-1.8.4/lib/ant-javamail.jar:/home/jenkins/tools/ant/apache-ant-1.8.4/lib/ant-apache-bsf.jar:/home/jenkins/tools/ant/apache-ant-1.8.4/lib/ant-commons-net.jar:/home/jenkins/tools/ant/apache-ant-1.8.4/lib/ant-antlr.jar:/home/jenkins/tools/ant/apache-ant-1.8.4/lib/ant-jsch.jar:/home/jenkins/tools/ant/apache-ant-1.8.4/lib/ant-apache-oro.jar:/home/jenkins/tools/ant/apache-ant-1.8.4/lib/ant-commons-logging.jar:/home/jenkins/tools/ant/apache-ant-1.8.4/lib/ant.jar:/home/jenkins/tools/ant/apache-ant-1.8.4/lib/ant-netrexx.jar:/home/jenkins/tools/ant/apache-ant-1.8.4/lib/ant-testutil.jar:/home/jenkins/tools/ant/apache-ant-1.8.4/lib/ant-jdepend.jar:/home/jenkins/tools/ant/apache-ant-1.8.4/lib/ant-apache-bcel.jar:/home/jenkins/tools/ant/apache-ant-1.8.4/lib/ant-apache-xalan2.jar:/home/jenkins/tools/ant/apache-ant-1.8.4/lib/ant-apache-resolver.jar:/home/jenkins/tools/ant/apache-ant-1.8.4/lib/ant-jmf.jar:/home/jenkins/tools/ant/apache-ant-1.8.4/lib/ant-apache-regexp.jar:/home/jenkins/tools/ant/apache-ant-1.8.4/lib/ant-swing.jar:/usr/local/asfpackages/java/jdk1.8.0_144/lib/tools.jar:/x1/jenkins/.ivy2/cache/com.carrotsearch.randomizedtesting/junit4-ant/jars/junit4-ant-2.5.3.jar com.carrotsearch.ant.tasks.junit4.slave.SlaveMainSafe -eventsfile /x1/jenkins/jenkins-slave/workspace/Lucene-Solr-Tests-7.x/solr/build/solr-core/test/temp/junit4-J2-20180209_115248_5718927179366285915000.events @/x1/jenkins/jenkins-slave/workspace/Lucene-Solr-Tests-7.x/solr/build/solr-core/test/temp/junit4-J2-20180209_115248_5713723369760884563014.suites -stdin
   [junit4] ERROR: JVM J2 ended with an exception: Forked process returned with error code: 1. Very likely a JVM crash.  See process stdout at: /x1/jenkins/jenkins-slave/workspace/Lucene-Solr-Tests-7.x/solr/build/solr-core/test/temp/junit4-J2-20180209_115248_5718698585797364681421.sysout See process stderr at: /x1/jenkins/jenkins-slave/workspace/Lucene-Solr-Tests-7.x/solr/build/solr-core/test/temp/junit4-J2-20180209_115248_5719149771284901948172.syserr
   [junit4] 	at com.carrotsearch.ant.tasks.junit4.JUnit4.executeSlave(JUnit4.java:1519)
   [junit4] 	at com.carrotsearch.ant.tasks.junit4.JUnit4.access$000(JUnit4.java:126)
   [junit4] 	at com.carrotsearch.ant.tasks.junit4.JUnit4$2.call(JUnit4.java:982)
   [junit4] 	at com.carrotsearch.ant.tasks.junit4.JUnit4$2.call(JUnit4.java:979)
   [junit4] 	at java.util.concurrent.FutureTask.run(FutureTask.java:266)
   [junit4] 	at java.util.concurrent.ThreadPoolExecutor.runWorker(ThreadPoolExecutor.java:1149)
   [junit4] 	at java.util.concurrent.ThreadPoolExecutor$Worker.run(ThreadPoolExecutor.java:624)
   [junit4] 	at java.lang.Thread.run(Thread.java:748)

BUILD FAILED
/x1/jenkins/jenkins-slave/workspace/Lucene-Solr-Tests-7.x/build.xml:836: The following error occurred while executing this line:
/x1/jenkins/jenkins-slave/workspace/Lucene-Solr-Tests-7.x/build.xml:780: The following error occurred while executing this line:
/x1/jenkins/jenkins-slave/workspace/Lucene-Solr-Tests-7.x/build.xml:59: The following error occurred while executing this line:
/x1/jenkins/jenkins-slave/workspace/Lucene-Solr-Tests-7.x/solr/build.xml:262: The following error occurred while executing this line:
/x1/jenkins/jenkins-slave/workspace/Lucene-Solr-Tests-7.x/solr/common-build.xml:556: The following error occurred while executing this line:
/x1/jenkins/jenkins-slave/workspace/Lucene-Solr-Tests-7.x/lucene/common-build.xml:1561: The following error occurred while executing this line:
/x1/jenkins/jenkins-slave/workspace/Lucene-Solr-Tests-7.x/lucene/common-build.xml:1086: At least one slave process threw an exception, first: Forked process returned with error code: 1. Very likely a JVM crash.  See process stdout at: /x1/jenkins/jenkins-slave/workspace/Lucene-Solr-Tests-7.x/solr/build/solr-core/test/temp/junit4-J2-20180209_115248_5718698585797364681421.sysout See process stderr at: /x1/jenkins/jenkins-slave/workspace/Lucene-Solr-Tests-7.x/solr/build/solr-core/test/temp/junit4-J2-20180209_115248_5719149771284901948172.syserr

Total time: 432 minutes 47 seconds
Build step 'Invoke Ant' marked build as failure
Archiving artifacts
[Fast Archiver] No artifacts from Lucene-Solr-Tests-7.x #359 to compare, so performing full copy of artifacts
Recording test results
Email was triggered for: Failure - Any
Sending email for trigger: Failure - Any

Mime
View raw message