lucene-dev mailing list archives

Site index · List index
Message view « Date » · « Thread »
Top « Date » · « Thread »
From Apache Jenkins Server <jenk...@builds.apache.org>
Subject [JENKINS] Lucene-Solr-Tests-master - Build # 2363 - Still Unstable
Date Fri, 23 Feb 2018 14:17:54 GMT
Build: https://builds.apache.org/job/Lucene-Solr-Tests-master/2363/

3 tests failed.
FAILED:  junit.framework.TestSuite.org.apache.solr.cloud.ShardRoutingTest

Error Message:
1 thread leaked from SUITE scope at org.apache.solr.cloud.ShardRoutingTest:     1) Thread[id=9777, name=qtp795916695-9777, state=TIMED_WAITING, group=TGRP-ShardRoutingTest]         at sun.misc.Unsafe.park(Native Method)         at java.util.concurrent.locks.LockSupport.parkNanos(LockSupport.java:215)         at java.util.concurrent.locks.AbstractQueuedSynchronizer$ConditionObject.await(AbstractQueuedSynchronizer.java:2163)         at org.eclipse.jetty.util.thread.ReservedThreadExecutor$ReservedThread.reservedWait(ReservedThreadExecutor.java:308)         at org.eclipse.jetty.util.thread.ReservedThreadExecutor$ReservedThread.run(ReservedThreadExecutor.java:373)         at org.eclipse.jetty.util.thread.QueuedThreadPool.runJob(QueuedThreadPool.java:708)         at org.eclipse.jetty.util.thread.QueuedThreadPool$2.run(QueuedThreadPool.java:626)         at java.lang.Thread.run(Thread.java:748)

Stack Trace:
com.carrotsearch.randomizedtesting.ThreadLeakError: 1 thread leaked from SUITE scope at org.apache.solr.cloud.ShardRoutingTest: 
   1) Thread[id=9777, name=qtp795916695-9777, state=TIMED_WAITING, group=TGRP-ShardRoutingTest]
        at sun.misc.Unsafe.park(Native Method)
        at java.util.concurrent.locks.LockSupport.parkNanos(LockSupport.java:215)
        at java.util.concurrent.locks.AbstractQueuedSynchronizer$ConditionObject.await(AbstractQueuedSynchronizer.java:2163)
        at org.eclipse.jetty.util.thread.ReservedThreadExecutor$ReservedThread.reservedWait(ReservedThreadExecutor.java:308)
        at org.eclipse.jetty.util.thread.ReservedThreadExecutor$ReservedThread.run(ReservedThreadExecutor.java:373)
        at org.eclipse.jetty.util.thread.QueuedThreadPool.runJob(QueuedThreadPool.java:708)
        at org.eclipse.jetty.util.thread.QueuedThreadPool$2.run(QueuedThreadPool.java:626)
        at java.lang.Thread.run(Thread.java:748)
	at __randomizedtesting.SeedInfo.seed([24B4BD63E0209CAF]:0)


FAILED:  junit.framework.TestSuite.org.apache.solr.cloud.ShardRoutingTest

Error Message:
There are still zombie threads that couldn't be terminated:    1) Thread[id=9777, name=qtp795916695-9777, state=TIMED_WAITING, group=TGRP-ShardRoutingTest]         at sun.misc.Unsafe.park(Native Method)         at java.util.concurrent.locks.LockSupport.parkNanos(LockSupport.java:215)         at java.util.concurrent.locks.AbstractQueuedSynchronizer$ConditionObject.await(AbstractQueuedSynchronizer.java:2163)         at org.eclipse.jetty.util.thread.ReservedThreadExecutor$ReservedThread.reservedWait(ReservedThreadExecutor.java:308)         at org.eclipse.jetty.util.thread.ReservedThreadExecutor$ReservedThread.run(ReservedThreadExecutor.java:373)         at org.eclipse.jetty.util.thread.QueuedThreadPool.runJob(QueuedThreadPool.java:708)         at org.eclipse.jetty.util.thread.QueuedThreadPool$2.run(QueuedThreadPool.java:626)         at java.lang.Thread.run(Thread.java:748)

Stack Trace:
com.carrotsearch.randomizedtesting.ThreadLeakError: There are still zombie threads that couldn't be terminated:
   1) Thread[id=9777, name=qtp795916695-9777, state=TIMED_WAITING, group=TGRP-ShardRoutingTest]
        at sun.misc.Unsafe.park(Native Method)
        at java.util.concurrent.locks.LockSupport.parkNanos(LockSupport.java:215)
        at java.util.concurrent.locks.AbstractQueuedSynchronizer$ConditionObject.await(AbstractQueuedSynchronizer.java:2163)
        at org.eclipse.jetty.util.thread.ReservedThreadExecutor$ReservedThread.reservedWait(ReservedThreadExecutor.java:308)
        at org.eclipse.jetty.util.thread.ReservedThreadExecutor$ReservedThread.run(ReservedThreadExecutor.java:373)
        at org.eclipse.jetty.util.thread.QueuedThreadPool.runJob(QueuedThreadPool.java:708)
        at org.eclipse.jetty.util.thread.QueuedThreadPool$2.run(QueuedThreadPool.java:626)
        at java.lang.Thread.run(Thread.java:748)
	at __randomizedtesting.SeedInfo.seed([24B4BD63E0209CAF]:0)


FAILED:  org.apache.solr.cloud.autoscaling.TriggerIntegrationTest.testEventQueue

Error Message:
action wasn't interrupted

Stack Trace:
java.lang.AssertionError: action wasn't interrupted
	at __randomizedtesting.SeedInfo.seed([24B4BD63E0209CAF:ED01FFCDE9475A5A]:0)
	at org.junit.Assert.fail(Assert.java:93)
	at org.junit.Assert.assertTrue(Assert.java:43)
	at org.apache.solr.cloud.autoscaling.TriggerIntegrationTest.testEventQueue(TriggerIntegrationTest.java:726)
	at sun.reflect.NativeMethodAccessorImpl.invoke0(Native Method)
	at sun.reflect.NativeMethodAccessorImpl.invoke(NativeMethodAccessorImpl.java:62)
	at sun.reflect.DelegatingMethodAccessorImpl.invoke(DelegatingMethodAccessorImpl.java:43)
	at java.lang.reflect.Method.invoke(Method.java:498)
	at com.carrotsearch.randomizedtesting.RandomizedRunner.invoke(RandomizedRunner.java:1737)
	at com.carrotsearch.randomizedtesting.RandomizedRunner$8.evaluate(RandomizedRunner.java:934)
	at com.carrotsearch.randomizedtesting.RandomizedRunner$9.evaluate(RandomizedRunner.java:970)
	at com.carrotsearch.randomizedtesting.RandomizedRunner$10.evaluate(RandomizedRunner.java:984)
	at com.carrotsearch.randomizedtesting.rules.SystemPropertiesRestoreRule$1.evaluate(SystemPropertiesRestoreRule.java:57)
	at org.apache.lucene.util.TestRuleSetupTeardownChained$1.evaluate(TestRuleSetupTeardownChained.java:49)
	at org.apache.lucene.util.AbstractBeforeAfterRule$1.evaluate(AbstractBeforeAfterRule.java:45)
	at org.apache.lucene.util.TestRuleThreadAndTestName$1.evaluate(TestRuleThreadAndTestName.java:48)
	at org.apache.lucene.util.TestRuleIgnoreAfterMaxFailures$1.evaluate(TestRuleIgnoreAfterMaxFailures.java:64)
	at org.apache.lucene.util.TestRuleMarkFailure$1.evaluate(TestRuleMarkFailure.java:47)
	at com.carrotsearch.randomizedtesting.rules.StatementAdapter.evaluate(StatementAdapter.java:36)
	at com.carrotsearch.randomizedtesting.ThreadLeakControl$StatementRunner.run(ThreadLeakControl.java:368)
	at com.carrotsearch.randomizedtesting.ThreadLeakControl.forkTimeoutingTask(ThreadLeakControl.java:817)
	at com.carrotsearch.randomizedtesting.ThreadLeakControl$3.evaluate(ThreadLeakControl.java:468)
	at com.carrotsearch.randomizedtesting.RandomizedRunner.runSingleTest(RandomizedRunner.java:943)
	at com.carrotsearch.randomizedtesting.RandomizedRunner$5.evaluate(RandomizedRunner.java:829)
	at com.carrotsearch.randomizedtesting.RandomizedRunner$6.evaluate(RandomizedRunner.java:879)
	at com.carrotsearch.randomizedtesting.RandomizedRunner$7.evaluate(RandomizedRunner.java:890)
	at com.carrotsearch.randomizedtesting.rules.StatementAdapter.evaluate(StatementAdapter.java:36)
	at com.carrotsearch.randomizedtesting.rules.SystemPropertiesRestoreRule$1.evaluate(SystemPropertiesRestoreRule.java:57)
	at org.apache.lucene.util.AbstractBeforeAfterRule$1.evaluate(AbstractBeforeAfterRule.java:45)
	at com.carrotsearch.randomizedtesting.rules.StatementAdapter.evaluate(StatementAdapter.java:36)
	at org.apache.lucene.util.TestRuleStoreClassName$1.evaluate(TestRuleStoreClassName.java:41)
	at com.carrotsearch.randomizedtesting.rules.NoShadowingOrOverridesOnMethodsRule$1.evaluate(NoShadowingOrOverridesOnMethodsRule.java:40)
	at com.carrotsearch.randomizedtesting.rules.NoShadowingOrOverridesOnMethodsRule$1.evaluate(NoShadowingOrOverridesOnMethodsRule.java:40)
	at com.carrotsearch.randomizedtesting.rules.StatementAdapter.evaluate(StatementAdapter.java:36)
	at com.carrotsearch.randomizedtesting.rules.StatementAdapter.evaluate(StatementAdapter.java:36)
	at com.carrotsearch.randomizedtesting.rules.StatementAdapter.evaluate(StatementAdapter.java:36)
	at org.apache.lucene.util.TestRuleAssertionsRequired$1.evaluate(TestRuleAssertionsRequired.java:53)
	at org.apache.lucene.util.TestRuleMarkFailure$1.evaluate(TestRuleMarkFailure.java:47)
	at org.apache.lucene.util.TestRuleIgnoreAfterMaxFailures$1.evaluate(TestRuleIgnoreAfterMaxFailures.java:64)
	at org.apache.lucene.util.TestRuleIgnoreTestSuites$1.evaluate(TestRuleIgnoreTestSuites.java:54)
	at com.carrotsearch.randomizedtesting.rules.StatementAdapter.evaluate(StatementAdapter.java:36)
	at com.carrotsearch.randomizedtesting.ThreadLeakControl$StatementRunner.run(ThreadLeakControl.java:368)
	at java.lang.Thread.run(Thread.java:748)




Build Log:
[...truncated 13112 lines...]
   [junit4] Suite: org.apache.solr.cloud.autoscaling.TriggerIntegrationTest
   [junit4]   2> 1054845 INFO  (SUITE-TriggerIntegrationTest-seed#[24B4BD63E0209CAF]-worker) [    ] o.a.s.SolrTestCaseJ4 SecureRandom sanity checks: test.solr.allowed.securerandom=null & java.security.egd=file:/dev/./urandom
   [junit4]   2> Creating dataDir: /x1/jenkins/jenkins-slave/workspace/Lucene-Solr-Tests-master/solr/build/solr-core/test/J0/temp/solr.cloud.autoscaling.TriggerIntegrationTest_24B4BD63E0209CAF-001/init-core-data-001
   [junit4]   2> 1054846 WARN  (SUITE-TriggerIntegrationTest-seed#[24B4BD63E0209CAF]-worker) [    ] o.a.s.SolrTestCaseJ4 startTrackingSearchers: numOpens=44 numCloses=44
   [junit4]   2> 1054846 INFO  (SUITE-TriggerIntegrationTest-seed#[24B4BD63E0209CAF]-worker) [    ] o.a.s.SolrTestCaseJ4 Using PointFields (NUMERIC_POINTS_SYSPROP=true) w/NUMERIC_DOCVALUES_SYSPROP=true
   [junit4]   2> 1054847 INFO  (SUITE-TriggerIntegrationTest-seed#[24B4BD63E0209CAF]-worker) [    ] o.a.s.SolrTestCaseJ4 Randomized ssl (false) and clientAuth (true) via: @org.apache.solr.util.RandomizeSSL(reason=, ssl=NaN, value=NaN, clientAuth=NaN)
   [junit4]   2> 1054847 INFO  (SUITE-TriggerIntegrationTest-seed#[24B4BD63E0209CAF]-worker) [    ] o.a.s.c.MiniSolrCloudCluster Starting cluster of 2 servers in /x1/jenkins/jenkins-slave/workspace/Lucene-Solr-Tests-master/solr/build/solr-core/test/J0/temp/solr.cloud.autoscaling.TriggerIntegrationTest_24B4BD63E0209CAF-001/tempDir-001
   [junit4]   2> 1054847 INFO  (SUITE-TriggerIntegrationTest-seed#[24B4BD63E0209CAF]-worker) [    ] o.a.s.c.ZkTestServer STARTING ZK TEST SERVER
   [junit4]   2> 1054848 INFO  (Thread-1686) [    ] o.a.s.c.ZkTestServer client port:0.0.0.0/0.0.0.0:0
   [junit4]   2> 1054848 INFO  (Thread-1686) [    ] o.a.s.c.ZkTestServer Starting server
   [junit4]   2> 1054885 ERROR (Thread-1686) [    ] o.a.z.s.ZooKeeperServer ZKShutdownHandler is not registered, so ZooKeeper server won't take any action on ERROR or SHUTDOWN server state changes
   [junit4]   2> 1054984 INFO  (SUITE-TriggerIntegrationTest-seed#[24B4BD63E0209CAF]-worker) [    ] o.a.s.c.ZkTestServer start zk server on port:59445
   [junit4]   2> 1055007 INFO  (zkConnectionManagerCallback-1506-thread-1) [    ] o.a.s.c.c.ConnectionManager zkClient has connected
   [junit4]   2> 1055020 INFO  (jetty-launcher-1503-thread-1) [    ] o.e.j.s.Server jetty-9.4.8.v20171121, build timestamp: 2017-11-22T02:57:37+05:30, git hash: 82b8fb23f757335bb3329d540ce37a2a2615f0a8
   [junit4]   2> 1055020 INFO  (jetty-launcher-1503-thread-2) [    ] o.e.j.s.Server jetty-9.4.8.v20171121, build timestamp: 2017-11-22T02:57:37+05:30, git hash: 82b8fb23f757335bb3329d540ce37a2a2615f0a8
   [junit4]   2> 1055049 INFO  (jetty-launcher-1503-thread-2) [    ] o.e.j.s.session DefaultSessionIdManager workerName=node0
   [junit4]   2> 1055049 INFO  (jetty-launcher-1503-thread-2) [    ] o.e.j.s.session No SessionScavenger set, using defaults
   [junit4]   2> 1055050 INFO  (jetty-launcher-1503-thread-2) [    ] o.e.j.s.session Scavenging every 660000ms
   [junit4]   2> 1055050 INFO  (jetty-launcher-1503-thread-1) [    ] o.e.j.s.session DefaultSessionIdManager workerName=node0
   [junit4]   2> 1055050 INFO  (jetty-launcher-1503-thread-1) [    ] o.e.j.s.session No SessionScavenger set, using defaults
   [junit4]   2> 1055050 INFO  (jetty-launcher-1503-thread-1) [    ] o.e.j.s.session Scavenging every 600000ms
   [junit4]   2> 1055050 INFO  (jetty-launcher-1503-thread-2) [    ] o.e.j.s.h.ContextHandler Started o.e.j.s.ServletContextHandler@1d8228ab{/solr,null,AVAILABLE}
   [junit4]   2> 1055051 INFO  (jetty-launcher-1503-thread-2) [    ] o.e.j.s.AbstractConnector Started ServerConnector@16189cb7{HTTP/1.1,[http/1.1]}{127.0.0.1:51188}
   [junit4]   2> 1055051 INFO  (jetty-launcher-1503-thread-2) [    ] o.e.j.s.Server Started @1057496ms
   [junit4]   2> 1055051 INFO  (jetty-launcher-1503-thread-2) [    ] o.a.s.c.s.e.JettySolrRunner Jetty properties: {hostContext=/solr, hostPort=51188}
   [junit4]   2> 1055051 ERROR (jetty-launcher-1503-thread-2) [    ] o.a.s.u.StartupLoggingUtils Missing Java Option solr.log.dir. Logging may be missing or incomplete.
   [junit4]   2> 1055051 INFO  (jetty-launcher-1503-thread-2) [    ] o.a.s.s.SolrDispatchFilter  ___      _       Welcome to Apache Solr™ version 8.0.0
   [junit4]   2> 1055051 INFO  (jetty-launcher-1503-thread-2) [    ] o.a.s.s.SolrDispatchFilter / __| ___| |_ _   Starting in cloud mode on port null
   [junit4]   2> 1055051 INFO  (jetty-launcher-1503-thread-2) [    ] o.a.s.s.SolrDispatchFilter \__ \/ _ \ | '_|  Install dir: null
   [junit4]   2> 1055051 INFO  (jetty-launcher-1503-thread-2) [    ] o.a.s.s.SolrDispatchFilter |___/\___/_|_|    Start time: 2018-02-23T13:53:23.630Z
   [junit4]   2> 1055052 INFO  (jetty-launcher-1503-thread-1) [    ] o.e.j.s.h.ContextHandler Started o.e.j.s.ServletContextHandler@6824a107{/solr,null,AVAILABLE}
   [junit4]   2> 1055053 INFO  (jetty-launcher-1503-thread-1) [    ] o.e.j.s.AbstractConnector Started ServerConnector@400ad194{HTTP/1.1,[http/1.1]}{127.0.0.1:38443}
   [junit4]   2> 1055053 INFO  (jetty-launcher-1503-thread-1) [    ] o.e.j.s.Server Started @1057498ms
   [junit4]   2> 1055053 INFO  (jetty-launcher-1503-thread-1) [    ] o.a.s.c.s.e.JettySolrRunner Jetty properties: {hostContext=/solr, hostPort=38443}
   [junit4]   2> 1055053 ERROR (jetty-launcher-1503-thread-1) [    ] o.a.s.u.StartupLoggingUtils Missing Java Option solr.log.dir. Logging may be missing or incomplete.
   [junit4]   2> 1055053 INFO  (jetty-launcher-1503-thread-1) [    ] o.a.s.s.SolrDispatchFilter  ___      _       Welcome to Apache Solr™ version 8.0.0
   [junit4]   2> 1055053 INFO  (jetty-launcher-1503-thread-1) [    ] o.a.s.s.SolrDispatchFilter / __| ___| |_ _   Starting in cloud mode on port null
   [junit4]   2> 1055053 INFO  (jetty-launcher-1503-thread-1) [    ] o.a.s.s.SolrDispatchFilter \__ \/ _ \ | '_|  Install dir: null
   [junit4]   2> 1055053 INFO  (jetty-launcher-1503-thread-1) [    ] o.a.s.s.SolrDispatchFilter |___/\___/_|_|    Start time: 2018-02-23T13:53:23.632Z
   [junit4]   2> 1055053 INFO  (zkConnectionManagerCallback-1508-thread-1) [    ] o.a.s.c.c.ConnectionManager zkClient has connected
   [junit4]   2> 1055054 INFO  (jetty-launcher-1503-thread-2) [    ] o.a.s.s.SolrDispatchFilter solr.xml found in ZooKeeper. Loading...
   [junit4]   2> 1055060 INFO  (zkConnectionManagerCallback-1510-thread-1) [    ] o.a.s.c.c.ConnectionManager zkClient has connected
   [junit4]   2> 1055061 INFO  (jetty-launcher-1503-thread-1) [    ] o.a.s.s.SolrDispatchFilter solr.xml found in ZooKeeper. Loading...
   [junit4]   2> 1055066 INFO  (jetty-launcher-1503-thread-2) [    ] o.a.s.c.ZkContainer Zookeeper client=127.0.0.1:59445/solr
   [junit4]   2> 1055068 INFO  (jetty-launcher-1503-thread-1) [    ] o.a.s.c.ZkContainer Zookeeper client=127.0.0.1:59445/solr
   [junit4]   2> 1055097 INFO  (zkConnectionManagerCallback-1514-thread-1) [    ] o.a.s.c.c.ConnectionManager zkClient has connected
   [junit4]   2> 1055104 INFO  (zkConnectionManagerCallback-1518-thread-1) [    ] o.a.s.c.c.ConnectionManager zkClient has connected
   [junit4]   2> 1055105 WARN  (NIOServerCxn.Factory:0.0.0.0/0.0.0.0:0) [    ] o.a.z.s.NIOServerCnxn Unable to read additional data from client sessionid 0x10492fcce770004, likely client has closed socket
   [junit4]   2> 1055107 INFO  (zkConnectionManagerCallback-1520-thread-1-processing-n:127.0.0.1:51188_solr) [n:127.0.0.1:51188_solr    ] o.a.s.c.c.ConnectionManager zkClient has connected
   [junit4]   2> 1055144 INFO  (zkConnectionManagerCallback-1522-thread-1-processing-n:127.0.0.1:38443_solr) [n:127.0.0.1:38443_solr    ] o.a.s.c.c.ConnectionManager zkClient has connected
   [junit4]   2> 1055163 INFO  (jetty-launcher-1503-thread-1) [n:127.0.0.1:38443_solr    ] o.a.s.c.Overseer Overseer (id=null) closing
   [junit4]   2> 1055164 INFO  (jetty-launcher-1503-thread-1) [n:127.0.0.1:38443_solr    ] o.a.s.c.OverseerElectionContext I am going to be the leader 127.0.0.1:38443_solr
   [junit4]   2> 1055165 INFO  (jetty-launcher-1503-thread-2) [n:127.0.0.1:51188_solr    ] o.a.s.c.Overseer Overseer (id=null) closing
   [junit4]   2> 1055165 INFO  (jetty-launcher-1503-thread-1) [n:127.0.0.1:38443_solr    ] o.a.s.c.Overseer Overseer (id=73345108438089734-127.0.0.1:38443_solr-n_0000000000) starting
   [junit4]   2> 1055166 INFO  (jetty-launcher-1503-thread-2) [n:127.0.0.1:51188_solr    ] o.a.s.c.ZkController Register node as live in ZooKeeper:/live_nodes/127.0.0.1:51188_solr
   [junit4]   2> 1055194 INFO  (zkCallback-1521-thread-1-processing-n:127.0.0.1:38443_solr) [n:127.0.0.1:38443_solr    ] o.a.s.c.c.ZkStateReader Updated live nodes from ZooKeeper... (0) -> (1)
   [junit4]   2> 1055194 INFO  (zkCallback-1519-thread-1-processing-n:127.0.0.1:51188_solr) [n:127.0.0.1:51188_solr    ] o.a.s.c.c.ZkStateReader Updated live nodes from ZooKeeper... (0) -> (1)
   [junit4]   2> 1055218 DEBUG (OverseerAutoScalingTriggerThread-73345108438089734-127.0.0.1:38443_solr-n_0000000000) [n:127.0.0.1:38443_solr    ] o.a.s.c.a.OverseerTriggerThread Adding .autoAddReplicas trigger
   [junit4]   2> 1055218 INFO  (jetty-launcher-1503-thread-1) [n:127.0.0.1:38443_solr    ] o.a.s.c.ZkController Register node as live in ZooKeeper:/live_nodes/127.0.0.1:38443_solr
   [junit4]   2> 1055219 INFO  (zkCallback-1519-thread-1-processing-n:127.0.0.1:51188_solr) [n:127.0.0.1:51188_solr    ] o.a.s.c.c.ZkStateReader Updated live nodes from ZooKeeper... (1) -> (2)
   [junit4]   2> 1055219 INFO  (zkCallback-1521-thread-1-processing-n:127.0.0.1:38443_solr) [n:127.0.0.1:38443_solr    ] o.a.s.c.c.ZkStateReader Updated live nodes from ZooKeeper... (1) -> (2)
   [junit4]   2> 1055233 DEBUG (OverseerAutoScalingTriggerThread-73345108438089734-127.0.0.1:38443_solr-n_0000000000) [n:127.0.0.1:38443_solr    ] o.a.s.c.a.OverseerTriggerThread Refreshing /autoscaling.json with znode version 1
   [junit4]   2> 1055233 DEBUG (OverseerAutoScalingTriggerThread-73345108438089734-127.0.0.1:38443_solr-n_0000000000) [n:127.0.0.1:38443_solr    ] o.a.s.c.a.NodeLostTrigger Initial livenodes: [127.0.0.1:51188_solr, 127.0.0.1:38443_solr]
   [junit4]   2> 1055233 DEBUG (OverseerAutoScalingTriggerThread-73345108438089734-127.0.0.1:38443_solr-n_0000000000) [n:127.0.0.1:38443_solr    ] o.a.s.c.a.OverseerTriggerThread Current znodeVersion 1, lastZnodeVersion -1
   [junit4]   2> 1055233 DEBUG (OverseerAutoScalingTriggerThread-73345108438089734-127.0.0.1:38443_solr-n_0000000000) [n:127.0.0.1:38443_solr    ] o.a.s.c.a.OverseerTriggerThread Processed trigger updates upto znodeVersion 1
   [junit4]   2> 1055241 DEBUG (OverseerAutoScalingTriggerThread-73345108438089734-127.0.0.1:38443_solr-n_0000000000) [n:127.0.0.1:38443_solr    ] o.a.s.c.a.OverseerTriggerThread -- clean old nodeAdded markers
   [junit4]   2> 1055241 DEBUG (OverseerAutoScalingTriggerThread-73345108438089734-127.0.0.1:38443_solr-n_0000000000) [n:127.0.0.1:38443_solr    ] o.a.s.c.a.OverseerTriggerThread Current znodeVersion 1, lastZnodeVersion 1
   [junit4]   2> 1055242 DEBUG (ScheduledTrigger-2576-thread-1) [n:127.0.0.1:38443_solr    ] o.a.s.c.a.NodeLostTrigger Running NodeLostTrigger: .auto_add_replicas with currently live nodes: 2
   [junit4]   2> 1055277 INFO  (jetty-launcher-1503-thread-2) [n:127.0.0.1:51188_solr    ] o.a.s.m.r.SolrJmxReporter JMX monitoring for 'solr_51188.solr.node' (registry 'solr.node') enabled at server: com.sun.jmx.mbeanserver.JmxMBeanServer@7f4734c5
   [junit4]   2> 1055285 INFO  (jetty-launcher-1503-thread-2) [n:127.0.0.1:51188_solr    ] o.a.s.m.r.SolrJmxReporter JMX monitoring for 'solr_51188.solr.jvm' (registry 'solr.jvm') enabled at server: com.sun.jmx.mbeanserver.JmxMBeanServer@7f4734c5
   [junit4]   2> 1055285 INFO  (jetty-launcher-1503-thread-2) [n:127.0.0.1:51188_solr    ] o.a.s.m.r.SolrJmxReporter JMX monitoring for 'solr_51188.solr.jetty' (registry 'solr.jetty') enabled at server: com.sun.jmx.mbeanserver.JmxMBeanServer@7f4734c5
   [junit4]   2> 1055286 INFO  (jetty-launcher-1503-thread-2) [n:127.0.0.1:51188_solr    ] o.a.s.c.CorePropertiesLocator Found 0 core definitions underneath /x1/jenkins/jenkins-slave/workspace/Lucene-Solr-Tests-master/solr/build/solr-core/test/J0/temp/solr.cloud.autoscaling.TriggerIntegrationTest_24B4BD63E0209CAF-001/tempDir-001/node2/.
   [junit4]   2> 1055436 INFO  (jetty-launcher-1503-thread-1) [n:127.0.0.1:38443_solr    ] o.a.s.m.r.SolrJmxReporter JMX monitoring for 'solr_38443.solr.node' (registry 'solr.node') enabled at server: com.sun.jmx.mbeanserver.JmxMBeanServer@7f4734c5
   [junit4]   2> 1055446 INFO  (jetty-launcher-1503-thread-1) [n:127.0.0.1:38443_solr    ] o.a.s.m.r.SolrJmxReporter JMX monitoring for 'solr_38443.solr.jvm' (registry 'solr.jvm') enabled at server: com.sun.jmx.mbeanserver.JmxMBeanServer@7f4734c5
   [junit4]   2> 1055447 INFO  (jetty-launcher-1503-thread-1) [n:127.0.0.1:38443_solr    ] o.a.s.m.r.SolrJmxReporter JMX monitoring for 'solr_38443.solr.jetty' (registry 'solr.jetty') enabled at server: com.sun.jmx.mbeanserver.JmxMBeanServer@7f4734c5
   [junit4]   2> 1055448 INFO  (jetty-launcher-1503-thread-1) [n:127.0.0.1:38443_solr    ] o.a.s.c.CorePropertiesLocator Found 0 core definitions underneath /x1/jenkins/jenkins-slave/workspace/Lucene-Solr-Tests-master/solr/build/solr-core/test/J0/temp/solr.cloud.autoscaling.TriggerIntegrationTest_24B4BD63E0209CAF-001/tempDir-001/node1/.
   [junit4]   2> 1055500 INFO  (zkConnectionManagerCallback-1528-thread-1) [    ] o.a.s.c.c.ConnectionManager zkClient has connected
   [junit4]   2> 1055525 INFO  (zkConnectionManagerCallback-1532-thread-1) [    ] o.a.s.c.c.ConnectionManager zkClient has connected
   [junit4]   2> 1055525 INFO  (SUITE-TriggerIntegrationTest-seed#[24B4BD63E0209CAF]-worker) [    ] o.a.s.c.c.ZkStateReader Updated live nodes from ZooKeeper... (0) -> (2)
   [junit4]   2> 1055526 INFO  (SUITE-TriggerIntegrationTest-seed#[24B4BD63E0209CAF]-worker) [    ] o.a.s.c.s.i.ZkClientClusterStateProvider Cluster at 127.0.0.1:59445/solr ready
   [junit4]   2> 1055591 INFO  (TEST-TriggerIntegrationTest.testContinueTriggersOnOverseerRestart-seed#[24B4BD63E0209CAF]) [    ] o.a.s.SolrTestCaseJ4 ###Starting testContinueTriggersOnOverseerRestart
   [junit4]   2> 1055602 INFO  (qtp661620047-7989) [n:127.0.0.1:38443_solr    ] o.a.s.h.a.CollectionsHandler Invoked Collection Action :overseerstatus with params action=OVERSEERSTATUS&wt=javabin&version=2 and sendToOCPQueue=true
   [junit4]   2> 1055612 INFO  (qtp661620047-7989) [n:127.0.0.1:38443_solr    ] o.a.s.s.HttpSolrCall [admin] webapp=null path=/admin/collections params={action=OVERSEERSTATUS&wt=javabin&version=2} status=0 QTime=10
   [junit4]   2> 1055613 INFO  (TEST-TriggerIntegrationTest.testContinueTriggersOnOverseerRestart-seed#[24B4BD63E0209CAF]) [    ] o.a.s.c.a.ScheduledTriggers -- removing trigger: .auto_add_replicas
   [junit4]   2> 1055616 INFO  (TEST-TriggerIntegrationTest.testContinueTriggersOnOverseerRestart-seed#[24B4BD63E0209CAF]) [    ] o.a.s.c.a.TriggerIntegrationTest /autoscaling.json reset, new znode version 2
   [junit4]   2> 1055616 DEBUG (zkCallback-1521-thread-1-processing-n:127.0.0.1:38443_solr) [n:127.0.0.1:38443_solr    ] o.a.s.c.a.OverseerTriggerThread Refreshing /autoscaling.json with znode version 2
   [junit4]   2> 1055617 DEBUG (OverseerAutoScalingTriggerThread-73345108438089734-127.0.0.1:38443_solr-n_0000000000) [n:127.0.0.1:38443_solr    ] o.a.s.c.a.OverseerTriggerThread Processed trigger updates upto znodeVersion 2
   [junit4]   2> 1055617 DEBUG (OverseerAutoScalingTriggerThread-73345108438089734-127.0.0.1:38443_solr-n_0000000000) [n:127.0.0.1:38443_solr    ] o.a.s.c.a.OverseerTriggerThread -- clean old nodeLost markers
   [junit4]   2> 1055617 DEBUG (OverseerAutoScalingTriggerThread-73345108438089734-127.0.0.1:38443_solr-n_0000000000) [n:127.0.0.1:38443_solr    ] o.a.s.c.a.OverseerTriggerThread -- clean old nodeAdded markers
   [junit4]   2> 1055617 DEBUG (OverseerAutoScalingTriggerThread-73345108438089734-127.0.0.1:38443_solr-n_0000000000) [n:127.0.0.1:38443_solr    ] o.a.s.c.a.OverseerTriggerThread Current znodeVersion 2, lastZnodeVersion 2
   [junit4]   2> 1055617 INFO  (TEST-TriggerIntegrationTest.testContinueTriggersOnOverseerRestart-seed#[24B4BD63E0209CAF]) [    ] o.a.s.c.c.ZkStateReader Updated live nodes from ZooKeeper... (0) -> (2)
   [junit4]   2> 1055628 INFO  (TEST-TriggerIntegrationTest.testContinueTriggersOnOverseerRestart-seed#[24B4BD63E0209CAF]) [    ] o.e.j.s.AbstractConnector Stopped ServerConnector@400ad194{HTTP/1.1,[http/1.1]}{127.0.0.1:0}
   [junit4]   2> 1055629 INFO  (TEST-TriggerIntegrationTest.testContinueTriggersOnOverseerRestart-seed#[24B4BD63E0209CAF]) [    ] o.a.s.c.CoreContainer Shutting down CoreContainer instance=431809488
   [junit4]   2> 1055629 INFO  (TEST-TriggerIntegrationTest.testContinueTriggersOnOverseerRestart-seed#[24B4BD63E0209CAF]) [    ] o.a.s.m.SolrMetricManager Closing metric reporters for registry=solr.node, tag=null
   [junit4]   2> 1055629 INFO  (TEST-TriggerIntegrationTest.testContinueTriggersOnOverseerRestart-seed#[24B4BD63E0209CAF]) [    ] o.a.s.m.r.SolrJmxReporter Closing reporter [org.apache.solr.metrics.reporters.SolrJmxReporter@614c235a: rootName = solr_38443, domain = solr.node, service url = null, agent id = null] for registry solr.node / com.codahale.metrics.MetricRegistry@26112656
   [junit4]   2> 1055636 INFO  (TEST-TriggerIntegrationTest.testContinueTriggersOnOverseerRestart-seed#[24B4BD63E0209CAF]) [    ] o.a.s.m.SolrMetricManager Closing metric reporters for registry=solr.jvm, tag=null
   [junit4]   2> 1055636 INFO  (TEST-TriggerIntegrationTest.testContinueTriggersOnOverseerRestart-seed#[24B4BD63E0209CAF]) [    ] o.a.s.m.r.SolrJmxReporter Closing reporter [org.apache.solr.metrics.reporters.SolrJmxReporter@25e7f6c2: rootName = solr_38443, domain = solr.jvm, service url = null, agent id = null] for registry solr.jvm / com.codahale.metrics.MetricRegistry@4ec2a71
   [junit4]   2> 1055640 INFO  (TEST-TriggerIntegrationTest.testContinueTriggersOnOverseerRestart-seed#[24B4BD63E0209CAF]) [    ] o.a.s.m.SolrMetricManager Closing metric reporters for registry=solr.jetty, tag=null
   [junit4]   2> 1055640 INFO  (TEST-TriggerIntegrationTest.testContinueTriggersOnOverseerRestart-seed#[24B4BD63E0209CAF]) [    ] o.a.s.m.r.SolrJmxReporter Closing reporter [org.apache.solr.metrics.reporters.SolrJmxReporter@457d0b5f: rootName = solr_38443, domain = solr.jetty, service url = null, agent id = null] for registry solr.jetty / com.codahale.metrics.MetricRegistry@6adeaf91
   [junit4]   2> 1055642 INFO  (TEST-TriggerIntegrationTest.testContinueTriggersOnOverseerRestart-seed#[24B4BD63E0209CAF]) [    ] o.a.s.c.ZkController Remove node as live in ZooKeeper:/live_nodes/127.0.0.1:38443_solr
   [junit4]   2> 1055642 INFO  (TEST-TriggerIntegrationTest.testContinueTriggersOnOverseerRestart-seed#[24B4BD63E0209CAF]) [    ] o.a.s.m.SolrMetricManager Closing metric reporters for registry=solr.cluster, tag=null
   [junit4]   2> 1055643 INFO  (zkCallback-1519-thread-1-processing-n:127.0.0.1:51188_solr) [n:127.0.0.1:51188_solr    ] o.a.s.c.c.ZkStateReader Updated live nodes from ZooKeeper... (2) -> (1)
   [junit4]   2> 1055643 INFO  (zkCallback-1521-thread-1-processing-n:127.0.0.1:38443_solr) [n:127.0.0.1:38443_solr    ] o.a.s.c.c.ZkStateReader Updated live nodes from ZooKeeper... (2) -> (1)
   [junit4]   2> 1055645 INFO  (TEST-TriggerIntegrationTest.testContinueTriggersOnOverseerRestart-seed#[24B4BD63E0209CAF]) [    ] o.a.s.c.TransientSolrCoreCacheDefault Allocating transient cache for 2147483647 transient cores
   [junit4]   2> 1055649 INFO  (TEST-TriggerIntegrationTest.testContinueTriggersOnOverseerRestart-seed#[24B4BD63E0209CAF]) [    ] o.a.s.c.Overseer Overseer (id=73345108438089734-127.0.0.1:38443_solr-n_0000000000) closing
   [junit4]   2> 1055649 INFO  (OverseerStateUpdate-73345108438089734-127.0.0.1:38443_solr-n_0000000000) [n:127.0.0.1:38443_solr    ] o.a.s.c.Overseer Overseer Loop exiting : 127.0.0.1:38443_solr
   [junit4]   2> 1055650 DEBUG (TEST-TriggerIntegrationTest.testContinueTriggersOnOverseerRestart-seed#[24B4BD63E0209CAF]) [    ] o.a.s.c.a.OverseerTriggerThread OverseerTriggerThread has been closed explicitly
   [junit4]   2> 1055650 WARN  (OverseerAutoScalingTriggerThread-73345108438089734-127.0.0.1:38443_solr-n_0000000000) [n:127.0.0.1:38443_solr    ] o.a.s.c.a.OverseerTriggerThread OverseerTriggerThread woken up but we are closed, exiting.
   [junit4]   2> 1055651 INFO  (zkCallback-1531-thread-1) [    ] o.a.s.c.c.ZkStateReader Updated live nodes from ZooKeeper... (2) -> (1)
   [junit4]   2> 1055651 INFO  (zkCallback-1531-thread-2) [    ] o.a.s.c.c.ZkStateReader Updated live nodes from ZooKeeper... (2) -> (1)
   [junit4]   2> 1055652 INFO  (zkCallback-1519-thread-1-processing-n:127.0.0.1:51188_solr) [n:127.0.0.1:51188_solr    ] o.a.s.c.OverseerElectionContext I am going to be the leader 127.0.0.1:51188_solr
   [junit4]   2> 1055652 INFO  (TEST-TriggerIntegrationTest.testContinueTriggersOnOverseerRestart-seed#[24B4BD63E0209CAF]) [    ] o.e.j.s.h.ContextHandler Stopped o.e.j.s.ServletContextHandler@6824a107{/solr,null,UNAVAILABLE}
   [junit4]   2> 1055652 INFO  (TEST-TriggerIntegrationTest.testContinueTriggersOnOverseerRestart-seed#[24B4BD63E0209CAF]) [    ] o.e.j.s.session Stopped scavenging
   [junit4]   2> 1055653 INFO  (zkCallback-1519-thread-1-processing-n:127.0.0.1:51188_solr) [n:127.0.0.1:51188_solr    ] o.a.s.c.Overseer Overseer (id=73345108438089733-127.0.0.1:51188_solr-n_0000000001) starting
   [junit4]   2> 1055665 DEBUG (OverseerAutoScalingTriggerThread-73345108438089733-127.0.0.1:51188_solr-n_0000000001) [n:127.0.0.1:51188_solr    ] o.a.s.c.a.OverseerTriggerThread Adding .autoAddReplicas trigger
   [junit4]   2> 1055666 DEBUG (OverseerAutoScalingTriggerThread-73345108438089733-127.0.0.1:51188_solr-n_0000000001) [n:127.0.0.1:51188_solr    ] o.a.s.c.a.OverseerTriggerThread Refreshing /autoscaling.json with znode version 3
   [junit4]   2> 1055666 DEBUG (OverseerAutoScalingTriggerThread-73345108438089733-127.0.0.1:51188_solr-n_0000000001) [n:127.0.0.1:51188_solr    ] o.a.s.c.a.NodeLostTrigger Initial livenodes: [127.0.0.1:51188_solr]
   [junit4]   2> 1055666 DEBUG (OverseerAutoScalingTriggerThread-73345108438089733-127.0.0.1:51188_solr-n_0000000001) [n:127.0.0.1:51188_solr    ] o.a.s.c.a.OverseerTriggerThread Current znodeVersion 3, lastZnodeVersion -1
   [junit4]   2> 1055666 DEBUG (OverseerAutoScalingTriggerThread-73345108438089733-127.0.0.1:51188_solr-n_0000000001) [n:127.0.0.1:51188_solr    ] o.a.s.c.a.OverseerTriggerThread Processed trigger updates upto znodeVersion 3
   [junit4]   2> 1055669 DEBUG (OverseerAutoScalingTriggerThread-73345108438089733-127.0.0.1:51188_solr-n_0000000001) [n:127.0.0.1:51188_solr    ] o.a.s.c.a.OverseerTriggerThread -- clean old nodeAdded markers
   [junit4]   2> 1055669 DEBUG (OverseerAutoScalingTriggerThread-73345108438089733-127.0.0.1:51188_solr-n_0000000001) [n:127.0.0.1:51188_solr    ] o.a.s.c.a.OverseerTriggerThread Current znodeVersion 3, lastZnodeVersion 3
   [junit4]   2> 1055669 DEBUG (ScheduledTrigger-2585-thread-1) [n:127.0.0.1:51188_solr    ] o.a.s.c.a.NodeLostTrigger Running NodeLostTrigger: .auto_add_replicas with currently live nodes: 1
   [junit4]   2> 1056673 DEBUG (ScheduledTrigger-2585-thread-1) [n:127.0.0.1:51188_solr    ] o.a.s.c.a.NodeLostTrigger Running NodeLostTrigger: .auto_add_replicas with currently live nodes: 1
   [junit4]   2> 1057674 DEBUG (ScheduledTrigger-2585-thread-2) [n:127.0.0.1:51188_solr    ] o.a.s.c.a.NodeLostTrigger Running NodeLostTrigger: .auto_add_replicas with currently live nodes: 1
   [junit4]   2> 1058674 DEBUG (ScheduledTrigger-2585-thread-1) [n:127.0.0.1:51188_solr    ] o.a.s.c.a.NodeLostTrigger Running NodeLostTrigger: .auto_add_replicas with currently live nodes: 1
   [junit4]   2> 1059674 DEBUG (ScheduledTrigger-2585-thread-1) [n:127.0.0.1:51188_solr    ] o.a.s.c.a.NodeLostTrigger Running NodeLostTrigger: .auto_add_replicas with currently live nodes: 1
   [junit4]   2> 1060654 INFO  (TEST-TriggerIntegrationTest.testContinueTriggersOnOverseerRestart-seed#[24B4BD63E0209CAF]) [    ] o.e.j.s.Server jetty-9.4.8.v20171121, build timestamp: 2017-11-22T02:57:37+05:30, git hash: 82b8fb23f757335bb3329d540ce37a2a2615f0a8
   [junit4]   2> 1060655 INFO  (TEST-TriggerIntegrationTest.testContinueTriggersOnOverseerRestart-seed#[24B4BD63E0209CAF]) [    ] o.e.j.s.session DefaultSessionIdManager workerName=node0
   [junit4]   2> 1060655 INFO  (TEST-TriggerIntegrationTest.testContinueTriggersOnOverseerRestart-seed#[24B4BD63E0209CAF]) [    ] o.e.j.s.session No SessionScavenger set, using defaults
   [junit4]   2> 1060656 INFO  (TEST-TriggerIntegrationTest.testContinueTriggersOnOverseerRestart-seed#[24B4BD63E0209CAF]) [    ] o.e.j.s.session Scavenging every 660000ms
   [junit4]   2> 1060656 INFO  (TEST-TriggerIntegrationTest.testContinueTriggersOnOverseerRestart-seed#[24B4BD63E0209CAF]) [    ] o.e.j.s.h.ContextHandler Started o.e.j.s.ServletContextHandler@3d310d8f{/solr,null,AVAILABLE}
   [junit4]   2> 1060657 INFO  (TEST-TriggerIntegrationTest.testContinueTriggersOnOverseerRestart-seed#[24B4BD63E0209CAF]) [    ] o.e.j.s.AbstractConnector Started ServerConnector@5e06b1e3{HTTP/1.1,[http/1.1]}{127.0.0.1:32850}
   [junit4]   2> 1060657 INFO  (TEST-TriggerIntegrationTest.testContinueTriggersOnOverseerRestart-seed#[24B4BD63E0209CAF]) [    ] o.e.j.s.Server Started @1063102ms
   [junit4]   2> 1060657 INFO  (TEST-TriggerIntegrationTest.testContinueTriggersOnOverseerRestart-seed#[24B4BD63E0209CAF]) [    ] o.a.s.c.s.e.JettySolrRunner Jetty properties: {hostContext=/solr, hostPort=32850}
   [junit4]   2> 1060657 ERROR (TEST-TriggerIntegrationTest.testContinueTriggersOnOverseerRestart-seed#[24B4BD63E0209CAF]) [    ] o.a.s.u.StartupLoggingUtils Missing Java Option solr.log.dir. Logging may be missing or incomplete.
   [junit4]   2> 1060658 INFO  (TEST-TriggerIntegrationTest.testContinueTriggersOnOverseerRestart-seed#[24B4BD63E0209CAF]) [    ] o.a.s.s.SolrDispatchFilter  ___      _       Welcome to Apache Solr™ version 8.0.0
   [junit4]   2> 1060658 INFO  (TEST-TriggerIntegrationTest.testContinueTriggersOnOverseerRestart-seed#[24B4BD63E0209CAF]) [    ] o.a.s.s.SolrDispatchFilter / __| ___| |_ _   Starting in cloud mode on port null
   [junit4]   2> 1060658 INFO  (TEST-TriggerIntegrationTest.testContinueTriggersOnOverseerRestart-seed#[24B4BD63E0209CAF]) [    ] o.a.s.s.SolrDispatchFilter \__ \/ _ \ | '_|  Install dir: null
   [junit4]   2> 1060658 INFO  (TEST-TriggerIntegrationTest.testContinueTriggersOnOverseerRestart-seed#[24B4BD63E0209CAF]) [    ] o.a.s.s.SolrDispatchFilter |___/\___/_|_|    Start time: 2018-02-23T13:53:29.237Z
   [junit4]   2> 1060662 INFO  (zkConnectionManagerCallback-1535-thread-1) [    ] o.a.s.c.c.ConnectionManager zkClient has connected
   [junit4]   2> 1060663 INFO  (TEST-TriggerIntegrationTest.testContinueTriggersOnOverseerRestart-seed#[24B4BD63E0209CAF]) [    ] o.a.s.s.SolrDispatchFilter solr.xml found in ZooKeeper. Loading...
   [junit4]   2> 1060673 INFO  (TEST-TriggerIntegrationTest.testContinueTriggersOnOverseerRestart-seed#[24B4BD63E0209CAF]) [    ] o.a.s.c.ZkContainer Zookeeper client=127.0.0.1:59445/solr
   [junit4]   2> 1060674 DEBUG (ScheduledTrigger-2585-thread-1) [n:127.0.0.1:51188_solr    ] o.a.s.c.a.NodeLostTrigger Running NodeLostTrigger: .auto_add_replicas with currently live nodes: 1
   [junit4]   2> 1060675 INFO  (zkConnectionManagerCallback-1539-thread-1) [    ] o.a.s.c.c.ConnectionManager zkClient has connected
   [junit4]   2> 1060680 INFO  (zkConnectionManagerCallback-1541-thread-1-processing-n:127.0.0.1:32850_solr) [n:127.0.0.1:32850_solr    ] o.a.s.c.c.ConnectionManager zkClient has connected
   [junit4]   2> 1060691 INFO  (TEST-TriggerIntegrationTest.testContinueTriggersOnOverseerRestart-seed#[24B4BD63E0209CAF]) [n:127.0.0.1:32850_solr    ] o.a.s.c.c.ZkStateReader Updated live nodes from ZooKeeper... (0) -> (1)
   [junit4]   2> 1060693 INFO  (TEST-TriggerIntegrationTest.testContinueTriggersOnOverseerRestart-seed#[24B4BD63E0209CAF]) [n:127.0.0.1:32850_solr    ] o.a.s.c.Overseer Overseer (id=null) closing
   [junit4]   2> 1060695 INFO  (TEST-TriggerIntegrationTest.testContinueTriggersOnOverseerRestart-seed#[24B4BD63E0209CAF]) [n:127.0.0.1:32850_solr    ] o.a.s.c.ZkController Register node as live in ZooKeeper:/live_nodes/127.0.0.1:32850_solr
   [junit4]   2> 1060697 INFO  (zkCallback-1531-thread-1) [    ] o.a.s.c.c.ZkStateReader Updated live nodes from ZooKeeper... (1) -> (2)
   [junit4]   2> 1060697 INFO  (zkCallback-1531-thread-2) [    ] o.a.s.c.c.ZkStateReader Updated live nodes from ZooKeeper... (1) -> (2)
   [junit4]   2> 1060697 INFO  (zkCallback-1519-thread-1-processing-n:127.0.0.1:51188_solr) [n:127.0.0.1:51188_solr    ] o.a.s.c.c.ZkStateReader Updated live nodes from ZooKeeper... (1) -> (2)
   [junit4]   2> 1060705 INFO  (zkCallback-1540-thread-1-processing-n:127.0.0.1:32850_solr) [n:127.0.0.1:32850_solr    ] o.a.s.c.c.ZkStateReader Updated live nodes from ZooKeeper... (1) -> (2)
   [junit4]   2> 1060781 INFO  (TEST-TriggerIntegrationTest.testContinueTriggersOnOverseerRestart-seed#[24B4BD63E0209CAF]) [n:127.0.0.1:32850_solr    ] o.a.s.m.r.SolrJmxReporter JMX monitoring for 'solr_32850.solr.node' (registry 'solr.node') enabled at server: com.sun.jmx.mbeanserver.JmxMBeanServer@7f4734c5
   [junit4]   2> 1060803 INFO  (TEST-TriggerIntegrationTest.testContinueTriggersOnOverseerRestart-seed#[24B4BD63E0209CAF]) [n:127.0.0.1:32850_solr    ] o.a.s.m.r.SolrJmxReporter JMX monitoring for 'solr_32850.solr.jvm' (registry 'solr.jvm') enabled at server: com.sun.jmx.mbeanserver.JmxMBeanServer@7f4734c5
   [junit4]   2> 1060803 INFO  (TEST-TriggerIntegrationTest.testContinueTriggersOnOverseerRestart-seed#[24B4BD63E0209CAF]) [n:127.0.0.1:32850_solr    ] o.a.s.m.r.SolrJmxReporter JMX monitoring for 'solr_32850.solr.jetty' (registry 'solr.jetty') enabled at server: com.sun.jmx.mbeanserver.JmxMBeanServer@7f4734c5
   [junit4]   2> 1060804 INFO  (TEST-TriggerIntegrationTest.testContinueTriggersOnOverseerRestart-seed#[24B4BD63E0209CAF]) [n:127.0.0.1:32850_solr    ] o.a.s.c.CorePropertiesLocator Found 0 core definitions underneath /x1/jenkins/jenkins-slave/workspace/Lucene-Solr-Tests-master/solr/build/solr-core/test/J0/temp/solr.cloud.autoscaling.TriggerIntegrationTest_24B4BD63E0209CAF-001/tempDir-001/node3/.
   [junit4]   2> 1060835 INFO  (qtp1380633802-8062) [n:127.0.0.1:32850_solr    ] o.a.s.h.a.CollectionsHandler Invoked Collection Action :overseerstatus with params action=OVERSEERSTATUS&wt=javabin&version=2 and sendToOCPQueue=true
   [junit4]   2> 1060845 INFO  (qtp1380633802-8062) [n:127.0.0.1:32850_solr    ] o.a.s.s.HttpSolrCall [admin] webapp=null path=/admin/collections params={action=OVERSEERSTATUS&wt=javabin&version=2} status=0 QTime=10
   [junit4]   2> 1060849 INFO  (qtp1380633802-8067) [n:127.0.0.1:32850_solr    ] o.a.s.s.HttpSolrCall [admin] webapp=null path=/admin/metrics params={prefix=CONTAINER.fs.usableSpace,CORE.coreName&wt=javabin&version=2&group=solr.node,solr.core} status=0 QTime=0
   [junit4]   2> 1060851 INFO  (qtp319484947-8001) [n:127.0.0.1:51188_solr    ] o.a.s.s.HttpSolrCall [admin] webapp=null path=/admin/metrics params={prefix=CONTAINER.fs.usableSpace,CORE.coreName&wt=javabin&version=2&group=solr.node,solr.core} status=0 QTime=0
   [junit4]   2> 1060851 DEBUG (qtp1380633802-8064) [n:127.0.0.1:32850_solr    ] o.a.s.c.a.AutoScalingHandler Verified autoscaling configuration
   [junit4]   2> 1060855 INFO  (qtp1380633802-8064) [n:127.0.0.1:32850_solr    ] o.a.s.s.HttpSolrCall [admin] webapp=null path=/admin/autoscaling params={wt=javabin&version=2} status=0 QTime=8
   [junit4]   2> 1060855 DEBUG (zkCallback-1519-thread-1-processing-n:127.0.0.1:51188_solr) [n:127.0.0.1:51188_solr    ] o.a.s.c.a.OverseerTriggerThread Refreshing /autoscaling.json with znode version 4
   [junit4]   2> 1060856 DEBUG (zkCallback-1519-thread-1-processing-n:127.0.0.1:51188_solr) [n:127.0.0.1:51188_solr    ] o.a.s.c.a.NodeAddedTrigger Initial livenodes: [127.0.0.1:51188_solr, 127.0.0.1:32850_solr]
   [junit4]   2> 1060856 DEBUG (zkCallback-1519-thread-1-processing-n:127.0.0.1:51188_solr) [n:127.0.0.1:51188_solr    ] o.a.s.c.a.NodeAddedTrigger NodeAddedTrigger node_added_triggerCTOOR instantiated with properties: {event=nodeAdded, waitFor=2, actions=[{name=test, class=org.apache.solr.cloud.autoscaling.TriggerIntegrationTest$TestTriggerAction}], enabled=true}
   [junit4]   2> 1060856 DEBUG (zkCallback-1519-thread-1-processing-n:127.0.0.1:51188_solr) [n:127.0.0.1:51188_solr    ] o.a.s.c.a.NodeLostTrigger Initial livenodes: [127.0.0.1:51188_solr, 127.0.0.1:32850_solr]
   [junit4]   2> 1060856 DEBUG (OverseerAutoScalingTriggerThread-73345108438089733-127.0.0.1:51188_solr-n_0000000001) [n:127.0.0.1:51188_solr    ] o.a.s.c.a.OverseerTriggerThread Processed trigger updates upto znodeVersion 4
   [junit4]   2> 1060857 INFO  (OverseerAutoScalingTriggerThread-73345108438089733-127.0.0.1:51188_solr-n_0000000001) [n:127.0.0.1:51188_solr    ] o.a.s.c.a.TriggerIntegrationTest TestTriggerAction init
   [junit4]   2> 1060858 DEBUG (ScheduledTrigger-2585-thread-3) [n:127.0.0.1:51188_solr    ] o.a.s.c.a.NodeAddedTrigger Running NodeAddedTrigger node_added_triggerCTOOR
   [junit4]   2> 1060858 DEBUG (ScheduledTrigger-2585-thread-3) [n:127.0.0.1:51188_solr    ] o.a.s.c.a.NodeAddedTrigger Found livenodes: 2
   [junit4]   2> 1060858 INFO  (TEST-TriggerIntegrationTest.testContinueTriggersOnOverseerRestart-seed#[24B4BD63E0209CAF]) [    ] o.e.j.s.AbstractConnector Stopped ServerConnector@16189cb7{HTTP/1.1,[http/1.1]}{127.0.0.1:0}
   [junit4]   2> 1060861 INFO  (TEST-TriggerIntegrationTest.testContinueTriggersOnOverseerRestart-seed#[24B4BD63E0209CAF]) [    ] o.a.s.c.CoreContainer Shutting down CoreContainer instance=1760390598
   [junit4]   2> 1060861 INFO  (TEST-TriggerIntegrationTest.testContinueTriggersOnOverseerRestart-seed#[24B4BD63E0209CAF]) [    ] o.a.s.m.SolrMetricManager Closing metric reporters for registry=solr.node, tag=null
   [junit4]   2> 1060861 INFO  (TEST-TriggerIntegrationTest.testContinueTriggersOnOverseerRestart-seed#[24B4BD63E0209CAF]) [    ] o.a.s.m.r.SolrJmxReporter Closing reporter [org.apache.solr.metrics.reporters.SolrJmxReporter@5a377dec: rootName = solr_51188, domain = solr.node, service url = null, agent id = null] for registry solr.node / com.codahale.metrics.MetricRegistry@14b93cb5
   [junit4]   2> 1060862 DEBUG (OverseerAutoScalingTriggerThread-73345108438089733-127.0.0.1:51188_solr-n_0000000001) [n:127.0.0.1:51188_solr    ] o.a.s.c.a.OverseerTriggerThread Current znodeVersion 4, lastZnodeVersion 4
   [junit4]   2> 1060869 INFO  (TEST-TriggerIntegrationTest.testContinueTriggersOnOverseerRestart-seed#[24B4BD63E0209CAF]) [    ] o.a.s.m.SolrMetricManager Closing metric reporters for registry=solr.jvm, tag=null
   [junit4]   2> 1060869 INFO  (TEST-TriggerIntegrationTest.testContinueTriggersOnOverseerRestart-seed#[24B4BD63E0209CAF]) [    ] o.a.s.m.r.SolrJmxReporter Closing reporter [org.apache.solr.metrics.reporters.SolrJmxReporter@59ad1651: rootName = solr_51188, domain = solr.jvm, service url = null, agent id = null] for registry solr.jvm / com.codahale.metrics.MetricRegistry@4ec2a71
   [junit4]   2> 1060874 INFO  (TEST-TriggerIntegrationTest.testContinueTriggersOnOverseerRestart-seed#[24B4BD63E0209CAF]) [    ] o.a.s.m.SolrMetricManager Closing metric reporters for registry=solr.jetty, tag=null
   [junit4]   2> 1060874 INFO  (TEST-TriggerIntegrationTest.testContinueTriggersOnOverseerRestart-seed#[24B4BD63E0209CAF]) [    ] o.a.s.m.r.SolrJmxReporter Closing reporter [org.apache.solr.metrics.reporters.SolrJmxReporter@51d99e28: rootName = solr_51188, domain = solr.jetty, service url = null, agent id = null] for registry solr.jetty / com.codahale.metrics.MetricRegistry@6adeaf91
   [junit4]   2> 1060875 INFO  (TEST-TriggerIntegrationTest.testContinueTriggersOnOverseerRestart-seed#[24B4BD63E0209CAF]) [    ] o.a.s.c.ZkController Remove node as live in ZooKeeper:/live_nodes/127.0.0.1:51188_solr
   [junit4]   2> 1060875 INFO  (zkCallback-1540-thread-1-processing-n:127.0.0.1:32850_solr) [n:127.0.0.1:32850_solr    ] o.a.s.c.c.ZkStateReader Updated live nodes from ZooKeeper... (2) -> (1)
   [junit4]   2> 1060875 INFO  (zkCallback-1531-thread-2) [    ] o.a.s.c.c.ZkStateReader Updated live nodes from ZooKeeper... (2) -> (1)
   [junit4]   2> 1060876 INFO  (zkCallback-1531-thread-1) [    ] o.a.s.c.c.ZkStateReader Updated live nodes from ZooKeeper... (2) -> (1)
   [junit4]   2> 1060876 INFO  (zkCallback-1519-thread-1-processing-n:127.0.0.1:51188_solr) [n:127.0.0.1:51188_solr    ] o.a.s.c.c.ZkStateReader Updated live nodes from ZooKeeper... (2) -> (1)
   [junit4]   2> 1060876 INFO  (TEST-TriggerIntegrationTest.testContinueTriggersOnOverseerRestart-seed#[24B4BD63E0209CAF]) [    ] o.a.s.m.SolrMetricManager Closing metric reporters for registry=solr.cluster, tag=null
   [junit4]   2> 1060876 INFO  (TEST-TriggerIntegrationTest.testContinueTriggersOnOverseerRestart-seed#[24B4BD63E0209CAF]) [    ] o.a.s.c.TransientSolrCoreCacheDefault Allocating transient cache for 2147483647 transient cores
   [junit4]   2> 1060877 INFO  (TEST-TriggerIntegrationTest.testContinueTriggersOnOverseerRestart-seed#[24B4BD63E0209CAF]) [    ] o.a.s.c.Overseer Overseer (id=73345108438089733-127.0.0.1:51188_solr-n_0000000001) closing
   [junit4]   2> 1060877 INFO  (OverseerStateUpdate-73345108438089733-127.0.0.1:51188_solr-n_0000000001) [n:127.0.0.1:51188_solr    ] o.a.s.c.Overseer Overseer Loop exiting : 127.0.0.1:51188_solr
   [junit4]   2> 1060878 WARN  (OverseerAutoScalingTriggerThread-73345108438089733-127.0.0.1:51188_solr-n_0000000001) [n:127.0.0.1:51188_solr    ] o.a.s.c.a.OverseerTriggerThread OverseerTriggerThread woken up but we are closed, exiting.
   [junit4]   2> 1060879 DEBUG (TEST-TriggerIntegrationTest.testContinueTriggersOnOverseerRestart-seed#[24B4BD63E0209CAF]) [    ] o.a.s.c.a.OverseerTriggerThread OverseerTriggerThread has been closed explicitly
   [junit4]   2> 1060880 INFO  (zkCallback-1540-thread-1-processing-n:127.0.0.1:32850_solr) [n:127.0.0.1:32850_solr    ] o.a.s.c.OverseerElectionContext I am going to be the leader 127.0.0.1:32850_solr
   [junit4]   2> 1060880 INFO  (zkCallback-1540-thread-1-processing-n:127.0.0.1:32850_solr) [n:127.0.0.1:32850_solr    ] o.a.s.c.Overseer Overseer (id=73345108438089739-127.0.0.1:32850_solr-n_0000000002) starting
   [junit4]   2> 1060881 INFO  (TEST-TriggerIntegrationTest.testContinueTriggersOnOverseerRestart-seed#[24B4BD63E0209CAF]) [    ] o.e.j.s.h.ContextHandler Stopped o.e.j.s.ServletContextHandler@1d8228ab{/solr,null,UNAVAILABLE}
   [junit4]   2> 1060881 INFO  (TEST-TriggerIntegrationTest.testContinueTriggersOnOverseerRestart-seed#[24B4BD63E0209CAF]) [    ] o.e.j.s.session Stopped scavenging
   [junit4]   2> 1060891 DEBUG (OverseerAutoScalingTriggerThread-73345108438089739-127.0.0.1:32850_solr-n_0000000002) [n:127.0.0.1:32850_solr    ] o.a.s.c.a.OverseerTriggerThread Refreshing /autoscaling.json with znode version 4
   [junit4]   2> 1060892 DEBUG (OverseerAutoScalingTriggerThread-73345108438089739-127.0.0.1:32850_solr-n_0000000002) [n:127.0.0.1:32850_solr    ] o.a.s.c.a.NodeAddedTrigger Initial livenodes: [127.0.0.1:32850_solr]
   [junit4]   2> 1060892 DEBUG (OverseerAutoScalingTriggerThread-73345108438089739-127.0.0.1:32850_solr-n_0000000002) [n:127.0.0.1:32850_solr    ] o.a.s.c.a.NodeAddedTrigger NodeAddedTrigger node_added_triggerCTOOR instantiated with properties: {event=nodeAdded, waitFor=2, actions=[{name=test, class=org.apache.solr.cloud.autoscaling.TriggerIntegrationTest$TestTriggerAction}], enabled=true}
   [junit4]   2> 1060892 DEBUG (OverseerAutoScalingTriggerThread-73345108438089739-127.0.0.1:32850_solr-n_0000000002) [n:127.0.0.1:32850_solr    ] o.a.s.c.a.NodeLostTrigger Initial livenodes: [127.0.0.1:32850_solr]
   [junit4]   2> 1060892 DEBUG (OverseerAutoScalingTriggerThread-73345108438089739-127.0.0.1:32850_solr-n_0000000002) [n:127.0.0.1:32850_solr    ] o.a.s.c.a.OverseerTriggerThread Current znodeVersion 4, lastZnodeVersion -1
   [junit4]   2> 1060892 DEBUG (OverseerAutoScalingTriggerThread-73345108438089739-127.0.0.1:32850_solr-n_0000000002) [n:127.0.0.1:32850_solr    ] o.a.s.c.a.OverseerTriggerThread Processed trigger updates upto znodeVersion 4
   [junit4]   2> 1060893 INFO  (OverseerAutoScalingTriggerThread-73345108438089739-127.0.0.1:32850_solr-n_0000000002) [n:127.0.0.1:32850_solr    ] o.a.s.c.a.TriggerIntegrationTest TestTriggerAction init
   [junit4]   2> 1060894 DEBUG (OverseerAutoScalingTriggerThread-73345108438089739-127.0.0.1:32850_solr-n_0000000002) [n:127.0.0.1:32850_solr    ] o.a.s.c.a.NodeLostTrigger Adding lost node from marker path: 127.0.0.1:51188_solr
   [junit4]   2> 1060894 DEBUG (ScheduledTrigger-2596-thread-1) [n:127.0.0.1:32850_solr    ] o.a.s.c.a.NodeAddedTrigger Running NodeAddedTrigger node_added_triggerCTOOR
   [junit4]   2> 1060894 DEBUG (ScheduledTrigger-2596-thread-1) [n:127.0.0.1:32850_solr    ] o.a.s.c.a.NodeAddedTrigger Found livenodes: 1
   [junit4]   2> 1060894 DEBUG (OverseerAutoScalingTriggerThread-73345108438089739-127.0.0.1:32850_solr-n_0000000002) [n:127.0.0.1:32850_solr    ] o.a.s.c.a.OverseerTriggerThread Current znodeVersion 4, lastZnodeVersion 4
   [junit4]   2> 1060895 DEBUG (ScheduledTrigger-2596-thread-2) [n:127.0.0.1:32850_solr    ] o.a.s.c.a.NodeLostTrigger Running NodeLostTrigger: .auto_add_replicas with currently live nodes: 1
   [junit4]   2> 1061894 DEBUG (ScheduledTrigger-2596-thread-1) [n:127.0.0.1:32850_solr    ] o.a.s.c.a.NodeAddedTrigger Running NodeAddedTrigger node_added_triggerCTOOR
   [junit4]   2> 1061894 DEBUG (ScheduledTrigger-2596-thread-1) [n:127.0.0.1:32850_solr    ] o.a.s.c.a.NodeAddedTrigger Found livenodes: 1
   [junit4]   2> 1061895 DEBUG (ScheduledTrigger-2596-thread-1) [n:127.0.0.1:32850_solr    ] o.a.s.c.a.NodeLostTrigger Running NodeLostTrigger: .auto_add_replicas with currently live nodes: 1
   [junit4]   2> 1062895 DEBUG (ScheduledTrigger-2596-thread-2) [n:127.0.0.1:32850_solr    ] o.a.s.c.a.NodeAddedTrigger Running NodeAddedTrigger node_added_triggerCTOOR
   [junit4]   2> 1062895 DEBUG (ScheduledTrigger-2596-thread-2) [n:127.0.0.1:32850_solr    ] o.a.s.c.a.NodeAddedTrigger Found livenodes: 1
   [junit4]   2> 1062896 DEBUG (ScheduledTrigger-2596-thread-4) [n:127.0.0.1:32850_solr    ] o.a.s.c.a.NodeLostTrigger Running NodeLostTrigger: .auto_add_replicas with currently live nodes: 1
   [junit4]   2> 1063895 DEBUG (ScheduledTrigger-2596-thread-3) [n:127.0.0.1:32850_solr    ] o.a.s.c.a.NodeAddedTrigger Running NodeAddedTrigger node_added_triggerCTOOR
   [junit4]   2> 1063895 DEBUG (ScheduledTrigger-2596-thread-3) [n:127.0.0.1:32850_solr    ] o.a.s.c.a.NodeAddedTrigger Found livenodes: 1
   [junit4]   2> 1063896 DEBUG (ScheduledTrigger-2596-thread-3) [n:127.0.0.1:32850_solr    ] o.a.s.c.a.NodeLostTrigger Running NodeLostTrigger: .auto_add_replicas with currently live nodes: 1
   [junit4]   2> 1064896 DEBUG (ScheduledTrigger-2596-thread-3) [n:127.0.0.1:32850_solr    ] o.a.s.c.a.NodeAddedTrigger Running NodeAddedTrigger node_added_triggerCTOOR
   [junit4]   2> 1064896 DEBUG (ScheduledTrigger-2596-thread-3) [n:127.0.0.1:32850_solr    ] o.a.s.c.a.NodeAddedTrigger Found livenodes: 1
   [junit4]   2> 1064896 DEBUG (ScheduledTrigger-2596-thread-4) [n:127.0.0.1:32850_solr    ] o.a.s.c.a.NodeLostTrigger Running NodeLostTrigger: .auto_add_replicas with currently live nodes: 1
   [junit4]   2> 1065896 DEBUG (ScheduledTrigger-2596-thread-1) [n:127.0.0.1:32850_solr    ] o.a.s.c.a.NodeAddedTrigger Running NodeAddedTrigger node_added_triggerCTOOR
   [junit4]   2> 1065896 DEBUG (ScheduledTrigger-2596-thread-1) [n:127.0.0.1:32850_solr    ] o.a.s.c.a.NodeAddedTrigger Found livenodes: 1
   [junit4]   2> 1065896 DEBUG (ScheduledTrigger-2596-thread-1) [n:127.0.0.1:32850_solr    ] o.a.s.c.a.NodeLostTrigger Running NodeLostTrigger: .auto_add_replicas with currently live nodes: 1
   [junit4]   2> 1066896 DEBUG (ScheduledTrigger-2596-thread-1) [n:127.0.0.1:32850_solr    ] o.a.s.c.a.NodeAddedTrigger Running NodeAddedTrigger node_added_triggerCTOOR
   [junit4]   2> 1066896 DEBUG (ScheduledTrigger-2596-thread-1) [n:127.0.0.1:32850_solr    ] o.a.s.c.a.NodeAddedTrigger Found livenodes: 1
   [junit4]   2> 1066896 DEBUG (ScheduledTrigger-2596-thread-4) [n:127.0.0.1:32850_solr    ] o.a.s.c.a.NodeLostTrigger Running NodeLostTrigger: .auto_add_replicas with currently live nodes: 1
   [junit4]   2> 1067897 DEBUG (ScheduledTrigger-2596-thread-1) [n:127.0.0.1:32850_solr    ] o.a.s.c.a.NodeAddedTrigger Running NodeAddedTrigger node_added_triggerCTOOR
   [junit4]   2> 1067897 DEBUG (ScheduledTrigger-2596-thread-3) [n:127.0.0.1:32850_solr    ] o.a.s.c.a.NodeLostTrigger Running NodeLostTrigger: .auto_add_replicas with currently live nodes: 1
   [junit4]   2> 1067897 DEBUG (ScheduledTrigger-2596-thread-1) [n:127.0.0.1:32850_solr    ] o.a.s.c.a.NodeAddedTrigger Found livenodes: 1
   [junit4]   2> 1068897 DEBUG (ScheduledTrigger-2596-thread-3) [n:127.0.0.1:32850_solr    ] o.a.s.c.a.NodeLostTrigger Running NodeLostTrigger: .auto_add_replicas with currently live nodes: 1
   [junit4]   2> 1068897 DEBUG (ScheduledTrigger-2596-thread-4) [n:127.0.0.1:32850_solr    ] o.a.s.c.a.NodeAddedTrigger Running NodeAddedTrigger node_added_triggerCTOOR
   [junit4]   2> 1068897 DEBUG (ScheduledTrigger-2596-thread-4) [n:127.0.0.1:32850_solr    ] o.a.s.c.a.NodeAddedTrigger Found livenodes: 1
   [junit4]   2> 1069897 DEBUG (ScheduledTrigger-2596-thread-3) [n:127.0.0.1:32850_solr    ] o.a.s.c.a.NodeLostTrigger Running NodeLostTrigger: .auto_add_replicas with currently live nodes: 1
   [junit4]   2> 1069897 DEBUG (ScheduledTrigger-2596-thread-3) [n:127.0.0.1:32850_solr    ] o.a.s.c.a.NodeAddedTrigger Running NodeAddedTrigger node_added_triggerCTOOR
   [junit4]   2> 1069897 DEBUG (ScheduledTrigger-2596-thread-3) [n:127.0.0.1:32850_solr    ] o.a.s.c.a.NodeAddedTrigger Found livenodes: 1
   [junit4]   2> 1070883 INFO  (TEST-TriggerIntegrationTest.testContinueTriggersOnOverseerRestart-seed#[24B4BD63E0209CAF]) [    ] o.e.j.s.Server jetty-9.4.8.v20171121, build timestamp: 2017-11-22T02:57:37+05:30, git hash: 82b8fb23f757335bb3329d540ce37a2a2615f0a8
   [junit4]   2> 1070885 INFO  (TEST-TriggerIntegrationTest.testContinueTriggersOnOverseerRestart-seed#[24B4BD63E0209CAF]) [    ] o.e.j.s.session DefaultSessionIdManager workerName=node0
   [junit4]   2> 1070885 INFO  (TEST-TriggerIntegrationTest.testContinueTriggersOnOverseerRestart-seed#[24B4BD63E0209CAF]) [    ] o.e.j.s.session No SessionScavenger set, using defaults
   [junit4]   2> 1070885 INFO  (TEST-TriggerIntegrationTest.testContinueTriggersOnOverseerRestart-seed#[24B4BD63E0209CAF]) [    ] o.e.j.s.session Scavenging every 660000ms
   [junit4]   2> 1070885 INFO  (TEST-TriggerIntegrationTest.testContinueTriggersOnOverseerRestart-seed#[24B4BD63E0209CAF]) [    ] o.e.j.s.h.ContextHandler Started o.e.j.s.ServletContextHandler@41521ced{/solr,null,AVAILABLE}
   [junit4]   2> 1070886 INFO  (TEST-TriggerIntegrationTest.testContinueTriggersOnOverseerRestart-seed#[24B4BD63E0209CAF]) [    ] o.e.j.s.AbstractConnector Started ServerConnector@8bb900c{HTTP/1.1,[http/1.1]}{127.0.0.1:41620}
   [junit4]   2> 1070886 INFO  (TEST-TriggerIntegrationTest.testContinueTriggersOnOverseerRestart-seed#[24B4BD63E0209CAF]) [    ] o.e.j.s.Server Started @1073331ms
   [junit4]   2> 1070886 INFO  (TEST-TriggerIntegrationTest.testContinueTriggersOnOverseerRestart-seed#[24B4BD63E0209CAF]) [    ] o.a.s.c.s.e.JettySolrRunner Jetty properties: {hostContext=/solr, hostPort=41620}
   [junit4]   2> 1070886 ERROR (TEST-TriggerIntegrationTest.testContinueTriggersOnOverseerRestart-seed#[24B4BD63E0209CAF]) [    ] o.a.s.u.StartupLoggingUtils Missing Java Option solr.log.dir. Logging may be missing or incomplete.
   [junit4]   2> 1070887 INFO  (TEST-TriggerIntegrationTest.testContinueTriggersOnOverseerRestart-seed#[24B4BD63E0209CAF]) [    ] o.a.s.s.SolrDispatchFilter  ___      _       Welcome to Apache Solr™ version 8.0.0
   [junit4]   2> 1070887 INFO  (TEST-TriggerIntegrationTest.testContinueTriggersOnOverseerRestart-seed#[24B4BD63E0209CAF]) [    ] o.a.s.s.SolrDispatchFilter / __| ___| |_ _   Starting in cloud mode on port null
   [junit4]   2> 1070887 INFO  (TEST-TriggerIntegrationTest.testContinueTriggersOnOverseerRestart-seed#[24B4BD63E0209CAF]) [    ] o.a.s.s.SolrDispatchFilter \__ \/ _ \ | '_|  Install dir: null
   [junit4]   2> 1070887 INFO  (TEST-TriggerIntegrationTest.testContinueTriggersOnOverseerRestart-seed#[24B4BD63E0209CAF]) [    ] o.a.s.s.SolrDispatchFilter |___/\___/_|_|    Start time: 2018-02-23T13:53:39.466Z
   [junit4]   2> 1070889 INFO  (zkConnectionManagerCallback-1545-thread-1) [    ] o.a.s.c.c.ConnectionManager zkClient has connected
   [junit4]   2> 1070889 INFO  (TEST-TriggerIntegrationTest.testContinueTriggersOnOverseerRestart-seed#[24B4BD63E0209CAF]) [    ] o.a.s.s.SolrDispatchFilter solr.xml found in ZooKeeper. Loading...
   [junit4]   2> 1070898 DEBUG (ScheduledTrigger-2596-thread-3) [n:127.0.0.1:32850_solr    ] o.a.s.c.a.NodeLostTrigger Running NodeLostTrigger: .auto_add_replicas with currently live nodes: 1
   [junit4]   2> 1070898 DEBUG (ScheduledTrigger-2596-thread-3) [n:127.0.0.1:32850_solr    ] o.a.s.c.a.NodeAddedTrigger Running NodeAddedTrigger node_added_triggerCTOOR
   [junit4]   2> 1070898 DEBUG (ScheduledTrigger-2596-thread-3) [n:127.0.0.1:32850_solr    ] o.a.s.c.a.NodeAddedTrigger Found livenodes: 1
   [junit4]   2> 1070899 INFO  (TEST-TriggerIntegrationTest.testContinueTriggersOnOverseerRestart-seed#[24B4BD63E0209CAF]) [    ] o.a.s.c.ZkContainer Zookeeper client=127.0.0.1:59445/solr
   [junit4]   2> 1070900 INFO  (zkConnectionManagerCallback-1549-thread-1) [    ] o.a.s.c.c.ConnectionManager zkClient has connected
   [junit4]   2> 1070902 INFO  (zkConnectionManagerCallback-1551-thread-1-processing-n:127.0.0.1:41620_solr) [n:127.0.0.1:41620_solr    ] o.a.s.c.c.ConnectionManager zkClient has connected
   [junit4]   2> 1070908 INFO  (TEST-TriggerIntegrationTest.testContinueTriggersOnOverseerRestart-seed#[24B4BD63E0209CAF]) [n:127.0.0.1:41620_solr    ] o.a.s.c.c.ZkStateReader Updated live nodes from ZooKeeper... (0) -> (1)
   [junit4]   2> 1070909 INFO  (TEST-TriggerIntegrationTest.testContinueTriggersOnOverseerRestart-seed#[24B4BD63E0209CAF]) [n:127.0.0.1:41620_solr    ] o.a.s.c.Overseer Overseer (id=null) closing
   [junit4]   2> 1070911 INFO  (TEST-TriggerIntegrationTest.testContinueTriggersOnOverseerRestart-seed#[24B4BD63E0209CAF]) [n:127.0.0.1:41620_solr    ] o.a.s.c.ZkController Register node as live in ZooKeeper:/live_nodes/127.0.0.1:41620_solr
   [junit4]   2> 1070917 INFO  (zkCallback-1540-thread-1-processing-n:127.0.0.1:32850_solr) [n:127.0.0.1:32850_solr    ] o.a.s.c.c.ZkStateReader Updated live nodes from ZooKeeper... (1) -> (2)
   [junit4]   2> 1070918 INFO  (zkCallback-1550-thread-1-processing-n:127.0.0.1:41620_solr) [n:127.0.0.1:41620_solr    ] o.a.s.c.c.ZkStateReader Updated live nodes from ZooKeeper... (1) -> (2)
   [junit4]   2> 1070918 INFO  (zkCallback-1531-thread-1) [    ] o.a.s.c.c.ZkStateReader Updated live nodes from ZooKeeper... (1) -> (2)
   [junit4]   2> 1070918 INFO  (zkCallback-1531-thread-2) [    ] o.a.s.c.c.ZkStateReader Updated live nodes from ZooKeeper... (1) -> (2)
   [junit4]   2> 1071013 INFO  (TEST-TriggerIntegrationTest.testContinueTriggersOnOverseerRestart-seed#[24B4BD63E0209CAF]) [n:127.0.0.1:41620_solr    ] o.a.s.m.r.SolrJmxReporter JMX monitoring for 'solr_41620.solr.node' (registry 'solr.node') enabled at server: com.sun.jmx.mbeanserver.JmxMBeanServer@7f4734c5
   [junit4]   2> 1071023 INFO  (TEST-TriggerIntegrationTest.testContinueTriggersOnOverseerRestart-seed#[24B4BD63E0209CAF]) [n:127.0.0.1:41620_solr    ] o.a.s.m.r.SolrJmxReporter JMX monitoring for 'solr_41620.solr.jvm' (registry 'solr.jvm') enabled at server: com.sun.jmx.mbeanserver.JmxMBeanServer@7f4734c5
   [junit4]   2> 1071023 INFO  (TEST-TriggerIntegrationTest.testContinueTriggersOnOverseerRestart-seed#[24B4BD63E0209CAF]) [n:127.0.0.1:41620_solr    ] o.a.s.m.r.SolrJmxReporter JMX monitoring for 'solr_41620.solr.jetty' (registry 'solr.jetty') enabled at server: com.sun.jmx.mbeanserver.JmxMBeanServer@7f4734c5
   [junit4]   2> 1071025 INFO  (TEST-TriggerIntegrationTest.testContinueTriggersOnOverseerRestart-seed#[24B4BD63E0209CAF]) [n:127.0.0.1:41620_solr    ] o.a.s.c.CorePropertiesLocator Found 0 core definitions underneath /x1/jenkins/jenkins-slave/workspace/Lucene-Solr-Tests-master/solr/build/solr-core/test/J0/temp/solr.cloud.autoscaling.TriggerIntegrationTest_24B4BD63E0209CAF-001/tempDir-001/node4/.
   [junit4]   2> 1071898 DEBUG (ScheduledTrigger-2596-thread-2) [n:127.0.0.1:32850_solr    ] o.a.s.c.a.NodeAddedTrigger Running NodeAddedTrigger node_added_triggerCTOOR
   [junit4]   2> 1071898 DEBUG (ScheduledTrigger-2596-thread-4) [n:127.0.0.1:32850_solr    ] o.a.s.c.a.NodeLostTrigger Running NodeLostTrigger: .auto_add_replicas with currently live nodes: 2
   [junit4]   2> 1071898 DEBUG (ScheduledTrigger-2596-thread-2) [n:127.0.0.1:32850_solr    ] o.a.s.c.a.NodeAddedTrigger Found livenodes: 2
   [junit4]   2> 1071898 DEBUG (ScheduledTrigger-2596-thread-2) [n:127.0.0.1:32850_solr    ] o.a.s.c.a.NodeAddedTrigger Tracking new node: 127.0.0.1:41620_solr at time 19645927697246489
   [junit4]   2> 1072899 DEBUG (ScheduledTrigger-2596-thread-4) [n:127.0.0.1:32850_solr    ] o.a.s.c.a.NodeLostTrigger Running NodeLostTrigger: .auto_add_replicas with currently live nodes: 2
   [junit4]   2> 1072899 DEBUG (ScheduledTrigger-2596-thread-3) [n:127.0.0.1:32850_solr    ] o.a.s.c.a.NodeAddedTrigger Running NodeAddedTrigger node_added_triggerCTOOR
   [junit4]   2> 1072899 DEBUG (ScheduledTrigger-2596-thread-3) [n:127.0.0.1:32850_solr    ] o.a.s.c.a.NodeAddedTrigger Found livenodes: 2
   [junit4]   2> 1073899 DEBUG (ScheduledTrigger-2596-thread-4) [n:127.0.0.1:32850_solr    ] o.a.s.c.a.NodeLostTrigger Running NodeLostTrigger: .auto_add_replicas with currently live nodes: 2
   [junit4]   2> 1073899 DEBUG (ScheduledTrigger-2596-thread-2) [n:127.0.0.1:32850_solr    ] o.a.s.c.a.NodeAddedTrigger Running NodeAddedTrigger node_added_triggerCTOOR
   [junit4]   2> 1073899 DEBUG (ScheduledTrigger-2596-thread-2) [n:127.0.0.1:32850_solr    ] o.a.s.c.a.NodeAddedTrigger Found livenodes: 2
   [junit4]   2> 1073899 DEBUG (ScheduledTrigger-2596-thread-2) [n:127.0.0.1:32850_solr    ] o.a.s.c.a.NodeAddedTrigger NodeAddedTrigger node_added_triggerCTOOR firing registered processor for nodes: [127.0.0.1:41620_solr] added at times [19645927697246489], now=19645929698525470
   [junit4]   2> 1073900 DEBUG (ScheduledTrigger-2596-thread-2) [n:127.0.0.1:32850_solr    ] o.a.s.c.a.ScheduledTriggers ++++++++ Cooldown inactive - processing event: {
   [junit4]   2>   "id":"45cbddfdad6919T4e30cm4g2feiukpwgx3xg9fbm",
   [junit4]   2>   "source":"node_added_triggerCTOOR",
   [junit4]   2>   "eventTime":19645927697246489,
   [junit4]   2>   "eventType":"NODEADDED",
   [junit4]   2>   "properties":{
   [junit4]   2>     "eventTimes":[19645927697246489],
   [junit4]   2>     "nodeNames":["127.0.0.1:41620_solr"]}}
   [junit4]   2> 1073900 DEBUG (ScheduledTrigger-2596-thread-2) [n:127.0.0.1:32850_solr    ] o.a.s.c.a.ScheduledTriggers Pausing all triggers: [.auto_add_replicas, node_added_triggerCTOOR]
   [junit4]   2> 1073901 INFO  (ScheduledTrigger-2596-thread-2) [n:127.0.0.1:32850_solr    ] o.a.s.c.a.SystemLogListener Collection .system does not exist, disabling logging.
   [junit4]   2> 1073902 DEBUG (AutoscalingActionExecutor-2597-thread-1-processing-n:127.0.0.1:32850_solr) [n:127.0.0.1:32850_solr    ] o.a.s.c.a.ScheduledTriggers -- processing actions for {
   [junit4]   2>   "id":"45cbddfdad6919T4e30cm4g2feiukpwgx3xg9fbm",
   [junit4]   2>   "source":"node_added_triggerCTOOR",
   [junit4]   2>   "eventTime":19645927697246489,
   [junit4]   2>   "eventType":"NODEADDED",
   [junit4]   2>   "properties":{
   [junit4]   2>     "eventTimes":[19645927697246489],
   [junit4]   2>     "_enqueue_time_":19645929699557281,
   [junit4]   2>     "nodeNames":["127.0.0.1:41620_solr"]}}
   [junit4]   2> 1073902 INFO  (TEST-TriggerIntegrationTest.testContinueTriggersOnOverseerRestart-seed#[24B4BD63E0209CAF]) [    ] o.a.s.SolrTestCaseJ4 ###Ending testContinueTriggersOnOverseerRestart
   [junit4]   2> 1073907 DEBUG (AutoscalingActionExecutor-2597-thread-1-processing-n:127.0.0.1:32850_solr) [n:127.0.0.1:32850_solr    ] o.a.s.c.a.ScheduledTriggers Resuming trigger: .auto_add_replicas after 5000ms
   [junit4]   2> 1073908 DEBUG (AutoscalingActionExecutor-2597-thread-1-processing-n:127.0.0.1:32850_solr) [n:127.0.0.1:32850_solr    ] o.a.s.c.a.ScheduledTriggers Resuming trigger: node_added_triggerCTOOR after 5000ms
   [junit4]   2> 1073912 DEBUG (AutoscalingActionExecutor-2597-thread-1-processing-n:127.0.0.1:32850_solr) [n:127.0.0.1:32850_solr    ] o.a.s.c.a.ScheduledTriggers -- processing took 9 ms for event id=45cbddfdad6919T4e30cm4g2feiukpwgx3xg9fbm
   [junit4]   2> 1073921 INFO  (TEST-TriggerIntegrationTest.testSetProperties-seed#[24B4BD63E0209CAF]) [    ] o.a.s.SolrTestCaseJ4 ###Starting testSetProperties
   [junit4]   2> 1073923 INFO  (qtp1380633802-8066) [n:127.0.0.1:32850_solr    ] o.a.s.h.a.CollectionsHandler Invoked Collection Action :overseerstatus with params action=OVERSEERSTATUS&wt=javabin&version=2 and sendToOCPQueue=true
   [junit4]   2> 1073928 INFO  (qtp1380633802-8066) [n:127.0.0.1:32850_solr    ] o.a.s.s.HttpSolrCall [admin] webapp=null path=/admin/collections params={action=OVERSEERSTATUS&wt=javabin&version=2} status=0 QTime=5
   [junit4]   2> 1073929 INFO  (TEST-TriggerIntegrationTest.testSetProperties-seed#[24B4BD63E0209CAF]) [    ] o.a.s.c.a.ScheduledTriggers -- removing trigger: .auto_add_replicas
   [junit4]   2> 1073930 INFO  (TEST-TriggerIntegrationTest.testSetProperties-seed#[24B4BD63E0209CAF]) [    ] o.a.s.c.a.ScheduledTriggers -- removing trigger: node_added_triggerCTOOR
   [junit4]   2> 1073931 INFO  (TEST-TriggerIntegrationTest.testSetProperties-seed#[24B4BD63E0209CAF]) [    ] o.a.s.c.a.TriggerIntegrationTest /autoscaling.json reset, new znode version 5
   [junit4]   2> 1073931 DEBUG (zkCallback-1540-thread-1-processing-n:127.0.0.1:32850_solr) [n:127.0.0.1:32850_solr    ] o.a.s.c.a.OverseerTriggerThread Refreshing /autoscaling.json with znode version 5
   [junit4]   2> 1073931 DEBUG (OverseerAutoScalingTriggerThread-73345108438089739-127.0.0.1:32850_solr-n_0000000002) [n:127.0.0.1:32850_solr    ] o.a.s.c.a.OverseerTriggerThread Processed trigger updates upto znodeVersion 5
   [junit4]   2> 1073931 DEBUG (OverseerAutoScalingTriggerThread-73345108438089739-127.0.0.1:32850_solr-n_0000000002) [n:127.0.0.1:32850_solr    ] o.a.s.c.a.OverseerTriggerThread -- clean old nodeLost markers
   [junit4]   2> 1073932 DEBUG (OverseerAutoScalingTriggerThread-73345108438089739-127.0.0.1:32850_solr-n_0000000002) [n:127.0.0.1:32850_solr    ] o.a.s.c.a.OverseerTriggerThread -- clean old nodeAdded markers
   [junit4]   2> 1073932 DEBUG (OverseerAutoScalingTriggerThread-73345108438089739-127.0.0.1:32850_solr-n_0000000002) [n:127.0.0.1:32850_solr    ] o.a.s.c.a.OverseerTriggerThread Current znodeVersion 5, lastZnodeVersion 5
   [junit4]   2> 1073932 INFO  (TEST-TriggerIntegrationTest.testSetProperties-seed#[24B4BD63E0209CAF]) [    ] o.a.s.c.c.ZkStateReader Updated live nodes from ZooKeeper... (0) -> (2)
   [junit4]   2> 1073934 INFO  (TEST-TriggerIntegrationTest.testSetProperties-seed#[24B4BD63E0209CAF]) [    ] o.e.j.s.AbstractConnector Stopped ServerConnector@5e06b1e3{HTTP/1.1,[http/1.1]}{127.0.0.1:0}
   [junit4]   2> 1073934 INFO  (TEST-TriggerIntegrationTest.testSetProperties-seed#[24B4BD63E0209CAF]) [    ] o.a.s.c.CoreContainer Shutting down CoreContainer instance=2051132034
   [junit4]   2> 1073934 INFO  (TEST-TriggerIntegrationTest.testSetProperties-seed#[24B4BD63E0209CAF]) [    ] o.a.s.m.SolrMetricManager Closing metric reporters for registry=solr.node, tag=null
   [junit4]   2> 1073934 INFO  (TEST-TriggerIntegrationTest.testSetProperties-seed#[24B4BD63E0209CAF]) [    ] o.a.s.m.r.SolrJmxReporter Closing reporter [org.apache.solr.metrics.reporters.SolrJmxReporter@5802c6e2: rootName = solr_32850, domain = solr.node, service url = null, agent id = null] for registry solr.node / com.codahale.metrics.MetricRegistry@3645edf
   [junit4]   2> 1073941 INFO  (TEST-TriggerIntegrationTest.testSetProperties-seed#[24B4BD63E0209CAF]) [    ] o.a.s.m.SolrMetricManager Closing metric reporters for registry=solr.jvm, tag=null
   [junit4]   2> 1073941 INFO  (TEST-TriggerIntegrationTest.testSetProperties-seed#[24B4BD63E0209CAF]) [    ] o.a.s.m.r.SolrJmxReporter Closing reporter [org.apache.solr.metrics.reporters.SolrJmxReporter@6c6bd4ef: rootName = solr_32850, domain = solr.jvm, service url = null, agent id = null] for registry solr.jvm / com.codahale.metrics.MetricRegistry@4ec2a71
   [junit4]   2> 1073945 INFO  (TEST-TriggerIntegrationTest.testSetProperties-seed#[24B4BD63E0209CAF]) [    ] o.a.s.m.SolrMetricManager Closing metric reporters for registry=solr.jetty, tag=null
   [junit4]   2> 1073945 INFO  (TEST-TriggerIntegrationTest.testSetProperties-seed#[24B4BD63E0209CAF]) [    ] o.a.s.m.r.SolrJmxReporter Closing reporter [org.apache.solr.metrics.reporters.SolrJmxReporter@1380cab8: rootName = solr_32850, domain = solr.jetty, service url = null, agent id = null] for registry solr.jetty / com.codahale.metrics.MetricRegistry@6adeaf91
   [junit4]   2> 1073946 INFO  (TEST-TriggerIntegrationTest.testSetProperties-seed#[24B4BD63E0209CAF]) [    ] o.a.s.c.ZkController Remove node as live in ZooKeeper:/live_nodes/127.0.0.1:32850_solr
   [junit4]   2> 1073947 INFO  (zkCallback-1550-thread-1-processing-n:127.0.0.1:41620_solr) [n:127.0.0.1:41620_solr    ] o.a.s.c.c.ZkStateReader Updated live nodes from ZooKeeper... (2) -> (1)
   [junit4]   2> 1073948 INFO  (zkCallback-1531-thread-1) [    ] o.a.s.c.c.ZkStateReader Updated live nodes from ZooKeeper... (2) -> (1)
   [junit4]   2> 1073949 INFO  (TEST-TriggerIntegrationTest.testSetProperties-seed#[24B4BD63E0209CAF]) [    ] o.a.s.m.SolrMetricManager Closing metric reporters for registry=solr.cluster, tag=null
   [junit4]   2> 1073949 INFO  (TEST-TriggerIntegrationTest.testSetProperties-seed#[24B4BD63E0209CAF]) [    ] o.a.s.c.TransientSolrCoreCacheDefault Allocating transient cache for 2147483647 transient cores
   [junit4]   2> 1073949 INFO  (TEST-TriggerIntegrationTest.testSetProperties-seed#[24B4BD63E0209CAF]) [    ] o.a.s.c.Overseer Overseer (id=73345108438089739-127.0.0.1:32850_solr-n_0000000002) closing
   [junit4]   2> 1073949 WARN  (OverseerAutoScalingTriggerThread-73345108438089739-127.0.0.1:32850_solr-n_0000000002) [n:127.0.0.1:32850_solr    ] o.a.s.c.a.OverseerTriggerThread OverseerTriggerThread woken up but we are closed, exiting.
   [junit4]   2> 1073949 INFO  (OverseerStateUpdate-73345108438089739-127.0.0.1:32850_solr-n_0000000002) [n:127.0.0.1:32850_solr    ] o.a.s.c.Overseer Overseer Loop exiting : 127.0.0.1:32850_solr
   [junit4]   2> 1073950 INFO  (zkCallback-1540-thread-1-processing-n:127.0.0.1:32850_solr) [n:127.0.0.1:32850_solr    ] o.a.s.c.c.ZkStateReader Updated live nodes from ZooKeeper... (2) -> (1)
   [junit4]   2> 1073955 INFO  (zkCallback-1531-thread-2) [    ] o.a.s.c.c.ZkStateReader Updated live nodes from ZooKeeper... (2) -> (1)
   [junit4]   2> 1073955 DEBUG (TEST-TriggerIntegrationTest.testSetProperties-seed#[24B4BD63E0209CAF]) [    ] o.a.s.c.a.OverseerTriggerThread OverseerTriggerThread has been closed explicitly
   [junit4]   2> 1073956 INFO  (zkCallback-1531-thread-3) [    ] o.a.s.c.c.ZkStateReader Updated live nodes from ZooKeeper... (2) -> (1)
   [junit4]   2> 1073956 INFO  (zkCallback-1550-thread-1-processing-n:127.0.0.1:41620_solr) [n:127.0.0.1:41620_solr    ] o.a.s.c.OverseerElectionContext I am going to be the leader 127.0.0.1:41620_solr
   [junit4]   2> 1073957 INFO  (zkCallback-1550-thread-1-processing-n:127.0.0.1:41620_solr) [n:127.0.0.1:41620_solr    ] o.a.s.c.Overseer Overseer (id=73345108438089742-127.0.0.1:41620_solr-n_0000000003) starting
   [junit4]   2> 1073957 INFO  (TEST-TriggerIntegrationTest.testSetProperties-seed#[24B4BD63E0209CAF]) [    ] o.e.j.s.h.ContextHandler Stopped o.e.j.s.ServletContextHandler@3d310d8f{/solr,null,UNAVAILABLE}
   [junit4]   2> 1073957 INFO  (TEST-TriggerIntegrationTest.testSetProperties-seed#[24B4BD63E0209CAF]) [    ] o.e.j.s.session Stopped scavenging
   [junit4]   2> 1073961 DEBUG (OverseerAutoScalingTriggerThread-73345108438089742-127.0.0.1:41620_solr-n_0000000003) [n:127.0.0.1:41620_solr    ] o.a.s.c.a.OverseerTriggerThread Adding .autoAddReplicas trigger
   [junit4]   2> 1073962 DEBUG (OverseerAutoScalingTriggerThread-73345108438089742-127.0.0.1:41620_solr-n_0000000003) [n:127.0.0.1:41620_solr    ] o.a.s.c.a.OverseerTriggerThread Refreshing /autoscaling.json with znode version 6
   [junit4]   2> 1073962 DEBUG (OverseerAutoScalingTriggerThread-73345108438089742-127.0.0.1:41620_solr-n_0000000003) [n:127.0.0.1:41620_solr    ] o.a.s.c.a.NodeLostTrigger Initial livenodes: [127.0.0.1:41620_solr]
   [junit4]   2> 1073962 DEBUG (OverseerAutoScalingTriggerThread-73345108438089742-127.0.0.1:41620_solr-n_0000000003) [n:127.0.0.1:41620_solr    ] o.a.s.c.a.OverseerTriggerThread Current znodeVersion 6, lastZnodeVersion -1
   [junit4]   2> 1073962 DEBUG (OverseerAutoScalingTriggerThread-73345108438089742-127.0.0.1:41620_solr-n_0000000003) [n:127.0.0.1:41620_solr    ] o.a.s.c.a.OverseerTriggerThread Processed trigger updates upto znodeVersion 6
   [junit4]   2> 1073964 DEBUG (OverseerAutoScalingTriggerThread-73345108438089742-127.0.0.1:41620_solr-n_0000000003) [n:127.0.0.1:41620_solr    ] o.a.s.c.a.OverseerTriggerThread -- clean old nodeAdded markers
   [junit4]   2> 1073964 DEBUG (OverseerAutoScalingTriggerThread-73345108438089742-127.0.0.1:41620_solr-n_0000000003) [n:127.0.0.1:41620_solr    ] o.a.s.c.a.OverseerTriggerThread Current znodeVersion 6, lastZnodeVersion 6
   [junit4]   2> 1073964 DEBUG (ScheduledTrigger-2607-thread-1) [n:127.0.0.1:41620_solr    ] o.a.s.c.a.NodeLostTrigger Running NodeLostTrigger: .auto_add_replicas with currently live nodes: 1
   [junit4]   2> 1074965 DEBUG (ScheduledTrigger-2607-thread-1) [n:127.0.0.1:41620_solr    ] o.a.s.c.a.NodeLostTrigger Running NodeLostTrigger: .auto_add_replicas with currently live nodes: 1
   [junit4]   2> 1075966 DEBUG (ScheduledTrigger-2607-thread-2) [n:127.0.0.1:41620_solr    ] o.a.s.c.a.NodeLostTrigger Running NodeLostTrigger: .auto_add_replicas with currently live nodes: 1
   [junit4]   2> 1076966 DEBUG (ScheduledTrigger-2607-thread-1) [n:127.0.0.1:41620_solr    ] o.a.s.c.a.NodeLostTrigger Running NodeLostTrigger: .auto_add_replicas with currently live nodes: 1
   [junit4]   2> 1077967 DEBUG (ScheduledTrigger-2607-thread-1) [n:127.0.0.1:41620_solr    ] o.a.s.c.a.NodeLostTrigger Running NodeLostTrigger: .auto_add_replicas with currently live nodes: 1
   [junit4]   2> 1078958 INFO  (TEST-TriggerIntegrationTest.testSetProperties-seed#[24B4BD63E0209CAF]) [    ] o.e.j.s.Server jetty-9.4.8.v20171121, build timestamp: 2017-11-22T02:57:37+05:30, git hash: 82b8fb23f757335bb3329d540ce37a2a2615f0a8
   [junit4]   2> 1078962 INFO  (TEST-TriggerIntegrationTest.testSetProperties-seed#[24B4BD63E0209CAF]) [    ] o.e.j.s.session DefaultSessionIdManager workerName=node0
   [junit4]   2> 1078962 INFO  (TEST-TriggerIntegrationTest.testSetProperties-seed#[24B4BD63E0209CAF]) [    ] o.e.j.s.session No SessionScavenger set, using defaults
   [junit4]   2> 1078962 INFO  (TEST-TriggerIntegrationTest.testSetProperties-seed#[24B4BD63E0209CAF]) [    ] o.e.j.s.session Scavenging every 600000ms
   [junit4]   2> 1078963 INFO  (TEST-TriggerIntegrationTest.testSetProperties-seed#[24B4BD63E0209CAF]) [    ] o.e.j.s.h.ContextHandler Started o.e.j.s.ServletContextHandler@56900ad{/solr,null,AVAILABLE}
   [junit4]   2> 1078963 INFO  (TEST-TriggerIntegrationTest.testSetProperties-seed#[24B4BD63E0209CAF]) [    ] o.e.j.s.AbstractConnector Started ServerConnector@e42ebf{HTTP/1.1,[http/1.1]}{127.0.0.1:50159}
   [junit4]   2> 1078963 INFO  (TEST-TriggerIntegrationTest.testSetProperties-seed#[24B4BD63E0209CAF]) [    ] o.e.j.s.Server Started @1081408ms
   [junit4]   2> 1078963 INFO  (TEST-TriggerIntegrationTest.testSetProperties-seed#[24B4BD63E0209CAF]) [    ] o.a.s.c.s.e.JettySolrRunner Jetty properties: {hostContext=/solr, hostPort=50159}
   [junit4]   2> 1078963 ERROR (TEST-TriggerIntegrationTest.testSetProperties-seed#[24B4BD63E0209CAF]) [    ] o.a.s.u.StartupLoggingUtils Missing Java Option solr.log.dir. Logging may be missing or incomplete.
   [junit4]   2> 1078964 INFO  (TEST-TriggerIntegrationTest.testSetProperties-seed#[24B4BD63E0209CAF]) [    ] o.a.s.s.SolrDispatchFilter  ___      _       Welcome to Apache Solr™ version 8.0.0
   [junit4]   2> 1078964 INFO  (TEST-TriggerIntegrationTest.testSetProperties-seed#[24B4BD63E0209CAF]) [    ] o.a.s.s.SolrDispatchFilter / __| ___| |_ _   Starting in cloud mode on port null
   [junit4]   2> 1078964 INFO  (TEST-TriggerIntegrationTest.testSetProperties-seed#[24B4BD63E0209CAF]) [    ] o.a.s.s.SolrDispatchFilter \__ \/ _ \ | '_|  Install dir: null
   [junit4]   2> 1078964 INFO  (TEST-TriggerIntegrationTest.testSetProperties-seed#[24B4BD63E0209CAF]) [    ] o.a.s.s.SolrDispatchFilter |___/\___/_|_|    Start time: 2018-02-23T13:53:47.543Z
   [junit4]   2> 1078967 DEBUG (ScheduledTrigger-2607-thread-1) [n:127.0.0.1:41620_solr    ] o.a.s.c.a.NodeLostTrigger Running NodeLostTrigger: .auto_add_replicas with currently live nodes: 1
   [junit4]   2> 1078975 INFO  (zkConnectionManagerCallback-1556-thread-1) [    ] o.a.s.c.c.ConnectionManager zkClient has connected
   [junit4]   2> 1078975 INFO  (TEST-TriggerIntegrationTest.testSetProperties-seed#[24B4BD63E0209CAF]) [    ] o.a.s.s.SolrDispatchFilter solr.xml found in ZooKeeper. Loading...
   [junit4]   2> 1078994 INFO  (TEST-TriggerIntegrationTest.testSetProperties-seed#[24B4BD63E0209CAF]) [    ] o.a.s.c.ZkContainer Zookeeper client=127.0.0.1:59445/solr
   [junit4]   2> 1079025 INFO  (zkConnectionManagerCallback-1560-thread-1) [    ] o.a.s.c.c.ConnectionManager zkClient has connected
   [junit4]   2> 1079033 INFO  (zkConnectionManagerCallback-1562-thread-1-processing-n:127.0.0.1:50159_solr) [n:127.0.0.1:50159_solr    ] o.a.s.c.c.ConnectionManager zkClient has connected
   [junit4]   2> 1079039 INFO  (TEST-TriggerIntegrationTest.testSetProperties-seed#[24B4BD63E0209CAF]) [n:127.0.0.1:50159_solr    ] o.a.s.c.c.ZkStateReader Updated live nodes from ZooKeeper... (0) -> (1)
   [junit4]   2> 1079040 INFO  (TEST-TriggerIntegrationTest.testSetProperties-seed#[24B4BD63E0209CAF]) [n:127.0.0.1:50159_solr    ] o.a.s.c.Overseer Overseer (id=null) closing
   [junit4]   2> 1079042 INFO  (TEST-TriggerIntegrationTest.testSetProperties-seed#[24B4BD63E0209CAF]) [n:127.0.0.1:50159_solr    ] o.a.s.c.ZkController Register node as live in ZooKeeper:/live_nodes/127.0.0.1:50159_solr
   [junit4]   2> 1079045 INFO  (zkCallback-1550-thread-1-processing-n:127.0.0.1:41620_solr) [n:127.0.0.1:41620_solr    ] o.a.s.c.c.ZkStateReader Updated live nodes from ZooKeeper... (1) -> (2)
   [junit4]   2> 1079045 INFO  (zkCallback-1531-thread-3) [    ] o.a.s.c.c.ZkStateReader Updated live nodes from ZooKeeper... (1) -> (2)
   [junit4]   2> 1079045 INFO  (zkCallback-1531-thread-2) [    ] o.a.s.c.c.ZkStateReader Updated live nodes from ZooKeeper... (1) -> (2)
   [junit4]   2> 1079045 INFO  (zkCallback-1531-thread-1) [    ] o.a.s.c.c.ZkStateReader Updated live nodes from ZooKeeper... (1) -> (2)
   [junit4]   2> 1079051 INFO  (zkCallback-1561-thread-1-processing-n:127.0.0.1:50159_solr) [n:127.0.0.1:50159_solr    ] o.a.s.c.c.ZkStateReader Updated live nodes from ZooKeeper... (1) -> (2)
   [junit4]   2> 1079156 INFO  (TEST-TriggerIntegrationTest.testSetProperties-seed#[24B4BD63E0209CAF]) [n:127.0.0.1:50159_solr    ] o.a.s.m.r.SolrJmxReporter JMX monitoring for 'solr_50159.solr.node' (registry 'solr.node') enabled at server: com.sun.jmx.mbeanserver.JmxMBeanServer@7f4734c5
   [junit4]   2> 1079166 INFO  (TEST-TriggerIntegrationTest.testSetProperties-seed#[24B4BD63E0209CAF]) [n:127.0.0.1:50159_solr    ] o.a.s.m.r.SolrJmxReporter JMX monitoring for 'solr_50159.solr.jvm' (registry 'solr.jvm') enabled at server: com.sun.jmx.mbeanserver.JmxMBeanServer@7f4734c5
   [junit4]   2> 1079166 INFO  (TEST-TriggerIntegrationTest.testSetProperties-seed#[24B4BD63E0209CAF]) [n:127.0.0.1:50159_solr    ] o.a.s.m.r.SolrJmxReporter JMX monitoring for 'solr_50159.solr.jetty' (registry 'solr.jetty') enabled at server: com.sun.jmx.mbeanserver.JmxMBeanServer@7f4734c5
   [junit4]   2> 1079167 INFO  (TEST-TriggerIntegrationTest.testSetProperties-seed#[24B4BD63E0209CAF]) [n:127.0.0.1:50159_solr    ] o.a.s.c.CorePropertiesLocator Found 0 core definitions underneath /x1/jenkins/jenkins-slave/workspace/Lucene-Solr-Tests-master/solr/build/solr-core/test/J0/temp/solr.cloud.autoscaling.TriggerIntegrationTest_24B4BD63E0209CAF-001/tempDir-001/node5/.
   [junit4]   2> 1079967 DEBUG (ScheduledTrigger-2607-thread-1) [n:127.0.0.1:41620_solr    ] o.a.s.c.a.NodeLostTrigger Running NodeLostTrigger: .auto_add_replicas with currently live nodes: 2
   [junit4]   2> 1080202 DEBUG (TEST-TriggerIntegrationTest.testSetProperties-seed#[24B4BD63E0209CAF]) [    ] o.a.s.c.a.ScheduledTriggers Changing value of autoscaling property: triggerScheduleDelaySeconds from: 1 to: 4
   [junit4]   2> 1080968 DEBUG (ScheduledTrigger-2607-thread-1) [n:127.0.0.1:41620_solr    ] o.a.s.c.a.NodeLostTrigger Running NodeLostTrigger: .auto_add_replicas with currently live nodes: 2
   [junit4]   2> 1081968 DEBUG (ScheduledTrigger-2607-thread-1) [n:127.0.0.1:41620_solr    ] o.a.s.c.a.NodeLostTrigger Running NodeLostTrigger: .auto_add_replicas with currently live nodes: 2
   [junit4]   2> 1082968 DEBUG (ScheduledTrigger-2607-thread-1) [n:127.0.0.1:41620_solr    ] o.a.s.c.a.NodeLostTrigger Running NodeLostTrigger: .auto_add_replicas with currently live nodes: 2
   [junit4]   2> 1083969 DEBUG (ScheduledTrigger-2607-thread-1) [n:127.0.0.1:41620_solr    ] o.a.s.c.a.NodeLostTrigger Running NodeLostTrigger: .auto_add_replicas with currently live nodes: 2
   [junit4]   2> 1084969 DEBUG (ScheduledTrigger-2607-thread-1) [n:127.0.0.1:41620_solr    ] o.a.s.c.a.NodeLostTrigger Running NodeLostTrigger: .auto_add_replicas with currently live nodes: 2
   [junit4]   2> 1085969 DEBUG (ScheduledTrigger-2607-thread-1) [n:127.0.0.1:41620_solr    ] o.a.s.c.a.NodeLostTrigger Running NodeLostTrigger: .auto_add_replicas with currently live nodes: 2
   [junit4]   2> 1086969 DEBUG (ScheduledTrigger-2607-thread-1) [n:127.0.0.1:41620_solr    ] o.a.s.c.a.NodeLostTrigger Running NodeLostTrigger: .auto_add_replicas with currently live nodes: 2
   [junit4]   2> 1087970 DEBUG (ScheduledTrigger-2607-thread-1) [n:127.0.0.1:41620_solr    ] o.a.s.c.a.NodeLostTrigger Running NodeLostTrigger: .auto_add_replicas with currently live nodes: 2
   [junit4]   2> 1088205 DEBUG (TEST-TriggerIntegrationTest.testSetProperties-seed#[24B4BD63E0209CAF]) [    ] o.a.s.c.a.ScheduledTriggers Changing value of autoscaling property: triggerScheduleDelaySeconds from: 4 to: 1
   [junit4]   2> 1088970 DEBUG (ScheduledTrigger-2607-thread-1) [n:127.0.0.1:41620_solr    ] o.a.s.c.a.NodeLostTrigger Running NodeLostTrigger: .auto_add_replicas with currently live nodes: 2
   [junit4]   2> 1089970 DEBUG (ScheduledTrigger-2607-thread-1) [n:127.0.0.1:41620_solr    ] o.a.s.c.a.NodeLostTrigger Running NodeLostTrigger: .auto_add_replicas with currently live nodes: 2
   [junit4]   2> 1090971 DEBUG (ScheduledTrigger-2607-thread-1) [n:127.0.0.1:41620_solr    ] o.a.s.c.a.NodeLostTrigger Running NodeLostTrigger: .auto_add_replicas with currently live nodes: 2
   [junit4]   2> 1091971 DEBUG (ScheduledTrigger-2607-thread-1) [n:127.0.0.1:41620_solr    ] o.a.s.c.a.NodeLostTrigger Running NodeLostTrigger: .auto_add_replicas with currently live nodes: 2
   [junit4]   2> 1092971 DEBUG (ScheduledTrigger-2607-thread-1) [n:127.0.0.1:41620_solr    ] o.a.s.c.a.NodeLostTrigger Running NodeLostTrigger: .auto_add_replicas with currently live nodes: 2
   [junit4]   2> 1093972 DEBUG (ScheduledTrigger-2607-thread-1) [n:127.0.0.1:41620_solr    ] o.a.s.c.a.NodeLostTrigger Running NodeLostTrigger: .auto_add_replicas with currently live nodes: 2
   [junit4]   2> 1094972 DEBUG (ScheduledTrigger-2607-thread-1) [n:127.0.0.1:41620_solr    ] o.a.s.c.a.NodeLostTrigger Running NodeLostTrigger: .auto_add_replicas with currently live nodes: 2
   [junit4]   2> 1095972 DEBUG (ScheduledTrigger-2607-thread-1) [n:127.0.0.1:41620_solr    ] o.a.s.c.a.NodeLostTrigger Running NodeLostTrigger: .auto_add_replicas with currently live nodes: 2
   [junit4]   2> 1096972 DEBUG (ScheduledTrigger-2607-thread-1) [n:127.0.0.1:41620_solr    ] o.a.s.c.a.NodeLostTrigger Running NodeLostTrigger: .auto_add_replicas with currently live nodes: 2
   [junit4]   2> 1097973 DEBUG (ScheduledTrigger-2607-thread-1) [n:127.0.0.1:41620_solr    ] o.a.s.c.a.NodeLostTrigger Running NodeLostTrigger: .auto_add_replicas with currently live nodes: 2
   [junit4]   2> 1098215 DEBUG (TEST-TriggerIntegrationTest.testSetProperties-seed#[24B4BD63E0209CAF]) [    ] o.a.s.c.a.ScheduledTriggers Changing value of autoscaling property: triggerCorePoolSize from: 4 to: 6
   [junit4]   2> 1098973 DEBUG (ScheduledTrigger-2607-thread-1) [n:127.0.0.1:41620_solr    ] o.a.s.c.a.NodeLostTrigger Running NodeLostTrigger: .auto_add_replicas with currently live nodes: 2
   [junit4]   2> 1099973 DEBUG (ScheduledTrigger-2607-thread-1) [n:127.0.0.1:41620_solr    ] o.a.s.c.a.NodeLostTrigger Running NodeLostTrigger: .auto_add_replicas with currently live nodes: 2
   [junit4]   2> 1100974 DEBUG (ScheduledTrigger-2607-thread-1) [n:127.0.0.1:41620_solr    ] o.a.s.c.a.NodeLostTrigger Running NodeLostTrigger: .auto_add_replicas with currently live nodes: 2
   [junit4]   2> 1101974 DEBUG (ScheduledTrigger-2607-thread-1) [n:127.0.0.1:41620_solr    ] o.a.s.c.a.NodeLostTrigger Running NodeLostTrigger: .auto_add_replicas with currently live nodes: 2
   [junit4]   2> 1102975 DEBUG (ScheduledTrigger-2607-thread-1) [n:127.0.0.1:41620_solr    ] o.a.s.c.a.NodeLostTrigger Running NodeLostTrigger: .auto_add_replicas with currently live nodes: 2
   [junit4]   2> 1103975 DEBUG (ScheduledTrigger-2607-thread-1) [n:127.0.0.1:41620_solr    ] o.a.s.c.a.NodeLostTrigger Running NodeLostTrigger: .auto_add_replicas with currently live nodes: 2
   [junit4]   2> 1104975 DEBUG (ScheduledTrigger-2607-thread-1) [n:127.0.0.1:41620_solr    ] o.a.s.c.a.NodeLostTrigger Running NodeLostTrigger: .auto_add_replicas with currently live nodes: 2
   [junit4]   2> 1105975 DEBUG (ScheduledTrigger-2607-thread-1) [n:127.0.0.1:41620_solr    ] o.a.s.c.a.NodeLostTrigger Running NodeLostTrigger: .auto_add_replicas with currently live nodes: 2
   [junit4]   2> 1106976 DEBUG (ScheduledTrigger-2607-thread-1) [n:127.0.0.1:41620_solr    ] o.a.s.c.a.NodeLostTrigger Running NodeLostTrigger: .auto_add_replicas with currently live nodes: 2
   [junit4]   2> 1107976 DEBUG (ScheduledTrigger-2607-thread-1) [n:127.0.0.1:41620_solr    ] o.a.s.c.a.NodeLostTrigger Running NodeLostTrigger: .auto_add_replicas with currently live nodes: 2
   [junit4]   2> 1108222 INFO  (TEST-TriggerIntegrationTest.testSetProperties-seed#[24B4BD63E0209CAF]) [    ] o.a.s.SolrTestCaseJ4 ###Ending testSetProperties
   [junit4]   2> 1108235 INFO  (TEST-TriggerIntegrationTest.testNodeLostTrigger-seed#[24B4BD63E0209CAF]) [    ] o.a.s.SolrTestCaseJ4 ###Starting testNodeLostTrigger
   [junit4]   2> 1108236 INFO  (qtp730770475-8098) [n:127.0.0.1:41620_solr    ] o.a.s.h.a.CollectionsHandler Invoked Collection Action :overseerstatus with params action=OVERSEERSTATUS&wt=javabin&version=2 and sendToOCPQueue=true
   [junit4]   2> 1108242 INFO  (qtp730770475-8098) [n:127.0.0.1:41620_solr    ] o.a.s.s.HttpSolrCall [admin] webapp=null path=/admin/collections params={action=OVERSEERSTATUS&wt=javabin&version=2} status=0 QTime=6
   [junit4]   2> 1108243 INFO  (TEST-TriggerIntegrationTest.testNodeLostTrigger-seed#[24B4BD63E0209CAF]) [    ] o.a.s.c.a.ScheduledTriggers -- removing trigger: .auto_add_replicas
   [junit4]   2> 1108244 INFO  (TEST-TriggerIntegrationTest.testNodeLostTrigger-seed#[24B4BD63E0209CAF]) [    ] o.a.s.c.a.TriggerIntegrationTest /autoscaling.json reset, new znode version 7
   [junit4]   2> 1108245 DEBUG (zkCallback-1550-thread-1-processing-n:127.0.0.1:41620_solr) [n:127.0.0.1:41620_solr    ] o.a.s.c.a.OverseerTriggerThread Refreshing /autoscaling.json with znode version 7
   [junit4]   2> 1108245 DEBUG (OverseerAutoScalingTriggerThread-73345108438089742-127.0.0.1:41620_solr-n_0000000003) [n:127.0.0.1:41620_solr    ] o.a.s.c.a.OverseerTriggerThread Processed trigger updates upto znodeVersion 7
   [junit4]   2> 1108245 DEBUG (OverseerAutoScalingTriggerThread-73345108438089742-127.0.0.1:41620_solr-n_0000000003) [n:127.0.0.1:41620_solr    ] o.a.s.c.a.OverseerTriggerThread -- clean old nodeLost markers
   [junit4]   2> 1108245 DEBUG (OverseerAutoScalingTriggerThread-73345108438089742-127.0.0.1:41620_solr-n_0000000003) [n:127.0.0.1:41620_solr    ] o.a.s.c.a.OverseerTriggerThread -- clean old nodeAdded markers
   [junit4]   2> 1108245 INFO  (TEST-TriggerIntegrationTest.testNodeLostTrigger-seed#[24B4BD63E0209CAF]) [    ] o.a.s.c.c.ZkStateReader Updated live nodes from ZooKeeper... (0) -> (2)
   [junit4]   2> 1108245 DEBUG (OverseerAutoScalingTriggerThread-73345108438089742-127.0.0.1:41620_solr-n_0000000003) [n:127.0.0.1:41620_

[...truncated too long message...]

  [junit4]   2> 1520008 ERROR (TEST-ShardRoutingTest.test-seed#[24B4BD63E0209CAF]) [    ] o.a.z.s.ZooKeeperServer ZKShutdownHandler is not registered, so ZooKeeper server won't take any action on ERROR or SHUTDOWN server state changes
   [junit4]   2> 1520008 INFO  (TEST-ShardRoutingTest.test-seed#[24B4BD63E0209CAF]) [    ] o.a.s.c.ZkTestServer connecting to 127.0.0.1:42625 42625
   [junit4]   2> 1520185 INFO  (Thread-2158) [    ] o.a.s.c.ZkTestServer connecting to 127.0.0.1:42625 42625
   [junit4]   2> 1520186 WARN  (Thread-2158) [    ] o.a.s.c.ZkTestServer Watch limit violations: 
   [junit4]   2> Maximum concurrent create/delete watches above limit:
   [junit4]   2> 
   [junit4]   2> 	11	/solr/aliases.json
   [junit4]   2> 	9	/solr/security.json
   [junit4]   2> 	9	/solr/configs/conf1
   [junit4]   2> 	5	/solr/collections/collection1/terms/shard1
   [junit4]   2> 	5	/solr/collections/collection1/terms/shard2
   [junit4]   2> 	5	/solr/collections/collection1/terms/shard3
   [junit4]   2> 	5	/solr/collections/collection1/terms/shard4
   [junit4]   2> 	2	/solr/collections/control_collection/terms/shard1
   [junit4]   2> 
   [junit4]   2> Maximum concurrent data watches above limit:
   [junit4]   2> 
   [junit4]   2> 	11	/solr/clusterprops.json
   [junit4]   2> 	11	/solr/clusterstate.json
   [junit4]   2> 	9	/solr/autoscaling.json
   [junit4]   2> 	8	/solr/collections/collection1/state.json
   [junit4]   2> 
   [junit4]   2> Maximum concurrent children watches above limit:
   [junit4]   2> 
   [junit4]   2> 	11	/solr/live_nodes
   [junit4]   2> 	11	/solr/collections
   [junit4]   2> 	9	/solr/overseer/queue
   [junit4]   2> 	9	/solr/overseer/queue-work
   [junit4]   2> 	9	/solr/overseer/collection-queue-work
   [junit4]   2> 	8	/solr/autoscaling/events/.auto_add_replicas
   [junit4]   2> 
   [junit4]   2> 1520187 INFO  (SUITE-ShardRoutingTest-seed#[24B4BD63E0209CAF]-worker) [    ] o.a.s.SolrTestCaseJ4 ------------------------------------------------------- Done waiting for tracked resources to be released
   [junit4]   2> Feb 23, 2018 2:01:09 PM com.carrotsearch.randomizedtesting.ThreadLeakControl checkThreadLeaks
   [junit4]   2> WARNING: Will linger awaiting termination of 1 leaked thread(s).
   [junit4]   2> Feb 23, 2018 2:01:29 PM com.carrotsearch.randomizedtesting.ThreadLeakControl checkThreadLeaks
   [junit4]   2> SEVERE: 1 thread leaked from SUITE scope at org.apache.solr.cloud.ShardRoutingTest: 
   [junit4]   2>    1) Thread[id=9777, name=qtp795916695-9777, state=TIMED_WAITING, group=TGRP-ShardRoutingTest]
   [junit4]   2>         at sun.misc.Unsafe.park(Native Method)
   [junit4]   2>         at java.util.concurrent.locks.LockSupport.parkNanos(LockSupport.java:215)
   [junit4]   2>         at java.util.concurrent.locks.AbstractQueuedSynchronizer$ConditionObject.await(AbstractQueuedSynchronizer.java:2163)
   [junit4]   2>         at org.eclipse.jetty.util.thread.ReservedThreadExecutor$ReservedThread.reservedWait(ReservedThreadExecutor.java:308)
   [junit4]   2>         at org.eclipse.jetty.util.thread.ReservedThreadExecutor$ReservedThread.run(ReservedThreadExecutor.java:373)
   [junit4]   2>         at org.eclipse.jetty.util.thread.QueuedThreadPool.runJob(QueuedThreadPool.java:708)
   [junit4]   2>         at org.eclipse.jetty.util.thread.QueuedThreadPool$2.run(QueuedThreadPool.java:626)
   [junit4]   2>         at java.lang.Thread.run(Thread.java:748)
   [junit4]   2> Feb 23, 2018 2:01:29 PM com.carrotsearch.randomizedtesting.ThreadLeakControl tryToInterruptAll
   [junit4]   2> INFO: Starting to interrupt leaked threads:
   [junit4]   2>    1) Thread[id=9777, name=qtp795916695-9777, state=TIMED_WAITING, group=TGRP-ShardRoutingTest]
   [junit4]   2> Feb 23, 2018 2:01:32 PM com.carrotsearch.randomizedtesting.ThreadLeakControl tryToInterruptAll
   [junit4]   2> SEVERE: There are still zombie threads that couldn't be terminated:
   [junit4]   2>    1) Thread[id=9777, name=qtp795916695-9777, state=TIMED_WAITING, group=TGRP-ShardRoutingTest]
   [junit4]   2>         at sun.misc.Unsafe.park(Native Method)
   [junit4]   2>         at java.util.concurrent.locks.LockSupport.parkNanos(LockSupport.java:215)
   [junit4]   2>         at java.util.concurrent.locks.AbstractQueuedSynchronizer$ConditionObject.await(AbstractQueuedSynchronizer.java:2163)
   [junit4]   2>         at org.eclipse.jetty.util.thread.ReservedThreadExecutor$ReservedThread.reservedWait(ReservedThreadExecutor.java:308)
   [junit4]   2>         at org.eclipse.jetty.util.thread.ReservedThreadExecutor$ReservedThread.run(ReservedThreadExecutor.java:373)
   [junit4]   2>         at org.eclipse.jetty.util.thread.QueuedThreadPool.runJob(QueuedThreadPool.java:708)
   [junit4]   2>         at org.eclipse.jetty.util.thread.QueuedThreadPool$2.run(QueuedThreadPool.java:626)
   [junit4]   2>         at java.lang.Thread.run(Thread.java:748)
   [junit4]   2> NOTE: test params are: codec=Asserting(Lucene70): {id=PostingsFormat(name=Memory)}, docValues:{foo_i=DocValuesFormat(name=Lucene70), _version_=DocValuesFormat(name=Lucene70)}, maxPointsInLeafNode=1275, maxMBSortInHeap=5.19073530171366, sim=Asserting(org.apache.lucene.search.similarities.AssertingSimilarity@70192e62), locale=ar-SA, timezone=America/Pangnirtung
   [junit4]   2> NOTE: Linux 3.13.0-88-generic amd64/Oracle Corporation 1.8.0_144 (64-bit)/cpus=4,threads=2,free=195209176,total=520093696
   [junit4]   2> NOTE: All tests run in this JVM: [PluginInfoTest, TestPHPSerializedResponseWriter, BinaryUpdateRequestHandlerTest, TestPullReplicaErrorHandling, TestDistribStateManager, TestRebalanceLeaders, TestClusterProperties, TestCrossCoreJoin, TestHdfsBackupRestoreCore, TestCollectionsAPIViaSolrCloudCluster, TestFastOutputStream, OverseerCollectionConfigSetProcessorTest, TestHalfAndHalfDocValues, TestFreeTextSuggestions, DistributedTermsComponentTest, ShardSplitTest, TestUseDocValuesAsStored2, TestManagedSchemaThreadSafety, SuggestComponentContextFilterQueryTest, CdcrReplicationDistributedZkTest, TestConfig, TestTrackingShardHandlerFactory, OutputWriterTest, TestGroupingSearch, ChaosMonkeyNothingIsSafeTest, SecurityConfHandlerTest, TestCollationField, TestSegmentSorting, TestEmbeddedSolrServerSchemaAPI, TestSkipOverseerOperations, TestRestoreCore, TestMultiValuedNumericRangeQuery, TestManagedSynonymFilterFactory, ReplicaListTransformerTest, TestStandardQParsers, BlockDirectoryTest, DistribDocExpirationUpdateProcessorTest, DirectoryFactoryTest, TestInitParams, BaseCdcrDistributedZkTest, TestLargeCluster, TestSolrXml, TestStressLucene, TestMergePolicyConfig, TestDynamicLoading, TestRemoteStreaming, LeaderFailureAfterFreshStartTest, StressHdfsTest, TestQueryWrapperFilter, SharedFSAutoReplicaFailoverTest, TestTestInjection, DateRangeFieldTest, DeleteLastCustomShardedReplicaTest, TestOmitPositions, TestSchemalessBufferedUpdates, SimpleFacetsTest, TestDocumentBuilder, TestOrdValues, TriggerIntegrationTest, SolrSlf4jReporterTest, QueryResultKeyTest, TestDistributedSearch, HLLUtilTest, ZkShardTermsTest, TestLegacyFieldReuse, TestPseudoReturnFields, TestPhraseSuggestions, RulesTest, UUIDFieldTest, ActionThrottleTest, TestRandomFaceting, ShardRoutingTest]
   [junit4]   2> NOTE: reproduce with: ant test  -Dtestcase=ShardRoutingTest -Dtests.seed=24B4BD63E0209CAF -Dtests.multiplier=2 -Dtests.slow=true -Dtests.locale=ar-SA -Dtests.timezone=America/Pangnirtung -Dtests.asserts=true -Dtests.file.encoding=UTF-8
   [junit4] ERROR   0.00s J0 | ShardRoutingTest (suite) <<<
   [junit4]    > Throwable #1: com.carrotsearch.randomizedtesting.ThreadLeakError: 1 thread leaked from SUITE scope at org.apache.solr.cloud.ShardRoutingTest: 
   [junit4]    >    1) Thread[id=9777, name=qtp795916695-9777, state=TIMED_WAITING, group=TGRP-ShardRoutingTest]
   [junit4]    >         at sun.misc.Unsafe.park(Native Method)
   [junit4]    >         at java.util.concurrent.locks.LockSupport.parkNanos(LockSupport.java:215)
   [junit4]    >         at java.util.concurrent.locks.AbstractQueuedSynchronizer$ConditionObject.await(AbstractQueuedSynchronizer.java:2163)
   [junit4]    >         at org.eclipse.jetty.util.thread.ReservedThreadExecutor$ReservedThread.reservedWait(ReservedThreadExecutor.java:308)
   [junit4]    >         at org.eclipse.jetty.util.thread.ReservedThreadExecutor$ReservedThread.run(ReservedThreadExecutor.java:373)
   [junit4]    >         at org.eclipse.jetty.util.thread.QueuedThreadPool.runJob(QueuedThreadPool.java:708)
   [junit4]    >         at org.eclipse.jetty.util.thread.QueuedThreadPool$2.run(QueuedThreadPool.java:626)
   [junit4]    >         at java.lang.Thread.run(Thread.java:748)
   [junit4]    > 	at __randomizedtesting.SeedInfo.seed([24B4BD63E0209CAF]:0)Throwable #2: com.carrotsearch.randomizedtesting.ThreadLeakError: There are still zombie threads that couldn't be terminated:
   [junit4]    >    1) Thread[id=9777, name=qtp795916695-9777, state=TIMED_WAITING, group=TGRP-ShardRoutingTest]
   [junit4]    >         at sun.misc.Unsafe.park(Native Method)
   [junit4]    >         at java.util.concurrent.locks.LockSupport.parkNanos(LockSupport.java:215)
   [junit4]    >         at java.util.concurrent.locks.AbstractQueuedSynchronizer$ConditionObject.await(AbstractQueuedSynchronizer.java:2163)
   [junit4]    >         at org.eclipse.jetty.util.thread.ReservedThreadExecutor$ReservedThread.reservedWait(ReservedThreadExecutor.java:308)
   [junit4]    >         at org.eclipse.jetty.util.thread.ReservedThreadExecutor$ReservedThread.run(ReservedThreadExecutor.java:373)
   [junit4]    >         at org.eclipse.jetty.util.thread.QueuedThreadPool.runJob(QueuedThreadPool.java:708)
   [junit4]    >         at org.eclipse.jetty.util.thread.QueuedThreadPool$2.run(QueuedThreadPool.java:626)
   [junit4]    >         at java.lang.Thread.run(Thread.java:748)
   [junit4]    > 	at __randomizedtesting.SeedInfo.seed([24B4BD63E0209CAF]:0)
   [junit4] Completed [465/778 (2!)] on J0 in 76.08s, 1 test, 2 errors <<< FAILURES!

[...truncated 51064 lines...]

Mime
View raw message