lucene-dev mailing list archives

Site index · List index
Message view « Date » · « Thread »
Top « Date » · « Thread »
From Policeman Jenkins Server <jenk...@thetaphi.de>
Subject [JENKINS] Lucene-Solr-7.x-Solaris (64bit/jdk1.8.0) - Build # 420 - Still Unstable!
Date Thu, 01 Feb 2018 04:36:40 GMT
Build: https://jenkins.thetaphi.de/job/Lucene-Solr-7.x-Solaris/420/
Java: 64bit/jdk1.8.0 -XX:-UseCompressedOops -XX:+UseSerialGC

4 tests failed.
FAILED:  org.apache.solr.cloud.AliasIntegrationTest.testModifyMetadataV2

Error Message:


Stack Trace:
java.lang.AssertionError
	at __randomizedtesting.SeedInfo.seed([FB172D5D63C9D5B9:76BA3FEF7D7AFD22]:0)
	at org.junit.Assert.fail(Assert.java:92)
	at org.junit.Assert.assertTrue(Assert.java:43)
	at org.junit.Assert.assertTrue(Assert.java:54)
	at org.apache.solr.cloud.AliasIntegrationTest.checkFooAndBarMeta(AliasIntegrationTest.java:283)
	at org.apache.solr.cloud.AliasIntegrationTest.testModifyMetadataV2(AliasIntegrationTest.java:237)
	at sun.reflect.NativeMethodAccessorImpl.invoke0(Native Method)
	at sun.reflect.NativeMethodAccessorImpl.invoke(NativeMethodAccessorImpl.java:62)
	at sun.reflect.DelegatingMethodAccessorImpl.invoke(DelegatingMethodAccessorImpl.java:43)
	at java.lang.reflect.Method.invoke(Method.java:498)
	at com.carrotsearch.randomizedtesting.RandomizedRunner.invoke(RandomizedRunner.java:1737)
	at com.carrotsearch.randomizedtesting.RandomizedRunner$8.evaluate(RandomizedRunner.java:934)
	at com.carrotsearch.randomizedtesting.RandomizedRunner$9.evaluate(RandomizedRunner.java:970)
	at com.carrotsearch.randomizedtesting.RandomizedRunner$10.evaluate(RandomizedRunner.java:984)
	at com.carrotsearch.randomizedtesting.rules.SystemPropertiesRestoreRule$1.evaluate(SystemPropertiesRestoreRule.java:57)
	at org.apache.lucene.util.TestRuleSetupTeardownChained$1.evaluate(TestRuleSetupTeardownChained.java:49)
	at org.apache.lucene.util.AbstractBeforeAfterRule$1.evaluate(AbstractBeforeAfterRule.java:45)
	at org.apache.lucene.util.TestRuleThreadAndTestName$1.evaluate(TestRuleThreadAndTestName.java:48)
	at org.apache.lucene.util.TestRuleIgnoreAfterMaxFailures$1.evaluate(TestRuleIgnoreAfterMaxFailures.java:64)
	at org.apache.lucene.util.TestRuleMarkFailure$1.evaluate(TestRuleMarkFailure.java:47)
	at com.carrotsearch.randomizedtesting.rules.StatementAdapter.evaluate(StatementAdapter.java:36)
	at com.carrotsearch.randomizedtesting.ThreadLeakControl$StatementRunner.run(ThreadLeakControl.java:368)
	at com.carrotsearch.randomizedtesting.ThreadLeakControl.forkTimeoutingTask(ThreadLeakControl.java:817)
	at com.carrotsearch.randomizedtesting.ThreadLeakControl$3.evaluate(ThreadLeakControl.java:468)
	at com.carrotsearch.randomizedtesting.RandomizedRunner.runSingleTest(RandomizedRunner.java:943)
	at com.carrotsearch.randomizedtesting.RandomizedRunner$5.evaluate(RandomizedRunner.java:829)
	at com.carrotsearch.randomizedtesting.RandomizedRunner$6.evaluate(RandomizedRunner.java:879)
	at com.carrotsearch.randomizedtesting.RandomizedRunner$7.evaluate(RandomizedRunner.java:890)
	at com.carrotsearch.randomizedtesting.rules.StatementAdapter.evaluate(StatementAdapter.java:36)
	at com.carrotsearch.randomizedtesting.rules.SystemPropertiesRestoreRule$1.evaluate(SystemPropertiesRestoreRule.java:57)
	at org.apache.lucene.util.AbstractBeforeAfterRule$1.evaluate(AbstractBeforeAfterRule.java:45)
	at com.carrotsearch.randomizedtesting.rules.StatementAdapter.evaluate(StatementAdapter.java:36)
	at org.apache.lucene.util.TestRuleStoreClassName$1.evaluate(TestRuleStoreClassName.java:41)
	at com.carrotsearch.randomizedtesting.rules.NoShadowingOrOverridesOnMethodsRule$1.evaluate(NoShadowingOrOverridesOnMethodsRule.java:40)
	at com.carrotsearch.randomizedtesting.rules.NoShadowingOrOverridesOnMethodsRule$1.evaluate(NoShadowingOrOverridesOnMethodsRule.java:40)
	at com.carrotsearch.randomizedtesting.rules.StatementAdapter.evaluate(StatementAdapter.java:36)
	at com.carrotsearch.randomizedtesting.rules.StatementAdapter.evaluate(StatementAdapter.java:36)
	at com.carrotsearch.randomizedtesting.rules.StatementAdapter.evaluate(StatementAdapter.java:36)
	at org.apache.lucene.util.TestRuleAssertionsRequired$1.evaluate(TestRuleAssertionsRequired.java:53)
	at org.apache.lucene.util.TestRuleMarkFailure$1.evaluate(TestRuleMarkFailure.java:47)
	at org.apache.lucene.util.TestRuleIgnoreAfterMaxFailures$1.evaluate(TestRuleIgnoreAfterMaxFailures.java:64)
	at org.apache.lucene.util.TestRuleIgnoreTestSuites$1.evaluate(TestRuleIgnoreTestSuites.java:54)
	at com.carrotsearch.randomizedtesting.rules.StatementAdapter.evaluate(StatementAdapter.java:36)
	at com.carrotsearch.randomizedtesting.ThreadLeakControl$StatementRunner.run(ThreadLeakControl.java:368)
	at java.lang.Thread.run(Thread.java:748)


FAILED:  junit.framework.TestSuite.org.apache.solr.cloud.TestSolrCloudWithSecureImpersonation

Error Message:
2 threads leaked from SUITE scope at org.apache.solr.cloud.TestSolrCloudWithSecureImpersonation:     1) Thread[id=15592, name=jetty-launcher-1729-thread-2-EventThread, state=TIMED_WAITING, group=TGRP-TestSolrCloudWithSecureImpersonation]         at sun.misc.Unsafe.park(Native Method)         at java.util.concurrent.locks.LockSupport.parkNanos(LockSupport.java:215)         at java.util.concurrent.locks.AbstractQueuedSynchronizer.doAcquireSharedNanos(AbstractQueuedSynchronizer.java:1037)         at java.util.concurrent.locks.AbstractQueuedSynchronizer.tryAcquireSharedNanos(AbstractQueuedSynchronizer.java:1328)         at java.util.concurrent.CountDownLatch.await(CountDownLatch.java:277)         at org.apache.curator.CuratorZookeeperClient.internalBlockUntilConnectedOrTimedOut(CuratorZookeeperClient.java:323)         at org.apache.curator.RetryLoop.callWithRetry(RetryLoop.java:105)         at org.apache.curator.framework.imps.GetDataBuilderImpl.pathInForeground(GetDataBuilderImpl.java:288)         at org.apache.curator.framework.imps.GetDataBuilderImpl.forPath(GetDataBuilderImpl.java:279)         at org.apache.curator.framework.imps.GetDataBuilderImpl.forPath(GetDataBuilderImpl.java:41)         at org.apache.curator.framework.recipes.shared.SharedValue.readValue(SharedValue.java:244)         at org.apache.curator.framework.recipes.shared.SharedValue.access$100(SharedValue.java:44)         at org.apache.curator.framework.recipes.shared.SharedValue$1.process(SharedValue.java:61)         at org.apache.curator.framework.imps.NamespaceWatcher.process(NamespaceWatcher.java:67)         at org.apache.zookeeper.ClientCnxn$EventThread.processEvent(ClientCnxn.java:531)         at org.apache.zookeeper.ClientCnxn$EventThread.run(ClientCnxn.java:506)    2) Thread[id=15591, name=jetty-launcher-1729-thread-1-EventThread, state=TIMED_WAITING, group=TGRP-TestSolrCloudWithSecureImpersonation]         at sun.misc.Unsafe.park(Native Method)         at java.util.concurrent.locks.LockSupport.parkNanos(LockSupport.java:215)         at java.util.concurrent.locks.AbstractQueuedSynchronizer.doAcquireSharedNanos(AbstractQueuedSynchronizer.java:1037)         at java.util.concurrent.locks.AbstractQueuedSynchronizer.tryAcquireSharedNanos(AbstractQueuedSynchronizer.java:1328)         at java.util.concurrent.CountDownLatch.await(CountDownLatch.java:277)         at org.apache.curator.CuratorZookeeperClient.internalBlockUntilConnectedOrTimedOut(CuratorZookeeperClient.java:323)         at org.apache.curator.RetryLoop.callWithRetry(RetryLoop.java:105)         at org.apache.curator.framework.imps.GetDataBuilderImpl.pathInForeground(GetDataBuilderImpl.java:288)         at org.apache.curator.framework.imps.GetDataBuilderImpl.forPath(GetDataBuilderImpl.java:279)         at org.apache.curator.framework.imps.GetDataBuilderImpl.forPath(GetDataBuilderImpl.java:41)         at org.apache.curator.framework.recipes.shared.SharedValue.readValue(SharedValue.java:244)         at org.apache.curator.framework.recipes.shared.SharedValue.access$100(SharedValue.java:44)         at org.apache.curator.framework.recipes.shared.SharedValue$1.process(SharedValue.java:61)         at org.apache.curator.framework.imps.NamespaceWatcher.process(NamespaceWatcher.java:67)         at org.apache.zookeeper.ClientCnxn$EventThread.processEvent(ClientCnxn.java:531)         at org.apache.zookeeper.ClientCnxn$EventThread.run(ClientCnxn.java:506)

Stack Trace:
com.carrotsearch.randomizedtesting.ThreadLeakError: 2 threads leaked from SUITE scope at org.apache.solr.cloud.TestSolrCloudWithSecureImpersonation: 
   1) Thread[id=15592, name=jetty-launcher-1729-thread-2-EventThread, state=TIMED_WAITING, group=TGRP-TestSolrCloudWithSecureImpersonation]
        at sun.misc.Unsafe.park(Native Method)
        at java.util.concurrent.locks.LockSupport.parkNanos(LockSupport.java:215)
        at java.util.concurrent.locks.AbstractQueuedSynchronizer.doAcquireSharedNanos(AbstractQueuedSynchronizer.java:1037)
        at java.util.concurrent.locks.AbstractQueuedSynchronizer.tryAcquireSharedNanos(AbstractQueuedSynchronizer.java:1328)
        at java.util.concurrent.CountDownLatch.await(CountDownLatch.java:277)
        at org.apache.curator.CuratorZookeeperClient.internalBlockUntilConnectedOrTimedOut(CuratorZookeeperClient.java:323)
        at org.apache.curator.RetryLoop.callWithRetry(RetryLoop.java:105)
        at org.apache.curator.framework.imps.GetDataBuilderImpl.pathInForeground(GetDataBuilderImpl.java:288)
        at org.apache.curator.framework.imps.GetDataBuilderImpl.forPath(GetDataBuilderImpl.java:279)
        at org.apache.curator.framework.imps.GetDataBuilderImpl.forPath(GetDataBuilderImpl.java:41)
        at org.apache.curator.framework.recipes.shared.SharedValue.readValue(SharedValue.java:244)
        at org.apache.curator.framework.recipes.shared.SharedValue.access$100(SharedValue.java:44)
        at org.apache.curator.framework.recipes.shared.SharedValue$1.process(SharedValue.java:61)
        at org.apache.curator.framework.imps.NamespaceWatcher.process(NamespaceWatcher.java:67)
        at org.apache.zookeeper.ClientCnxn$EventThread.processEvent(ClientCnxn.java:531)
        at org.apache.zookeeper.ClientCnxn$EventThread.run(ClientCnxn.java:506)
   2) Thread[id=15591, name=jetty-launcher-1729-thread-1-EventThread, state=TIMED_WAITING, group=TGRP-TestSolrCloudWithSecureImpersonation]
        at sun.misc.Unsafe.park(Native Method)
        at java.util.concurrent.locks.LockSupport.parkNanos(LockSupport.java:215)
        at java.util.concurrent.locks.AbstractQueuedSynchronizer.doAcquireSharedNanos(AbstractQueuedSynchronizer.java:1037)
        at java.util.concurrent.locks.AbstractQueuedSynchronizer.tryAcquireSharedNanos(AbstractQueuedSynchronizer.java:1328)
        at java.util.concurrent.CountDownLatch.await(CountDownLatch.java:277)
        at org.apache.curator.CuratorZookeeperClient.internalBlockUntilConnectedOrTimedOut(CuratorZookeeperClient.java:323)
        at org.apache.curator.RetryLoop.callWithRetry(RetryLoop.java:105)
        at org.apache.curator.framework.imps.GetDataBuilderImpl.pathInForeground(GetDataBuilderImpl.java:288)
        at org.apache.curator.framework.imps.GetDataBuilderImpl.forPath(GetDataBuilderImpl.java:279)
        at org.apache.curator.framework.imps.GetDataBuilderImpl.forPath(GetDataBuilderImpl.java:41)
        at org.apache.curator.framework.recipes.shared.SharedValue.readValue(SharedValue.java:244)
        at org.apache.curator.framework.recipes.shared.SharedValue.access$100(SharedValue.java:44)
        at org.apache.curator.framework.recipes.shared.SharedValue$1.process(SharedValue.java:61)
        at org.apache.curator.framework.imps.NamespaceWatcher.process(NamespaceWatcher.java:67)
        at org.apache.zookeeper.ClientCnxn$EventThread.processEvent(ClientCnxn.java:531)
        at org.apache.zookeeper.ClientCnxn$EventThread.run(ClientCnxn.java:506)
	at __randomizedtesting.SeedInfo.seed([FB172D5D63C9D5B9]:0)


FAILED:  org.apache.solr.cloud.autoscaling.TriggerIntegrationTest.testSetProperties

Error Message:
Expected 8 triggers but found: [x0, x1, x2, x3, x4, x5, x6] expected:<8> but was:<7>

Stack Trace:
java.lang.AssertionError: Expected 8 triggers but found: [x0, x1, x2, x3, x4, x5, x6] expected:<8> but was:<7>
	at __randomizedtesting.SeedInfo.seed([FB172D5D63C9D5B9:9073FA14D0E4403D]:0)
	at org.junit.Assert.fail(Assert.java:93)
	at org.junit.Assert.failNotEquals(Assert.java:647)
	at org.junit.Assert.assertEquals(Assert.java:128)
	at org.junit.Assert.assertEquals(Assert.java:472)
	at org.apache.solr.cloud.autoscaling.TriggerIntegrationTest.testSetProperties(TriggerIntegrationTest.java:1322)
	at sun.reflect.NativeMethodAccessorImpl.invoke0(Native Method)
	at sun.reflect.NativeMethodAccessorImpl.invoke(NativeMethodAccessorImpl.java:62)
	at sun.reflect.DelegatingMethodAccessorImpl.invoke(DelegatingMethodAccessorImpl.java:43)
	at java.lang.reflect.Method.invoke(Method.java:498)
	at com.carrotsearch.randomizedtesting.RandomizedRunner.invoke(RandomizedRunner.java:1737)
	at com.carrotsearch.randomizedtesting.RandomizedRunner$8.evaluate(RandomizedRunner.java:934)
	at com.carrotsearch.randomizedtesting.RandomizedRunner$9.evaluate(RandomizedRunner.java:970)
	at com.carrotsearch.randomizedtesting.RandomizedRunner$10.evaluate(RandomizedRunner.java:984)
	at com.carrotsearch.randomizedtesting.rules.SystemPropertiesRestoreRule$1.evaluate(SystemPropertiesRestoreRule.java:57)
	at org.apache.lucene.util.TestRuleSetupTeardownChained$1.evaluate(TestRuleSetupTeardownChained.java:49)
	at org.apache.lucene.util.AbstractBeforeAfterRule$1.evaluate(AbstractBeforeAfterRule.java:45)
	at org.apache.lucene.util.TestRuleThreadAndTestName$1.evaluate(TestRuleThreadAndTestName.java:48)
	at org.apache.lucene.util.TestRuleIgnoreAfterMaxFailures$1.evaluate(TestRuleIgnoreAfterMaxFailures.java:64)
	at org.apache.lucene.util.TestRuleMarkFailure$1.evaluate(TestRuleMarkFailure.java:47)
	at com.carrotsearch.randomizedtesting.rules.StatementAdapter.evaluate(StatementAdapter.java:36)
	at com.carrotsearch.randomizedtesting.ThreadLeakControl$StatementRunner.run(ThreadLeakControl.java:368)
	at com.carrotsearch.randomizedtesting.ThreadLeakControl.forkTimeoutingTask(ThreadLeakControl.java:817)
	at com.carrotsearch.randomizedtesting.ThreadLeakControl$3.evaluate(ThreadLeakControl.java:468)
	at com.carrotsearch.randomizedtesting.RandomizedRunner.runSingleTest(RandomizedRunner.java:943)
	at com.carrotsearch.randomizedtesting.RandomizedRunner$5.evaluate(RandomizedRunner.java:829)
	at com.carrotsearch.randomizedtesting.RandomizedRunner$6.evaluate(RandomizedRunner.java:879)
	at com.carrotsearch.randomizedtesting.RandomizedRunner$7.evaluate(RandomizedRunner.java:890)
	at com.carrotsearch.randomizedtesting.rules.StatementAdapter.evaluate(StatementAdapter.java:36)
	at com.carrotsearch.randomizedtesting.rules.SystemPropertiesRestoreRule$1.evaluate(SystemPropertiesRestoreRule.java:57)
	at org.apache.lucene.util.AbstractBeforeAfterRule$1.evaluate(AbstractBeforeAfterRule.java:45)
	at com.carrotsearch.randomizedtesting.rules.StatementAdapter.evaluate(StatementAdapter.java:36)
	at org.apache.lucene.util.TestRuleStoreClassName$1.evaluate(TestRuleStoreClassName.java:41)
	at com.carrotsearch.randomizedtesting.rules.NoShadowingOrOverridesOnMethodsRule$1.evaluate(NoShadowingOrOverridesOnMethodsRule.java:40)
	at com.carrotsearch.randomizedtesting.rules.NoShadowingOrOverridesOnMethodsRule$1.evaluate(NoShadowingOrOverridesOnMethodsRule.java:40)
	at com.carrotsearch.randomizedtesting.rules.StatementAdapter.evaluate(StatementAdapter.java:36)
	at com.carrotsearch.randomizedtesting.rules.StatementAdapter.evaluate(StatementAdapter.java:36)
	at com.carrotsearch.randomizedtesting.rules.StatementAdapter.evaluate(StatementAdapter.java:36)
	at org.apache.lucene.util.TestRuleAssertionsRequired$1.evaluate(TestRuleAssertionsRequired.java:53)
	at org.apache.lucene.util.TestRuleMarkFailure$1.evaluate(TestRuleMarkFailure.java:47)
	at org.apache.lucene.util.TestRuleIgnoreAfterMaxFailures$1.evaluate(TestRuleIgnoreAfterMaxFailures.java:64)
	at org.apache.lucene.util.TestRuleIgnoreTestSuites$1.evaluate(TestRuleIgnoreTestSuites.java:54)
	at com.carrotsearch.randomizedtesting.rules.StatementAdapter.evaluate(StatementAdapter.java:36)
	at com.carrotsearch.randomizedtesting.ThreadLeakControl$StatementRunner.run(ThreadLeakControl.java:368)
	at java.lang.Thread.run(Thread.java:748)


FAILED:  org.apache.solr.cloud.autoscaling.TriggerIntegrationTest.testMetricTrigger

Error Message:


Stack Trace:
java.lang.AssertionError
	at __randomizedtesting.SeedInfo.seed([FB172D5D63C9D5B9:411B1AD23C2103F6]:0)
	at org.junit.Assert.fail(Assert.java:92)
	at org.junit.Assert.assertTrue(Assert.java:43)
	at org.junit.Assert.assertNull(Assert.java:551)
	at org.junit.Assert.assertNull(Assert.java:562)
	at org.apache.solr.cloud.autoscaling.TriggerIntegrationTest.testMetricTrigger(TriggerIntegrationTest.java:1575)
	at sun.reflect.NativeMethodAccessorImpl.invoke0(Native Method)
	at sun.reflect.NativeMethodAccessorImpl.invoke(NativeMethodAccessorImpl.java:62)
	at sun.reflect.DelegatingMethodAccessorImpl.invoke(DelegatingMethodAccessorImpl.java:43)
	at java.lang.reflect.Method.invoke(Method.java:498)
	at com.carrotsearch.randomizedtesting.RandomizedRunner.invoke(RandomizedRunner.java:1737)
	at com.carrotsearch.randomizedtesting.RandomizedRunner$8.evaluate(RandomizedRunner.java:934)
	at com.carrotsearch.randomizedtesting.RandomizedRunner$9.evaluate(RandomizedRunner.java:970)
	at com.carrotsearch.randomizedtesting.RandomizedRunner$10.evaluate(RandomizedRunner.java:984)
	at com.carrotsearch.randomizedtesting.rules.SystemPropertiesRestoreRule$1.evaluate(SystemPropertiesRestoreRule.java:57)
	at org.apache.lucene.util.TestRuleSetupTeardownChained$1.evaluate(TestRuleSetupTeardownChained.java:49)
	at org.apache.lucene.util.AbstractBeforeAfterRule$1.evaluate(AbstractBeforeAfterRule.java:45)
	at org.apache.lucene.util.TestRuleThreadAndTestName$1.evaluate(TestRuleThreadAndTestName.java:48)
	at org.apache.lucene.util.TestRuleIgnoreAfterMaxFailures$1.evaluate(TestRuleIgnoreAfterMaxFailures.java:64)
	at org.apache.lucene.util.TestRuleMarkFailure$1.evaluate(TestRuleMarkFailure.java:47)
	at com.carrotsearch.randomizedtesting.rules.StatementAdapter.evaluate(StatementAdapter.java:36)
	at com.carrotsearch.randomizedtesting.ThreadLeakControl$StatementRunner.run(ThreadLeakControl.java:368)
	at com.carrotsearch.randomizedtesting.ThreadLeakControl.forkTimeoutingTask(ThreadLeakControl.java:817)
	at com.carrotsearch.randomizedtesting.ThreadLeakControl$3.evaluate(ThreadLeakControl.java:468)
	at com.carrotsearch.randomizedtesting.RandomizedRunner.runSingleTest(RandomizedRunner.java:943)
	at com.carrotsearch.randomizedtesting.RandomizedRunner$5.evaluate(RandomizedRunner.java:829)
	at com.carrotsearch.randomizedtesting.RandomizedRunner$6.evaluate(RandomizedRunner.java:879)
	at com.carrotsearch.randomizedtesting.RandomizedRunner$7.evaluate(RandomizedRunner.java:890)
	at com.carrotsearch.randomizedtesting.rules.StatementAdapter.evaluate(StatementAdapter.java:36)
	at com.carrotsearch.randomizedtesting.rules.SystemPropertiesRestoreRule$1.evaluate(SystemPropertiesRestoreRule.java:57)
	at org.apache.lucene.util.AbstractBeforeAfterRule$1.evaluate(AbstractBeforeAfterRule.java:45)
	at com.carrotsearch.randomizedtesting.rules.StatementAdapter.evaluate(StatementAdapter.java:36)
	at org.apache.lucene.util.TestRuleStoreClassName$1.evaluate(TestRuleStoreClassName.java:41)
	at com.carrotsearch.randomizedtesting.rules.NoShadowingOrOverridesOnMethodsRule$1.evaluate(NoShadowingOrOverridesOnMethodsRule.java:40)
	at com.carrotsearch.randomizedtesting.rules.NoShadowingOrOverridesOnMethodsRule$1.evaluate(NoShadowingOrOverridesOnMethodsRule.java:40)
	at com.carrotsearch.randomizedtesting.rules.StatementAdapter.evaluate(StatementAdapter.java:36)
	at com.carrotsearch.randomizedtesting.rules.StatementAdapter.evaluate(StatementAdapter.java:36)
	at com.carrotsearch.randomizedtesting.rules.StatementAdapter.evaluate(StatementAdapter.java:36)
	at org.apache.lucene.util.TestRuleAssertionsRequired$1.evaluate(TestRuleAssertionsRequired.java:53)
	at org.apache.lucene.util.TestRuleMarkFailure$1.evaluate(TestRuleMarkFailure.java:47)
	at org.apache.lucene.util.TestRuleIgnoreAfterMaxFailures$1.evaluate(TestRuleIgnoreAfterMaxFailures.java:64)
	at org.apache.lucene.util.TestRuleIgnoreTestSuites$1.evaluate(TestRuleIgnoreTestSuites.java:54)
	at com.carrotsearch.randomizedtesting.rules.StatementAdapter.evaluate(StatementAdapter.java:36)
	at com.carrotsearch.randomizedtesting.ThreadLeakControl$StatementRunner.run(ThreadLeakControl.java:368)
	at java.lang.Thread.run(Thread.java:748)




Build Log:
[...truncated 12302 lines...]
   [junit4] Suite: org.apache.solr.cloud.TestSolrCloudWithSecureImpersonation
   [junit4]   2> Creating dataDir: /export/home/jenkins/workspace/Lucene-Solr-7.x-Solaris/solr/build/solr-core/test/J0/temp/solr.cloud.TestSolrCloudWithSecureImpersonation_FB172D5D63C9D5B9-001/init-core-data-001
   [junit4]   2> 1149757 INFO  (SUITE-TestSolrCloudWithSecureImpersonation-seed#[FB172D5D63C9D5B9]-worker) [    ] o.a.s.SolrTestCaseJ4 Using PointFields (NUMERIC_POINTS_SYSPROP=true) w/NUMERIC_DOCVALUES_SYSPROP=false
   [junit4]   2> 1149757 INFO  (SUITE-TestSolrCloudWithSecureImpersonation-seed#[FB172D5D63C9D5B9]-worker) [    ] o.a.s.SolrTestCaseJ4 Randomized ssl (false) and clientAuth (false) via: @org.apache.solr.util.RandomizeSSL(reason=, value=NaN, ssl=NaN, clientAuth=NaN)
   [junit4]   2> 1149758 INFO  (SUITE-TestSolrCloudWithSecureImpersonation-seed#[FB172D5D63C9D5B9]-worker) [    ] o.a.s.SolrTestCaseJ4 SecureRandom sanity checks: test.solr.allowed.securerandom=null & java.security.egd=file:/dev/./urandom
   [junit4]   2> 1149788 INFO  (SUITE-TestSolrCloudWithSecureImpersonation-seed#[FB172D5D63C9D5B9]-worker) [    ] o.a.s.c.MiniSolrCloudCluster Starting cluster of 2 servers in /export/home/jenkins/workspace/Lucene-Solr-7.x-Solaris/solr/build/solr-core/test/J0/temp/solr.cloud.TestSolrCloudWithSecureImpersonation_FB172D5D63C9D5B9-001/tempDir-001
   [junit4]   2> 1149788 INFO  (SUITE-TestSolrCloudWithSecureImpersonation-seed#[FB172D5D63C9D5B9]-worker) [    ] o.a.s.c.ZkTestServer STARTING ZK TEST SERVER
   [junit4]   2> 1149789 INFO  (Thread-8339) [    ] o.a.s.c.ZkTestServer client port:0.0.0.0/0.0.0.0:0
   [junit4]   2> 1149789 INFO  (Thread-8339) [    ] o.a.s.c.ZkTestServer Starting server
   [junit4]   2> 1149791 ERROR (Thread-8339) [    ] o.a.z.s.ZooKeeperServer ZKShutdownHandler is not registered, so ZooKeeper server won't take any action on ERROR or SHUTDOWN server state changes
   [junit4]   2> 1149889 INFO  (SUITE-TestSolrCloudWithSecureImpersonation-seed#[FB172D5D63C9D5B9]-worker) [    ] o.a.s.c.ZkTestServer start zk server on port:46075
   [junit4]   2> 1149891 INFO  (zkConnectionManagerCallback-1732-thread-1) [    ] o.a.s.c.c.ConnectionManager zkClient has connected
   [junit4]   2> 1149896 INFO  (jetty-launcher-1729-thread-2) [    ] o.e.j.s.Server jetty-9.4.8.v20171121, build timestamp: 2017-11-22T05:27:37+08:00, git hash: 82b8fb23f757335bb3329d540ce37a2a2615f0a8
   [junit4]   2> 1149896 INFO  (jetty-launcher-1729-thread-1) [    ] o.e.j.s.Server jetty-9.4.8.v20171121, build timestamp: 2017-11-22T05:27:37+08:00, git hash: 82b8fb23f757335bb3329d540ce37a2a2615f0a8
   [junit4]   2> 1149897 INFO  (jetty-launcher-1729-thread-1) [    ] o.e.j.s.session DefaultSessionIdManager workerName=node0
   [junit4]   2> 1149897 INFO  (jetty-launcher-1729-thread-1) [    ] o.e.j.s.session No SessionScavenger set, using defaults
   [junit4]   2> 1149897 INFO  (jetty-launcher-1729-thread-1) [    ] o.e.j.s.session Scavenging every 600000ms
   [junit4]   2> 1149898 INFO  (jetty-launcher-1729-thread-2) [    ] o.e.j.s.session DefaultSessionIdManager workerName=node0
   [junit4]   2> 1149898 INFO  (jetty-launcher-1729-thread-2) [    ] o.e.j.s.session No SessionScavenger set, using defaults
   [junit4]   2> 1149898 INFO  (jetty-launcher-1729-thread-2) [    ] o.e.j.s.session Scavenging every 660000ms
   [junit4]   2> 1149898 INFO  (jetty-launcher-1729-thread-1) [    ] o.e.j.s.h.ContextHandler Started o.e.j.s.ServletContextHandler@6738bc47{/solr,null,AVAILABLE}
   [junit4]   2> 1149898 INFO  (jetty-launcher-1729-thread-2) [    ] o.e.j.s.h.ContextHandler Started o.e.j.s.ServletContextHandler@1d44a667{/solr,null,AVAILABLE}
   [junit4]   2> 1149900 INFO  (jetty-launcher-1729-thread-1) [    ] o.e.j.s.AbstractConnector Started ServerConnector@1f226cec{HTTP/1.1,[http/1.1]}{127.0.0.1:45640}
   [junit4]   2> 1149900 INFO  (jetty-launcher-1729-thread-1) [    ] o.e.j.s.Server Started @1153405ms
   [junit4]   2> 1149901 INFO  (jetty-launcher-1729-thread-1) [    ] o.a.s.c.s.e.JettySolrRunner Jetty properties: {hostContext=/solr, hostPort=45640}
   [junit4]   2> 1149901 INFO  (jetty-launcher-1729-thread-2) [    ] o.e.j.s.AbstractConnector Started ServerConnector@2c81dc4c{HTTP/1.1,[http/1.1]}{127.0.0.1:48917}
   [junit4]   2> 1149901 INFO  (jetty-launcher-1729-thread-2) [    ] o.e.j.s.Server Started @1153405ms
   [junit4]   2> 1149901 INFO  (jetty-launcher-1729-thread-2) [    ] o.a.s.c.s.e.JettySolrRunner Jetty properties: {hostContext=/solr, hostPort=48917}
   [junit4]   2> 1149901 ERROR (jetty-launcher-1729-thread-1) [    ] o.a.s.u.StartupLoggingUtils Missing Java Option solr.log.dir. Logging may be missing or incomplete.
   [junit4]   2> 1149901 ERROR (jetty-launcher-1729-thread-2) [    ] o.a.s.u.StartupLoggingUtils Missing Java Option solr.log.dir. Logging may be missing or incomplete.
   [junit4]   2> 1149901 INFO  (jetty-launcher-1729-thread-1) [    ] o.a.s.s.SolrDispatchFilter  ___      _       Welcome to Apache Solr™ version 7.3.0
   [junit4]   2> 1149901 INFO  (jetty-launcher-1729-thread-1) [    ] o.a.s.s.SolrDispatchFilter / __| ___| |_ _   Starting in cloud mode on port null
   [junit4]   2> 1149901 INFO  (jetty-launcher-1729-thread-2) [    ] o.a.s.s.SolrDispatchFilter  ___      _       Welcome to Apache Solr™ version 7.3.0
   [junit4]   2> 1149901 INFO  (jetty-launcher-1729-thread-1) [    ] o.a.s.s.SolrDispatchFilter \__ \/ _ \ | '_|  Install dir: null
   [junit4]   2> 1149901 INFO  (jetty-launcher-1729-thread-2) [    ] o.a.s.s.SolrDispatchFilter / __| ___| |_ _   Starting in cloud mode on port null
   [junit4]   2> 1149901 INFO  (jetty-launcher-1729-thread-1) [    ] o.a.s.s.SolrDispatchFilter |___/\___/_|_|    Start time: 2018-02-01T03:21:39.991Z
   [junit4]   2> 1149901 INFO  (jetty-launcher-1729-thread-2) [    ] o.a.s.s.SolrDispatchFilter \__ \/ _ \ | '_|  Install dir: null
   [junit4]   2> 1149901 INFO  (jetty-launcher-1729-thread-2) [    ] o.a.s.s.SolrDispatchFilter |___/\___/_|_|    Start time: 2018-02-01T03:21:39.991Z
   [junit4]   2> 1149903 INFO  (zkConnectionManagerCallback-1735-thread-1) [    ] o.a.s.c.c.ConnectionManager zkClient has connected
   [junit4]   2> 1149904 INFO  (zkConnectionManagerCallback-1736-thread-1) [    ] o.a.s.c.c.ConnectionManager zkClient has connected
   [junit4]   2> 1149904 INFO  (jetty-launcher-1729-thread-1) [    ] o.a.s.s.SolrDispatchFilter solr.xml found in ZooKeeper. Loading...
   [junit4]   2> 1149904 INFO  (jetty-launcher-1729-thread-2) [    ] o.a.s.s.SolrDispatchFilter solr.xml found in ZooKeeper. Loading...
   [junit4]   2> 1149911 INFO  (jetty-launcher-1729-thread-1) [    ] o.a.s.c.ZkContainer Zookeeper client=127.0.0.1:46075/solr
   [junit4]   2> 1149911 INFO  (jetty-launcher-1729-thread-2) [    ] o.a.s.c.ZkContainer Zookeeper client=127.0.0.1:46075/solr
   [junit4]   2> 1149913 INFO  (zkConnectionManagerCallback-1742-thread-1) [    ] o.a.s.c.c.ConnectionManager zkClient has connected
   [junit4]   2> 1149914 INFO  (zkConnectionManagerCallback-1744-thread-1) [    ] o.a.s.c.c.ConnectionManager zkClient has connected
   [junit4]   2> 1149916 INFO  (zkConnectionManagerCallback-1746-thread-1-processing-n:127.0.0.1:45640_solr) [n:127.0.0.1:45640_solr    ] o.a.s.c.c.ConnectionManager zkClient has connected
   [junit4]   2> 1149917 INFO  (zkConnectionManagerCallback-1748-thread-1-processing-n:127.0.0.1:48917_solr) [n:127.0.0.1:48917_solr    ] o.a.s.c.c.ConnectionManager zkClient has connected
   [junit4]   2> 1150046 INFO  (jetty-launcher-1729-thread-2) [n:127.0.0.1:48917_solr    ] o.a.s.c.Overseer Overseer (id=null) closing
   [junit4]   2> 1150046 INFO  (jetty-launcher-1729-thread-2) [n:127.0.0.1:48917_solr    ] o.a.s.c.OverseerElectionContext I am going to be the leader 127.0.0.1:48917_solr
   [junit4]   2> 1150047 INFO  (jetty-launcher-1729-thread-2) [n:127.0.0.1:48917_solr    ] o.a.s.c.Overseer Overseer (id=72121190628786182-127.0.0.1:48917_solr-n_0000000000) starting
   [junit4]   2> 1150057 INFO  (jetty-launcher-1729-thread-2) [n:127.0.0.1:48917_solr    ] o.a.s.c.ZkController Register node as live in ZooKeeper:/live_nodes/127.0.0.1:48917_solr
   [junit4]   2> 1150060 INFO  (OverseerStateUpdate-72121190628786182-127.0.0.1:48917_solr-n_0000000000) [n:127.0.0.1:48917_solr    ] o.a.s.c.c.ZkStateReader Updated live nodes from ZooKeeper... (0) -> (1)
   [junit4]   2> 1150062 INFO  (jetty-launcher-1729-thread-1) [n:127.0.0.1:45640_solr    ] o.a.s.c.c.ZkStateReader Updated live nodes from ZooKeeper... (0) -> (1)
   [junit4]   2> 1150064 INFO  (jetty-launcher-1729-thread-1) [n:127.0.0.1:45640_solr    ] o.a.s.c.Overseer Overseer (id=null) closing
   [junit4]   2> 1150067 INFO  (jetty-launcher-1729-thread-1) [n:127.0.0.1:45640_solr    ] o.a.s.c.ZkController Register node as live in ZooKeeper:/live_nodes/127.0.0.1:45640_solr
   [junit4]   2> 1150068 INFO  (zkCallback-1747-thread-1-processing-n:127.0.0.1:48917_solr) [n:127.0.0.1:48917_solr    ] o.a.s.c.c.ZkStateReader Updated live nodes from ZooKeeper... (1) -> (2)
   [junit4]   2> 1150086 INFO  (zkCallback-1745-thread-1-processing-n:127.0.0.1:45640_solr) [n:127.0.0.1:45640_solr    ] o.a.s.c.c.ZkStateReader Updated live nodes from ZooKeeper... (1) -> (2)
   [junit4]   2> 1150126 INFO  (jetty-launcher-1729-thread-1) [n:127.0.0.1:45640_solr    ] o.a.s.c.CoreContainer Initializing authentication plugin: org.apache.solr.security.HttpParamDelegationTokenPlugin
   [junit4]   2> 1150132 WARN  (jetty-launcher-1729-thread-1) [n:127.0.0.1:45640_solr    ] o.a.s.c.s.i.Krb5HttpClientBuilder org.apache.solr.client.solrj.impl.Krb5HttpClientBuilder is configured without specifying system property 'java.security.auth.login.config'
   [junit4]   2> 1150137 INFO  (jetty-launcher-1729-thread-1) [n:127.0.0.1:45640_solr    ] o.a.s.s.KerberosPlugin Params: {solr.kerberos.impersonator.user.noGroups.hosts=*, solr.kerberos.impersonator.user.bogusGroup.groups=__some_bogus_group, token.valid=30, cookie.domain=127.0.0.1, solr.kerberos.impersonator.user.anyHostAnyUser.groups=*, solr.kerberos.impersonator.user.bogusGroup.hosts=*, solr.kerberos.impersonator.user.anyHostAnyUser.hosts=*, token.validity=36000, solr.kerberos.impersonator.user.noHosts.groups=*, type=kerberos, solr.kerberos.impersonator.user.localHostAnyGroup.groups=*, delegation-token.token-kind=solr-dt, solr.kerberos.impersonator.user.wrongHost.hosts=1.1.1.1.1.1, cookie.path=/, zk-dt-secret-manager.znodeWorkingPath=solr/security/zkdtsm, solr.kerberos.impersonator.user.localHostAnyGroup.hosts=serv1-vm3,localhost,127.0.0.1, signer.secret.provider.zookeeper.path=/token, solr.kerberos.impersonator.user.anyHostUsersGroup.groups=staff, zk-dt-secret-manager.enable=true, solr.kerberos.impersonator.user.wrongHost.groups=*, kerberos.name.rules=DEFAULT, signer.secret.provider=zookeeper, solr.kerberos.impersonator.user.anyHostUsersGroup.hosts=*}
   [junit4]   2> 1150170 INFO  (jetty-launcher-1729-thread-2) [n:127.0.0.1:48917_solr    ] o.a.s.c.CoreContainer Initializing authentication plugin: org.apache.solr.security.HttpParamDelegationTokenPlugin
   [junit4]   2> 1150170 WARN  (jetty-launcher-1729-thread-2) [n:127.0.0.1:48917_solr    ] o.a.s.c.s.i.Krb5HttpClientBuilder org.apache.solr.client.solrj.impl.Krb5HttpClientBuilder is configured without specifying system property 'java.security.auth.login.config'
   [junit4]   2> 1150171 INFO  (jetty-launcher-1729-thread-2) [n:127.0.0.1:48917_solr    ] o.a.s.s.KerberosPlugin Params: {solr.kerberos.impersonator.user.noGroups.hosts=*, solr.kerberos.impersonator.user.bogusGroup.groups=__some_bogus_group, token.valid=30, cookie.domain=127.0.0.1, solr.kerberos.impersonator.user.anyHostAnyUser.groups=*, solr.kerberos.impersonator.user.bogusGroup.hosts=*, solr.kerberos.impersonator.user.anyHostAnyUser.hosts=*, token.validity=36000, solr.kerberos.impersonator.user.noHosts.groups=*, type=kerberos, solr.kerberos.impersonator.user.localHostAnyGroup.groups=*, delegation-token.token-kind=solr-dt, solr.kerberos.impersonator.user.wrongHost.hosts=1.1.1.1.1.1, cookie.path=/, zk-dt-secret-manager.znodeWorkingPath=solr/security/zkdtsm, solr.kerberos.impersonator.user.localHostAnyGroup.hosts=serv1-vm3,localhost,127.0.0.1, signer.secret.provider.zookeeper.path=/token, solr.kerberos.impersonator.user.anyHostUsersGroup.groups=staff, zk-dt-secret-manager.enable=true, solr.kerberos.impersonator.user.wrongHost.groups=*, kerberos.name.rules=DEFAULT, signer.secret.provider=zookeeper, solr.kerberos.impersonator.user.anyHostUsersGroup.hosts=*}
   [junit4]   2> 1150208 INFO  (jetty-launcher-1729-thread-2) [n:127.0.0.1:48917_solr    ] o.a.c.f.i.CuratorFrameworkImpl Starting
   [junit4]   2> 1150208 INFO  (jetty-launcher-1729-thread-1) [n:127.0.0.1:45640_solr    ] o.a.c.f.i.CuratorFrameworkImpl Starting
   [junit4]   2> 1150232 INFO  (jetty-launcher-1729-thread-1-EventThread) [n:127.0.0.1:45640_solr    ] o.a.c.f.s.ConnectionStateManager State change: CONNECTED
   [junit4]   2> 1150234 INFO  (jetty-launcher-1729-thread-2-EventThread) [n:127.0.0.1:48917_solr    ] o.a.c.f.s.ConnectionStateManager State change: CONNECTED
   [junit4]   2> 1150345 WARN  (jetty-launcher-1729-thread-1) [n:127.0.0.1:45640_solr    ] o.a.s.c.s.i.Krb5HttpClientBuilder org.apache.solr.client.solrj.impl.Krb5HttpClientBuilder is configured without specifying system property 'java.security.auth.login.config'
   [junit4]   2> 1150345 WARN  (jetty-launcher-1729-thread-2) [n:127.0.0.1:48917_solr    ] o.a.s.c.s.i.Krb5HttpClientBuilder org.apache.solr.client.solrj.impl.Krb5HttpClientBuilder is configured without specifying system property 'java.security.auth.login.config'
   [junit4]   2> 1150392 INFO  (jetty-launcher-1729-thread-2) [n:127.0.0.1:48917_solr    ] o.a.s.m.r.SolrJmxReporter JMX monitoring for 'solr_48917.solr.node' (registry 'solr.node') enabled at server: com.sun.jmx.mbeanserver.JmxMBeanServer@78273b86
   [junit4]   2> 1150395 INFO  (jetty-launcher-1729-thread-1) [n:127.0.0.1:45640_solr    ] o.a.s.m.r.SolrJmxReporter JMX monitoring for 'solr_45640.solr.node' (registry 'solr.node') enabled at server: com.sun.jmx.mbeanserver.JmxMBeanServer@78273b86
   [junit4]   2> 1150401 INFO  (jetty-launcher-1729-thread-2) [n:127.0.0.1:48917_solr    ] o.a.s.m.r.SolrJmxReporter JMX monitoring for 'solr_48917.solr.jvm' (registry 'solr.jvm') enabled at server: com.sun.jmx.mbeanserver.JmxMBeanServer@78273b86
   [junit4]   2> 1150401 INFO  (jetty-launcher-1729-thread-2) [n:127.0.0.1:48917_solr    ] o.a.s.m.r.SolrJmxReporter JMX monitoring for 'solr_48917.solr.jetty' (registry 'solr.jetty') enabled at server: com.sun.jmx.mbeanserver.JmxMBeanServer@78273b86
   [junit4]   2> 1150401 INFO  (jetty-launcher-1729-thread-1) [n:127.0.0.1:45640_solr    ] o.a.s.m.r.SolrJmxReporter JMX monitoring for 'solr_45640.solr.jvm' (registry 'solr.jvm') enabled at server: com.sun.jmx.mbeanserver.JmxMBeanServer@78273b86
   [junit4]   2> 1150401 INFO  (jetty-launcher-1729-thread-1) [n:127.0.0.1:45640_solr    ] o.a.s.m.r.SolrJmxReporter JMX monitoring for 'solr_45640.solr.jetty' (registry 'solr.jetty') enabled at server: com.sun.jmx.mbeanserver.JmxMBeanServer@78273b86
   [junit4]   2> 1150402 INFO  (jetty-launcher-1729-thread-2) [n:127.0.0.1:48917_solr    ] o.a.s.c.CorePropertiesLocator Found 0 core definitions underneath /export/home/jenkins/workspace/Lucene-Solr-7.x-Solaris/solr/build/solr-core/test/J0/temp/solr.cloud.TestSolrCloudWithSecureImpersonation_FB172D5D63C9D5B9-001/tempDir-001/node1/.
   [junit4]   2> 1150402 INFO  (jetty-launcher-1729-thread-1) [n:127.0.0.1:45640_solr    ] o.a.s.c.CorePropertiesLocator Found 0 core definitions underneath /export/home/jenkins/workspace/Lucene-Solr-7.x-Solaris/solr/build/solr-core/test/J0/temp/solr.cloud.TestSolrCloudWithSecureImpersonation_FB172D5D63C9D5B9-001/tempDir-001/node2/.
   [junit4]   2> 1150432 INFO  (zkConnectionManagerCallback-1754-thread-1) [    ] o.a.s.c.c.ConnectionManager zkClient has connected
   [junit4]   2> 1150434 WARN  (NIOServerCxn.Factory:0.0.0.0/0.0.0.0:0) [    ] o.a.z.s.NIOServerCnxn Unable to read additional data from client sessionid 0x10039d73c350009, likely client has closed socket
   [junit4]   2> 1150455 INFO  (TEST-TestSolrCloudWithSecureImpersonation.testProxyNoConfigGroups-seed#[FB172D5D63C9D5B9]) [    ] o.a.s.SolrTestCaseJ4 ###Starting testProxyNoConfigGroups
   [junit4]   2> 1150480 WARN  (TEST-TestSolrCloudWithSecureImpersonation.testProxyNoConfigGroups-seed#[FB172D5D63C9D5B9]) [    ] o.a.h.c.p.ResponseProcessCookies Invalid cookie header: "Set-Cookie: hadoop.auth="u=noGroups&p=noGroups&t=test&e=1517491300556&s=mvPSAgBJXT//49ZNfbdvEtiFWFc="; Path=/; Domain=127.0.0.1; Expires=J, 01-Feb-2018 13:21:40 GMT; HttpOnly". Invalid 'expires' attribute: J, 01-Feb-2018 13:21:40 GMT
   [junit4]   2> 1150481 INFO  (TEST-TestSolrCloudWithSecureImpersonation.testProxyNoConfigGroups-seed#[FB172D5D63C9D5B9]) [    ] o.a.s.SolrTestCaseJ4 ###Ending testProxyNoConfigGroups
   [junit4]   2> 1150498 INFO  (TEST-TestSolrCloudWithSecureImpersonation.testForwarding-seed#[FB172D5D63C9D5B9]) [    ] o.a.s.SolrTestCaseJ4 ###Starting testForwarding
   [junit4]   2> 1150500 INFO  (zkConnectionManagerCallback-1757-thread-1) [    ] o.a.s.c.c.ConnectionManager zkClient has connected
   [junit4]   2> 1150995 INFO  (zkConnectionManagerCallback-1760-thread-1) [    ] o.a.s.c.c.ConnectionManager zkClient has connected
   [junit4]   2> 1150997 INFO  (TEST-TestSolrCloudWithSecureImpersonation.testForwarding-seed#[FB172D5D63C9D5B9]) [    ] o.a.s.c.c.ZkStateReader Updated live nodes from ZooKeeper... (0) -> (2)
   [junit4]   2> 1150998 INFO  (TEST-TestSolrCloudWithSecureImpersonation.testForwarding-seed#[FB172D5D63C9D5B9]) [    ] o.a.s.c.s.i.ZkClientClusterStateProvider Cluster at 127.0.0.1:46075/solr ready
   [junit4]   2> 1151002 INFO  (qtp1169959775-15539) [n:127.0.0.1:48917_solr    ] o.a.s.h.a.CollectionsHandler Invoked Collection Action :create with params pullReplicas=0&replicationFactor=1&collection.configName=conf1&maxShardsPerNode=1&name=forwardingCollection&nrtReplicas=1&action=CREATE&numShards=1&tlogReplicas=0&wt=javabin&version=2 and sendToOCPQueue=true
   [junit4]   2> 1151006 INFO  (OverseerThreadFactory-3382-thread-1-processing-n:127.0.0.1:48917_solr) [n:127.0.0.1:48917_solr    ] o.a.s.c.a.c.CreateCollectionCmd Create collection forwardingCollection
   [junit4]   2> 1151117 INFO  (OverseerStateUpdate-72121190628786182-127.0.0.1:48917_solr-n_0000000000) [n:127.0.0.1:48917_solr    ] o.a.s.c.o.SliceMutator createReplica() {
   [junit4]   2>   "operation":"ADDREPLICA",
   [junit4]   2>   "collection":"forwardingCollection",
   [junit4]   2>   "shard":"shard1",
   [junit4]   2>   "core":"forwardingCollection_shard1_replica_n1",
   [junit4]   2>   "state":"down",
   [junit4]   2>   "base_url":"http://127.0.0.1:45640/solr",
   [junit4]   2>   "type":"NRT",
   [junit4]   2>   "waitForFinalState":"false"} 
   [junit4]   2> 1151322 INFO  (qtp556391846-15546) [n:127.0.0.1:45640_solr    ] o.a.s.h.a.CoreAdminOperation core create command qt=/admin/cores&coreNodeName=core_node2&collection.configName=conf1&newCollection=true&name=forwardingCollection_shard1_replica_n1&action=CREATE&numShards=1&collection=forwardingCollection&shard=shard1&wt=javabin&version=2&replicaType=NRT
   [junit4]   2> 1151322 INFO  (qtp556391846-15546) [n:127.0.0.1:45640_solr    ] o.a.s.c.TransientSolrCoreCacheDefault Allocating transient cache for 2147483647 transient cores
   [junit4]   2> 1151427 INFO  (zkCallback-1745-thread-1-processing-n:127.0.0.1:45640_solr) [n:127.0.0.1:45640_solr    ] o.a.s.c.c.ZkStateReader A cluster state change: [WatchedEvent state:SyncConnected type:NodeDataChanged path:/collections/forwardingCollection/state.json] for collection [forwardingCollection] has occurred - updating... (live nodes size: [2])
   [junit4]   2> 1151428 INFO  (zkCallback-1745-thread-2-processing-n:127.0.0.1:45640_solr) [n:127.0.0.1:45640_solr    ] o.a.s.c.c.ZkStateReader A cluster state change: [WatchedEvent state:SyncConnected type:NodeDataChanged path:/collections/forwardingCollection/state.json] for collection [forwardingCollection] has occurred - updating... (live nodes size: [2])
   [junit4]   2> 1152350 INFO  (qtp556391846-15546) [n:127.0.0.1:45640_solr c:forwardingCollection s:shard1 r:core_node2 x:forwardingCollection_shard1_replica_n1] o.a.s.c.SolrConfig Using Lucene MatchVersion: 7.3.0
   [junit4]   2> 1152367 INFO  (qtp556391846-15546) [n:127.0.0.1:45640_solr c:forwardingCollection s:shard1 r:core_node2 x:forwardingCollection_shard1_replica_n1] o.a.s.s.IndexSchema [forwardingCollection_shard1_replica_n1] Schema name=test
   [junit4]   2> 1152670 INFO  (qtp556391846-15546) [n:127.0.0.1:45640_solr c:forwardingCollection s:shard1 r:core_node2 x:forwardingCollection_shard1_replica_n1] o.a.s.s.IndexSchema Loaded schema test/1.0 with uniqueid field id
   [junit4]   2> 1152692 INFO  (qtp556391846-15546) [n:127.0.0.1:45640_solr c:forwardingCollection s:shard1 r:core_node2 x:forwardingCollection_shard1_replica_n1] o.a.s.c.CoreContainer Creating SolrCore 'forwardingCollection_shard1_replica_n1' using configuration from collection forwardingCollection, trusted=true
   [junit4]   2> 1152692 INFO  (qtp556391846-15546) [n:127.0.0.1:45640_solr c:forwardingCollection s:shard1 r:core_node2 x:forwardingCollection_shard1_replica_n1] o.a.s.m.r.SolrJmxReporter JMX monitoring for 'solr_45640.solr.core.forwardingCollection.shard1.replica_n1' (registry 'solr.core.forwardingCollection.shard1.replica_n1') enabled at server: com.sun.jmx.mbeanserver.JmxMBeanServer@78273b86
   [junit4]   2> 1152693 INFO  (qtp556391846-15546) [n:127.0.0.1:45640_solr c:forwardingCollection s:shard1 r:core_node2 x:forwardingCollection_shard1_replica_n1] o.a.s.c.SolrCore solr.RecoveryStrategy.Builder
   [junit4]   2> 1152693 INFO  (qtp556391846-15546) [n:127.0.0.1:45640_solr c:forwardingCollection s:shard1 r:core_node2 x:forwardingCollection_shard1_replica_n1] o.a.s.c.SolrCore [[forwardingCollection_shard1_replica_n1] ] Opening new SolrCore at [/export/home/jenkins/workspace/Lucene-Solr-7.x-Solaris/solr/build/solr-core/test/J0/temp/solr.cloud.TestSolrCloudWithSecureImpersonation_FB172D5D63C9D5B9-001/tempDir-001/node2/forwardingCollection_shard1_replica_n1], dataDir=[/export/home/jenkins/workspace/Lucene-Solr-7.x-Solaris/solr/build/solr-core/test/J0/temp/solr.cloud.TestSolrCloudWithSecureImpersonation_FB172D5D63C9D5B9-001/tempDir-001/node2/./forwardingCollection_shard1_replica_n1/data/]
   [junit4]   2> 1152694 INFO  (qtp556391846-15546) [n:127.0.0.1:45640_solr c:forwardingCollection s:shard1 r:core_node2 x:forwardingCollection_shard1_replica_n1] o.a.s.u.RandomMergePolicy RandomMergePolicy wrapping class org.apache.lucene.index.TieredMergePolicy: [TieredMergePolicy: maxMergeAtOnce=21, maxMergeAtOnceExplicit=40, maxMergedSegmentMB=58.9052734375, floorSegmentMB=0.7021484375, forceMergeDeletesPctAllowed=14.51644617190361, segmentsPerTier=49.0, maxCFSSegmentSizeMB=8.796093022207999E12, noCFSRatio=0.780054157225594
   [junit4]   2> 1152742 INFO  (qtp556391846-15546) [n:127.0.0.1:45640_solr c:forwardingCollection s:shard1 r:core_node2 x:forwardingCollection_shard1_replica_n1] o.a.s.u.UpdateHandler Using UpdateLog implementation: org.apache.solr.update.UpdateLog
   [junit4]   2> 1152742 INFO  (qtp556391846-15546) [n:127.0.0.1:45640_solr c:forwardingCollection s:shard1 r:core_node2 x:forwardingCollection_shard1_replica_n1] o.a.s.u.UpdateLog Initializing UpdateLog: dataDir= defaultSyncLevel=FLUSH numRecordsToKeep=100 maxNumLogsToKeep=10 numVersionBuckets=65536
   [junit4]   2> 1152743 INFO  (qtp556391846-15546) [n:127.0.0.1:45640_solr c:forwardingCollection s:shard1 r:core_node2 x:forwardingCollection_shard1_replica_n1] o.a.s.u.CommitTracker Hard AutoCommit: disabled
   [junit4]   2> 1152743 INFO  (qtp556391846-15546) [n:127.0.0.1:45640_solr c:forwardingCollection s:shard1 r:core_node2 x:forwardingCollection_shard1_replica_n1] o.a.s.u.CommitTracker Soft AutoCommit: disabled
   [junit4]   2> 1152744 INFO  (qtp556391846-15546) [n:127.0.0.1:45640_solr c:forwardingCollection s:shard1 r:core_node2 x:forwardingCollection_shard1_replica_n1] o.a.s.u.RandomMergePolicy RandomMergePolicy wrapping class org.apache.lucene.index.LogByteSizeMergePolicy: [LogByteSizeMergePolicy: minMergeSize=1677721, mergeFactor=45, maxMergeSize=2147483648, maxMergeSizeForForcedMerge=9223372036854775807, calibrateSizeByDeletes=false, maxMergeDocs=2147483647, maxCFSSegmentSizeMB=8.796093022207999E12, noCFSRatio=0.11126311555072183]
   [junit4]   2> 1152744 INFO  (qtp556391846-15546) [n:127.0.0.1:45640_solr c:forwardingCollection s:shard1 r:core_node2 x:forwardingCollection_shard1_replica_n1] o.a.s.s.SolrIndexSearcher Opening [Searcher@255ef0a7[forwardingCollection_shard1_replica_n1] main]
   [junit4]   2> 1152747 INFO  (qtp556391846-15546) [n:127.0.0.1:45640_solr c:forwardingCollection s:shard1 r:core_node2 x:forwardingCollection_shard1_replica_n1] o.a.s.h.c.SpellCheckComponent Initializing spell checkers
   [junit4]   2> 1152752 INFO  (qtp556391846-15546) [n:127.0.0.1:45640_solr c:forwardingCollection s:shard1 r:core_node2 x:forwardingCollection_shard1_replica_n1] o.a.s.s.DirectSolrSpellChecker init: {name=direct,classname=DirectSolrSpellChecker,field=lowerfilt,minQueryLength=3}
   [junit4]   2> 1152771 INFO  (qtp556391846-15546) [n:127.0.0.1:45640_solr c:forwardingCollection s:shard1 r:core_node2 x:forwardingCollection_shard1_replica_n1] o.a.s.h.ReplicationHandler Commits will be reserved for 10000ms.
   [junit4]   2> 1152771 INFO  (searcherExecutor-3387-thread-1-processing-n:127.0.0.1:45640_solr x:forwardingCollection_shard1_replica_n1 s:shard1 c:forwardingCollection r:core_node2) [n:127.0.0.1:45640_solr c:forwardingCollection s:shard1 r:core_node2 x:forwardingCollection_shard1_replica_n1] o.a.s.h.c.SpellCheckComponent Loading spell index for spellchecker: default
   [junit4]   2> 1152771 INFO  (qtp556391846-15546) [n:127.0.0.1:45640_solr c:forwardingCollection s:shard1 r:core_node2 x:forwardingCollection_shard1_replica_n1] o.a.s.u.UpdateLog Could not find max version in index or recent updates, using new clock 1591167211652775936
   [junit4]   2> 1152772 INFO  (searcherExecutor-3387-thread-1-processing-n:127.0.0.1:45640_solr x:forwardingCollection_shard1_replica_n1 s:shard1 c:forwardingCollection r:core_node2) [n:127.0.0.1:45640_solr c:forwardingCollection s:shard1 r:core_node2 x:forwardingCollection_shard1_replica_n1] o.a.s.h.c.SpellCheckComponent Loading spell index for spellchecker: direct
   [junit4]   2> 1152772 INFO  (searcherExecutor-3387-thread-1-processing-n:127.0.0.1:45640_solr x:forwardingCollection_shard1_replica_n1 s:shard1 c:forwardingCollection r:core_node2) [n:127.0.0.1:45640_solr c:forwardingCollection s:shard1 r:core_node2 x:forwardingCollection_shard1_replica_n1] o.a.s.h.c.SpellCheckComponent Loading spell index for spellchecker: wordbreak
   [junit4]   2> 1152772 INFO  (searcherExecutor-3387-thread-1-processing-n:127.0.0.1:45640_solr x:forwardingCollection_shard1_replica_n1 s:shard1 c:forwardingCollection r:core_node2) [n:127.0.0.1:45640_solr c:forwardingCollection s:shard1 r:core_node2 x:forwardingCollection_shard1_replica_n1] o.a.s.h.c.SpellCheckComponent Loading spell index for spellchecker: multipleFields
   [junit4]   2> 1152772 INFO  (searcherExecutor-3387-thread-1-processing-n:127.0.0.1:45640_solr x:forwardingCollection_shard1_replica_n1 s:shard1 c:forwardingCollection r:core_node2) [n:127.0.0.1:45640_solr c:forwardingCollection s:shard1 r:core_node2 x:forwardingCollection_shard1_replica_n1] o.a.s.h.c.SpellCheckComponent Loading spell index for spellchecker: jarowinkler
   [junit4]   2> 1152772 INFO  (searcherExecutor-3387-thread-1-processing-n:127.0.0.1:45640_solr x:forwardingCollection_shard1_replica_n1 s:shard1 c:forwardingCollection r:core_node2) [n:127.0.0.1:45640_solr c:forwardingCollection s:shard1 r:core_node2 x:forwardingCollection_shard1_replica_n1] o.a.s.h.c.SpellCheckComponent Loading spell index for spellchecker: external
   [junit4]   2> 1152773 INFO  (searcherExecutor-3387-thread-1-processing-n:127.0.0.1:45640_solr x:forwardingCollection_shard1_replica_n1 s:shard1 c:forwardingCollection r:core_node2) [n:127.0.0.1:45640_solr c:forwardingCollection s:shard1 r:core_node2 x:forwardingCollection_shard1_replica_n1] o.a.s.h.c.SpellCheckComponent Loading spell index for spellchecker: freq
   [junit4]   2> 1152773 INFO  (searcherExecutor-3387-thread-1-processing-n:127.0.0.1:45640_solr x:forwardingCollection_shard1_replica_n1 s:shard1 c:forwardingCollection r:core_node2) [n:127.0.0.1:45640_solr c:forwardingCollection s:shard1 r:core_node2 x:forwardingCollection_shard1_replica_n1] o.a.s.h.c.SpellCheckComponent Loading spell index for spellchecker: fqcn
   [junit4]   2> 1152773 INFO  (searcherExecutor-3387-thread-1-processing-n:127.0.0.1:45640_solr x:forwardingCollection_shard1_replica_n1 s:shard1 c:forwardingCollection r:core_node2) [n:127.0.0.1:45640_solr c:forwardingCollection s:shard1 r:core_node2 x:forwardingCollection_shard1_replica_n1] o.a.s.h.c.SpellCheckComponent Loading spell index for spellchecker: perDict
   [junit4]   2> 1152775 INFO  (searcherExecutor-3387-thread-1-processing-n:127.0.0.1:45640_solr x:forwardingCollection_shard1_replica_n1 s:shard1 c:forwardingCollection r:core_node2) [n:127.0.0.1:45640_solr c:forwardingCollection s:shard1 r:core_node2 x:forwardingCollection_shard1_replica_n1] o.a.s.c.SolrCore [forwardingCollection_shard1_replica_n1] Registered new searcher Searcher@255ef0a7[forwardingCollection_shard1_replica_n1] main{ExitableDirectoryReader(UninvertingDirectoryReader())}
   [junit4]   2> 1152782 INFO  (qtp556391846-15546) [n:127.0.0.1:45640_solr c:forwardingCollection s:shard1 r:core_node2 x:forwardingCollection_shard1_replica_n1] o.a.s.c.ShardLeaderElectionContext Enough replicas found to continue.
   [junit4]   2> 1152782 INFO  (qtp556391846-15546) [n:127.0.0.1:45640_solr c:forwardingCollection s:shard1 r:core_node2 x:forwardingCollection_shard1_replica_n1] o.a.s.c.ShardLeaderElectionContext I may be the new leader - try and sync
   [junit4]   2> 1152782 INFO  (qtp556391846-15546) [n:127.0.0.1:45640_solr c:forwardingCollection s:shard1 r:core_node2 x:forwardingCollection_shard1_replica_n1] o.a.s.c.SyncStrategy Sync replicas to http://127.0.0.1:45640/solr/forwardingCollection_shard1_replica_n1/
   [junit4]   2> 1152782 INFO  (qtp556391846-15546) [n:127.0.0.1:45640_solr c:forwardingCollection s:shard1 r:core_node2 x:forwardingCollection_shard1_replica_n1] o.a.s.c.SyncStrategy Sync Success - now sync replicas to me
   [junit4]   2> 1152782 INFO  (qtp556391846-15546) [n:127.0.0.1:45640_solr c:forwardingCollection s:shard1 r:core_node2 x:forwardingCollection_shard1_replica_n1] o.a.s.c.SyncStrategy http://127.0.0.1:45640/solr/forwardingCollection_shard1_replica_n1/ has no replicas
   [junit4]   2> 1152782 INFO  (qtp556391846-15546) [n:127.0.0.1:45640_solr c:forwardingCollection s:shard1 r:core_node2 x:forwardingCollection_shard1_replica_n1] o.a.s.c.ShardLeaderElectionContext Found all replicas participating in election, clear LIR
   [junit4]   2> 1152786 INFO  (qtp556391846-15546) [n:127.0.0.1:45640_solr c:forwardingCollection s:shard1 r:core_node2 x:forwardingCollection_shard1_replica_n1] o.a.s.c.ShardLeaderElectionContext I am the new leader: http://127.0.0.1:45640/solr/forwardingCollection_shard1_replica_n1/ shard1
   [junit4]   2> 1152889 INFO  (zkCallback-1745-thread-2-processing-n:127.0.0.1:45640_solr) [n:127.0.0.1:45640_solr    ] o.a.s.c.c.ZkStateReader A cluster state change: [WatchedEvent state:SyncConnected type:NodeDataChanged path:/collections/forwardingCollection/state.json] for collection [forwardingCollection] has occurred - updating... (live nodes size: [2])
   [junit4]   2> 1152889 INFO  (zkCallback-1745-thread-1-processing-n:127.0.0.1:45640_solr) [n:127.0.0.1:45640_solr    ] o.a.s.c.c.ZkStateReader A cluster state change: [WatchedEvent state:SyncConnected type:NodeDataChanged path:/collections/forwardingCollection/state.json] for collection [forwardingCollection] has occurred - updating... (live nodes size: [2])
   [junit4]   2> 1152892 INFO  (qtp556391846-15546) [n:127.0.0.1:45640_solr c:forwardingCollection s:shard1 r:core_node2 x:forwardingCollection_shard1_replica_n1] o.a.s.c.ZkController I am the leader, no recovery necessary
   [junit4]   2> 1152894 INFO  (qtp556391846-15546) [n:127.0.0.1:45640_solr c:forwardingCollection s:shard1 r:core_node2 x:forwardingCollection_shard1_replica_n1] o.a.s.s.HttpSolrCall [admin] webapp=null path=/admin/cores params={qt=/admin/cores&coreNodeName=core_node2&collection.configName=conf1&newCollection=true&name=forwardingCollection_shard1_replica_n1&action=CREATE&numShards=1&collection=forwardingCollection&shard=shard1&wt=javabin&version=2&replicaType=NRT} status=0 QTime=1573
   [junit4]   2> 1152895 WARN  (httpShardExecutor-3378-thread-1-processing-n:127.0.0.1:48917_solr [http:////127.0.0.1:45640//solr] http:////127.0.0.1:45640//solr) [n:127.0.0.1:48917_solr    ] o.a.h.c.p.ResponseProcessCookies Invalid cookie header: "Set-Cookie: hadoop.auth="u=$&p=$&t=test&e=1517491301410&s=DKf8jH63H/+UJ49Vp0xm4O1TD64="; Path=/; Domain=127.0.0.1; Expires=J, 01-Feb-2018 13:21:41 GMT; HttpOnly". Invalid 'expires' attribute: J, 01-Feb-2018 13:21:41 GMT
   [junit4]   2> 1152898 INFO  (qtp1169959775-15539) [n:127.0.0.1:48917_solr    ] o.a.s.h.a.CollectionsHandler Wait for new collection to be active for at most 30 seconds. Check all shard replicas
   [junit4]   2> 1152998 INFO  (zkCallback-1745-thread-1-processing-n:127.0.0.1:45640_solr) [n:127.0.0.1:45640_solr    ] o.a.s.c.c.ZkStateReader A cluster state change: [WatchedEvent state:SyncConnected type:NodeDataChanged path:/collections/forwardingCollection/state.json] for collection [forwardingCollection] has occurred - updating... (live nodes size: [2])
   [junit4]   2> 1152998 INFO  (zkCallback-1745-thread-2-processing-n:127.0.0.1:45640_solr) [n:127.0.0.1:45640_solr    ] o.a.s.c.c.ZkStateReader A cluster state change: [WatchedEvent state:SyncConnected type:NodeDataChanged path:/collections/forwardingCollection/state.json] for collection [forwardingCollection] has occurred - updating... (live nodes size: [2])
   [junit4]   2> 1153007 INFO  (OverseerCollectionConfigSetProcessor-72121190628786182-127.0.0.1:48917_solr-n_0000000000) [n:127.0.0.1:48917_solr    ] o.a.s.c.OverseerTaskQueue Response ZK path: /overseer/collection-queue-work/qnr-0000000000 doesn't exist.  Requestor may have disconnected from ZooKeeper
   [junit4]   2> 1153903 INFO  (qtp1169959775-15539) [n:127.0.0.1:48917_solr    ] o.a.s.s.HttpSolrCall [admin] webapp=null path=/admin/collections params={pullReplicas=0&replicationFactor=1&collection.configName=conf1&maxShardsPerNode=1&name=forwardingCollection&nrtReplicas=1&action=CREATE&numShards=1&tlogReplicas=0&wt=javabin&version=2} status=0 QTime=2901
   [junit4]   2> 1153903 WARN  (TEST-TestSolrCloudWithSecureImpersonation.testForwarding-seed#[FB172D5D63C9D5B9]) [    ] o.a.h.c.p.ResponseProcessCookies Invalid cookie header: "Set-Cookie: hadoop.auth="u=user&p=user&t=test&e=1517491301089&s=rTqHSr/XQJMSEjmVy7cnhyP8l8s="; Path=/; Domain=127.0.0.1; Expires=J, 01-Feb-2018 13:21:41 GMT; HttpOnly". Invalid 'expires' attribute: J, 01-Feb-2018 13:21:41 GMT
   [junit4]   2> 1153904 INFO  (TEST-TestSolrCloudWithSecureImpersonation.testForwarding-seed#[FB172D5D63C9D5B9]) [    ] o.a.s.c.AbstractDistribZkTestBase Wait for recoveries to finish - collection: forwardingCollection failOnTimeout:true timeout (sec):100
   [junit4]   2> 1153904 INFO  (TEST-TestSolrCloudWithSecureImpersonation.testForwarding-seed#[FB172D5D63C9D5B9]) [    ] o.a.s.c.AbstractDistribZkTestBase Recoveries finished - collection: forwardingCollection
   [junit4]   2> 1153907 INFO  (qtp556391846-15546) [n:127.0.0.1:45640_solr c:forwardingCollection s:shard1 r:core_node2 x:forwardingCollection_shard1_replica_n1] o.a.s.c.S.Request [forwardingCollection_shard1_replica_n1]  webapp=/solr path=/select params={q=*:*&wt=javabin&version=2} hits=0 status=0 QTime=0
   [junit4]   2> 1153908 WARN  (TEST-TestSolrCloudWithSecureImpersonation.testForwarding-seed#[FB172D5D63C9D5B9]) [    ] o.a.h.c.p.ResponseProcessCookies Invalid cookie header: "Set-Cookie: hadoop.auth="u=user&p=user&t=test&e=1517491303996&s=Se6q4L6Opdzp1GL0w2waYvCgA18="; Path=/; Domain=127.0.0.1; Expires=J, 01-Feb-2018 13:21:43 GMT; HttpOnly". Invalid 'expires' attribute: J, 01-Feb-2018 13:21:43 GMT
   [junit4]   2> 1153910 INFO  (qtp1169959775-15553) [n:127.0.0.1:48917_solr    ] o.a.s.c.TransientSolrCoreCacheDefault Allocating transient cache for 2147483647 transient cores
   [junit4]   2> 1153913 INFO  (qtp556391846-15546) [n:127.0.0.1:45640_solr c:forwardingCollection s:shard1 r:core_node2 x:forwardingCollection_shard1_replica_n1] o.a.s.c.S.Request [forwardingCollection_shard1_replica_n1]  webapp=/solr path=/select params={q=*:*&wt=javabin&version=2} hits=0 status=0 QTime=0
   [junit4]   2> 1153914 WARN  (qtp1169959775-15553) [n:127.0.0.1:48917_solr    ] o.a.h.c.p.ResponseProcessCookies Invalid cookie header: "Set-Cookie: hadoop.auth="u=$&p=$&t=test&e=1517491304003&s=kriSjiOrbPAhRSsE1EUOLLcK6qI="; Path=/; Domain=127.0.0.1; Expires=J, 01-Feb-2018 13:21:44 GMT; HttpOnly". Invalid 'expires' attribute: J, 01-Feb-2018 13:21:44 GMT
   [junit4]   2> 1153914 WARN  (TEST-TestSolrCloudWithSecureImpersonation.testForwarding-seed#[FB172D5D63C9D5B9]) [    ] o.a.h.c.p.ResponseProcessCookies Invalid cookie header: "Set-Cookie: hadoop.auth="u=user&p=user&t=test&e=1517491304000&s=mcpfbpVG3E5lMK69pckG0JS0aEA="; Path=/; Domain=127.0.0.1; Expires=J, 01-Feb-2018 13:21:44 GMT; HttpOnly". Invalid 'expires' attribute: J, 01-Feb-2018 13:21:44 GMT
   [junit4]   2> 1153915 WARN  (TEST-TestSolrCloudWithSecureImpersonation.testForwarding-seed#[FB172D5D63C9D5B9]) [    ] o.a.h.c.p.ResponseProcessCookies Invalid cookie header: "Set-Cookie: hadoop.auth="u=$&p=$&t=test&e=1517491304003&s=kriSjiOrbPAhRSsE1EUOLLcK6qI="; Path=/; Domain=127.0.0.1; Expires=J, 01-Feb-2018 13:21:44 GMT; HttpOnly". Invalid 'expires' attribute: J, 01-Feb-2018 13:21:44 GMT
   [junit4]   2> 1153915 INFO  (TEST-TestSolrCloudWithSecureImpersonation.testForwarding-seed#[FB172D5D63C9D5B9]) [    ] o.a.s.SolrTestCaseJ4 ###Ending testForwarding
   [junit4]   2> 1153938 INFO  (TEST-TestSolrCloudWithSecureImpersonation.testProxyValidateAnyHostAnyUser-seed#[FB172D5D63C9D5B9]) [    ] o.a.s.SolrTestCaseJ4 ###Starting testProxyValidateAnyHostAnyUser
   [junit4]   2> 1153940 INFO  (qtp556391846-15540) [n:127.0.0.1:45640_solr    ] o.a.s.h.a.CollectionsHandler Invoked Collection Action :list with params doAs=bar&action=LIST&wt=javabin&version=2 and sendToOCPQueue=true
   [junit4]   2> 1153940 INFO  (qtp556391846-15540) [n:127.0.0.1:45640_solr    ] o.a.s.s.HttpSolrCall [admin] webapp=null path=/admin/collections params={doAs=bar&action=LIST&wt=javabin&version=2} status=0 QTime=0
   [junit4]   2> 1153940 WARN  (TEST-TestSolrCloudWithSecureImpersonation.testProxyValidateAnyHostAnyUser-seed#[FB172D5D63C9D5B9]) [    ] o.a.h.c.p.ResponseProcessCookies Invalid cookie header: "Set-Cookie: hadoop.auth="u=anyHostAnyUser&p=anyHostAnyUser&t=test&e=1517491304029&s=AcEaT02gS3shOr4VWPa6d6lcPgA="; Path=/; Domain=127.0.0.1; Expires=J, 01-Feb-2018 13:21:44 GMT; HttpOnly". Invalid 'expires' attribute: J, 01-Feb-2018 13:21:44 GMT
   [junit4]   2> 1153940 INFO  (TEST-TestSolrCloudWithSecureImpersonation.testProxyValidateAnyHostAnyUser-seed#[FB172D5D63C9D5B9]) [    ] o.a.s.SolrTestCaseJ4 ###Ending testProxyValidateAnyHostAnyUser
   [junit4]   2> 1153972 INFO  (TEST-TestSolrCloudWithSecureImpersonation.testProxyNoConfigHosts-seed#[FB172D5D63C9D5B9]) [    ] o.a.s.SolrTestCaseJ4 ###Starting testProxyNoConfigHosts
   [junit4]   2> 1153974 WARN  (TEST-TestSolrCloudWithSecureImpersonation.testProxyNoConfigHosts-seed#[FB172D5D63C9D5B9]) [    ] o.a.h.c.p.ResponseProcessCookies Invalid cookie header: "Set-Cookie: hadoop.auth="u=noHosts&p=noHosts&t=test&e=1517491304063&s=gm5xxn9KXKAei1eqkVfLMHp5dGA="; Path=/; Domain=127.0.0.1; Expires=J, 01-Feb-2018 13:21:44 GMT; HttpOnly". Invalid 'expires' attribute: J, 01-Feb-2018 13:21:44 GMT
   [junit4]   2> 1153975 INFO  (TEST-TestSolrCloudWithSecureImpersonation.testProxyNoConfigHosts-seed#[FB172D5D63C9D5B9]) [    ] o.a.s.SolrTestCaseJ4 ###Ending testProxyNoConfigHosts
   [junit4]   2> 1154001 INFO  (TEST-TestSolrCloudWithSecureImpersonation.testProxyValidateGroup-seed#[FB172D5D63C9D5B9]) [    ] o.a.s.SolrTestCaseJ4 ###Starting testProxyValidateGroup
   [junit4]   2> 1154002 INFO  (qtp556391846-15540) [n:127.0.0.1:45640_solr    ] o.a.s.h.a.CollectionsHandler Invoked Collection Action :list with params doAs=jenkins&action=LIST&wt=javabin&version=2 and sendToOCPQueue=true
   [junit4]   2> 1154002 INFO  (qtp556391846-15540) [n:127.0.0.1:45640_solr    ] o.a.s.s.HttpSolrCall [admin] webapp=null path=/admin/collections params={doAs=jenkins&action=LIST&wt=javabin&version=2} status=0 QTime=0
   [junit4]   2> 1154002 WARN  (TEST-TestSolrCloudWithSecureImpersonation.testProxyValidateGroup-seed#[FB172D5D63C9D5B9]) [    ] o.a.h.c.p.ResponseProcessCookies Invalid cookie header: "Set-Cookie: hadoop.auth="u=anyHostUsersGroup&p=anyHostUsersGroup&t=test&e=1517491304091&s=nC6es3oKrMNXikJ2UTb1S0p/yOY="; Path=/; Domain=127.0.0.1; Expires=J, 01-Feb-2018 13:21:44 GMT; HttpOnly". Invalid 'expires' attribute: J, 01-Feb-2018 13:21:44 GMT
   [junit4]   2> 1154003 INFO  (TEST-TestSolrCloudWithSecureImpersonation.testProxyValidateGroup-seed#[FB172D5D63C9D5B9]) [    ] o.a.s.SolrTestCaseJ4 ###Ending testProxyValidateGroup
   [junit4]   2> 1154024 INFO  (TEST-TestSolrCloudWithSecureImpersonation.testProxyNullProxyUser-seed#[FB172D5D63C9D5B9]) [    ] o.a.s.SolrTestCaseJ4 ###Starting testProxyNullProxyUser
   [junit4]   2> 1154024 INFO  (qtp556391846-15546) [n:127.0.0.1:45640_solr c:forwardingCollection s:shard1 r:core_node2 x:forwardingCollection_shard1_replica_n1] o.a.s.s.SolrDispatchFilter Error authenticating
   [junit4]   2> java.lang.IllegalArgumentException: userName is NULL, empty or contains a '&'
   [junit4]   2> 	at org.apache.hadoop.security.authentication.util.AuthToken.checkForIllegalArgument(AuthToken.java:87)
   [junit4]   2> 	at org.apache.hadoop.security.authentication.util.AuthToken.<init>(AuthToken.java:70)
   [junit4]   2> 	at org.apache.hadoop.security.authentication.server.AuthenticationToken.<init>(AuthenticationToken.java:58)
   [junit4]   2> 	at org.apache.solr.security.HttpParamDelegationTokenPlugin$HttpParamDelegationTokenAuthenticationHandler$HttpParamAuthenticationHandler.authenticate(HttpParamDelegationTokenPlugin.java:213)
   [junit4]   2> 	at org.apache.hadoop.security.token.delegation.web.DelegationTokenAuthenticationHandler.authenticate(DelegationTokenAuthenticationHandler.java:348)
   [junit4]   2> 	at org.apache.solr.security.RequestContinuesRecorderAuthenticationHandler.authenticate(RequestContinuesRecorderAuthenticationHandler.java:69)
   [junit4]   2> 	at org.apache.hadoop.security.authentication.server.AuthenticationFilter.doFilter(AuthenticationFilter.java:518)
   [junit4]   2> 	at org.apache.solr.security.DelegationTokenKerberosFilter.doFilter(DelegationTokenKerberosFilter.java:134)
   [junit4]   2> 	at org.apache.solr.security.HttpParamDelegationTokenPlugin$HttpParamToRequestFilter.doFilter(HttpParamDelegationTokenPlugin.java:245)
   [junit4]   2> 	at org.apache.solr.security.KerberosPlugin.doAuthenticate(KerberosPlugin.java:243)
   [junit4]   2> 	at org.apache.solr.servlet.SolrDispatchFilter.authenticateRequest(SolrDispatchFilter.java:449)
   [junit4]   2> 	at org.apache.solr.servlet.SolrDispatchFilter.doFilter(SolrDispatchFilter.java:349)
   [junit4]   2> 	at org.apache.solr.servlet.SolrDispatchFilter.doFilter(SolrDispatchFilter.java:326)
   [junit4]   2> 	at org.eclipse.jetty.servlet.ServletHandler$CachedChain.doFilter(ServletHandler.java:1637)
   [junit4]   2> 	at org.apache.solr.client.solrj.embedded.JettySolrRunner$DebugFilter.doFilter(JettySolrRunner.java:139)
   [junit4]   2> 	at org.eclipse.jetty.servlet.ServletHandler$CachedChain.doFilter(ServletHandler.java:1637)
   [junit4]   2> 	at org.eclipse.jetty.servlet.ServletHandler.doHandle(ServletHandler.java:533)
   [junit4]   2> 	at org.eclipse.jetty.server.handler.ScopedHandler.nextHandle(ScopedHandler.java:188)
   [junit4]   2> 	at org.eclipse.jetty.server.session.SessionHandler.doHandle(SessionHandler.java:1595)
   [junit4]   2> 	at org.eclipse.jetty.server.handler.ScopedHandler.nextHandle(ScopedHandler.java:188)
   [junit4]   2> 	at org.eclipse.jetty.server.handler.ContextHandler.doHandle(ContextHandler.java:1253)
   [junit4]   2> 	at org.eclipse.jetty.server.handler.ScopedHandler.nextScope(ScopedHandler.java:168)
   [junit4]   2> 	at org.eclipse.jetty.servlet.ServletHandler.doScope(ServletHandler.java:473)
   [junit4]   2> 	at org.eclipse.jetty.server.session.SessionHandler.doScope(SessionHandler.java:1564)
   [junit4]   2> 	at org.eclipse.jetty.server.handler.ScopedHandler.nextScope(ScopedHandler.java:166)
   [junit4]   2> 	at org.eclipse.jetty.server.handler.ContextHandler.doScope(ContextHandler.java:1155)
   [junit4]   2> 	at org.eclipse.jetty.server.handler.ScopedHandler.handle(ScopedHandler.java:141)
   [junit4]   2> 	at org.eclipse.jetty.server.handler.gzip.GzipHandler.handle(GzipHandler.java:527)
   [junit4]   2> 	at org.eclipse.jetty.server.handler.HandlerWrapper.handle(HandlerWrapper.java:132)
   [junit4]   2> 	at org.eclipse.jetty.server.Server.handle(Server.java:530)
   [junit4]   2> 	at org.eclipse.jetty.server.HttpChannel.handle(HttpChannel.java:347)
   [junit4]   2> 	at org.eclipse.jetty.server.HttpConnection.onFillable(HttpConnection.java:256)
   [junit4]   2> 	at org.eclipse.jetty.io.AbstractConnection$ReadCallback.succeeded(AbstractConnection.java:279)
   [junit4]   2> 	at org.eclipse.jetty.io.FillInterest.fillable(FillInterest.java:102)
   [junit4]   2> 	at org.eclipse.jetty.io.ChannelEndPoint$2.run(ChannelEndPoint.java:124)
   [junit4]   2> 	at org.eclipse.jetty.util.thread.strategy.EatWhatYouKill.doProduce(EatWhatYouKill.java:247)
   [junit4]   2> 	at org.eclipse.jetty.util.thread.strategy.EatWhatYouKill.produce(EatWhatYouKill.java:140)
   [junit4]   2> 	at org.eclipse.jetty.util.thread.strategy.EatWhatYouKill.run(EatWhatYouKill.java:131)
   [junit4]   2> 	at org.eclipse.jetty.util.thread.ReservedThreadExecutor$ReservedThread.run(ReservedThreadExecutor.java:382)
   [junit4]   2> 	at org.eclipse.jetty.util.thread.QueuedThreadPool.runJob(QueuedThreadPool.java:708)
   [junit4]   2> 	at org.eclipse.jetty.util.thread.QueuedThreadPool$2.run(QueuedThreadPool.java:626)
   [junit4]   2> 	at java.lang.Thread.run(Thread.java:748)
   [junit4]   2> 1154025 WARN  (qtp556391846-15546) [n:127.0.0.1:45640_solr c:forwardingCollection s:shard1 r:core_node2 x:forwardingCollection_shard1_replica_n1] o.e.j.s.HttpChannel /solr/admin/collections
   [junit4]   2> org.apache.solr.common.SolrException: Error during request authentication, 
   [junit4]   2> 	at org.apache.solr.servlet.SolrDispatchFilter.authenticateRequest(SolrDispatchFilter.java:455)
   [junit4]   2> 	at org.apache.solr.servlet.SolrDispatchFilter.doFilter(SolrDispatchFilter.java:349)
   [junit4]   2> 	at org.apache.solr.servlet.SolrDispatchFilter.doFilter(SolrDispatchFilter.java:326)
   [junit4]   2> 	at org.eclipse.jetty.servlet.ServletHandler$CachedChain.doFilter(ServletHandler.java:1637)
   [junit4]   2> 	at org.apache.solr.client.solrj.embedded.JettySolrRunner$DebugFilter.doFilter(JettySolrRunner.java:139)
   [junit4]   2> 	at org.eclipse.jetty.servlet.ServletHandler$CachedChain.doFilter(ServletHandler.java:1637)
   [junit4]   2> 	at org.eclipse.jetty.servlet.ServletHandler.doHandle(ServletHandler.java:533)
   [junit4]   2> 	at org.eclipse.jetty.server.handler.ScopedHandler.nextHandle(ScopedHandler.java:188)
   [junit4]   2> 	at org.eclipse.jetty.server.session.SessionHandler.doHandle(SessionHandler.java:1595)
   [junit4]   2> 	at org.eclipse.jetty.server.handler.ScopedHandler.nextHandle(ScopedHandler.java:188)
   [junit4]   2> 	at org.eclipse.jetty.server.handler.ContextHandler.doHandle(ContextHandler.java:1253)
   [junit4]   2> 	at org.eclipse.jetty.server.handler.ScopedHandler.nextScope(ScopedHandler.java:168)
   [junit4]   2> 	at org.eclipse.jetty.servlet.ServletHandler.doScope(ServletHandler.java:473)
   [junit4]   2> 	at org.eclipse.jetty.server.session.SessionHandler.doScope(SessionHandler.java:1564)
   [junit4]   2> 	at org.eclipse.jetty.server.handler.ScopedHandler.nextScope(ScopedHandler.java:166)
   [junit4]   2> 	at org.eclipse.jetty.server.handler.ContextHandler.doScope(ContextHandler.java:1155)
   [junit4]   2> 	at org.eclipse.jetty.server.handler.ScopedHandler.handle(ScopedHandler.java:141)
   [junit4]   2> 	at org.eclipse.jetty.server.handler.gzip.GzipHandler.handle(GzipHandler.java:527)
   [junit4]   2> 	at org.eclipse.jetty.server.handler.HandlerWrapper.handle(HandlerWrapper.java:132)
   [junit4]   2> 	at org.eclipse.jetty.server.Server.handle(Server.java:530)
   [junit4]   2> 	at org.eclipse.jetty.server.HttpChannel.handle(HttpChannel.java:347)
   [junit4]   2> 	at org.eclipse.jetty.server.HttpConnection.onFillable(HttpConnection.java:256)
   [junit4]   2> 	at org.eclipse.jetty.io.AbstractConnection$ReadCallback.succeeded(AbstractConnection.java:279)
   [junit4]   2> 	at org.eclipse.jetty.io.FillInterest.fillable(FillInterest.java:102)
   [junit4]   2> 	at org.eclipse.jetty.io.ChannelEndPoint$2.run(ChannelEndPoint.java:124)
   [junit4]   2> 	at org.eclipse.jetty.util.thread.strategy.EatWhatYouKill.doProduce(EatWhatYouKill.java:247)
   [junit4]   2> 	at org.eclipse.jetty.util.thread.strategy.EatWhatYouKill.produce(EatWhatYouKill.java:140)
   [junit4]   2> 	at org.eclipse.jetty.util.thread.strategy.EatWhatYouKill.run(EatWhatYouKill.java:131)
   [junit4]   2> 	at org.eclipse.jetty.util.thread.ReservedThreadExecutor$ReservedThread.run(ReservedThreadExecutor.java:382)
   [junit4]   2> 	at org.eclipse.jetty.util.thread.QueuedThreadPool.runJob(QueuedThreadPool.java:708)
   [junit4]   2> 	at org.eclipse.jetty.util.thread.QueuedThreadPool$2.run(QueuedThreadPool.java:626)
   [junit4]   2> 	at java.lang.Thread.run(Thread.java:748)
   [junit4]   2> Caused by: java.lang.IllegalArgumentException: userName is NULL, empty or contains a '&'
   [junit4]   2> 	at org.apache.hadoop.security.authentication.util.AuthToken.checkForIllegalArgument(AuthToken.java:87)
   [junit4]   2> 	at org.apache.hadoop.security.authentication.util.AuthToken.<init>(AuthToken.java:70)
   [junit4]   2> 	at org.apache.hadoop.security.authentication.server.AuthenticationToken.<init>(AuthenticationToken.java:58)
   [junit4]   2> 	at org.apache.solr.security.HttpParamDelegationTokenPlugin$HttpParamDelegationTokenAuthenticationHandler$HttpParamAuthenticationHandler.authenticate(HttpParamDelegationTokenPlugin.java:213)
   [junit4]   2> 	at org.apache.hadoop.security.token.delegation.web.DelegationTokenAuthenticationHandler.authenticate(DelegationTokenAuthenticationHandler.java:348)
   [junit4]   2> 	at org.apache.solr.security.RequestContinuesRecorderAuthenticationHandler.authenticate(RequestContinuesRecorderAuthenticationHandler.java:69)
   [junit4]   2> 	at org.apache.hadoop.security.authentication.server.AuthenticationFilter.doFilter(AuthenticationFilter.java:518)
   [junit4]   2> 	at org.apache.solr.security.DelegationTokenKerberosFilter.doFilter(DelegationTokenKerberosFilter.java:134)
   [junit4]   2> 	at org.apache.solr.security.HttpParamDelegationTokenPlugin$HttpParamToRequestFilter.doFilter(HttpParamDelegationTokenPlugin.java:245)
   [junit4]   2> 	at org.apache.solr.security.KerberosPlugin.doAuthenticate(KerberosPlugin.java:243)
   [junit4]   2> 	at org.apache.solr.servlet.SolrDispatchFilter.authenticateRequest(SolrDispatchFilter.java:449)
   [junit4]   2> 	... 31 more
   [junit4]   2> 1154031 INFO  (TEST-TestSolrCloudWithSecureImpersonation.testProxyNullProxyUser-seed#[FB172D5D63C9D5B9]) [    ] o.a.s.SolrTestCaseJ4 ###Ending testProxyNullProxyUser
   [junit4]   2> 1154053 INFO  (TEST-TestSolrCloudWithSecureImpersonation.testProxyValidateHost-seed#[FB172D5D63C9D5B9]) [    ] o.a.s.SolrTestCaseJ4 ###Starting testProxyValidateHost
   [junit4]   2> 1154054 INFO  (qtp556391846-15547) [n:127.0.0.1:45640_solr    ] o.a.s.h.a.CollectionsHandler Invoked Collection Action :list with params doAs=bar&action=LIST&wt=javabin&version=2 and sendToOCPQueue=true
   [junit4]   2> 1154054 INFO  (qtp556391846-15547) [n:127.0.0.1:45640_solr    ] o.a.s.s.HttpSolrCall [admin] webapp=null path=/admin/collections params={doAs=bar&action=LIST&wt=javabin&version=2} status=0 QTime=0
   [junit4]   2> 1154055 WARN  (TEST-TestSolrCloudWithSecureImpersonation.testProxyValidateHost-seed#[FB172D5D63C9D5B9]) [    ] o.a.h.c.p.ResponseProcessCookies Invalid cookie header: "Set-Cookie: hadoop.auth="u=localHostAnyGroup&p=localHostAnyGroup&t=test&e=1517491304144&s=+XCJBquGQND5DTMMrVCmugvdkdY="; Path=/; Domain=127.0.0.1; Expires=J, 01-Feb-2018 13:21:44 GMT; HttpOnly". Invalid 'expires' attribute: J, 01-Feb-2018 13:21:44 GMT
   [junit4]   2> 1154055 INFO  (TEST-TestSolrCloudWithSecureImpersonation.testProxyValidateHost-seed#[FB172D5D63C9D5B9]) [    ] o.a.s.SolrTestCaseJ4 ###Ending testProxyValidateHost
   [junit4]   2> 1154077 INFO  (TEST-TestSolrCloudWithSecureImpersonation.testProxyInvalidRemote-seed#[FB172D5D63C9D5B9]) [    ] o.a.s.SolrTestCaseJ4 ###Starting testProxyInvalidRemote
   [junit4]   2> 1154085 WARN  (TEST-TestSolrCloudWithSecureImpersonation.testProxyInvalidRemote-seed#[FB172D5D63C9D5B9]) [    ] o.a.h.c.p.ResponseProcessCookies Invalid cookie header: "Set-Cookie: hadoop.auth="u=localHostAnyGroup&p=localHostAnyGroup&t=test&e=1517491304168&s=vCiM0dJIGTYlpt3lYIIc/KmdhYY="; Path=/; Domain=127.0.0.1; Expires=J, 01-Feb-2018 13:21:44 GMT; HttpOnly". Invalid 'expires' attribute: J, 01-Feb-2018 13:21:44 GMT
   [junit4]   2> 1154085 INFO  (TEST-TestSolrCloudWithSecureImpersonation.testProxyInvalidRemote-seed#[FB172D5D63C9D5B9]) [    ] o.a.s.SolrTestCaseJ4 ###Ending testProxyInvalidRemote
   [junit4]   2> 1154117 INFO  (TEST-TestSolrCloudWithSecureImpersonation.testProxyInvalidProxyUser-seed#[FB172D5D63C9D5B9]) [    ] o.a.s.SolrTestCaseJ4 ###Starting testProxyInvalidProxyUser
   [junit4]   2> 1154120 WARN  (TEST-TestSolrCloudWithSecureImpersonation.testProxyInvalidProxyUser-seed#[FB172D5D63C9D5B9]) [    ] o.a.h.c.p.ResponseProcessCookies Invalid cookie header: "Set-Cookie: hadoop.auth="u=bar&p=bar&t=test&e=1517491304207&s=Ww+6GcUD456cgwyHnMzFjvCHvvQ="; Path=/; Domain=127.0.0.1; Expires=J, 01-Feb-2018 13:21:44 GMT; HttpOnly". Invalid 'expires' attribute: J, 01-Feb-2018 13:21:44 GMT
   [junit4]   2> 1154120 INFO  (TEST-TestSolrCloudWithSecureImpersonation.testProxyInvalidProxyUser-seed#[FB172D5D63C9D5B9]) [    ] o.a.s.SolrTestCaseJ4 ###Ending testProxyInvalidProxyUser
   [junit4]   2> 1154152 INFO  (TEST-TestSolrCloudWithSecureImpersonation.testProxyInvalidGroup-seed#[FB172D5D63C9D5B9]) [    ] o.a.s.SolrTestCaseJ4 ###Starting testProxyInvalidGroup
   [junit4]   2> 1154170 WARN  (qtp556391846-15543) [    ] o.a.h.s.ShellBasedUnixGroupsMapping got exception trying to get groups for user bar: id: invalid user name: "bar"
   [junit4]   2> id: invalid user name: "bar"
   [junit4]   2> 
   [junit4]   2> 1154172 WARN  (TEST-TestSolrCloudWithSecureImpersonation.testProxyInvalidGroup-seed#[FB172D5D63C9D5B9]) [    ] o.a.h.c.p.ResponseProcessCookies Invalid cookie header: "Set-Cookie: hadoop.auth="u=bogusGroup&p=bogusGroup&t=test&e=1517491304243&s=1YziM06b08MRSqXk3X7Ehfoe8gA="; Path=/; Domain=127.0.0.1; Expires=J, 01-Feb-2018 13:21:44 GMT; HttpOnly". Invalid 'expires' attribute: J, 01-Feb-2018 13:21:44 GMT
   [junit4]   2> 1154172 INFO  (TEST-TestSolrCloudWithSecureImpersonation.testProxyInvalidGroup-seed#[FB172D5D63C9D5B9]) [    ] o.a.s.SolrTestCaseJ4 ###Ending testProxyInvalidGroup
   [junit4]   2> 1154193 INFO  (TEST-TestSolrCloudWithSecureImpersonation.testProxyWrongHost-seed#[FB172D5D63C9D5B9]) [    ] o.a.s.SolrTestCaseJ4 ###Starting testProxyWrongHost
   [junit4]   2> 1165055 WARN  (jetty-launcher-1729-thread-1-SendThread(127.0.0.1:46075)) [n:127.0.0.1:45640_solr    ] o.a.z.ClientCnxn Client session timed out, have not heard from server in 14713ms for sessionid 0x10039d73c350008
   [junit4]   2> 1165055 WARN  (NIOServerCxn.Factory:0.0.0.0/0.0.0.0:0) [    ] o.a.z.s.NIOServerCnxn Unable to read additional data from client sessionid 0x10039d73c350008, likely client has closed socket
   [junit4]   2> 1165055 WARN  (jetty-launcher-1729-thread-2-SendThread(127.0.0.1:46075)) [n:127.0.0.1:48917_solr    ] o.a.z.ClientCnxn Client session timed out, have not heard from server in 14713ms for sessionid 0x10039d73c350007
   [junit4]   2> 1165055 WARN  (NIOServerCxn.Factory:0.0.0.0/0.0.0.0:0) [    ] o.a.z.s.NIOServerCnxn Unable to read additional data from client sessionid 0x10039d73c350007, likely client has closed socket
   [junit4]   2> 1165056 WARN  (TEST-TestSolrCloudWithSecureImpersonation.testProxyWrongHost-seed#[FB172D5D63C9D5B9]) [    ] o.a.h.c.p.ResponseProcessCookies Invalid cookie header: "Set-Cookie: hadoop.auth="u=wrongHost&p=wrongHost&t=test&e=1517491304284&s=oOFbnRt8y6q0V7yLDqrTidImts4="; Path=/; Domain=127.0.0.1; Expires=J, 01-Feb-2018 13:21:44 GMT; HttpOnly". Invalid 'expires' attribute: J, 01-Feb-2018 13:21:44 GMT
   [junit4]   2> 1165056 INFO  (TEST-TestSolrCloudWithSecureImpersonation.testProxyWrongHost-seed#[FB172D5D63C9D5B9]) [    ] o.a.s.SolrTestCaseJ4 ###Ending testProxyWrongHost
   [junit4]   2> 1165082 INFO  (TEST-TestSolrCloudWithSecureImpersonation.testProxyUnknownRemote-seed#[FB172D5D63C9D5B9]) [    ] o.a.s.SolrTestCaseJ4 ###Starting testProxyUnknownRemote
   [junit4]   2> 1165155 WARN  (zkConnectionManagerCallback-1760-thread-1) [    ] o.a.s.c.c.ConnectionManager Watcher org.apache.solr.common.cloud.ConnectionManager@4b8b69f6 name: ZooKeeperConnection Watcher:127.0.0.1:46075/solr got event WatchedEvent state:Disconnected type:None path:null path: null type: None
   [junit4]   2> 1165155 WARN  (zkConnectionManagerCallback-1760-thread-1) [    ] o.a.s.c.c.ConnectionManager zkClient has disconnected
   [junit4]   2> 1180259 WARN  (jetty-launcher-1729-thread-1-SendThread(127.0.0.1:46075)) [n:127.0.0.1:45640_solr    ] o.a.z.ClientCnxn Client session timed out, have not heard from server in 15208ms for sessionid 0x10039d73c350005
   [junit4]   2> 1180259 WARN  (jetty-launcher-1729-thread-2-SendThread(127.0.0.1:46075)) [n:127.0.0.1:48917_solr    ] o.a.z.ClientCnxn Client session timed out, have not heard from server in 15208ms for sessionid 0x10039d73c350006
   [junit4]   2> 1180259 WARN  (NIOServerCxn.Factory:0.0.0.0/0.0.0.0:0) [    ] o.a.z.s.NIOServerCnxn Unable to read additional data from client sessionid 0x10039d73c350005, likely client has closed socket
   [junit4]   2> 1180259 WARN  (NIOServerCxn.Factory:0.0.0.0/0.0.0.0:0) [    ] o.a.z.s.NIOServerCnxn Unable to read additional data from client sessionid 0x10039d73c350006, likely client has closed socket
   [junit4]   2> 1180259 WARN  (jetty-launcher-1729-thread-1-SendThread(127.0.0.1:46075)) [n:127.0.0.1:45640_solr    ] o.a.z.ClientCnxn Unable to reconnect to ZooKeeper service, session 0x10039d73c350008 has expired
   [junit4]   2> 1180260 WARN  (TEST-TestSolrCloudWithSecureImpersonation.testProxyUnknownRemote-seed#[FB172D5D63C9D5B9]) [    ] o.a.h.c.p.ResponseProcessCookies Invalid cookie header: "Set-Cookie: hadoop.auth="u=localHostAnyGroup&p=localHostAnyGroup&t=test&e=1517491315173&s=TUQW0N0K6y4nARMge8n0u2VcGQM="; Path=/; Domain=127.0.0.1; Expires=J, 01-Feb-2018 13:21:55 GMT; HttpOnly". Invalid 'expires' attribute: J, 01-Feb-2018 13:21:55 GMT
   [junit4]   2> 1180260 WARN  (TEST-TestSolrCloudWithSecureImpersonation.testForwarding-seed#[FB172D5D63C9D5B9]-SendThread(127.0.0.1:46075)) [    ] o.a.z.ClientCnxn Unable to reconnect to ZooKeeper service, session 0x10039d73c35000b has expired
   [junit4]   2> 1180260 INFO  (TEST-TestSolrCloudWithSecureImpersonation.testProxyUnknownRemote-seed#[FB172D5D63C9D5B9]) [    ] o.a.s.SolrTestCaseJ4 ###Ending testProxyUnknownRemote
   [junit4]   2> 1180260 WARN  (zkConnectionManagerCallback-1760-thread-1) [    ] o.a.s.c.c.ConnectionManager Watcher org.apache.solr.common.cloud.ConnectionManager@4b8b69f6 name: ZooKeeperConnection Watcher:127.0.0.1:46075/solr got event WatchedEvent state:Expired type:None path:null path: null type: None
   [junit4]   2> 1180260 WARN  (jetty-launcher-1729-thread-2-SendThread(127.0.0.1:46075)) [n:127.0.0.1:48917_solr    ] o.a.z.ClientCnxn Unable to reconnect to ZooKeeper service, session 0x10039d73c350007 has expired
   [junit4]   2> 1180263 INFO  (jetty-closer-1730-thread-2) [    ] o.e.j.s.AbstractConnector Stopped ServerConnector@2c81dc4c{HTTP/1.1,[http/1.1]}{127.0.0.1:0}
   [junit4]   2> 1180263 INFO  (jetty-closer-1730-thread-2) [    ] o.a.s.c.CoreContainer Shutting down CoreContainer instance=1796967718
   [junit4]   2> 1180263 INFO  (jetty-closer-1730-thread-1) [    ] o.e.j.s.AbstractConnector Stopped ServerConnector@1f226cec{HTTP/1.1,[http/1.1]}{127.0.0.1:0}
   [junit4]   2> 1180263 INFO  (jetty-closer-1730-thread-1) [    ] o.a.s.c.CoreContainer Shutting down CoreContainer instance=769195635
   [junit4]   2> 1180263 INFO  (jetty-closer-1730-thread-1) [    ] o.a.s.m.SolrMetricManager Closing metric reporters for registry=solr.node, tag=null
   [junit4]   2> 1180263 INFO  (jetty-closer-1730-thread-1) [    ] o.a.s.m.r.SolrJmxReporter Closing reporter [org.apache.solr.metrics.reporters.SolrJmxReporter@31d5dbc6: rootName = solr_45640, domain = solr.node, service url = null, agent id = null] for registry solr.node / com.codahale.metrics.MetricRegistry@580acd70
   [junit4]   2> 1180264 INFO  (jetty-closer-1730-thread-2) [    ] o.a.s.m.SolrMetricManager Closing metric reporters for registry=solr.node, tag=null
   [junit4]   2> 1180264 INFO  (jetty-closer-1730-thread-2) [    ] o.a.s.m.r.SolrJmxReporter Closing reporter [org.apache.solr.metrics.reporters.SolrJmxReporter@46a25efe: rootName = solr_48917, domain = solr.node, service url = null, agent id = null] for registry solr.node / com.codahale.metrics.MetricRegistry@57814907
   [junit4]   2> 1180268 INFO  (jetty-closer-1730-thread-1) [    ] o.a.s.m.SolrMetricManager Closing metric reporters for registry=solr.jvm, tag=null
   [junit4]   2> 1180268 INFO  (jetty-closer-1730-thread-1) [    ] o.a.s.m.r.SolrJmxReporter Closing reporter [org.apache.solr.metrics.reporters.SolrJmxReporter@1300c47: rootName = solr_45640, domain = solr.jvm, service url = null, agent id = null] for registry solr.jvm / com.codahale.metrics.MetricRegistry@22e08e0d
   [junit4]   2> 1180269 INFO  (jetty-closer-1730-thread-2) [    ] o.a.s.m.SolrMetricManager Closing metric reporters for registry=solr.jvm, tag=null
   [junit4]   2> 1180269 INFO  (jetty-closer-1730-thread-2) [    ] o.a.s.m.r.SolrJmxReporter Closing reporter [org.apache.solr.metrics.reporters.SolrJmxReporter@5811e0db: rootName = solr_48917, domain = solr.jvm, service url = null, agent id = null] for registry solr.jvm / com.codahale.metrics.MetricRegistry@22e08e0d
   [junit4]   2> 1180271 INFO  (jetty-closer-1730-thread-1) [    ] o.a.s.m.SolrMetricManager Closing metric reporters for registry=solr.jetty, tag=null
   [junit4]   2> 1180271 INFO  (jetty-closer-1730-thread-1) [    ] o.a.s.m.r.SolrJmxReporter Closing reporter [org.apache.solr.metrics.reporters.SolrJmxReporter@349294e6: rootName = solr_45640, domain = solr.jetty, service url = null, agent id = null] for registry solr.jetty / com.codahale.metrics.MetricRegistry@35231bdc
   [junit4]   2> 1180271 INFO  (jetty-closer-1730-thread-2) [    ] o.a.s.m.SolrMetricManager Closing metric reporters for registry=solr.jetty, tag=null
   [junit4]   2> 1180271 INFO  (jetty-closer-1730-thread-2) [    ] o.a.s.m.r.SolrJmxReporter Closing reporter [org.apache.solr.metrics.reporters.SolrJmxReporter@304774f2: rootName = solr_48917, domain = solr.jetty, service url = null, agent id = null] for registry solr.jetty / com.codahale.metrics.MetricRegistry@35231bdc
   [junit4]   2> 1180360 WARN  (zkConnectionManagerCallback-1746-thread-1-processing-n:127.0.0.1:45640_solr) [n:127.0.0.1:45640_solr    ] o.a.s.c.c.ConnectionManager Watcher org.apache.solr.common.cloud.ConnectionManager@4a4eb7a3 name: ZooKeeperConnection Watcher:127.0.0.1:46075/solr got event WatchedEvent state:Disconnected type:None path:null path: null type: None
   [junit4]   2> 1180361 WARN  (zkConnectionManagerCallback-1746-thread-1-processing-n:127.0.0.1:45640_solr) [n:127.0.0.1:45640_solr    ] o.a.s.c.c.ConnectionManager zkClient has disconnected
   [junit4]   2> 1180362 WARN  (zkConnectionManagerCallback-1748-thread-1-processing-n:127.0.0.1:48917_solr) [n:127.0.0.1:48917_solr    ] o.a.s.c.c.ConnectionManager Watcher org.apache.solr.common.cloud.ConnectionManager@1374bd22 name: ZooKeeperConnection Watcher:127.0.0.1:46075/solr got event WatchedEvent state:Disconnected type:None path:null path: null type: None
   [junit4]   2> 1180363 WARN  (zkConnectionManagerCallback-1748-thread-1-processing-n:127.0.0.1:48917_solr) [n:127.0.0.1:48917_solr    ] o.a.s.c.c.ConnectionManager zkClient has disconnected
   [junit4]   2> 1181390 INFO  (zkConnectionManagerCallback-1746-thread-1-processing-n:127.0.0.1:45640_solr) [n:127.0.0.1:45640_solr    ] o.a.s.c.c.ConnectionManager zkClient has connected
   [junit4]   2> 1181864 INFO  (jetty-closer-1730-thread-1) [    ] o.a.s.c.ZkController Remove node as live in ZooKeeper:/live_nodes/127.0.0.1:45640_solr
   [junit4]   2> 1181865 INFO  (jetty-closer-1730-thread-1) [    ] o.a.s.m.SolrMetricManager Closing metric reporters for registry=solr.cluster, tag=null
   [junit4]   2> 1181866 INFO  (zkCallback-1745-thread-6-processing-n:127.0.0.1:45640_solr) [n:127.0.0.1:45640_solr    ] o.a.s.c.c.ZkStateReader Updated live nodes from ZooKeeper... (2) -> (1)
   [junit4]   2> 1181866 INFO  (coreCloseExecutor-3392-thread-1) [n:127.0.0.1:45640_solr c:forwardingCollection s:shard1 r:core_node2 x:forwardingCollection_shard1_replica_n1] o.a.s.c.SolrCore [forwardingCollection_shard1_replica_n1]  CLOSING SolrCore org.apache.solr.core.SolrCore@608b07ba
   [junit4]   2> 1181866 INFO  (coreCloseExecutor-3392-thread-1) [n:127.0.0.1:45640_solr c:forwardingCollection s:shard1 r:core_node2 x:forwardingCollection_shard1_replica_n1] o.a.s.m.SolrMetricManager Closing metric reporters for registry=solr.core.forwardingCollection.shard1.replica_n1, tag=1619724218
   [junit4]   2> 1181866 INFO  (coreCloseExecutor-3392-thread-1) [n:127.0.0.1:45640_solr c:forwardingCollection s:shard1 r:core_node2 x:forwardingCollection_shard1_replica_n1] o.a.s.m.r.SolrJmxReporter Closing reporter [org.apache.solr.metrics.reporters.SolrJmxReporter@5026b233: rootName = solr_45640, domain = solr.core.forwardingCollection.shard1.replica_n1, service url = null, agent id = null] for registry solr.core.forwardingCollection.shard1.replica_n1 / com.codahale.metrics.MetricRegistry@5a69aa7f
   [junit4]   2> 1181873 INFO  (coreCloseExecutor-3392-thread-1) [n:127.0.0.1:45640_solr c:forwardingCollection s:shard1 r:core_node2 x:forwardingCollection_shard1_replica_n1] o.a.s.m.SolrMetricManager Closing metric reporters for registry=solr.collection.forwardingCollection.shard1.leader, tag=1619724218
   [junit4]   2> 1181878 ERROR (Thread[Thread-8357,5,TGRP-TestSolrCloudWithSecureImpersonation]) [n:127.0.0.1:45640_solr    ] o.a.h.s.t.d.AbstractDelegationTokenSecretManager ExpiredTokenRemover received java.lang.InterruptedException: sleep interrupted
   [junit4]   2> 1181886 INFO  (jetty-closer-1730-thread-1) [    ] o.e.j.s.h.ContextHandler Stopped o.e.j.s.ServletContextHandler@6738bc47{/solr,null,UNAVAILABLE}
   [junit4]   2> 1181886 INFO  (jetty-closer-1730-thread-1) [    ] o.e.j.s.session Stopped scavenging
   [junit4]   2> 1181996 INFO  (zkConnectionManagerCallback-1748-thread-1-processing-n:127.0.0.1:48917_solr) [n:127.0.0.1:48917_solr    ] o.a.s.c.c.ConnectionManager zkClient has connected
   [junit4]   2> 1181997 INFO  (zkCallback-1747-thread-4-processing-n:127.0.0.1:48917_solr) [n:127.0.0.1:48917_solr    ] o.a.s.c.c.ZkStateReader Updated live nodes from ZooKeeper... (2) -> (1)
   [junit4]   2> 1181998 INFO  (jetty-closer-1730-thread-2) [    ] o.a.s.c.ZkController Remove node as live in ZooKeeper:/live_nodes/127.0.0.1:48917_solr
   [junit4]   2> 1181999 INFO  (jetty-closer-1730-thread-2) [    ] o.a.s.m.SolrMetricManager Closing metric reporters for registry=solr.cluster, tag=null
   [junit4]   2> 1181999 INFO  (jetty-closer-1730-thread-2) [    ] o.a.s.c.Overseer Overseer (id=72121190628786182-127.0.0.1:48917_solr-n_0000000000) closing
   [junit4]   2> 1182000 INFO  (OverseerStateUpdate-72121190628786182-127.0.0.1:48917_solr-n_0000000000) [n:127.0.0.1:48917_solr    ] o.a.s.c.Overseer Overseer Loop exiting : 127.0.0.1:48917_solr
   [junit4]   2> 1182000 INFO  (zkCallback-1747-thread-4-processing-n:127.0.0.1:48917_solr) [n:127.0.0.1:48917_solr    ] o.a.s.c.c.ZkStateReader Updated live nodes from ZooKeeper... (1) -> (0)
   [junit4]   2> 1182000 WARN  (OverseerAutoScalingTriggerThread-72121190628786182-127.0.0.1:48917_solr-n_0000000000) [n:127.0.0.1:48917_solr    ] o.a.s.c.a.OverseerTriggerThread OverseerTriggerThread woken up but we are closed, exiting.
   [junit4]   2> 1182004 ERROR (Thread[Thread-8356,5,TGRP-TestSolrCloudWithSecureImpersonation]) [n:127.0.0.1:48917_solr    ] o.a.h.s.t.d.AbstractDelegationTokenSecretManager ExpiredTokenRemover received java.lang.InterruptedException: sleep interrupted
   [junit4]   2> 1182006 INFO  (jetty-closer-1730-thread-2) [    ] o.e.j.s.h.ContextHandler Stopped o.e.j.s.ServletCont

[...truncated too long message...]

19_solr) [n:127.0.0.1:55819_solr    ] o.a.s.c.c.ZkStateReader Updated live nodes from ZooKeeper... (1) -> (0)
   [junit4]   2> 3009689 WARN  (OverseerAutoScalingTriggerThread-72121307975188485-127.0.0.1:58067_solr-n_0000000000) [n:127.0.0.1:58067_solr    ] o.a.s.c.a.OverseerTriggerThread OverseerTriggerThread woken up but we are closed, exiting.
   [junit4]   2> 3009700 INFO  (zkCallback-4224-thread-1-processing-n:127.0.0.1:55819_solr) [n:127.0.0.1:55819_solr    ] o.a.s.c.OverseerElectionContext I am going to be the leader 127.0.0.1:55819_solr
   [junit4]   2> 3009701 INFO  (jetty-closer-4207-thread-2) [    ] o.e.j.s.h.ContextHandler Stopped o.e.j.s.ServletContextHandler@5d80f970{/solr,null,UNAVAILABLE}
   [junit4]   2> 3009705 INFO  (jetty-closer-4207-thread-2) [    ] o.e.j.s.session Stopped scavenging
   [junit4]   2> 3009707 INFO  (jetty-closer-4207-thread-1) [    ] o.e.j.s.h.ContextHandler Stopped o.e.j.s.ServletContextHandler@161b7967{/solr,null,UNAVAILABLE}
   [junit4]   2> 3009711 INFO  (jetty-closer-4207-thread-1) [    ] o.e.j.s.session Stopped scavenging
   [junit4]   2> 3009712 ERROR (SUITE-AliasIntegrationTest-seed#[FB172D5D63C9D5B9]-worker) [    ] o.a.z.s.ZooKeeperServer ZKShutdownHandler is not registered, so ZooKeeper server won't take any action on ERROR or SHUTDOWN server state changes
   [junit4]   2> 3009713 INFO  (SUITE-AliasIntegrationTest-seed#[FB172D5D63C9D5B9]-worker) [    ] o.a.s.c.ZkTestServer connecting to 127.0.0.1:59029 59029
   [junit4]   2> 3019192 INFO  (Thread-4862) [    ] o.a.s.c.ZkTestServer connecting to 127.0.0.1:59029 59029
   [junit4]   2> 3019204 WARN  (Thread-4862) [    ] o.a.s.c.ZkTestServer Watch limit violations: 
   [junit4]   2> Maximum concurrent create/delete watches above limit:
   [junit4]   2> 
   [junit4]   2> 	24	/solr/aliases.json
   [junit4]   2> 	24	/solr/clusterprops.json
   [junit4]   2> 	16	/solr/configs/conf
   [junit4]   2> 	9	/solr/collections/collection2meta/terms/shard1
   [junit4]   2> 	9	/solr/collections/collection1meta/terms/shard2
   [junit4]   2> 	8	/solr/collections/collection1meta/terms/shard1
   [junit4]   2> 	3	/solr/collections/collection_two/terms/shard1
   [junit4]   2> 	3	/solr/collections/collection_one/terms/shard2
   [junit4]   2> 	3	/solr/collections/testErrorChecks-collection/terms/shard1
   [junit4]   2> 	3	/solr/collections/testErrorChecks-collection/terms/shard2
   [junit4]   2> 	3	/solr/collections/collection1/terms/shard2
   [junit4]   2> 	2	/solr/collections/collection_new/terms/shard1
   [junit4]   2> 	2	/solr/collections/collection2/terms/shard1
   [junit4]   2> 	2	/solr/collections/collection_one/terms/shard1
   [junit4]   2> 	2	/solr/collections/collection_old/terms/shard2
   [junit4]   2> 	2	/solr/collections/collection_old/terms/shard1
   [junit4]   2> 	2	/solr/security.json
   [junit4]   2> 	2	/solr/collections/collection1/terms/shard1
   [junit4]   2> 
   [junit4]   2> Maximum concurrent data watches above limit:
   [junit4]   2> 
   [junit4]   2> 	173	/solr/aliases.json
   [junit4]   2> 	44	/solr/collections/collection1meta/state.json
   [junit4]   2> 	24	/solr/collections/collection2meta/state.json
   [junit4]   2> 	24	/solr/clusterstate.json
   [junit4]   2> 	11	/solr/collections/collection_one/state.json
   [junit4]   2> 	11	/solr/collections/collection1/state.json
   [junit4]   2> 	11	/solr/collections/collection_old/state.json
   [junit4]   2> 	11	/solr/collections/testErrorChecks-collection/state.json
   [junit4]   2> 	6	/solr/collections/collection_new/state.json
   [junit4]   2> 	6	/solr/collections/collection_two/state.json
   [junit4]   2> 	6	/solr/collections/collection2/state.json
   [junit4]   2> 
   [junit4]   2> Maximum concurrent children watches above limit:
   [junit4]   2> 
   [junit4]   2> 	189	/solr/collections
   [junit4]   2> 	24	/solr/live_nodes
   [junit4]   2> 
   [junit4]   2> NOTE: leaving temporary files on disk at: /export/home/jenkins/workspace/Lucene-Solr-7.x-Solaris/solr/build/solr-core/test/J1/temp/solr.cloud.AliasIntegrationTest_FB172D5D63C9D5B9-001
   [junit4]   2> NOTE: test params are: codec=Asserting(Lucene70): {a_t=Lucene50(blocksize=128), id=Lucene50(blocksize=128)}, docValues:{}, maxPointsInLeafNode=907, maxMBSortInHeap=5.338186053646156, sim=RandomSimilarity(queryNorm=false): {}, locale=cs, timezone=America/Guatemala
   [junit4]   2> NOTE: SunOS 5.11 amd64/Oracle Corporation 1.8.0_152 (64-bit)/cpus=3,threads=1,free=78836216,total=518979584
   [junit4]   2> NOTE: All tests run in this JVM: [ChaosMonkeySafeLeaderWithPullReplicasTest, MinimalSchemaTest, PeerSyncWithIndexFingerprintCachingTest, TestCoreDiscovery, TestOrdValues, LeaderInitiatedRecoveryOnShardRestartTest, TestGeoJSONResponseWriter, NodeAddedTriggerTest, ExternalFileFieldSortTest, DefaultValueUpdateProcessorTest, TestQuerySenderListener, TestMultiValuedNumericRangeQuery, TestStressLucene, TestStressRecovery, CdcrRequestHandlerTest, ReturnFieldsTest, RegexBytesRefFilterTest, TestManagedSchemaAPI, DocValuesTest, TestSolr4Spatial, DOMUtilTest, TestLegacyNumericUtils, TestDynamicFieldResource, UpdateParamsTest, TestSolrIndexConfig, RestartWhileUpdatingTest, ActionThrottleTest, TestFuzzyAnalyzedSuggestions, DistanceFunctionTest, CoreAdminHandlerTest, TestRandomFaceting, ShufflingReplicaListTransformerTest, ZkFailoverTest, ZkControllerTest, TestGenericDistributedQueue, SparseHLLTest, StatsReloadRaceTest, TestFieldCacheSort, TestRandomFlRTGCloud, MetricsConfigTest, PrimUtilsTest, URLClassifyProcessorTest, BasicFunctionalityTest, TestStressCloudBlindAtomicUpdates, HttpTriggerListenerTest, TestUniqueKeyFieldResource, TestHalfAndHalfDocValues, TestClusterProperties, TestPolicyCloud, DirectUpdateHandlerTest, TestFieldResource, VersionInfoTest, DebugComponentTest, HighlighterConfigTest, HighlighterMaxOffsetTest, DirectoryFactoryTest, TestReversedWildcardFilterFactory, TestMaxScoreQueryParser, TestSystemCollAutoCreate, TestAtomicUpdateErrorCases, TestSSLRandomization, TestCollectionAPIs, ZkStateReaderTest, CSVRequestHandlerTest, TestLRUCache, TriLevelCompositeIdRoutingTest, SortByFunctionTest, TestScoreJoinQPScore, DistribDocExpirationUpdateProcessorTest, TestStreamBody, TestCSVLoader, TestTestInjection, SolrMetricsIntegrationTest, TestFastLRUCache, TermVectorComponentTest, DistributedSuggestComponentTest, ChaosMonkeySafeLeaderTest, ConcurrentCreateRoutedAliasTest, DeleteReplicaTest, CustomCollectionTest, CreateRoutedAliasTest, TestComponentsName, InfixSuggestersTest, TestCrossCoreJoin, TestDFRSimilarityFactory, SearchRateTriggerTest, DateRangeFieldTest, AnalyticsQueryTest, DocValuesNotIndexedTest, TestHashPartitioner, SharedFSAutoReplicaFailoverTest, TestLuceneIndexBackCompat, TestPayloadScoreQParserPlugin, TestDistributedStatsComponentCardinality, SolrCmdDistributorTest, TestRTimerTree, DocExpirationUpdateProcessorFactoryTest, SmileWriterTest, SolrCoreCheckLockOnStartupTest, DistributedDebugComponentTest, TestCollectionAPI, TestRandomCollapseQParserPlugin, HdfsBasicDistributedZkTest, TestBadConfig, BJQParserTest, MergeStrategyTest, TestXmlQParser, TestPHPSerializedResponseWriter, ChaosMonkeyNothingIsSafeTest, TestRetrieveFieldsOptimizer, DistributedFacetExistsSmallTest, TestConfigReload, AddBlockUpdateTest, SystemInfoHandlerTest, LIRRollingUpdatesTest, TestManagedSynonymFilterFactory, TestSolr4Spatial2, TestConfig, TestLeaderElectionZkExpiry, TestSchemalessBufferedUpdates, DistributedIntervalFacetingTest, V2StandaloneTest, BadIndexSchemaTest, TestRTGBase, ClassificationUpdateProcessorTest, TestClusterStateProvider, BlockJoinFacetRandomTest, TestTolerantUpdateProcessorCloud, TestConfigSetImmutable, TestTriggerIntegration, ImplicitSnitchTest, TestHttpShardHandlerFactory, TestInPlaceUpdatesStandalone, OverriddenZkACLAndCredentialsProvidersTest, TestUpdate, NodeMutatorTest, TestDistribIDF, FullSolrCloudDistribCmdsTest, DistributedQueryComponentCustomSortTest, SSLMigrationTest, TestFastWriter, CollectionTooManyReplicasTest, HdfsRecoverLeaseTest, TestComplexPhraseQParserPlugin, TestSolrDeletionPolicy2, HttpPartitionOnCommitTest, SpellPossibilityIteratorTest, XsltUpdateRequestHandlerTest, TestEmbeddedSolrServerConstructors, ShardRoutingTest, TestConfigSets, CircularListTest, DistanceUnitsTest, AutoScalingHandlerTest, PKIAuthenticationIntegrationTest, TestSimpleTextCodec, IndexBasedSpellCheckerTest, CollectionsAPIDistributedZkTest, PrimitiveFieldTypeTest, DistributedQueueTest, TestPointFields, TestSolrQueryParser, PreAnalyzedFieldManagedSchemaCloudTest, IndexSchemaTest, ZkSolrClientTest, TestFieldTypeResource, CoreMergeIndexesAdminHandlerTest, ScriptEngineTest, MoveReplicaHDFSFailoverTest, TestDistribStateManager, HLLSerializationTest, AsyncCallRequestStatusResponseTest, TestExtendedDismaxParser, TestOnReconnectListenerSupport, TestOverriddenPrefixQueryForCustomFieldType, TestNamedUpdateProcessors, TestPullReplica, BlockCacheTest, TolerantUpdateProcessorTest, AssignTest, TestLMDirichletSimilarityFactory, TestNodeAddedTrigger, CoreAdminCreateDiscoverTest, SortSpecParsingTest, TestTrackingShardHandlerFactory, HdfsUnloadDistributedZkTest, BufferStoreTest, BasicDistributedZkTest, BasicDistributedZk2Test, UnloadDistributedZkTest, SyncSliceTest, OpenCloseCoreStressTest, OverseerTest, BasicZkTest, RecoveryZkTest, TestReplicationHandler, ShardRoutingCustomTest, TestDistributedGrouping, TestFaceting, DistributedSpellCheckComponentTest, TestStressReorder, TestReload, TestStressVersions, DistributedTermsComponentTest, TestCoreContainer, SimpleFacetsTest, StatsComponentTest, ConvertedLegacyTest, TestSort, TestFiltering, TestFunctionQuery, SoftAutoCommitTest, TestXIncludeConfig, TestLMJelinekMercerSimilarityFactory, TimeZoneUtilsTest, DateMathParserTest, TestSystemIdResolver, TestSolrJ, TestDocumentBuilder, SliceStateTest, TestCursorMarkWithoutUniqueKey, TestSimpleTrackingShardHandler, ConnectionReuseTest, AliasIntegrationTest]
   [junit4] Completed [521/773 (3!)] on J1 in 81.25s, 8 tests, 1 failure <<< FAILURES!

[...truncated 49091 lines...]

Mime
View raw message