lucene-dev mailing list archives

Site index · List index
Message view « Date » · « Thread »
Top « Date » · « Thread »
From Policeman Jenkins Server <jenk...@thetaphi.de>
Subject [JENKINS] Lucene-Solr-7.x-Solaris (64bit/jdk1.8.0) - Build # 459 - Unstable!
Date Fri, 23 Feb 2018 20:47:54 GMT
Build: https://jenkins.thetaphi.de/job/Lucene-Solr-7.x-Solaris/459/
Java: 64bit/jdk1.8.0 -XX:-UseCompressedOops -XX:+UseParallelGC

4 tests failed.
FAILED:  org.apache.solr.cloud.ReplaceNodeNoTargetTest.test

Error Message:


Stack Trace:
java.lang.AssertionError
	at __randomizedtesting.SeedInfo.seed([2765261D870EBA06:AF3119C729F2D7FE]:0)
	at org.junit.Assert.fail(Assert.java:92)
	at org.junit.Assert.assertTrue(Assert.java:43)
	at org.junit.Assert.assertTrue(Assert.java:54)
	at org.apache.solr.cloud.ReplaceNodeNoTargetTest.test(ReplaceNodeNoTargetTest.java:92)
	at sun.reflect.NativeMethodAccessorImpl.invoke0(Native Method)
	at sun.reflect.NativeMethodAccessorImpl.invoke(NativeMethodAccessorImpl.java:62)
	at sun.reflect.DelegatingMethodAccessorImpl.invoke(DelegatingMethodAccessorImpl.java:43)
	at java.lang.reflect.Method.invoke(Method.java:498)
	at com.carrotsearch.randomizedtesting.RandomizedRunner.invoke(RandomizedRunner.java:1737)
	at com.carrotsearch.randomizedtesting.RandomizedRunner$8.evaluate(RandomizedRunner.java:934)
	at com.carrotsearch.randomizedtesting.RandomizedRunner$9.evaluate(RandomizedRunner.java:970)
	at com.carrotsearch.randomizedtesting.RandomizedRunner$10.evaluate(RandomizedRunner.java:984)
	at com.carrotsearch.randomizedtesting.rules.SystemPropertiesRestoreRule$1.evaluate(SystemPropertiesRestoreRule.java:57)
	at org.apache.lucene.util.TestRuleSetupTeardownChained$1.evaluate(TestRuleSetupTeardownChained.java:49)
	at org.apache.lucene.util.AbstractBeforeAfterRule$1.evaluate(AbstractBeforeAfterRule.java:45)
	at org.apache.lucene.util.TestRuleThreadAndTestName$1.evaluate(TestRuleThreadAndTestName.java:48)
	at org.apache.lucene.util.TestRuleIgnoreAfterMaxFailures$1.evaluate(TestRuleIgnoreAfterMaxFailures.java:64)
	at org.apache.lucene.util.TestRuleMarkFailure$1.evaluate(TestRuleMarkFailure.java:47)
	at com.carrotsearch.randomizedtesting.rules.StatementAdapter.evaluate(StatementAdapter.java:36)
	at com.carrotsearch.randomizedtesting.ThreadLeakControl$StatementRunner.run(ThreadLeakControl.java:368)
	at com.carrotsearch.randomizedtesting.ThreadLeakControl.forkTimeoutingTask(ThreadLeakControl.java:817)
	at com.carrotsearch.randomizedtesting.ThreadLeakControl$3.evaluate(ThreadLeakControl.java:468)
	at com.carrotsearch.randomizedtesting.RandomizedRunner.runSingleTest(RandomizedRunner.java:943)
	at com.carrotsearch.randomizedtesting.RandomizedRunner$5.evaluate(RandomizedRunner.java:829)
	at com.carrotsearch.randomizedtesting.RandomizedRunner$6.evaluate(RandomizedRunner.java:879)
	at com.carrotsearch.randomizedtesting.RandomizedRunner$7.evaluate(RandomizedRunner.java:890)
	at com.carrotsearch.randomizedtesting.rules.StatementAdapter.evaluate(StatementAdapter.java:36)
	at com.carrotsearch.randomizedtesting.rules.SystemPropertiesRestoreRule$1.evaluate(SystemPropertiesRestoreRule.java:57)
	at org.apache.lucene.util.AbstractBeforeAfterRule$1.evaluate(AbstractBeforeAfterRule.java:45)
	at com.carrotsearch.randomizedtesting.rules.StatementAdapter.evaluate(StatementAdapter.java:36)
	at org.apache.lucene.util.TestRuleStoreClassName$1.evaluate(TestRuleStoreClassName.java:41)
	at com.carrotsearch.randomizedtesting.rules.NoShadowingOrOverridesOnMethodsRule$1.evaluate(NoShadowingOrOverridesOnMethodsRule.java:40)
	at com.carrotsearch.randomizedtesting.rules.NoShadowingOrOverridesOnMethodsRule$1.evaluate(NoShadowingOrOverridesOnMethodsRule.java:40)
	at com.carrotsearch.randomizedtesting.rules.StatementAdapter.evaluate(StatementAdapter.java:36)
	at com.carrotsearch.randomizedtesting.rules.StatementAdapter.evaluate(StatementAdapter.java:36)
	at com.carrotsearch.randomizedtesting.rules.StatementAdapter.evaluate(StatementAdapter.java:36)
	at org.apache.lucene.util.TestRuleAssertionsRequired$1.evaluate(TestRuleAssertionsRequired.java:53)
	at org.apache.lucene.util.TestRuleMarkFailure$1.evaluate(TestRuleMarkFailure.java:47)
	at org.apache.lucene.util.TestRuleIgnoreAfterMaxFailures$1.evaluate(TestRuleIgnoreAfterMaxFailures.java:64)
	at org.apache.lucene.util.TestRuleIgnoreTestSuites$1.evaluate(TestRuleIgnoreTestSuites.java:54)
	at com.carrotsearch.randomizedtesting.rules.StatementAdapter.evaluate(StatementAdapter.java:36)
	at com.carrotsearch.randomizedtesting.ThreadLeakControl$StatementRunner.run(ThreadLeakControl.java:368)
	at java.lang.Thread.run(Thread.java:748)


FAILED:  junit.framework.TestSuite.org.apache.solr.cloud.TestSolrCloudWithSecureImpersonation

Error Message:
3 threads leaked from SUITE scope at org.apache.solr.cloud.TestSolrCloudWithSecureImpersonation:     1) Thread[id=37666, name=jetty-launcher-7298-thread-2-SendThread(127.0.0.1:36314), state=TIMED_WAITING, group=TGRP-TestSolrCloudWithSecureImpersonation]         at java.lang.Thread.sleep(Native Method)         at org.apache.zookeeper.client.StaticHostProvider.next(StaticHostProvider.java:105)         at org.apache.zookeeper.ClientCnxn$SendThread.startConnect(ClientCnxn.java:1000)         at org.apache.zookeeper.ClientCnxn$SendThread.run(ClientCnxn.java:1063)    2) Thread[id=37596, name=jetty-launcher-7298-thread-1-EventThread, state=TIMED_WAITING, group=TGRP-TestSolrCloudWithSecureImpersonation]         at sun.misc.Unsafe.park(Native Method)         at java.util.concurrent.locks.LockSupport.parkNanos(LockSupport.java:215)         at java.util.concurrent.locks.AbstractQueuedSynchronizer.doAcquireSharedNanos(AbstractQueuedSynchronizer.java:1037)         at java.util.concurrent.locks.AbstractQueuedSynchronizer.tryAcquireSharedNanos(AbstractQueuedSynchronizer.java:1328)         at java.util.concurrent.CountDownLatch.await(CountDownLatch.java:277)         at org.apache.curator.CuratorZookeeperClient.internalBlockUntilConnectedOrTimedOut(CuratorZookeeperClient.java:323)         at org.apache.curator.RetryLoop.callWithRetry(RetryLoop.java:105)         at org.apache.curator.framework.imps.GetDataBuilderImpl.pathInForeground(GetDataBuilderImpl.java:288)         at org.apache.curator.framework.imps.GetDataBuilderImpl.forPath(GetDataBuilderImpl.java:279)         at org.apache.curator.framework.imps.GetDataBuilderImpl.forPath(GetDataBuilderImpl.java:41)         at org.apache.curator.framework.recipes.shared.SharedValue.readValue(SharedValue.java:244)         at org.apache.curator.framework.recipes.shared.SharedValue.access$100(SharedValue.java:44)         at org.apache.curator.framework.recipes.shared.SharedValue$1.process(SharedValue.java:61)         at org.apache.curator.framework.imps.NamespaceWatcher.process(NamespaceWatcher.java:67)         at org.apache.zookeeper.ClientCnxn$EventThread.processEvent(ClientCnxn.java:531)         at org.apache.zookeeper.ClientCnxn$EventThread.run(ClientCnxn.java:506)    3) Thread[id=37667, name=jetty-launcher-7298-thread-2-EventThread, state=WAITING, group=TGRP-TestSolrCloudWithSecureImpersonation]         at sun.misc.Unsafe.park(Native Method)         at java.util.concurrent.locks.LockSupport.park(LockSupport.java:175)         at java.util.concurrent.locks.AbstractQueuedSynchronizer$ConditionObject.await(AbstractQueuedSynchronizer.java:2039)         at java.util.concurrent.LinkedBlockingQueue.take(LinkedBlockingQueue.java:442)         at org.apache.zookeeper.ClientCnxn$EventThread.run(ClientCnxn.java:502)

Stack Trace:
com.carrotsearch.randomizedtesting.ThreadLeakError: 3 threads leaked from SUITE scope at org.apache.solr.cloud.TestSolrCloudWithSecureImpersonation: 
   1) Thread[id=37666, name=jetty-launcher-7298-thread-2-SendThread(127.0.0.1:36314), state=TIMED_WAITING, group=TGRP-TestSolrCloudWithSecureImpersonation]
        at java.lang.Thread.sleep(Native Method)
        at org.apache.zookeeper.client.StaticHostProvider.next(StaticHostProvider.java:105)
        at org.apache.zookeeper.ClientCnxn$SendThread.startConnect(ClientCnxn.java:1000)
        at org.apache.zookeeper.ClientCnxn$SendThread.run(ClientCnxn.java:1063)
   2) Thread[id=37596, name=jetty-launcher-7298-thread-1-EventThread, state=TIMED_WAITING, group=TGRP-TestSolrCloudWithSecureImpersonation]
        at sun.misc.Unsafe.park(Native Method)
        at java.util.concurrent.locks.LockSupport.parkNanos(LockSupport.java:215)
        at java.util.concurrent.locks.AbstractQueuedSynchronizer.doAcquireSharedNanos(AbstractQueuedSynchronizer.java:1037)
        at java.util.concurrent.locks.AbstractQueuedSynchronizer.tryAcquireSharedNanos(AbstractQueuedSynchronizer.java:1328)
        at java.util.concurrent.CountDownLatch.await(CountDownLatch.java:277)
        at org.apache.curator.CuratorZookeeperClient.internalBlockUntilConnectedOrTimedOut(CuratorZookeeperClient.java:323)
        at org.apache.curator.RetryLoop.callWithRetry(RetryLoop.java:105)
        at org.apache.curator.framework.imps.GetDataBuilderImpl.pathInForeground(GetDataBuilderImpl.java:288)
        at org.apache.curator.framework.imps.GetDataBuilderImpl.forPath(GetDataBuilderImpl.java:279)
        at org.apache.curator.framework.imps.GetDataBuilderImpl.forPath(GetDataBuilderImpl.java:41)
        at org.apache.curator.framework.recipes.shared.SharedValue.readValue(SharedValue.java:244)
        at org.apache.curator.framework.recipes.shared.SharedValue.access$100(SharedValue.java:44)
        at org.apache.curator.framework.recipes.shared.SharedValue$1.process(SharedValue.java:61)
        at org.apache.curator.framework.imps.NamespaceWatcher.process(NamespaceWatcher.java:67)
        at org.apache.zookeeper.ClientCnxn$EventThread.processEvent(ClientCnxn.java:531)
        at org.apache.zookeeper.ClientCnxn$EventThread.run(ClientCnxn.java:506)
   3) Thread[id=37667, name=jetty-launcher-7298-thread-2-EventThread, state=WAITING, group=TGRP-TestSolrCloudWithSecureImpersonation]
        at sun.misc.Unsafe.park(Native Method)
        at java.util.concurrent.locks.LockSupport.park(LockSupport.java:175)
        at java.util.concurrent.locks.AbstractQueuedSynchronizer$ConditionObject.await(AbstractQueuedSynchronizer.java:2039)
        at java.util.concurrent.LinkedBlockingQueue.take(LinkedBlockingQueue.java:442)
        at org.apache.zookeeper.ClientCnxn$EventThread.run(ClientCnxn.java:502)
	at __randomizedtesting.SeedInfo.seed([2765261D870EBA06]:0)


FAILED:  junit.framework.TestSuite.org.apache.solr.cloud.TestSolrCloudWithSecureImpersonation

Error Message:
There are still zombie threads that couldn't be terminated:    1) Thread[id=37666, name=jetty-launcher-7298-thread-2-SendThread(127.0.0.1:36314), state=TIMED_WAITING, group=TGRP-TestSolrCloudWithSecureImpersonation]         at java.lang.Thread.sleep(Native Method)         at org.apache.zookeeper.client.StaticHostProvider.next(StaticHostProvider.java:105)         at org.apache.zookeeper.ClientCnxn$SendThread.startConnect(ClientCnxn.java:1000)         at org.apache.zookeeper.ClientCnxn$SendThread.run(ClientCnxn.java:1063)

Stack Trace:
com.carrotsearch.randomizedtesting.ThreadLeakError: There are still zombie threads that couldn't be terminated:
   1) Thread[id=37666, name=jetty-launcher-7298-thread-2-SendThread(127.0.0.1:36314), state=TIMED_WAITING, group=TGRP-TestSolrCloudWithSecureImpersonation]
        at java.lang.Thread.sleep(Native Method)
        at org.apache.zookeeper.client.StaticHostProvider.next(StaticHostProvider.java:105)
        at org.apache.zookeeper.ClientCnxn$SendThread.startConnect(ClientCnxn.java:1000)
        at org.apache.zookeeper.ClientCnxn$SendThread.run(ClientCnxn.java:1063)
	at __randomizedtesting.SeedInfo.seed([2765261D870EBA06]:0)


FAILED:  org.apache.solr.handler.TestReplicationHandler.doTestIndexAndConfigReplication

Error Message:
Index: 0, Size: 0

Stack Trace:
java.lang.IndexOutOfBoundsException: Index: 0, Size: 0
	at __randomizedtesting.SeedInfo.seed([2765261D870EBA06:332D7D48A4090718]:0)
	at java.util.ArrayList.rangeCheck(ArrayList.java:657)
	at java.util.ArrayList.get(ArrayList.java:433)
	at org.apache.solr.handler.TestReplicationHandler.doTestIndexAndConfigReplication(TestReplicationHandler.java:561)
	at sun.reflect.NativeMethodAccessorImpl.invoke0(Native Method)
	at sun.reflect.NativeMethodAccessorImpl.invoke(NativeMethodAccessorImpl.java:62)
	at sun.reflect.DelegatingMethodAccessorImpl.invoke(DelegatingMethodAccessorImpl.java:43)
	at java.lang.reflect.Method.invoke(Method.java:498)
	at com.carrotsearch.randomizedtesting.RandomizedRunner.invoke(RandomizedRunner.java:1737)
	at com.carrotsearch.randomizedtesting.RandomizedRunner$8.evaluate(RandomizedRunner.java:934)
	at com.carrotsearch.randomizedtesting.RandomizedRunner$9.evaluate(RandomizedRunner.java:970)
	at com.carrotsearch.randomizedtesting.RandomizedRunner$10.evaluate(RandomizedRunner.java:984)
	at com.carrotsearch.randomizedtesting.rules.SystemPropertiesRestoreRule$1.evaluate(SystemPropertiesRestoreRule.java:57)
	at org.apache.lucene.util.TestRuleSetupTeardownChained$1.evaluate(TestRuleSetupTeardownChained.java:49)
	at org.apache.lucene.util.AbstractBeforeAfterRule$1.evaluate(AbstractBeforeAfterRule.java:45)
	at org.apache.lucene.util.TestRuleThreadAndTestName$1.evaluate(TestRuleThreadAndTestName.java:48)
	at org.apache.lucene.util.TestRuleIgnoreAfterMaxFailures$1.evaluate(TestRuleIgnoreAfterMaxFailures.java:64)
	at org.apache.lucene.util.TestRuleMarkFailure$1.evaluate(TestRuleMarkFailure.java:47)
	at com.carrotsearch.randomizedtesting.rules.StatementAdapter.evaluate(StatementAdapter.java:36)
	at com.carrotsearch.randomizedtesting.ThreadLeakControl$StatementRunner.run(ThreadLeakControl.java:368)
	at com.carrotsearch.randomizedtesting.ThreadLeakControl.forkTimeoutingTask(ThreadLeakControl.java:817)
	at com.carrotsearch.randomizedtesting.ThreadLeakControl$3.evaluate(ThreadLeakControl.java:468)
	at com.carrotsearch.randomizedtesting.RandomizedRunner.runSingleTest(RandomizedRunner.java:943)
	at com.carrotsearch.randomizedtesting.RandomizedRunner$5.evaluate(RandomizedRunner.java:829)
	at com.carrotsearch.randomizedtesting.RandomizedRunner$6.evaluate(RandomizedRunner.java:879)
	at com.carrotsearch.randomizedtesting.RandomizedRunner$7.evaluate(RandomizedRunner.java:890)
	at com.carrotsearch.randomizedtesting.rules.StatementAdapter.evaluate(StatementAdapter.java:36)
	at com.carrotsearch.randomizedtesting.rules.SystemPropertiesRestoreRule$1.evaluate(SystemPropertiesRestoreRule.java:57)
	at org.apache.lucene.util.AbstractBeforeAfterRule$1.evaluate(AbstractBeforeAfterRule.java:45)
	at com.carrotsearch.randomizedtesting.rules.StatementAdapter.evaluate(StatementAdapter.java:36)
	at org.apache.lucene.util.TestRuleStoreClassName$1.evaluate(TestRuleStoreClassName.java:41)
	at com.carrotsearch.randomizedtesting.rules.NoShadowingOrOverridesOnMethodsRule$1.evaluate(NoShadowingOrOverridesOnMethodsRule.java:40)
	at com.carrotsearch.randomizedtesting.rules.NoShadowingOrOverridesOnMethodsRule$1.evaluate(NoShadowingOrOverridesOnMethodsRule.java:40)
	at com.carrotsearch.randomizedtesting.rules.StatementAdapter.evaluate(StatementAdapter.java:36)
	at com.carrotsearch.randomizedtesting.rules.StatementAdapter.evaluate(StatementAdapter.java:36)
	at com.carrotsearch.randomizedtesting.rules.StatementAdapter.evaluate(StatementAdapter.java:36)
	at org.apache.lucene.util.TestRuleAssertionsRequired$1.evaluate(TestRuleAssertionsRequired.java:53)
	at org.apache.lucene.util.TestRuleMarkFailure$1.evaluate(TestRuleMarkFailure.java:47)
	at org.apache.lucene.util.TestRuleIgnoreAfterMaxFailures$1.evaluate(TestRuleIgnoreAfterMaxFailures.java:64)
	at org.apache.lucene.util.TestRuleIgnoreTestSuites$1.evaluate(TestRuleIgnoreTestSuites.java:54)
	at com.carrotsearch.randomizedtesting.rules.StatementAdapter.evaluate(StatementAdapter.java:36)
	at com.carrotsearch.randomizedtesting.ThreadLeakControl$StatementRunner.run(ThreadLeakControl.java:368)
	at java.lang.Thread.run(Thread.java:748)




Build Log:
[...truncated 13396 lines...]
   [junit4] Suite: org.apache.solr.cloud.ReplaceNodeNoTargetTest
   [junit4]   2> 2917752 INFO  (SUITE-ReplaceNodeNoTargetTest-seed#[2765261D870EBA06]-worker) [    ] o.a.s.SolrTestCaseJ4 SecureRandom sanity checks: test.solr.allowed.securerandom=null & java.security.egd=file:/dev/./urandom
   [junit4]   2> Creating dataDir: /export/home/jenkins/workspace/Lucene-Solr-7.x-Solaris/solr/build/solr-core/test/J0/temp/solr.cloud.ReplaceNodeNoTargetTest_2765261D870EBA06-001/init-core-data-001
   [junit4]   2> 2917753 WARN  (SUITE-ReplaceNodeNoTargetTest-seed#[2765261D870EBA06]-worker) [    ] o.a.s.SolrTestCaseJ4 startTrackingSearchers: numOpens=21 numCloses=21
   [junit4]   2> 2917753 INFO  (SUITE-ReplaceNodeNoTargetTest-seed#[2765261D870EBA06]-worker) [    ] o.a.s.SolrTestCaseJ4 Using PointFields (NUMERIC_POINTS_SYSPROP=true) w/NUMERIC_DOCVALUES_SYSPROP=true
   [junit4]   2> 2917754 INFO  (SUITE-ReplaceNodeNoTargetTest-seed#[2765261D870EBA06]-worker) [    ] o.a.s.SolrTestCaseJ4 Randomized ssl (false) and clientAuth (false) via: @org.apache.solr.util.RandomizeSSL(reason=, value=NaN, ssl=NaN, clientAuth=NaN)
   [junit4]   2> 2917755 INFO  (SUITE-ReplaceNodeNoTargetTest-seed#[2765261D870EBA06]-worker) [    ] o.a.s.c.MiniSolrCloudCluster Starting cluster of 6 servers in /export/home/jenkins/workspace/Lucene-Solr-7.x-Solaris/solr/build/solr-core/test/J0/temp/solr.cloud.ReplaceNodeNoTargetTest_2765261D870EBA06-001/tempDir-001
   [junit4]   2> 2917755 INFO  (SUITE-ReplaceNodeNoTargetTest-seed#[2765261D870EBA06]-worker) [    ] o.a.s.c.ZkTestServer STARTING ZK TEST SERVER
   [junit4]   2> 2917755 INFO  (Thread-1861) [    ] o.a.s.c.ZkTestServer client port:0.0.0.0/0.0.0.0:0
   [junit4]   2> 2917755 INFO  (Thread-1861) [    ] o.a.s.c.ZkTestServer Starting server
   [junit4]   2> 2917791 ERROR (Thread-1861) [    ] o.a.z.s.ZooKeeperServer ZKShutdownHandler is not registered, so ZooKeeper server won't take any action on ERROR or SHUTDOWN server state changes
   [junit4]   2> 2917855 INFO  (SUITE-ReplaceNodeNoTargetTest-seed#[2765261D870EBA06]-worker) [    ] o.a.s.c.ZkTestServer start zk server on port:48387
   [junit4]   2> 2917862 INFO  (zkConnectionManagerCallback-2055-thread-1) [    ] o.a.s.c.c.ConnectionManager zkClient has connected
   [junit4]   2> 2917891 INFO  (jetty-launcher-2052-thread-1) [    ] o.e.j.s.Server jetty-9.4.8.v20171121, build timestamp: 2017-11-21T12:27:37-09:00, git hash: 82b8fb23f757335bb3329d540ce37a2a2615f0a8
   [junit4]   2> 2917892 INFO  (jetty-launcher-2052-thread-2) [    ] o.e.j.s.Server jetty-9.4.8.v20171121, build timestamp: 2017-11-21T12:27:37-09:00, git hash: 82b8fb23f757335bb3329d540ce37a2a2615f0a8
   [junit4]   2> 2917893 INFO  (jetty-launcher-2052-thread-1) [    ] o.e.j.s.session DefaultSessionIdManager workerName=node0
   [junit4]   2> 2917893 INFO  (jetty-launcher-2052-thread-1) [    ] o.e.j.s.session No SessionScavenger set, using defaults
   [junit4]   2> 2917893 INFO  (jetty-launcher-2052-thread-1) [    ] o.e.j.s.session Scavenging every 600000ms
   [junit4]   2> 2917893 INFO  (jetty-launcher-2052-thread-1) [    ] o.e.j.s.h.ContextHandler Started o.e.j.s.ServletContextHandler@3a36053b{/solr,null,AVAILABLE}
   [junit4]   2> 2917893 INFO  (jetty-launcher-2052-thread-1) [    ] o.e.j.s.AbstractConnector Started ServerConnector@624e0193{HTTP/1.1,[http/1.1]}{127.0.0.1:34283}
   [junit4]   2> 2917893 INFO  (jetty-launcher-2052-thread-1) [    ] o.e.j.s.Server Started @2924385ms
   [junit4]   2> 2917893 INFO  (jetty-launcher-2052-thread-1) [    ] o.a.s.c.s.e.JettySolrRunner Jetty properties: {hostContext=/solr, hostPort=34283}
   [junit4]   2> 2917893 ERROR (jetty-launcher-2052-thread-1) [    ] o.a.s.u.StartupLoggingUtils Missing Java Option solr.log.dir. Logging may be missing or incomplete.
   [junit4]   2> 2917893 INFO  (jetty-launcher-2052-thread-1) [    ] o.a.s.s.SolrDispatchFilter  ___      _       Welcome to Apache Solr™ version 7.3.0
   [junit4]   2> 2917893 INFO  (jetty-launcher-2052-thread-1) [    ] o.a.s.s.SolrDispatchFilter / __| ___| |_ _   Starting in cloud mode on port null
   [junit4]   2> 2917893 INFO  (jetty-launcher-2052-thread-1) [    ] o.a.s.s.SolrDispatchFilter \__ \/ _ \ | '_|  Install dir: null
   [junit4]   2> 2917893 INFO  (jetty-launcher-2052-thread-1) [    ] o.a.s.s.SolrDispatchFilter |___/\___/_|_|    Start time: 2018-02-23T20:00:19.853Z
   [junit4]   2> 2917898 INFO  (jetty-launcher-2052-thread-5) [    ] o.e.j.s.Server jetty-9.4.8.v20171121, build timestamp: 2017-11-21T12:27:37-09:00, git hash: 82b8fb23f757335bb3329d540ce37a2a2615f0a8
   [junit4]   2> 2917898 INFO  (jetty-launcher-2052-thread-6) [    ] o.e.j.s.Server jetty-9.4.8.v20171121, build timestamp: 2017-11-21T12:27:37-09:00, git hash: 82b8fb23f757335bb3329d540ce37a2a2615f0a8
   [junit4]   2> 2917899 INFO  (jetty-launcher-2052-thread-2) [    ] o.e.j.s.session DefaultSessionIdManager workerName=node0
   [junit4]   2> 2917899 INFO  (jetty-launcher-2052-thread-2) [    ] o.e.j.s.session No SessionScavenger set, using defaults
   [junit4]   2> 2917899 INFO  (jetty-launcher-2052-thread-2) [    ] o.e.j.s.session Scavenging every 600000ms
   [junit4]   2> 2917899 INFO  (jetty-launcher-2052-thread-4) [    ] o.e.j.s.Server jetty-9.4.8.v20171121, build timestamp: 2017-11-21T12:27:37-09:00, git hash: 82b8fb23f757335bb3329d540ce37a2a2615f0a8
   [junit4]   2> 2917899 INFO  (jetty-launcher-2052-thread-2) [    ] o.e.j.s.h.ContextHandler Started o.e.j.s.ServletContextHandler@14c5233b{/solr,null,AVAILABLE}
   [junit4]   2> 2917900 INFO  (jetty-launcher-2052-thread-2) [    ] o.e.j.s.AbstractConnector Started ServerConnector@969d605{HTTP/1.1,[http/1.1]}{127.0.0.1:49548}
   [junit4]   2> 2917900 INFO  (jetty-launcher-2052-thread-2) [    ] o.e.j.s.Server Started @2924392ms
   [junit4]   2> 2917900 INFO  (jetty-launcher-2052-thread-2) [    ] o.a.s.c.s.e.JettySolrRunner Jetty properties: {hostContext=/solr, hostPort=49548}
   [junit4]   2> 2917900 ERROR (jetty-launcher-2052-thread-2) [    ] o.a.s.u.StartupLoggingUtils Missing Java Option solr.log.dir. Logging may be missing or incomplete.
   [junit4]   2> 2917900 INFO  (jetty-launcher-2052-thread-2) [    ] o.a.s.s.SolrDispatchFilter  ___      _       Welcome to Apache Solr™ version 7.3.0
   [junit4]   2> 2917900 INFO  (jetty-launcher-2052-thread-2) [    ] o.a.s.s.SolrDispatchFilter / __| ___| |_ _   Starting in cloud mode on port null
   [junit4]   2> 2917900 INFO  (jetty-launcher-2052-thread-2) [    ] o.a.s.s.SolrDispatchFilter \__ \/ _ \ | '_|  Install dir: null
   [junit4]   2> 2917900 INFO  (jetty-launcher-2052-thread-2) [    ] o.a.s.s.SolrDispatchFilter |___/\___/_|_|    Start time: 2018-02-23T20:00:19.860Z
   [junit4]   2> 2917900 INFO  (jetty-launcher-2052-thread-4) [    ] o.e.j.s.session DefaultSessionIdManager workerName=node0
   [junit4]   2> 2917900 INFO  (jetty-launcher-2052-thread-4) [    ] o.e.j.s.session No SessionScavenger set, using defaults
   [junit4]   2> 2917900 INFO  (jetty-launcher-2052-thread-4) [    ] o.e.j.s.session Scavenging every 660000ms
   [junit4]   2> 2917901 INFO  (jetty-launcher-2052-thread-4) [    ] o.e.j.s.h.ContextHandler Started o.e.j.s.ServletContextHandler@2c8755c6{/solr,null,AVAILABLE}
   [junit4]   2> 2917901 INFO  (jetty-launcher-2052-thread-4) [    ] o.e.j.s.AbstractConnector Started ServerConnector@64eb2b4a{HTTP/1.1,[http/1.1]}{127.0.0.1:52550}
   [junit4]   2> 2917901 INFO  (jetty-launcher-2052-thread-4) [    ] o.e.j.s.Server Started @2924393ms
   [junit4]   2> 2917901 INFO  (jetty-launcher-2052-thread-4) [    ] o.a.s.c.s.e.JettySolrRunner Jetty properties: {hostContext=/solr, hostPort=52550}
   [junit4]   2> 2917901 ERROR (jetty-launcher-2052-thread-4) [    ] o.a.s.u.StartupLoggingUtils Missing Java Option solr.log.dir. Logging may be missing or incomplete.
   [junit4]   2> 2917901 INFO  (jetty-launcher-2052-thread-4) [    ] o.a.s.s.SolrDispatchFilter  ___      _       Welcome to Apache Solr™ version 7.3.0
   [junit4]   2> 2917901 INFO  (jetty-launcher-2052-thread-4) [    ] o.a.s.s.SolrDispatchFilter / __| ___| |_ _   Starting in cloud mode on port null
   [junit4]   2> 2917901 INFO  (jetty-launcher-2052-thread-4) [    ] o.a.s.s.SolrDispatchFilter \__ \/ _ \ | '_|  Install dir: null
   [junit4]   2> 2917901 INFO  (jetty-launcher-2052-thread-4) [    ] o.a.s.s.SolrDispatchFilter |___/\___/_|_|    Start time: 2018-02-23T20:00:19.861Z
   [junit4]   2> 2917902 INFO  (jetty-launcher-2052-thread-5) [    ] o.e.j.s.session DefaultSessionIdManager workerName=node0
   [junit4]   2> 2917902 INFO  (jetty-launcher-2052-thread-5) [    ] o.e.j.s.session No SessionScavenger set, using defaults
   [junit4]   2> 2917902 INFO  (jetty-launcher-2052-thread-5) [    ] o.e.j.s.session Scavenging every 660000ms
   [junit4]   2> 2917903 INFO  (jetty-launcher-2052-thread-3) [    ] o.e.j.s.Server jetty-9.4.8.v20171121, build timestamp: 2017-11-21T12:27:37-09:00, git hash: 82b8fb23f757335bb3329d540ce37a2a2615f0a8
   [junit4]   2> 2917904 INFO  (jetty-launcher-2052-thread-6) [    ] o.e.j.s.session DefaultSessionIdManager workerName=node0
   [junit4]   2> 2917904 INFO  (jetty-launcher-2052-thread-6) [    ] o.e.j.s.session No SessionScavenger set, using defaults
   [junit4]   2> 2917904 INFO  (jetty-launcher-2052-thread-6) [    ] o.e.j.s.session Scavenging every 660000ms
   [junit4]   2> 2917905 INFO  (jetty-launcher-2052-thread-6) [    ] o.e.j.s.h.ContextHandler Started o.e.j.s.ServletContextHandler@15cd5b4f{/solr,null,AVAILABLE}
   [junit4]   2> 2917905 INFO  (jetty-launcher-2052-thread-5) [    ] o.e.j.s.h.ContextHandler Started o.e.j.s.ServletContextHandler@59f4d4f8{/solr,null,AVAILABLE}
   [junit4]   2> 2917905 INFO  (jetty-launcher-2052-thread-6) [    ] o.e.j.s.AbstractConnector Started ServerConnector@41499736{HTTP/1.1,[http/1.1]}{127.0.0.1:48767}
   [junit4]   2> 2917905 INFO  (jetty-launcher-2052-thread-6) [    ] o.e.j.s.Server Started @2924397ms
   [junit4]   2> 2917905 INFO  (jetty-launcher-2052-thread-6) [    ] o.a.s.c.s.e.JettySolrRunner Jetty properties: {hostContext=/solr, hostPort=48767}
   [junit4]   2> 2917905 INFO  (jetty-launcher-2052-thread-5) [    ] o.e.j.s.AbstractConnector Started ServerConnector@2dbab89a{HTTP/1.1,[http/1.1]}{127.0.0.1:50032}
   [junit4]   2> 2917905 ERROR (jetty-launcher-2052-thread-6) [    ] o.a.s.u.StartupLoggingUtils Missing Java Option solr.log.dir. Logging may be missing or incomplete.
   [junit4]   2> 2917905 INFO  (jetty-launcher-2052-thread-5) [    ] o.e.j.s.Server Started @2924397ms
   [junit4]   2> 2917905 INFO  (jetty-launcher-2052-thread-5) [    ] o.a.s.c.s.e.JettySolrRunner Jetty properties: {hostContext=/solr, hostPort=50032}
   [junit4]   2> 2917905 INFO  (jetty-launcher-2052-thread-6) [    ] o.a.s.s.SolrDispatchFilter  ___      _       Welcome to Apache Solr™ version 7.3.0
   [junit4]   2> 2917905 INFO  (jetty-launcher-2052-thread-6) [    ] o.a.s.s.SolrDispatchFilter / __| ___| |_ _   Starting in cloud mode on port null
   [junit4]   2> 2917905 INFO  (jetty-launcher-2052-thread-6) [    ] o.a.s.s.SolrDispatchFilter \__ \/ _ \ | '_|  Install dir: null
   [junit4]   2> 2917905 INFO  (jetty-launcher-2052-thread-6) [    ] o.a.s.s.SolrDispatchFilter |___/\___/_|_|    Start time: 2018-02-23T20:00:19.865Z
   [junit4]   2> 2917906 ERROR (jetty-launcher-2052-thread-5) [    ] o.a.s.u.StartupLoggingUtils Missing Java Option solr.log.dir. Logging may be missing or incomplete.
   [junit4]   2> 2917906 INFO  (jetty-launcher-2052-thread-5) [    ] o.a.s.s.SolrDispatchFilter  ___      _       Welcome to Apache Solr™ version 7.3.0
   [junit4]   2> 2917906 INFO  (jetty-launcher-2052-thread-5) [    ] o.a.s.s.SolrDispatchFilter / __| ___| |_ _   Starting in cloud mode on port null
   [junit4]   2> 2917906 INFO  (jetty-launcher-2052-thread-5) [    ] o.a.s.s.SolrDispatchFilter \__ \/ _ \ | '_|  Install dir: null
   [junit4]   2> 2917906 INFO  (jetty-launcher-2052-thread-5) [    ] o.a.s.s.SolrDispatchFilter |___/\___/_|_|    Start time: 2018-02-23T20:00:19.866Z
   [junit4]   2> 2917910 INFO  (zkConnectionManagerCallback-2057-thread-1) [    ] o.a.s.c.c.ConnectionManager zkClient has connected
   [junit4]   2> 2917917 INFO  (jetty-launcher-2052-thread-3) [    ] o.e.j.s.session DefaultSessionIdManager workerName=node0
   [junit4]   2> 2917917 INFO  (jetty-launcher-2052-thread-3) [    ] o.e.j.s.session No SessionScavenger set, using defaults
   [junit4]   2> 2917917 INFO  (jetty-launcher-2052-thread-3) [    ] o.e.j.s.session Scavenging every 600000ms
   [junit4]   2> 2917917 INFO  (jetty-launcher-2052-thread-3) [    ] o.e.j.s.h.ContextHandler Started o.e.j.s.ServletContextHandler@765692c8{/solr,null,AVAILABLE}
   [junit4]   2> 2917918 INFO  (jetty-launcher-2052-thread-3) [    ] o.e.j.s.AbstractConnector Started ServerConnector@33c088d{HTTP/1.1,[http/1.1]}{127.0.0.1:45631}
   [junit4]   2> 2917918 INFO  (jetty-launcher-2052-thread-3) [    ] o.e.j.s.Server Started @2924409ms
   [junit4]   2> 2917918 INFO  (jetty-launcher-2052-thread-3) [    ] o.a.s.c.s.e.JettySolrRunner Jetty properties: {hostContext=/solr, hostPort=45631}
   [junit4]   2> 2917918 ERROR (jetty-launcher-2052-thread-3) [    ] o.a.s.u.StartupLoggingUtils Missing Java Option solr.log.dir. Logging may be missing or incomplete.
   [junit4]   2> 2917918 INFO  (jetty-launcher-2052-thread-3) [    ] o.a.s.s.SolrDispatchFilter  ___      _       Welcome to Apache Solr™ version 7.3.0
   [junit4]   2> 2917918 INFO  (jetty-launcher-2052-thread-3) [    ] o.a.s.s.SolrDispatchFilter / __| ___| |_ _   Starting in cloud mode on port null
   [junit4]   2> 2917918 INFO  (jetty-launcher-2052-thread-3) [    ] o.a.s.s.SolrDispatchFilter \__ \/ _ \ | '_|  Install dir: null
   [junit4]   2> 2917918 INFO  (jetty-launcher-2052-thread-3) [    ] o.a.s.s.SolrDispatchFilter |___/\___/_|_|    Start time: 2018-02-23T20:00:19.878Z
   [junit4]   2> 2917919 INFO  (jetty-launcher-2052-thread-1) [    ] o.a.s.s.SolrDispatchFilter solr.xml found in ZooKeeper. Loading...
   [junit4]   2> 2917919 INFO  (zkConnectionManagerCallback-2065-thread-1) [    ] o.a.s.c.c.ConnectionManager zkClient has connected
   [junit4]   2> 2917920 INFO  (zkConnectionManagerCallback-2063-thread-1) [    ] o.a.s.c.c.ConnectionManager zkClient has connected
   [junit4]   2> 2917921 INFO  (zkConnectionManagerCallback-2061-thread-1) [    ] o.a.s.c.c.ConnectionManager zkClient has connected
   [junit4]   2> 2917923 INFO  (jetty-launcher-2052-thread-6) [    ] o.a.s.s.SolrDispatchFilter solr.xml found in ZooKeeper. Loading...
   [junit4]   2> 2917923 INFO  (jetty-launcher-2052-thread-4) [    ] o.a.s.s.SolrDispatchFilter solr.xml found in ZooKeeper. Loading...
   [junit4]   2> 2917923 WARN  (NIOServerCxn.Factory:0.0.0.0/0.0.0.0:0) [    ] o.a.z.s.NIOServerCnxn Unable to read additional data from client sessionid 0x100aedc3e0d0001, likely client has closed socket
   [junit4]   2> 2917925 INFO  (jetty-launcher-2052-thread-1) [    ] o.a.s.c.ZkContainer Zookeeper client=127.0.0.1:48387/solr
   [junit4]   2> 2917926 INFO  (zkConnectionManagerCallback-2059-thread-1) [    ] o.a.s.c.c.ConnectionManager zkClient has connected
   [junit4]   2> 2917944 INFO  (jetty-launcher-2052-thread-6) [    ] o.a.s.c.ZkContainer Zookeeper client=127.0.0.1:48387/solr
   [junit4]   2> 2917944 INFO  (jetty-launcher-2052-thread-4) [    ] o.a.s.c.ZkContainer Zookeeper client=127.0.0.1:48387/solr
   [junit4]   2> 2917928 INFO  (jetty-launcher-2052-thread-5) [    ] o.a.s.s.SolrDispatchFilter solr.xml found in ZooKeeper. Loading...
   [junit4]   2> 2917927 INFO  (zkConnectionManagerCallback-2071-thread-1) [    ] o.a.s.c.c.ConnectionManager zkClient has connected
   [junit4]   2> 2917954 INFO  (zkConnectionManagerCallback-2079-thread-1) [    ] o.a.s.c.c.ConnectionManager zkClient has connected
   [junit4]   2> 2917927 INFO  (zkConnectionManagerCallback-2067-thread-1) [    ] o.a.s.c.c.ConnectionManager zkClient has connected
   [junit4]   2> 2917949 INFO  (zkConnectionManagerCallback-2077-thread-1) [    ] o.a.s.c.c.ConnectionManager zkClient has connected
   [junit4]   2> 2917948 INFO  (jetty-launcher-2052-thread-2) [    ] o.a.s.s.SolrDispatchFilter solr.xml found in ZooKeeper. Loading...
   [junit4]   2> 2917959 WARN  (NIOServerCxn.Factory:0.0.0.0/0.0.0.0:0) [    ] o.a.z.s.NIOServerCnxn Unable to read additional data from client sessionid 0x100aedc3e0d0004, likely client has closed socket
   [junit4]   2> 2917961 INFO  (jetty-launcher-2052-thread-2) [    ] o.a.s.c.ZkContainer Zookeeper client=127.0.0.1:48387/solr
   [junit4]   2> 2917962 WARN  (NIOServerCxn.Factory:0.0.0.0/0.0.0.0:0) [    ] o.a.z.s.NIOServerCnxn Unable to read additional data from client sessionid 0x100aedc3e0d0007, likely client has closed socket
   [junit4]   2> 2917971 INFO  (jetty-launcher-2052-thread-5) [    ] o.a.s.c.ZkContainer Zookeeper client=127.0.0.1:48387/solr
   [junit4]   2> 2917963 INFO  (jetty-launcher-2052-thread-3) [    ] o.a.s.s.SolrDispatchFilter solr.xml found in ZooKeeper. Loading...
   [junit4]   2> 2917962 INFO  (zkConnectionManagerCallback-2083-thread-1) [    ] o.a.s.c.c.ConnectionManager zkClient has connected
   [junit4]   2> 2917973 INFO  (zkConnectionManagerCallback-2089-thread-1-processing-n:127.0.0.1:52550_solr) [n:127.0.0.1:52550_solr    ] o.a.s.c.c.ConnectionManager zkClient has connected
   [junit4]   2> 2917973 INFO  (zkConnectionManagerCallback-2085-thread-1-processing-n:127.0.0.1:34283_solr) [n:127.0.0.1:34283_solr    ] o.a.s.c.c.ConnectionManager zkClient has connected
   [junit4]   2> 2917978 INFO  (zkConnectionManagerCallback-2093-thread-1-processing-n:127.0.0.1:48767_solr) [n:127.0.0.1:48767_solr    ] o.a.s.c.c.ConnectionManager zkClient has connected
   [junit4]   2> 2918057 INFO  (zkConnectionManagerCallback-2091-thread-1) [    ] o.a.s.c.c.ConnectionManager zkClient has connected
   [junit4]   2> 2918060 WARN  (NIOServerCxn.Factory:0.0.0.0/0.0.0.0:0) [    ] o.a.z.s.NIOServerCnxn Unable to read additional data from client sessionid 0x100aedc3e0d000d, likely client has closed socket
   [junit4]   2> 2918071 INFO  (zkConnectionManagerCallback-2096-thread-1-processing-n:127.0.0.1:50032_solr) [n:127.0.0.1:50032_solr    ] o.a.s.c.c.ConnectionManager zkClient has connected
   [junit4]   2> 2918071 WARN  (NIOServerCxn.Factory:0.0.0.0/0.0.0.0:0) [    ] o.a.z.s.NIOServerCnxn Unable to read additional data from client sessionid 0x100aedc3e0d0006, likely client has closed socket
   [junit4]   2> 2918079 INFO  (jetty-launcher-2052-thread-3) [    ] o.a.s.c.ZkContainer Zookeeper client=127.0.0.1:48387/solr
   [junit4]   2> 2918083 INFO  (zkConnectionManagerCallback-2100-thread-1) [    ] o.a.s.c.c.ConnectionManager zkClient has connected
   [junit4]   2> 2918101 INFO  (jetty-launcher-2052-thread-1) [n:127.0.0.1:34283_solr    ] o.a.s.c.Overseer Overseer (id=null) closing
   [junit4]   2> 2918100 INFO  (jetty-launcher-2052-thread-6) [n:127.0.0.1:48767_solr    ] o.a.s.c.Overseer Overseer (id=null) closing
   [junit4]   2> 2918084 INFO  (zkConnectionManagerCallback-2102-thread-1-processing-n:127.0.0.1:49548_solr) [n:127.0.0.1:49548_solr    ] o.a.s.c.c.ConnectionManager zkClient has connected
   [junit4]   2> 2918115 WARN  (NIOServerCxn.Factory:0.0.0.0/0.0.0.0:0) [    ] o.a.z.s.NIOServerCnxn Unable to read additional data from client sessionid 0x100aedc3e0d0010, likely client has closed socket
   [junit4]   2> 2918116 INFO  (jetty-launcher-2052-thread-1) [n:127.0.0.1:34283_solr    ] o.a.s.c.ZkController Register node as live in ZooKeeper:/live_nodes/127.0.0.1:34283_solr
   [junit4]   2> 2918120 INFO  (jetty-launcher-2052-thread-5) [n:127.0.0.1:50032_solr    ] o.a.s.c.Overseer Overseer (id=null) closing
   [junit4]   2> 2918121 INFO  (jetty-launcher-2052-thread-5) [n:127.0.0.1:50032_solr    ] o.a.s.c.ZkController Register node as live in ZooKeeper:/live_nodes/127.0.0.1:50032_solr
   [junit4]   2> 2918160 INFO  (jetty-launcher-2052-thread-6) [n:127.0.0.1:48767_solr    ] o.a.s.c.OverseerElectionContext I am going to be the leader 127.0.0.1:48767_solr
   [junit4]   2> 2918166 INFO  (zkConnectionManagerCallback-2107-thread-1-processing-n:127.0.0.1:45631_solr) [n:127.0.0.1:45631_solr    ] o.a.s.c.c.ConnectionManager zkClient has connected
   [junit4]   2> 2918169 INFO  (jetty-launcher-2052-thread-6) [n:127.0.0.1:48767_solr    ] o.a.s.c.Overseer Overseer (id=72249854995005454-127.0.0.1:48767_solr-n_0000000000) starting
   [junit4]   2> 2918174 INFO  (jetty-launcher-2052-thread-2) [n:127.0.0.1:49548_solr    ] o.a.s.c.c.ZkStateReader Updated live nodes from ZooKeeper... (0) -> (2)
   [junit4]   2> 2918176 INFO  (jetty-launcher-2052-thread-2) [n:127.0.0.1:49548_solr    ] o.a.s.c.Overseer Overseer (id=null) closing
   [junit4]   2> 2918178 INFO  (jetty-launcher-2052-thread-2) [n:127.0.0.1:49548_solr    ] o.a.s.c.ZkController Register node as live in ZooKeeper:/live_nodes/127.0.0.1:49548_solr
   [junit4]   2> 2918231 INFO  (jetty-launcher-2052-thread-6) [n:127.0.0.1:48767_solr    ] o.a.s.c.ZkController Register node as live in ZooKeeper:/live_nodes/127.0.0.1:48767_solr
   [junit4]   2> 2918273 INFO  (zkCallback-2095-thread-1-processing-n:127.0.0.1:50032_solr) [n:127.0.0.1:50032_solr    ] o.a.s.c.c.ZkStateReader Updated live nodes from ZooKeeper... (0) -> (4)
   [junit4]   2> 2918273 INFO  (zkCallback-2084-thread-1-processing-n:127.0.0.1:34283_solr) [n:127.0.0.1:34283_solr    ] o.a.s.c.c.ZkStateReader Updated live nodes from ZooKeeper... (0) -> (3)
   [junit4]   2> 2918274 INFO  (zkCallback-2092-thread-1-processing-n:127.0.0.1:48767_solr) [n:127.0.0.1:48767_solr    ] o.a.s.c.c.ZkStateReader Updated live nodes from ZooKeeper... (0) -> (4)
   [junit4]   2> 2918274 INFO  (zkCallback-2101-thread-1-processing-n:127.0.0.1:49548_solr) [n:127.0.0.1:49548_solr    ] o.a.s.c.c.ZkStateReader Updated live nodes from ZooKeeper... (2) -> (3)
   [junit4]   2> 2918280 INFO  (jetty-launcher-2052-thread-3) [n:127.0.0.1:45631_solr    ] o.a.s.c.c.ZkStateReader Updated live nodes from ZooKeeper... (0) -> (4)
   [junit4]   2> 2918280 INFO  (zkCallback-2084-thread-3-processing-n:127.0.0.1:34283_solr) [n:127.0.0.1:34283_solr    ] o.a.s.c.c.ZkStateReader Updated live nodes from ZooKeeper... (3) -> (4)
   [junit4]   2> 2918280 INFO  (zkCallback-2101-thread-2-processing-n:127.0.0.1:49548_solr) [n:127.0.0.1:49548_solr    ] o.a.s.c.c.ZkStateReader Updated live nodes from ZooKeeper... (3) -> (4)
   [junit4]   2> 2918284 INFO  (jetty-launcher-2052-thread-3) [n:127.0.0.1:45631_solr    ] o.a.s.c.Overseer Overseer (id=null) closing
   [junit4]   2> 2918286 INFO  (jetty-launcher-2052-thread-3) [n:127.0.0.1:45631_solr    ] o.a.s.c.ZkController Register node as live in ZooKeeper:/live_nodes/127.0.0.1:45631_solr
   [junit4]   2> 2918373 INFO  (jetty-launcher-2052-thread-1) [n:127.0.0.1:34283_solr    ] o.a.s.m.r.SolrJmxReporter JMX monitoring for 'solr_34283.solr.node' (registry 'solr.node') enabled at server: com.sun.jmx.mbeanserver.JmxMBeanServer@5961dce5
   [junit4]   2> 2918378 INFO  (jetty-launcher-2052-thread-1) [n:127.0.0.1:34283_solr    ] o.a.s.m.r.SolrJmxReporter JMX monitoring for 'solr_34283.solr.jvm' (registry 'solr.jvm') enabled at server: com.sun.jmx.mbeanserver.JmxMBeanServer@5961dce5
   [junit4]   2> 2918378 INFO  (jetty-launcher-2052-thread-1) [n:127.0.0.1:34283_solr    ] o.a.s.m.r.SolrJmxReporter JMX monitoring for 'solr_34283.solr.jetty' (registry 'solr.jetty') enabled at server: com.sun.jmx.mbeanserver.JmxMBeanServer@5961dce5
   [junit4]   2> 2918379 INFO  (jetty-launcher-2052-thread-1) [n:127.0.0.1:34283_solr    ] o.a.s.c.CorePropertiesLocator Found 0 core definitions underneath /export/home/jenkins/workspace/Lucene-Solr-7.x-Solaris/solr/build/solr-core/test/J0/temp/solr.cloud.ReplaceNodeNoTargetTest_2765261D870EBA06-001/tempDir-001/node1/.
   [junit4]   2> 2918380 INFO  (zkCallback-2101-thread-2-processing-n:127.0.0.1:49548_solr) [n:127.0.0.1:49548_solr    ] o.a.s.c.c.ZkStateReader Updated live nodes from ZooKeeper... (4) -> (5)
   [junit4]   2> 2918380 INFO  (zkCallback-2084-thread-3-processing-n:127.0.0.1:34283_solr) [n:127.0.0.1:34283_solr    ] o.a.s.c.c.ZkStateReader Updated live nodes from ZooKeeper... (4) -> (5)
   [junit4]   2> 2918380 INFO  (zkCallback-2092-thread-3-processing-n:127.0.0.1:48767_solr) [n:127.0.0.1:48767_solr    ] o.a.s.c.c.ZkStateReader Updated live nodes from ZooKeeper... (4) -> (5)
   [junit4]   2> 2918393 INFO  (jetty-launcher-2052-thread-4) [n:127.0.0.1:52550_solr    ] o.a.s.c.c.ZkStateReader Updated live nodes from ZooKeeper... (0) -> (5)
   [junit4]   2> 2918395 INFO  (jetty-launcher-2052-thread-4) [n:127.0.0.1:52550_solr    ] o.a.s.c.Overseer Overseer (id=null) closing
   [junit4]   2> 2918398 INFO  (jetty-launcher-2052-thread-4) [n:127.0.0.1:52550_solr    ] o.a.s.c.ZkController Register node as live in ZooKeeper:/live_nodes/127.0.0.1:52550_solr
   [junit4]   2> 2918409 INFO  (zkCallback-2101-thread-2-processing-n:127.0.0.1:49548_solr) [n:127.0.0.1:49548_solr    ] o.a.s.c.c.ZkStateReader Updated live nodes from ZooKeeper... (5) -> (6)
   [junit4]   2> 2918409 INFO  (zkCallback-2084-thread-3-processing-n:127.0.0.1:34283_solr) [n:127.0.0.1:34283_solr    ] o.a.s.c.c.ZkStateReader Updated live nodes from ZooKeeper... (5) -> (6)
   [junit4]   2> 2918410 INFO  (zkCallback-2092-thread-3-processing-n:127.0.0.1:48767_solr) [n:127.0.0.1:48767_solr    ] o.a.s.c.c.ZkStateReader Updated live nodes from ZooKeeper... (5) -> (6)
   [junit4]   2> 2918413 INFO  (jetty-launcher-2052-thread-5) [n:127.0.0.1:50032_solr    ] o.a.s.m.r.SolrJmxReporter JMX monitoring for 'solr_50032.solr.node' (registry 'solr.node') enabled at server: com.sun.jmx.mbeanserver.JmxMBeanServer@5961dce5
   [junit4]   2> 2918416 INFO  (zkCallback-2106-thread-1-processing-n:127.0.0.1:45631_solr) [n:127.0.0.1:45631_solr    ] o.a.s.c.c.ZkStateReader Updated live nodes from ZooKeeper... (4) -> (6)
   [junit4]   2> 2918416 INFO  (zkCallback-2088-thread-1-processing-n:127.0.0.1:52550_solr) [n:127.0.0.1:52550_solr    ] o.a.s.c.c.ZkStateReader Updated live nodes from ZooKeeper... (5) -> (6)
   [junit4]   2> 2918422 INFO  (jetty-launcher-2052-thread-5) [n:127.0.0.1:50032_solr    ] o.a.s.m.r.SolrJmxReporter JMX monitoring for 'solr_50032.solr.jvm' (registry 'solr.jvm') enabled at server: com.sun.jmx.mbeanserver.JmxMBeanServer@5961dce5
   [junit4]   2> 2918422 INFO  (jetty-launcher-2052-thread-5) [n:127.0.0.1:50032_solr    ] o.a.s.m.r.SolrJmxReporter JMX monitoring for 'solr_50032.solr.jetty' (registry 'solr.jetty') enabled at server: com.sun.jmx.mbeanserver.JmxMBeanServer@5961dce5
   [junit4]   2> 2918422 INFO  (jetty-launcher-2052-thread-5) [n:127.0.0.1:50032_solr    ] o.a.s.c.CorePropertiesLocator Found 0 core definitions underneath /export/home/jenkins/workspace/Lucene-Solr-7.x-Solaris/solr/build/solr-core/test/J0/temp/solr.cloud.ReplaceNodeNoTargetTest_2765261D870EBA06-001/tempDir-001/node3/.
   [junit4]   2> 2918449 INFO  (zkCallback-2095-thread-4-processing-n:127.0.0.1:50032_solr) [n:127.0.0.1:50032_solr    ] o.a.s.c.c.ZkStateReader Updated live nodes from ZooKeeper... (4) -> (6)
   [junit4]   2> 2918482 INFO  (jetty-launcher-2052-thread-3) [n:127.0.0.1:45631_solr    ] o.a.s.m.r.SolrJmxReporter JMX monitoring for 'solr_45631.solr.node' (registry 'solr.node') enabled at server: com.sun.jmx.mbeanserver.JmxMBeanServer@5961dce5
   [junit4]   2> 2918536 INFO  (jetty-launcher-2052-thread-6) [n:127.0.0.1:48767_solr    ] o.a.s.m.r.SolrJmxReporter JMX monitoring for 'solr_48767.solr.node' (registry 'solr.node') enabled at server: com.sun.jmx.mbeanserver.JmxMBeanServer@5961dce5
   [junit4]   2> 2918541 INFO  (jetty-launcher-2052-thread-6) [n:127.0.0.1:48767_solr    ] o.a.s.m.r.SolrJmxReporter JMX monitoring for 'solr_48767.solr.jvm' (registry 'solr.jvm') enabled at server: com.sun.jmx.mbeanserver.JmxMBeanServer@5961dce5
   [junit4]   2> 2918541 INFO  (jetty-launcher-2052-thread-6) [n:127.0.0.1:48767_solr    ] o.a.s.m.r.SolrJmxReporter JMX monitoring for 'solr_48767.solr.jetty' (registry 'solr.jetty') enabled at server: com.sun.jmx.mbeanserver.JmxMBeanServer@5961dce5
   [junit4]   2> 2918542 INFO  (jetty-launcher-2052-thread-6) [n:127.0.0.1:48767_solr    ] o.a.s.c.CorePropertiesLocator Found 0 core definitions underneath /export/home/jenkins/workspace/Lucene-Solr-7.x-Solaris/solr/build/solr-core/test/J0/temp/solr.cloud.ReplaceNodeNoTargetTest_2765261D870EBA06-001/tempDir-001/node4/.
   [junit4]   2> 2918655 INFO  (jetty-launcher-2052-thread-2) [n:127.0.0.1:49548_solr    ] o.a.s.m.r.SolrJmxReporter JMX monitoring for 'solr_49548.solr.node' (registry 'solr.node') enabled at server: com.sun.jmx.mbeanserver.JmxMBeanServer@5961dce5
   [junit4]   2> 2918659 INFO  (jetty-launcher-2052-thread-3) [n:127.0.0.1:45631_solr    ] o.a.s.m.r.SolrJmxReporter JMX monitoring for 'solr_45631.solr.jvm' (registry 'solr.jvm') enabled at server: com.sun.jmx.mbeanserver.JmxMBeanServer@5961dce5
   [junit4]   2> 2918659 INFO  (jetty-launcher-2052-thread-3) [n:127.0.0.1:45631_solr    ] o.a.s.m.r.SolrJmxReporter JMX monitoring for 'solr_45631.solr.jetty' (registry 'solr.jetty') enabled at server: com.sun.jmx.mbeanserver.JmxMBeanServer@5961dce5
   [junit4]   2> 2918663 INFO  (jetty-launcher-2052-thread-3) [n:127.0.0.1:45631_solr    ] o.a.s.c.CorePropertiesLocator Found 0 core definitions underneath /export/home/jenkins/workspace/Lucene-Solr-7.x-Solaris/solr/build/solr-core/test/J0/temp/solr.cloud.ReplaceNodeNoTargetTest_2765261D870EBA06-001/tempDir-001/node6/.
   [junit4]   2> 2918681 INFO  (jetty-launcher-2052-thread-2) [n:127.0.0.1:49548_solr    ] o.a.s.m.r.SolrJmxReporter JMX monitoring for 'solr_49548.solr.jvm' (registry 'solr.jvm') enabled at server: com.sun.jmx.mbeanserver.JmxMBeanServer@5961dce5
   [junit4]   2> 2918682 INFO  (jetty-launcher-2052-thread-2) [n:127.0.0.1:49548_solr    ] o.a.s.m.r.SolrJmxReporter JMX monitoring for 'solr_49548.solr.jetty' (registry 'solr.jetty') enabled at server: com.sun.jmx.mbeanserver.JmxMBeanServer@5961dce5
   [junit4]   2> 2918682 INFO  (jetty-launcher-2052-thread-2) [n:127.0.0.1:49548_solr    ] o.a.s.c.CorePropertiesLocator Found 0 core definitions underneath /export/home/jenkins/workspace/Lucene-Solr-7.x-Solaris/solr/build/solr-core/test/J0/temp/solr.cloud.ReplaceNodeNoTargetTest_2765261D870EBA06-001/tempDir-001/node2/.
   [junit4]   2> 2918722 INFO  (jetty-launcher-2052-thread-4) [n:127.0.0.1:52550_solr    ] o.a.s.m.r.SolrJmxReporter JMX monitoring for 'solr_52550.solr.node' (registry 'solr.node') enabled at server: com.sun.jmx.mbeanserver.JmxMBeanServer@5961dce5
   [junit4]   2> 2918726 INFO  (jetty-launcher-2052-thread-4) [n:127.0.0.1:52550_solr    ] o.a.s.m.r.SolrJmxReporter JMX monitoring for 'solr_52550.solr.jvm' (registry 'solr.jvm') enabled at server: com.sun.jmx.mbeanserver.JmxMBeanServer@5961dce5
   [junit4]   2> 2918726 INFO  (jetty-launcher-2052-thread-4) [n:127.0.0.1:52550_solr    ] o.a.s.m.r.SolrJmxReporter JMX monitoring for 'solr_52550.solr.jetty' (registry 'solr.jetty') enabled at server: com.sun.jmx.mbeanserver.JmxMBeanServer@5961dce5
   [junit4]   2> 2918727 INFO  (jetty-launcher-2052-thread-4) [n:127.0.0.1:52550_solr    ] o.a.s.c.CorePropertiesLocator Found 0 core definitions underneath /export/home/jenkins/workspace/Lucene-Solr-7.x-Solaris/solr/build/solr-core/test/J0/temp/solr.cloud.ReplaceNodeNoTargetTest_2765261D870EBA06-001/tempDir-001/node5/.
   [junit4]   2> 2918859 INFO  (zkConnectionManagerCallback-2117-thread-1) [    ] o.a.s.c.c.ConnectionManager zkClient has connected
   [junit4]   2> 2918863 INFO  (zkConnectionManagerCallback-2121-thread-1) [    ] o.a.s.c.c.ConnectionManager zkClient has connected
   [junit4]   2> 2918865 INFO  (SUITE-ReplaceNodeNoTargetTest-seed#[2765261D870EBA06]-worker) [    ] o.a.s.c.c.ZkStateReader Updated live nodes from ZooKeeper... (0) -> (6)
   [junit4]   2> 2918866 INFO  (SUITE-ReplaceNodeNoTargetTest-seed#[2765261D870EBA06]-worker) [    ] o.a.s.c.s.i.ZkClientClusterStateProvider Cluster at 127.0.0.1:48387/solr ready
   [junit4]   2> 2919463 INFO  (TEST-ReplaceNodeNoTargetTest.test-seed#[2765261D870EBA06]) [    ] o.a.s.SolrTestCaseJ4 ###Starting test
   [junit4]   2> 2919464 INFO  (zkConnectionManagerCallback-2123-thread-1) [    ] o.a.s.c.c.ConnectionManager zkClient has connected
   [junit4]   2> 2919466 INFO  (TEST-ReplaceNodeNoTargetTest.test-seed#[2765261D870EBA06]) [    ] o.a.s.c.ReplaceNodeNoTargetTest total_jettys: 6
   [junit4]   2> 2919469 INFO  (qtp103419525-12726) [n:127.0.0.1:34283_solr    ] o.a.s.s.HttpSolrCall [admin] webapp=null path=/admin/metrics params={prefix=CONTAINER.fs.usableSpace,CORE.coreName&wt=javabin&version=2&group=solr.node,solr.core} status=0 QTime=0
   [junit4]   2> 2919471 INFO  (qtp2097155962-12787) [n:127.0.0.1:45631_solr    ] o.a.s.s.HttpSolrCall [admin] webapp=null path=/admin/metrics params={prefix=CONTAINER.fs.usableSpace,CORE.coreName&wt=javabin&version=2&group=solr.node,solr.core} status=0 QTime=0
   [junit4]   2> 2919538 INFO  (qtp1511530316-12770) [n:127.0.0.1:48767_solr    ] o.a.s.s.HttpSolrCall [admin] webapp=null path=/admin/metrics params={prefix=CONTAINER.fs.usableSpace,CORE.coreName&wt=javabin&version=2&group=solr.node,solr.core} status=0 QTime=0
   [junit4]   2> 2919539 INFO  (qtp1134285751-12737) [n:127.0.0.1:49548_solr    ] o.a.s.s.HttpSolrCall [admin] webapp=null path=/admin/metrics params={prefix=CONTAINER.fs.usableSpace,CORE.coreName&wt=javabin&version=2&group=solr.node,solr.core} status=0 QTime=0
   [junit4]   2> 2919541 INFO  (qtp2083173310-12757) [n:127.0.0.1:50032_solr    ] o.a.s.s.HttpSolrCall [admin] webapp=null path=/admin/metrics params={prefix=CONTAINER.fs.usableSpace,CORE.coreName&wt=javabin&version=2&group=solr.node,solr.core} status=0 QTime=0
   [junit4]   2> 2919544 INFO  (qtp1933041858-12746) [n:127.0.0.1:52550_solr    ] o.a.s.s.HttpSolrCall [admin] webapp=null path=/admin/metrics params={prefix=CONTAINER.fs.usableSpace,CORE.coreName&wt=javabin&version=2&group=solr.node,solr.core} status=0 QTime=0
   [junit4]   2> 2919545 INFO  (qtp1933041858-12747) [n:127.0.0.1:52550_solr    ] o.a.s.s.HttpSolrCall [admin] webapp=null path=/admin/autoscaling params={wt=javabin&version=2} status=0 QTime=77
   [junit4]   2> 2919545 INFO  (qtp1933041858-12749) [n:127.0.0.1:52550_solr    ] o.a.s.h.a.CollectionsHandler Invoked Collection Action :create with params pullReplicas=0&replicationFactor=2&collection.configName=conf1&name=replacenodetest_coll_notarget&nrtReplicas=2&action=CREATE&numShards=5&tlogReplicas=0&wt=javabin&version=2 and sendToOCPQueue=true
   [junit4]   2> 2919548 INFO  (OverseerThreadFactory-5033-thread-1-processing-n:127.0.0.1:48767_solr) [n:127.0.0.1:48767_solr    ] o.a.s.c.a.c.CreateCollectionCmd Create collection replacenodetest_coll_notarget
   [junit4]   2> 2919583 INFO  (qtp103419525-12726) [n:127.0.0.1:34283_solr    ] o.a.s.s.HttpSolrCall [admin] webapp=null path=/admin/metrics params={prefix=CONTAINER.fs.usableSpace,CORE.coreName&wt=javabin&version=2&group=solr.node,solr.core} status=0 QTime=0
   [junit4]   2> 2919591 INFO  (qtp2097155962-12787) [n:127.0.0.1:45631_solr    ] o.a.s.s.HttpSolrCall [admin] webapp=null path=/admin/metrics params={prefix=CONTAINER.fs.usableSpace,CORE.coreName&wt=javabin&version=2&group=solr.node,solr.core} status=0 QTime=0
   [junit4]   2> 2919592 INFO  (qtp1511530316-12770) [n:127.0.0.1:48767_solr    ] o.a.s.s.HttpSolrCall [admin] webapp=null path=/admin/metrics params={prefix=CONTAINER.fs.usableSpace,CORE.coreName&wt=javabin&version=2&group=solr.node,solr.core} status=0 QTime=0
   [junit4]   2> 2919593 INFO  (qtp1134285751-12737) [n:127.0.0.1:49548_solr    ] o.a.s.s.HttpSolrCall [admin] webapp=null path=/admin/metrics params={prefix=CONTAINER.fs.usableSpace,CORE.coreName&wt=javabin&version=2&group=solr.node,solr.core} status=0 QTime=0
   [junit4]   2> 2919594 INFO  (qtp2083173310-12757) [n:127.0.0.1:50032_solr    ] o.a.s.s.HttpSolrCall [admin] webapp=null path=/admin/metrics params={prefix=CONTAINER.fs.usableSpace,CORE.coreName&wt=javabin&version=2&group=solr.node,solr.core} status=0 QTime=0
   [junit4]   2> 2919596 INFO  (qtp1933041858-12748) [n:127.0.0.1:52550_solr    ] o.a.s.s.HttpSolrCall [admin] webapp=null path=/admin/metrics params={prefix=CONTAINER.fs.usableSpace,CORE.coreName&wt=javabin&version=2&group=solr.node,solr.core} status=0 QTime=0
   [junit4]   2> 2919599 INFO  (OverseerThreadFactory-5033-thread-1-processing-n:127.0.0.1:48767_solr) [n:127.0.0.1:48767_solr    ] o.a.s.c.s.c.a.PolicyHelper returnSession, curr-time 2933671230 sessionWrapper.createTime 2933671227344921, this.sessionWrapper.createTime 2933671227344921 
   [junit4]   2> 2919718 INFO  (OverseerStateUpdate-72249854995005454-127.0.0.1:48767_solr-n_0000000000) [n:127.0.0.1:48767_solr    ] o.a.s.c.o.SliceMutator createReplica() {
   [junit4]   2>   "operation":"ADDREPLICA",
   [junit4]   2>   "collection":"replacenodetest_coll_notarget",
   [junit4]   2>   "shard":"shard1",
   [junit4]   2>   "core":"replacenodetest_coll_notarget_shard1_replica_n1",
   [junit4]   2>   "state":"down",
   [junit4]   2>   "base_url":"http://127.0.0.1:52550/solr",
   [junit4]   2>   "type":"NRT",
   [junit4]   2>   "waitForFinalState":"false"} 
   [junit4]   2> 2919722 INFO  (OverseerStateUpdate-72249854995005454-127.0.0.1:48767_solr-n_0000000000) [n:127.0.0.1:48767_solr    ] o.a.s.c.o.SliceMutator createReplica() {
   [junit4]   2>   "operation":"ADDREPLICA",
   [junit4]   2>   "collection":"replacenodetest_coll_notarget",
   [junit4]   2>   "shard":"shard1",
   [junit4]   2>   "core":"replacenodetest_coll_notarget_shard1_replica_n2",
   [junit4]   2>   "state":"down",
   [junit4]   2>   "base_url":"http://127.0.0.1:50032/solr",
   [junit4]   2>   "type":"NRT",
   [junit4]   2>   "waitForFinalState":"false"} 
   [junit4]   2> 2919725 INFO  (OverseerStateUpdate-72249854995005454-127.0.0.1:48767_solr-n_0000000000) [n:127.0.0.1:48767_solr    ] o.a.s.c.o.SliceMutator createReplica() {
   [junit4]   2>   "operation":"ADDREPLICA",
   [junit4]   2>   "collection":"replacenodetest_coll_notarget",
   [junit4]   2>   "shard":"shard2",
   [junit4]   2>   "core":"replacenodetest_coll_notarget_shard2_replica_n4",
   [junit4]   2>   "state":"down",
   [junit4]   2>   "base_url":"http://127.0.0.1:49548/solr",
   [junit4]   2>   "type":"NRT",
   [junit4]   2>   "waitForFinalState":"false"} 
   [junit4]   2> 2919730 INFO  (OverseerStateUpdate-72249854995005454-127.0.0.1:48767_solr-n_0000000000) [n:127.0.0.1:48767_solr    ] o.a.s.c.o.SliceMutator createReplica() {
   [junit4]   2>   "operation":"ADDREPLICA",
   [junit4]   2>   "collection":"replacenodetest_coll_notarget",
   [junit4]   2>   "shard":"shard2",
   [junit4]   2>   "core":"replacenodetest_coll_notarget_shard2_replica_n7",
   [junit4]   2>   "state":"down",
   [junit4]   2>   "base_url":"http://127.0.0.1:48767/solr",
   [junit4]   2>   "type":"NRT",
   [junit4]   2>   "waitForFinalState":"false"} 
   [junit4]   2> 2919734 INFO  (OverseerStateUpdate-72249854995005454-127.0.0.1:48767_solr-n_0000000000) [n:127.0.0.1:48767_solr    ] o.a.s.c.o.SliceMutator createReplica() {
   [junit4]   2>   "operation":"ADDREPLICA",
   [junit4]   2>   "collection":"replacenodetest_coll_notarget",
   [junit4]   2>   "shard":"shard3",
   [junit4]   2>   "core":"replacenodetest_coll_notarget_shard3_replica_n8",
   [junit4]   2>   "state":"down",
   [junit4]   2>   "base_url":"http://127.0.0.1:45631/solr",
   [junit4]   2>   "type":"NRT",
   [junit4]   2>   "waitForFinalState":"false"} 
   [junit4]   2> 2919737 INFO  (OverseerStateUpdate-72249854995005454-127.0.0.1:48767_solr-n_0000000000) [n:127.0.0.1:48767_solr    ] o.a.s.c.o.SliceMutator createReplica() {
   [junit4]   2>   "operation":"ADDREPLICA",
   [junit4]   2>   "collection":"replacenodetest_coll_notarget",
   [junit4]   2>   "shard":"shard3",
   [junit4]   2>   "core":"replacenodetest_coll_notarget_shard3_replica_n10",
   [junit4]   2>   "state":"down",
   [junit4]   2>   "base_url":"http://127.0.0.1:34283/solr",
   [junit4]   2>   "type":"NRT",
   [junit4]   2>   "waitForFinalState":"false"} 
   [junit4]   2> 2919740 INFO  (OverseerStateUpdate-72249854995005454-127.0.0.1:48767_solr-n_0000000000) [n:127.0.0.1:48767_solr    ] o.a.s.c.o.SliceMutator createReplica() {
   [junit4]   2>   "operation":"ADDREPLICA",
   [junit4]   2>   "collection":"replacenodetest_coll_notarget",
   [junit4]   2>   "shard":"shard4",
   [junit4]   2>   "core":"replacenodetest_coll_notarget_shard4_replica_n12",
   [junit4]   2>   "state":"down",
   [junit4]   2>   "base_url":"http://127.0.0.1:34283/solr",
   [junit4]   2>   "type":"NRT",
   [junit4]   2>   "waitForFinalState":"false"} 
   [junit4]   2> 2919744 INFO  (OverseerStateUpdate-72249854995005454-127.0.0.1:48767_solr-n_0000000000) [n:127.0.0.1:48767_solr    ] o.a.s.c.o.SliceMutator createReplica() {
   [junit4]   2>   "operation":"ADDREPLICA",
   [junit4]   2>   "collection":"replacenodetest_coll_notarget",
   [junit4]   2>   "shard":"shard4",
   [junit4]   2>   "core":"replacenodetest_coll_notarget_shard4_replica_n14",
   [junit4]   2>   "state":"down",
   [junit4]   2>   "base_url":"http://127.0.0.1:45631/solr",
   [junit4]   2>   "type":"NRT",
   [junit4]   2>   "waitForFinalState":"false"} 
   [junit4]   2> 2919758 INFO  (OverseerStateUpdate-72249854995005454-127.0.0.1:48767_solr-n_0000000000) [n:127.0.0.1:48767_solr    ] o.a.s.c.o.SliceMutator createReplica() {
   [junit4]   2>   "operation":"ADDREPLICA",
   [junit4]   2>   "collection":"replacenodetest_coll_notarget",
   [junit4]   2>   "shard":"shard5",
   [junit4]   2>   "core":"replacenodetest_coll_notarget_shard5_replica_n16",
   [junit4]   2>   "state":"down",
   [junit4]   2>   "base_url":"http://127.0.0.1:48767/solr",
   [junit4]   2>   "type":"NRT",
   [junit4]   2>   "waitForFinalState":"false"} 
   [junit4]   2> 2919763 INFO  (OverseerStateUpdate-72249854995005454-127.0.0.1:48767_solr-n_0000000000) [n:127.0.0.1:48767_solr    ] o.a.s.c.o.SliceMutator createReplica() {
   [junit4]   2>   "operation":"ADDREPLICA",
   [junit4]   2>   "collection":"replacenodetest_coll_notarget",
   [junit4]   2>   "shard":"shard5",
   [junit4]   2>   "core":"replacenodetest_coll_notarget_shard5_replica_n18",
   [junit4]   2>   "state":"down",
   [junit4]   2>   "base_url":"http://127.0.0.1:49548/solr",
   [junit4]   2>   "type":"NRT",
   [junit4]   2>   "waitForFinalState":"false"} 
   [junit4]   2> 2919967 INFO  (qtp1933041858-12748) [n:127.0.0.1:52550_solr    ] o.a.s.h.a.CoreAdminOperation core create command qt=/admin/cores&coreNodeName=core_node3&collection.configName=conf1&newCollection=true&name=replacenodetest_coll_notarget_shard1_replica_n1&action=CREATE&numShards=5&collection=replacenodetest_coll_notarget&shard=shard1&wt=javabin&version=2&replicaType=NRT
   [junit4]   2> 2919970 INFO  (qtp1933041858-12748) [n:127.0.0.1:52550_solr    ] o.a.s.c.TransientSolrCoreCacheDefault Allocating transient cache for 2147483647 transient cores
   [junit4]   2> 2919972 INFO  (qtp2083173310-12757) [n:127.0.0.1:50032_solr    ] o.a.s.h.a.CoreAdminOperation core create command qt=/admin/cores&coreNodeName=core_node5&collection.configName=conf1&newCollection=true&name=replacenodetest_coll_notarget_shard1_replica_n2&action=CREATE&numShards=5&collection=replacenodetest_coll_notarget&shard=shard1&wt=javabin&version=2&replicaType=NRT
   [junit4]   2> 2919972 INFO  (qtp2097155962-12792) [n:127.0.0.1:45631_solr    ] o.a.s.h.a.CoreAdminOperation core create command qt=/admin/cores&coreNodeName=core_node17&collection.configName=conf1&newCollection=true&name=replacenodetest_coll_notarget_shard4_replica_n14&action=CREATE&numShards=5&collection=replacenodetest_coll_notarget&shard=shard4&wt=javabin&version=2&replicaType=NRT
   [junit4]   2> 2919972 INFO  (qtp2083173310-12757) [n:127.0.0.1:50032_solr    ] o.a.s.c.TransientSolrCoreCacheDefault Allocating transient cache for 2147483647 transient cores
   [junit4]   2> 2919973 INFO  (qtp2097155962-12792) [n:127.0.0.1:45631_solr    ] o.a.s.c.TransientSolrCoreCacheDefault Allocating transient cache for 2147483647 transient cores
   [junit4]   2> 2919973 INFO  (qtp103419525-12726) [n:127.0.0.1:34283_solr    ] o.a.s.h.a.CoreAdminOperation core create command qt=/admin/cores&coreNodeName=core_node13&collection.configName=conf1&newCollection=true&name=replacenodetest_coll_notarget_shard3_replica_n10&action=CREATE&numShards=5&collection=replacenodetest_coll_notarget&shard=shard3&wt=javabin&version=2&replicaType=NRT
   [junit4]   2> 2919973 INFO  (qtp2097155962-12787) [n:127.0.0.1:45631_solr    ] o.a.s.h.a.CoreAdminOperation core create command qt=/admin/cores&coreNodeName=core_node11&collection.configName=conf1&newCollection=true&name=replacenodetest_coll_notarget_shard3_replica_n8&action=CREATE&numShards=5&collection=replacenodetest_coll_notarget&shard=shard3&wt=javabin&version=2&replicaType=NRT
   [junit4]   2> 2919973 INFO  (qtp103419525-12726) [n:127.0.0.1:34283_solr    ] o.a.s.c.TransientSolrCoreCacheDefault Allocating transient cache for 2147483647 transient cores
   [junit4]   2> 2919973 INFO  (qtp103419525-12731) [n:127.0.0.1:34283_solr    ] o.a.s.h.a.CoreAdminOperation core create command qt=/admin/cores&coreNodeName=core_node15&collection.configName=conf1&newCollection=true&name=replacenodetest_coll_notarget_shard4_replica_n12&action=CREATE&numShards=5&collection=replacenodetest_coll_notarget&shard=shard4&wt=javabin&version=2&replicaType=NRT
   [junit4]   2> 2919973 INFO  (qtp1134285751-12737) [n:127.0.0.1:49548_solr    ] o.a.s.h.a.CoreAdminOperation core create command qt=/admin/cores&coreNodeName=core_node6&collection.configName=conf1&newCollection=true&name=replacenodetest_coll_notarget_shard2_replica_n4&action=CREATE&numShards=5&collection=replacenodetest_coll_notarget&shard=shard2&wt=javabin&version=2&replicaType=NRT
   [junit4]   2> 2919973 INFO  (qtp1134285751-12737) [n:127.0.0.1:49548_solr    ] o.a.s.c.TransientSolrCoreCacheDefault Allocating transient cache for 2147483647 transient cores
   [junit4]   2> 2919973 INFO  (qtp1134285751-12739) [n:127.0.0.1:49548_solr    ] o.a.s.h.a.CoreAdminOperation core create command qt=/admin/cores&coreNodeName=core_node20&collection.configName=conf1&newCollection=true&name=replacenodetest_coll_notarget_shard5_replica_n18&action=CREATE&numShards=5&collection=replacenodetest_coll_notarget&shard=shard5&wt=javabin&version=2&replicaType=NRT
   [junit4]   2> 2919974 INFO  (qtp1511530316-12772) [n:127.0.0.1:48767_solr    ] o.a.s.h.a.CoreAdminOperation core create command qt=/admin/cores&coreNodeName=core_node9&collection.configName=conf1&newCollection=true&name=replacenodetest_coll_notarget_shard2_replica_n7&action=CREATE&numShards=5&collection=replacenodetest_coll_notarget&shard=shard2&wt=javabin&version=2&replicaType=NRT
   [junit4]   2> 2919974 INFO  (qtp1511530316-12770) [n:127.0.0.1:48767_solr    ] o.a.s.h.a.CoreAdminOperation core create command qt=/admin/cores&coreNodeName=core_node19&collection.configName=conf1&newCollection=true&name=replacenodetest_coll_notarget_shard5_replica_n16&action=CREATE&numShards=5&collection=replacenodetest_coll_notarget&shard=shard5&wt=javabin&version=2&replicaType=NRT
   [junit4]   2> 2919974 INFO  (qtp1511530316-12772) [n:127.0.0.1:48767_solr    ] o.a.s.c.TransientSolrCoreCacheDefault Allocating transient cache for 2147483647 transient cores
   [junit4]   2> 2920093 INFO  (zkCallback-2095-thread-4-processing-n:127.0.0.1:50032_solr) [n:127.0.0.1:50032_solr    ] o.a.s.c.c.ZkStateReader A cluster state change: [WatchedEvent state:SyncConnected type:NodeDataChanged path:/collections/replacenodetest_coll_notarget/state.json] for collection [replacenodetest_coll_notarget] has occurred - updating... (live nodes size: [6])
   [junit4]   2> 2920093 INFO  (zkCallback-2101-thread-1-processing-n:127.0.0.1:49548_solr) [n:127.0.0.1:49548_solr    ] o.a.s.c.c.ZkStateReader A cluster state change: [WatchedEvent state:SyncConnected type:NodeDataChanged path:/collections/replacenodetest_coll_notarget/state.json] for collection [replacenodetest_coll_notarget] has occurred - updating... (live nodes size: [6])
   [junit4]   2> 2920093 INFO  (zkCallback-2084-thread-3-processing-n:127.0.0.1:34283_solr) [n:127.0.0.1:34283_solr    ] o.a.s.c.c.ZkStateReader A cluster state change: [WatchedEvent state:SyncConnected type:NodeDataChanged path:/collections/replacenodetest_coll_notarget/state.json] for collection [replacenodetest_coll_notarget] has occurred - updating... (live nodes size: [6])
   [junit4]   2> 2920093 INFO  (zkCallback-2106-thread-1-processing-n:127.0.0.1:45631_solr) [n:127.0.0.1:45631_solr    ] o.a.s.c.c.ZkStateReader A cluster state change: [WatchedEvent state:SyncConnected type:NodeDataChanged path:/collections/replacenodetest_coll_notarget/state.json] for collection [replacenodetest_coll_notarget] has occurred - updating... (live nodes size: [6])
   [junit4]   2> 2920093 INFO  (zkCallback-2088-thread-1-processing-n:127.0.0.1:52550_solr) [n:127.0.0.1:52550_solr    ] o.a.s.c.c.ZkStateReader A cluster state change: [WatchedEvent state:SyncConnected type:NodeDataChanged path:/collections/replacenodetest_coll_notarget/state.json] for collection [replacenodetest_coll_notarget] has occurred - updating... (live nodes size: [6])
   [junit4]   2> 2920093 INFO  (zkCallback-2101-thread-2-processing-n:127.0.0.1:49548_solr) [n:127.0.0.1:49548_solr    ] o.a.s.c.c.ZkStateReader A cluster state change: [WatchedEvent state:SyncConnected type:NodeDataChanged path:/collections/replacenodetest_coll_notarget/state.json] for collection [replacenodetest_coll_notarget] has occurred - updating... (live nodes size: [6])
   [junit4]   2> 2920093 INFO  (zkCallback-2088-thread-2-processing-n:127.0.0.1:52550_solr) [n:127.0.0.1:52550_solr    ] o.a.s.c.c.ZkStateReader A cluster state change: [WatchedEvent state:SyncConnected type:NodeDataChanged path:/collections/replacenodetest_coll_notarget/state.json] for collection [replacenodetest_coll_notarget] has occurred - updating... (live nodes size: [6])
   [junit4]   2> 2920093 INFO  (zkCallback-2106-thread-2-processing-n:127.0.0.1:45631_solr) [n:127.0.0.1:45631_solr    ] o.a.s.c.c.ZkStateReader A cluster state change: [WatchedEvent state:SyncConnected type:NodeDataChanged path:/collections/replacenodetest_coll_notarget/state.json] for collection [replacenodetest_coll_notarget] has occurred - updating... (live nodes size: [6])
   [junit4]   2> 2920093 INFO  (zkCallback-2084-thread-2-processing-n:127.0.0.1:34283_solr) [n:127.0.0.1:34283_solr    ] o.a.s.c.c.ZkStateReader A cluster state change: [WatchedEvent state:SyncConnected type:NodeDataChanged path:/collections/replacenodetest_coll_notarget/state.json] for collection [replacenodetest_coll_notarget] has occurred - updating... (live nodes size: [6])
   [junit4]   2> 2920093 INFO  (zkCallback-2095-thread-3-processing-n:127.0.0.1:50032_solr) [n:127.0.0.1:50032_solr    ] o.a.s.c.c.ZkStateReader A cluster state change: [WatchedEvent state:SyncConnected type:NodeDataChanged path:/collections/replacenodetest_coll_notarget/state.json] for collection [replacenodetest_coll_notarget] has occurred - updating... (live nodes size: [6])
   [junit4]   2> 2920094 INFO  (zkCallback-2092-thread-3-processing-n:127.0.0.1:48767_solr) [n:127.0.0.1:48767_solr    ] o.a.s.c.c.ZkStateReader A cluster state change: [WatchedEvent state:SyncConnected type:NodeDataChanged path:/collections/replacenodetest_coll_notarget/state.json] for collection [replacenodetest_coll_notarget] has occurred - updating... (live nodes size: [6])
   [junit4]   2> 2920095 INFO  (zkCallback-2092-thread-2-processing-n:127.0.0.1:48767_solr) [n:127.0.0.1:48767_solr    ] o.a.s.c.c.ZkStateReader A cluster state change: [WatchedEvent state:SyncConnected type:NodeDataChanged path:/collections/replacenodetest_coll_notarget/state.json] for collection [replacenodetest_coll_notarget] has occurred - updating... (live nodes size: [6])
   [junit4]   2> 2921006 INFO  (qtp103419525-12731) [n:127.0.0.1:34283_solr c:replacenodetest_coll_notarget s:shard4 r:core_node15 x:replacenodetest_coll_notarget_shard4_replica_n12] o.a.s.c.SolrConfig Using Lucene MatchVersion: 7.3.0
   [junit4]   2> 2921010 INFO  (qtp1511530316-12770) [n:127.0.0.1:48767_solr c:replacenodetest_coll_notarget s:shard5 r:core_node19 x:replacenodetest_coll_notarget_shard5_replica_n16] o.a.s.c.SolrConfig Using Lucene MatchVersion: 7.3.0
   [junit4]   2> 2921019 INFO  (qtp103419525-12731) [n:127.0.0.1:34283_solr c:replacenodetest_coll_notarget s:shard4 r:core_node15 x:replacenodetest_coll_notarget_shard4_replica_n12] o.a.s.s.IndexSchema [replacenodetest_coll_notarget_shard4_replica_n12] Schema name=cloud-dynamic
   [junit4]   2> 2921048 INFO  (qtp2097155962-12787) [n:127.0.0.1:45631_solr c:replacenodetest_coll_notarget s:shard3 r:core_node11 x:replacenodetest_coll_notarget_shard3_replica_n8] o.a.s.c.SolrConfig Using Lucene MatchVersion: 7.3.0
   [junit4]   2> 2921048 INFO  (qtp2097155962-12792) [n:127.0.0.1:45631_solr c:replacenodetest_coll_notarget s:shard4 r:core_node17 x:replacenodetest_coll_notarget_shard4_replica_n14] o.a.s.c.SolrConfig Using Lucene MatchVersion: 7.3.0
   [junit4]   2> 2921048 INFO  (qtp103419525-12731) [n:127.0.0.1:34283_solr c:replacenodetest_coll_notarget s:shard4 r:core_node15 x:replacenodetest_coll_notarget_shard4_replica_n12] o.a.s.s.IndexSchema Loaded schema cloud-dynamic/1.6 with uniqueid field id
   [junit4]   2> 2921048 INFO  (qtp103419525-12731) [n:127.0.0.1:34283_solr c:replacenodetest_coll_notarget s:shard4 r:core_node15 x:replacenodetest_coll_notarget_shard4_replica_n12] o.a.s.c.CoreContainer Creating SolrCore 'replacenodetest_coll_notarget_shard4_replica_n12' using configuration from collection replacenodetest_coll_notarget, trusted=true
   [junit4]   2> 2921049 INFO  (qtp103419525-12731) [n:127.0.0.1:34283_solr c:replacenodetest_coll_notarget s:shard4 r:core_node15 x:replacenodetest_coll_notarget_shard4_replica_n12] o.a.s.m.r.SolrJmxReporter JMX monitoring for 'solr_34283.solr.core.replacenodetest_coll_notarget.shard4.replica_n12' (registry 'solr.core.replacenodetest_coll_notarget.shard4.replica_n12') enabled at server: com.sun.jmx.mbeanserver.JmxMBeanServer@5961dce5
   [junit4]   2> 2921049 INFO  (qtp103419525-12731) [n:127.0.0.1:34283_solr c:replacenodetest_coll_notarget s:shard4 r:core_node15 x:replacenodetest_coll_notarget_shard4_replica_n12] o.a.s.c.SolrCore solr.RecoveryStrategy.Builder
   [junit4]   2> 2921049 INFO  (qtp103419525-12731) [n:127.0.0.1:34283_solr c:replacenodetest_coll_notarget s:shard4 r:core_node15 x:replacenodetest_coll_notarget_shard4_replica_n12] o.a.s.c.SolrCore [[replacenodetest_coll_notarget_shard4_replica_n12] ] Opening new SolrCore at [/export/home/jenkins/workspace/Lucene-Solr-7.x-Solaris/solr/build/solr-core/test/J0/temp/solr.cloud.ReplaceNodeNoTargetTest_2765261D870EBA06-001/tempDir-001/node1/replacenodetest_coll_notarget_shard4_replica_n12], dataDir=[/export/home/jenkins/workspace/Lucene-Solr-7.x-Solaris/solr/build/solr-core/test/J0/temp/solr.cloud.ReplaceNodeNoTargetTest_2765261D870EBA06-001/tempDir-001/node1/./replacenodetest_coll_notarget_shard4_replica_n12/data/]
   [junit4]   2> 2921063 INFO  (qtp103419525-12726) [n:127.0.0.1:34283_solr c:replacenodetest_coll_notarget s:shard3 r:core_node13 x:replacenodetest_coll_notarget_shard3_replica_n10] o.a.s.c.SolrConfig Using Lucene MatchVersion: 7.3.0
   [junit4]   2> 2921068 INFO  (qtp1933041858-12748) [n:127.0.0.1:52550_solr c:replacenodetest_coll_notarget s:shard1 r:core_node3 x:replacenodetest_coll_notarget_shard1_replica_n1] o.a.s.c.SolrConfig Using Lucene MatchVersion: 7.3.0
   [junit4]   2> 2921075 INFO  (qtp1933041858-12748) [n:127.0.0.1:52550_solr c:replacenodetest_coll_notarget s:shard1 r:core_node3 x:replacenodetest_coll_notarget_shard1_replica_n1] o.a.s.s.IndexSchema [replacenodetest_coll_notarget_shard1_replica_n1] Schema name=cloud-dynamic
   [junit4]   2> 2921076 INFO  (qtp2097155962-12792) [n:127.0.0.1:45631_solr c:replacenodetest_coll_notarget s:shard4 r:core_node17 x:replacenodetest_coll_notarget_shard4_replica_n14] o.a.s.s.IndexSchema [replacenodetest_coll_notarget_shard4_replica_n14] Schema name=cloud-dynamic
   [junit4]   2> 2921098 INFO  (qtp103419525-12726) [n:127.0.0.1:34283_solr c:replacenodetest_coll_notarget s:shard3 r:core_node13 x:replacenodetest_coll_notarget_shard3_replica_n10] o.a.s.s.IndexSchema [replacenodetest_coll_notarget_shard3_replica_n10] Schema name=cloud-dynamic
   [junit4]   2> 2921105 INFO  (qtp2097155962-12792) [n:127.0.0.1:45631_solr c:replacenodetest_coll_notarget s:shard4 r:core_node17 x:replacenodetest_coll_notarget_shard4_replica_n14] o.a.s.s.IndexSchema Loaded schema cloud-dynamic/1.6 with uniqueid field id
   [junit4]   2> 2921105 INFO  (qtp2097155962-12792) [n:127.0.0.1:45631_solr c:replacenodetest_coll_notarget s:shard4 r:core_node17 x:replacenodetest_coll_notarget_shard4_replica_n14] o.a.s.c.CoreContainer Creating SolrCore 'replacenodetest_coll_notarget_shard4_replica_n14' using configuration from collection replacenodetest_coll_notarget, trusted=true
   [junit4]   2> 2921105 INFO  (qtp2097155962-12792) [n:127.0.0.1:45631_solr c:replacenodetest_coll_notarget s:shard4 r:core_node17 x:replacenodetest_coll_notarget_shard4_replica_n14] o.a.s.m.r.SolrJmxReporter JMX monitoring for 'solr_45631.solr.core.replacenodetest_coll_notarget.shard4.replica_n14' (registry 'solr.core.replacenodetest_coll_notarget.shard4.replica_n14') enabled at server: com.sun.jmx.mbeanserver.JmxMBeanServer@5961dce5
   [junit4]   2> 2921106 INFO  (qtp2097155962-12792) [n:127.0.0.1:45631_solr c:replacenodetest_coll_notarget s:shard4 r:core_node17 x:replacenodetest_coll_notarget_shard4_replica_n14] o.a.s.c.SolrCore solr.RecoveryStrategy.Builder
   [junit4]   2> 2921106 INFO  (qtp2097155962-12792) [n:127.0.0.1:45631_solr c:replacenodetest_coll_notarget s:shard4 r:core_node17 x:replacenodetest_coll_notarget_shard4_replica_n14] o.a.s.c.SolrCore [[replacenodetest_coll_notarget_shard4_replica_n14] ] Opening new SolrCore at [/export/home/jenkins/workspace/Lucene-Solr-7.x-Solaris/solr/build/solr-core/test/J0/temp/solr.cloud.ReplaceNodeNoTargetTest_2765261D870EBA06-001/tempDir-001/node6/replacenodetest_coll_notarget_shard4_replica_n14], dataDir=[/export/home/jenkins/workspace/Lucene-Solr-7.x-Solaris/solr/build/solr-core/test/J0/temp/solr.cloud.ReplaceNodeNoTargetTest_2765261D870EBA06-001/tempDir-001/node6/./replacenodetest_coll_notarget_shard4_replica_n14/data/]
   [junit4]   2> 2921107 INFO  (qtp1933041858-12748) [n:127.0.0.1:52550_solr c:replacenodetest_coll_notarget s:shard1 r:core_node3 x:replacenodetest_coll_notarget_shard1_replica_n1] o.a.s.s.IndexSchema Loaded schema cloud-dynamic/1.6 with uniqueid field id
   [junit4]   2> 2921107 INFO  (qtp1933041858-12748) [n:127.0.0.1:52550_solr c:replacenodetest_coll_notarget s:shard1 r:core_node3 x:replacenodetest_coll_notarget_shard1_replica_n1] o.a.s.c.CoreContainer Creating SolrCore 'replacenodetest_coll_notarget_shard1_replica_n1' using configuration from collection replacenodetest_coll_notarget, trusted=true
   [junit4]   2> 2921107 INFO  (qtp1933041858-12748) [n:127.0.0.1:52550_solr c:replacenodetest_coll_notarget s:shard1 r:core_node3 x:replacenodetest_coll_notarget_shard1_replica_n1] o.a.s.m.r.SolrJmxReporter JMX monitoring for 'solr_52550.solr.core.replacenodetest_coll_notarget.shard1.replica_n1' (registry 'solr.core.replacenodetest_coll_notarget.shard1.replica_n1') enabled at server: com.sun.jmx.mbeanserver.JmxMBeanServer@5961dce5
   [junit4]   2> 2921107 INFO  (qtp1933041858-12748) [n:127.0.0.1:52550_solr c:replacenodetest_coll_notarget s:shard1 r:core_node3 x:replacenodetest_coll_notarget_shard1_replica_n1] o.a.s.c.SolrCore solr.RecoveryStrategy.Builder
   [junit4]   2> 2921107 INFO  (qtp1933041858-12748) [n:127.0.0.1:52550_solr c:replacenodetest_coll_notarget s:shard1 r:core_node3 x:replacenodetest_coll_notarget_shard1_replica_n1] o.a.s.c.SolrCore [[replacenodetest_coll_notarget_shard1_replica_n1] ] Opening new SolrCore at [/export/home/jenkins/workspace/Lucene-Solr-7.x-Solaris/solr/build/solr-core/test/J0/temp/solr.cloud.ReplaceNodeNoTargetTest_2765261D870EBA06-001/tempDir-001/node5/replacenodetest_coll_notarget_shard1_replica_n1], dataDir=[/export/home/jenkins/workspace/Lucene-Solr-7.x-Solaris/solr/build/solr-core/test/J0/temp/solr.cloud.ReplaceNodeNoTargetTest_2765261D870EBA06-001/tempDir-001/node5/./replacenodetest_coll_notarget_shard1_replica_n1/data/]
   [junit4]   2> 2921123 INFO  (qtp103419525-12726) [n:127.0.0.1:34283_solr c:replacenodetest_coll_notarget s:shard3 r:core_node13 x:replacenodetest_coll_notarget_shard3_replica_n10] o.a.s.s.IndexSchema Loaded schema cloud-dynamic/1.6 with uniqueid field id
   [junit4]   2> 2921123 INFO  (qtp103419525-12726) [n:127.0.0.1:34283_solr c:replacenodetest_coll_notarget s:shard3 r:core_node13 x:replacenodetest_coll_notarget_shard3_replica_n10] o.a.s.c.CoreContainer Creating SolrCore 'replacenodetest_coll_notarget_shard3_replica_n10' using configuration from collection replacenodetest_coll_notarget, trusted=true
   [junit4]   2> 2921124 INFO  (qtp1511530316-12770) [n:127.0.0.1:48767_solr c:replacenodetest_coll_notarget s:shard5 r:core_node19 x:replacenodetest_coll_notarget_shard5_replica_n16] o.a.s.s.IndexSchema [replacenodetest_coll_notarget_shard5_replica_n16] Schema name=cloud-dynamic
   [junit4]   2> 2921124 INFO  (qtp103419525-12726) [n:127.0.0.1:34283_solr c:replacenodetest_coll_notarget s:shard3 r:core_node13 x:replacenodetest_coll_notarget_shard3_replica_n10] o.a.s.m.r.SolrJmxReporter JMX monitoring for 'solr_34283.solr.core.replacenodetest_coll_notarget.shard3.replica_n10' (registry 'solr.core.replacenodetest_coll_notarget.shard3.replica_n10') enabled at server: com.sun.jmx.mbeanserver.JmxMBeanServer@5961dce5
   [junit4]   2> 2921124 INFO  (qtp103419525-12726) [n:127.0.0.1:34283_solr c:replacenodetest_coll_notarget s:shard3 r:core_node13 x:replacenodetest_coll_notarget_shard3_replica_n10] o.a.s.c.SolrCore solr.RecoveryStrategy.Builder
   [junit4]   2> 2921124 INFO  (qtp103419525-12726) [n:127.0.0.1:34283_solr c:replacenodetest_coll_notarget s:shard3 r:core_node13 x:replacenodetest_coll_notarget_shard3_replica_n10] o.a.s.c.SolrCore [[replacenodetest_coll_notarget_shard3_replica_n10] ] Opening new SolrCore at [/export/home/jenkins/workspace/Lucene-Solr-7.x-Solaris/solr/build/solr-core/test/J0/temp/solr.cloud.ReplaceNodeNoTargetTest_2765261D870EBA06-001/tempDir-001/node1/replacenodetest_coll_notarget_shard3_replica_n10], dataDir=[/export/home/jenkins/workspace/Lucene-Solr-7.x-Solaris/solr/build/solr-core/test/J0/temp/solr.cloud.ReplaceNodeNoTargetTest_2765261D870EBA06-001/tempDir-001/node1/./replacenodetest_coll_notarget_shard3_replica_n10/data/]
   [junit4]   2> 2921127 INFO  (qtp1134285751-12737) [n:127.0.0.1:49548_solr c:replacenodetest_coll_notarget s:shard2 r:core_node6 x:replacenodetest_coll_notarget_shard2_replica_n4] o.a.s.c.SolrConfig Using Lucene MatchVersion: 7.3.0
   [junit4]   2> 2921155 INFO  (qtp1511530316-12770) [n:127.0.0.1:48767_solr c:replacenodetest_coll_notarget s:shard5 r:core_node19 x:replacenodetest_coll_notarget_shard5_replica_n16] o.a.s.s.IndexSchema Loaded schema cloud-dynamic/1.6 with uniqueid field id
   [junit4]   2> 2921155 INFO  (qtp1511530316-12770) [n:127.0.0.1:48767_solr c:replacenodetest_coll_notarget s:shard5 r:core_node19 x:replacenodetest_coll_notarget_shard5_replica_n16] o.a.s.c.CoreContainer Creating SolrCore 'replacenodetest_coll_notarget_shard5_replica_n16' using configuration from collection replacenodetest_coll_notarget, trusted=true
   [junit4]   2> 2921155 INFO  (qtp1511530316-12770) [n:127.0.0.1:48767_solr c:replacenodetest_coll_notarget s:shard5 r:core_node19 x:replacenodetest_coll_notarget_shard5_replica_n16] o.a.s.m.r.SolrJmxReporter JMX monitoring for 'solr_48767.solr.core.replacenodetest_coll_notarget.shard5.replica_n16' (registry 'solr.core.replacenodetest_coll_notarget.shard5.replica_n16') enabled at server: com.sun.jmx.mbeanserver.JmxMBeanServer@5961dce5
   [junit4]   2> 2921156 INFO  (qtp1511530316-12770) [n:127.0.0.1:48767_solr c:replacenodetest_coll_notarget s:shard5 r:core_node19 x:replacenodetest_coll_notarget_shard5_replica_n16] o.a.s.c.SolrCore solr.RecoveryStrategy.Builder
   [junit4]   2> 2921156 INFO  (qtp1511530316-12770) [n:127.0.0.1:48767_solr c:replacenodetest_coll_notarget s:shard5 r:core_node19 x:replacenodetest_coll_notarget_shard5_replica_n16] o.a.s.c.SolrCore [[replacenodetest_coll_notarget_shard5_replica_n16] ] Opening new SolrCore at [/export/home/jenkins/workspace/Lucene-Solr-7.x-Solaris/solr/build/solr-core/test/J0/temp/solr.cloud.ReplaceNodeNoTargetTest_2765261D870EBA06-001/tempDir-001/node4/replacenodetest_coll_notarget_shard5_replica_n16], dataDir=[/export/home/jenkins/workspace/Lucene-Solr-7.x-Solaris/solr/build/solr-core/test/J0/temp/solr.cloud.ReplaceNodeNoTargetTest_2765261D870EBA06-001/tempDir-001/node4/./replacenodetest_coll_notarget_shard5_replica_n16/data/]
   [junit4]   2> 2921157 INFO  (qtp2097155962-12787) [n:127.0.0.1:45631_solr c:replacenodetest_coll_notarget s:shard3 r:core_node11 x:replacenodetest_coll_notarget_shard3_replica_n8] o.a.s.s.IndexSchema [replacenodetest_coll_notarget_shard3_replica_n8] Schema name=cloud-dynamic
   [junit4]   2> 2921174 INFO  (qtp2083173310-12757) [n:127.0.0.1:50032_solr c:replacenodetest_coll_notarget s:shard1 r:core_node5 x:replacenodetest_coll_notarget_shard1_replica_n2] o.a.s.c.SolrConfig Using Lucene MatchVersion: 7.3.0
   [junit4]   2> 2921175 INFO  (qtp1134285751-12739) [n:127.0.0.1:49548_solr c:replacenodetest_coll_notarget s:shard5 r:core_node20 x:replacenodetest_coll_notarget_shard5_replica_n18] o.a.s.c.SolrConfig Using Lucene MatchVersion: 7.3.0
   [junit4]   2> 2921196 INFO  (qtp1511530316-12772) [n:127.0.0.1:48767_solr c:replacenodetest_coll_notarget s:shard2 r:core_node9 x:replacenodetest_coll_notarget_shard2_replica_n7] o.a.s.c.SolrConfig Using Lucene MatchVersion: 7.3.0
   [junit4]   2> 2921202 INFO  (qtp2083173310-12757) [n:127.0.0.1:50032_solr c:replacenodetest_coll_notarget s:shard1 r:core_node5 x:replacenodetest_coll_notarget_shard1_replica_n2] o.a.s.s.IndexSchema [replacenodetest_coll_notarget_shard1_replica_n2] Schema name=cloud-dynamic
   [junit4]   2> 2921203 INFO  (qtp1511530316-12772) [n:127.0.0.1:48767_solr c:replacenodetest_coll_notarget s:shard2 r:core_node9 x:replacenodetest_coll_notarget_shard2_replica_n7] o.a.s.s.IndexSchema [replacenodetest_coll_notarget_shard2_replica_n7] Schema name=cloud-dynamic
   [junit4]   2> 2921231 INFO  (qtp2097155962-12787) [n:127.0.0.1:45631_solr c:replacenodetest_coll_notarget s:shard3 r:core_node11 x:replacenodetest_coll_notarget_shard3_replica_n8] o.a.s.s.IndexSchema Loaded schema cloud-dynamic/1.6 with uniqueid field id
   [junit4]   2> 2921231 INFO  (qtp2097155962-12787) [n:127.0.0.1:45631_solr c:replacenodetest_coll_notarget s:shard3 r:core_node11 x:replacenodetest_coll_notarget_shard3_replica_n8] o.a.s.c.CoreContainer Creating SolrCore 'replacenodetest_coll_notarget_shard3_replica_n8' using configuration from collection replacenodetest_coll_notarget, trusted=true
   [junit4]   2> 2921231 INFO  (qtp1134285751-12739) [n:127.0.0.1:49548_solr c:replacenodetest_coll_notarget s:shard5 r:core_node20 x:replacenodetest_coll_notarget_shard5_replica_n18] o.a.s.s.IndexSchema [replacenodetest_coll_notarget_shard5_replica_n18] Schema name=cloud-dynamic
   [junit4]   2> 2921231 INFO  (qtp2097155962-12787) [n:127.0.0.1:45631_solr c:replacenodetest_coll_notarget s:shard3 r:core_node11 x:replacenodetest_coll_notarget_shard3_replica_n8] o.a.s.m.r.SolrJmxReporter JMX monitoring for 'solr_45631.solr.core.replacenodetest_coll_notarget.shard3.replica_n8' (registry 'solr.core.replacenodetest_coll_notarget.shard3.replica_n8') enabled at server: com.sun.jmx.mbeanserver.JmxMBeanServer@5961dce5
   [junit4]   2> 2921231 INFO  (qtp2097155962-12787) [n:127.0.0.1:45631_solr c:replacenodetest_coll_notarget s:shard3 r:core_node11 x:replacenodetest_coll_notarget_shard3_replica_n8] o.a.s.c.SolrCore solr.RecoveryStrategy.Builder
   [junit4]   2> 2921231 INFO  (qtp2097155962-12787) [n:127.0.0.1:45631_solr c:replacenodetest_coll_notarget s:shard3 r:core_node11 x:replacenodetest_coll_notarget_shard3_replica_n8] o.a.s.c.SolrCore [[replacenodetest_coll_notarget_shard3_replica_n8] ] Opening new SolrCore at [/export/home/jenkins/workspace/Lucene-Solr-7.x-Solaris/solr/build/solr-core/test/J0/temp/solr.cloud.ReplaceNodeNoTargetTest_2765261D870EBA06-001/tempDir-001/node6/replacenodetest_coll_notarget_shard3_replica_n8], dataDir=[/export/home/jenkins/workspace/Lucene-Solr-7.x-Solaris/solr/build/solr-core/test/J0/temp/solr.cloud.ReplaceNodeNoTargetTest_2765261D870EBA06-001/tempDir-001/node6/./replacenodetest_coll_notarget_shard3_replica_n8/data/]
   [junit4]   2> 2921232 INFO  (qtp1134285751-12737) [n:127.0.0.1:49548_solr c:replacenodetest_coll_notarget s:shard2 r:core_node6 x:replacenodetest_coll_notarget_shard2_replica_n4] o.a.s.s.IndexSchema [replacenodetest_coll_notarget_shard2_replica_n4] Schema name=cloud-dynamic
   [junit4]   2> 2921235 INFO  (qtp1511530316-12772) [n:127.0.0.1:48767_solr c:replacenodetest_coll_notarget s:shard2 r:core_node9 x:replacenodetest_coll_notarget_shard2_replica_n7] o.a.s.s.IndexSchema Loaded schema cloud-dynamic/1.6 with uniqueid field id
   [junit4]   2> 2921235 INFO  (qtp1511530316-12772) [n:127.0.0.1:48767_solr c:replacenodetest_coll_notarget s:shard2 r:core_node9 x:replacenodetest_coll_notarget_shard2_replica_n7] o.a.s.c.CoreContainer Creating SolrCore 'replacenodetest_coll_notarget_shard2_replica_n7' using configuration from collection replacenodetest_coll_notarget, trusted=true
   [junit4]   2> 2921235 INFO  (qtp1511530316-12772) [n:127.0.0.1:48767_solr c:replacenodetest_coll_notarget s:shard2 r:core_node9 x:replacenodetest_coll_notarget_shard2_replica_n7] o.a.s.m.r.SolrJmxReporter JMX monitoring for 'solr_48767.solr.core.replacenodetest_coll_notarget.shard2.replica_n7' (registry 'solr.core.replacenodetest_coll_notarget.shard2.replica_n7') enabled at server: com.sun.jmx.mbeanserver.JmxMBeanServer@5961dce5
   [junit4]   2> 2921235 INFO  (qtp1511530316-12772) [n:127.0.0.1:48767_solr c:replacenodetest_coll_notarget s:shard2 r:core_node9 x:replacenodetest_coll_notarget_shard2_replica_n7] o.a.s.c.SolrCore solr.RecoveryStrategy.Builder
   [junit4]   2> 2921235 INFO  (qtp1511530316-12772) [n:127.0.0.1:48767_solr c:replacenodetest_coll_notarget s:shard2 r:core_node9 x:replacenodetest_coll_notarget_shard2_replica_n7] o.a.s.c.SolrCore [[replacenodetest_coll_notarget_shard2_replica_n7] ] Opening new SolrCore at [/export/home/jenkins/workspace/Lucene-Solr-7.x-Solaris/solr/build/solr-core/test/J0/temp/solr.cloud.ReplaceNodeNoTargetTest_2765261D870EBA06-001/tempDir-001/node4/replacenodetest_coll_notarget_shard2_replica_n7], dataDir=[/export/home/jenkins/workspace/Lucene-Solr-7.x-Solaris/solr/build/solr-core/test/J0/temp/solr.cloud.ReplaceNodeNoTargetTest_2765261D870EBA06-001/tempDir-001/node4/./replacenodetest_coll_notarget_shard2_replica_n7/data/]
   [junit4]   2> 2921258 INFO  (qtp2083173310-12757) [n:127.0.0.1:50032_solr c:replacenodetest_coll_notarget s:shard1 r:core_node5 x:replacenodetest_coll_notarget_shard1_replica_n2] o.a.s.s.IndexSchema Loaded schema cloud-dynamic/1.6 with uniqueid field id
   [junit4]   2> 2921258 INFO  (qtp2083173310-12757) [n:127.0.0.1:50032_solr c:replacenodetest_coll_notarget s:shard1 r:core_node5 x:replacenodetest_coll_notarget_shard1_replica_n2] o.a.s.c.CoreContainer Creating SolrCore 'replacenodetest_coll_notarget_shard1_replica_n2' using configuration from collection replacenodetest_coll_notarget, trusted=true
   [junit4]   2> 2921259 INFO  (qtp1134285751-12739) [n:127.0.0.1:49548_solr c:replacenodetest_coll_notarget s:shard5 r:core_node20 x:replacenodetest_coll_notarget_shard5_replica_n18] o.a.s.s.IndexSchema Loaded schema cloud-dynamic/1.6 with uniqueid field id
   [junit4]   2> 2921259 INFO  (qtp1134285751-12739) [n:127.0.0.1:49548_solr c:replacenodetest_coll_notarget s:shard5 r:core_node20 x:replacenodetest_coll_notarget_shard5_replica_n18] o.a.s.c.CoreContainer Creating SolrCore 'replacenodetest_coll_notarget_shard5_replica_n18' using configuration from collection replacenodetest_coll_notarget, trusted=true
   [junit4]   2> 2921260 INFO  (qtp1134285751-12739) [n:127.0.0.1:49548_solr c:replacenodetest_coll_notarget s:shard5 r:core_node20 x:replacenodetest_coll_notarget_shard5_replica_n18] o.a.s.m.r.SolrJmxReporter JMX monitoring for 'solr_49548.solr.core.replacenodetest_coll_notarget.shard5.replica_n18' (registry 'solr.core.replacenodetest_coll_notarget.shard5.replica_n18') enabled at server: com.sun.jmx.mbeanserver.JmxMBeanServer@5961dce5
   [junit4]   2> 2921260 INFO  (qtp1134285751-12739) [n:127.0.0.1:49548_solr c:replacenodetest_coll_notarget s:shard5 r:core_node20 x:replacenodetest_coll_notarget_shard5_replica_n18] o.a.s.c.SolrCore solr.RecoveryStrategy.Builder
   [junit4]   2> 2921260 INFO  (qtp1134285751-12739) [n:127.0.0.1:49548_solr c:replacenodetest_coll_notarget s:shard5 r:core_node20 x:replacenodetest_coll_notarget_shard5_replica_n18] o.a.s.c.SolrCore [[replacenodetest_coll_notarget_shard5_replica_n18] ] Opening new SolrCore at [/export/home/jenkins/workspace/Lucene-Solr-7.x-Solaris/solr/build/solr-core/test/J0/temp/solr.cloud.ReplaceNodeNoTargetTest_2765261D870EBA06-001/tempDir-001/node2/replacenodetest_coll_notarget_shard5_replica_n18], dataDir=[/export/home/jenkins/workspace/Lucene-Solr-7.x-Solaris/solr/build/solr-core/test/J0/temp/solr.cloud.ReplaceNodeNoTargetTest_2765261D870EBA06-001/tempDir-001/node2/./replacenodetest_coll_notarget_shard5_replica_n18/data/]
   [junit4]   2> 2921260 INFO  (qtp1134285751-12737) [n:127.0.0.1:49548_solr c:replacenodetest_coll_notarget s:shard2 r:core_node6 x:replacenodetest_coll_notarget_shard2_replica_n4] o.a.s.s.IndexSchema Loaded schema cloud-dynamic/1.6 with uniqueid field id
   [junit4]   2> 2921260 INFO  (qtp1134285751-12737) [n:127.0.0.1:49548_solr c:replacenodetest_coll_notarget s:shard2 r:core_node6 x:replacenodetest_coll_notarget_shard2_replica_n4] o.a.s.c.CoreContainer Creating SolrCore 'replacenodetest_coll_notarget_shard2_replica_n4' using configuration from collection replacenodetest_coll_notarget, trusted=true
   [junit4]   2> 2921261 INFO  (qtp1134285751-12737) [n:127.0.0.1:49548_solr c:replacenodetest_coll_notarget s:shard2 r:co

[...truncated too long message...]

sPlanActionTest, MoveReplicaTest, TestClusterProperties, BlockCacheTest, TestFastWriter, BooleanFieldTest, TestRequestForwarding, PreAnalyzedFieldTest, ShardRoutingTest, TestSerializedLuceneMatchVersion, SimplePostToolTest, DistributedQueryComponentOptimizationTest, ZkSolrClientTest, ConcurrentCreateRoutedAliasTest, TestSchemaManager, SpellCheckComponentTest, DocExpirationUpdateProcessorFactoryTest, PeerSyncTest, DOMUtilTest, SolrShardReporterTest, HdfsCollectionsAPIDistributedZkTest, TestMacroExpander, TestRequestStatusCollectionAPI, TestManagedResourceStorage, TestCollationFieldDocValues, TestStressLucene, LIRRollingUpdatesTest, SuggestComponentTest, DistributedFacetPivotLargeTest, TestWordDelimiterFilterFactory, TestSha256AuthenticationProvider, TestTestInjection, MinimalSchemaTest, BasicAuthIntegrationTest, PeerSyncWithIndexFingerprintCachingTest, TestPKIAuthenticationPlugin, DebugComponentTest, TestSegmentSorting, TestLuceneIndexBackCompat, AliasIntegrationTest, CdcrVersionReplicationTest, DisMaxRequestHandlerTest, BasicFunctionalityTest, TestCryptoKeys, DistributedFacetPivotSmallAdvancedTest, PrimUtilsTest, UpdateRequestProcessorFactoryTest, TestAnalyzedSuggestions, ClusterStateTest, BlockJoinFacetRandomTest, TestSort, HdfsWriteToMultipleCollectionsTest, TestXmlQParser, DocValuesNotIndexedTest, ChaosMonkeySafeLeaderTest, UnloadDistributedZkTest, SyncSliceTest, OpenCloseCoreStressTest, OverseerTest, ClusterStateUpdateTest, TestZkChroot, TestRandomDVFaceting, ZkCLITest, TestDistributedGrouping, TermVectorComponentDistributedTest, ZkControllerTest, TestRealTimeGet, TestStressReorder, TestJoin, TestReload, DistributedTermsComponentTest, TestRangeQuery, SimpleFacetsTest, TestSolr4Spatial, StatsComponentTest, QueryElevationComponentTest, TestFiltering, TestFunctionQuery, DirectUpdateHandlerTest, TestBadConfig, HighlighterTest, SoftAutoCommitTest, ShowFileRequestHandlerTest, DistributedQueryElevationComponentTest, SolrIndexSplitterTest, SignatureUpdateProcessorFactoryTest, TestExtendedDismaxParser, SuggesterFSTTest, SolrRequestParserTest, TestFoldingMultitermQuery, SuggesterTSTTest, TestTrie, SuggesterWFSTTest, WordBreakSolrSpellCheckerTest, FieldMutatingUpdateProcessorTest, TestAtomicUpdateErrorCases, QueryEqualityTest, DefaultValueUpdateProcessorTest, TestRemoteStreaming, DocValuesMultiTest, DistanceFunctionTest, TestSolrDeletionPolicy1, SolrInfoBeanTest, XsltUpdateRequestHandlerTest, CacheHeaderTest, IndexBasedSpellCheckerTest, LukeRequestHandlerTest, TestWriterPerf, TestReversedWildcardFilterFactory, DocumentAnalysisRequestHandlerTest, TestQueryTypes, PrimitiveFieldTypeTest, TestOmitPositions, FileBasedSpellCheckerTest, XmlUpdateRequestHandlerTest, TestValueSourceCache, PathHierarchyTokenizerFactoryTest, TermVectorComponentTest, MoreLikeThisHandlerTest, FieldAnalysisRequestHandlerTest, TestSolrQueryParser, FastVectorHighlighterTest, IndexSchemaRuntimeFieldTest, LoggingHandlerTest, RegexBoostProcessorTest, IndexSchemaTest, MBeansHandlerTest, QueryParsingTest, UniqFieldsUpdateProcessorFactoryTest, JsonLoaderTest, BinaryUpdateRequestHandlerTest, TestPartialUpdateDeduplication, CSVRequestHandlerTest, TestComponentsName, AlternateDirectoryTest, TestSolrIndexConfig, TestQuerySenderNoQuery, CopyFieldTest, ResponseLogComponentTest, TestStressRecovery, TestMergePolicyConfig, TestSolrDeletionPolicy2, MultiTermTest, SampleTest, TestBinaryField, TestSearchPerf, NumericFieldsTest, TestElisionMultitermQuery, OutputWriterTest, TestFuzzyAnalyzedSuggestions, NotRequiredUniqueKeyTest, TestCharFilters, SynonymTokenizerTest, EchoParamsTest, TestSweetSpotSimilarityFactory, TestDFRSimilarityFactory, TestPerFieldSimilarity, TestBM25SimilarityFactory, TimeZoneUtilsTest, ResourceLoaderTest, URLClassifyProcessorTest, TestFastLRUCache, TestSuggestSpellingConverter, DateFieldTest, TestLRUCache, SliceStateTest, SystemInfoHandlerTest, TestRTGBase, DistributedIntervalFacetingTest, SolrTestCaseJ4Test, TestCursorMarkWithoutUniqueKey, TestHighlightDedupGrouping, TestSimpleTrackingShardHandler, TestTolerantSearch, TestJettySolrRunner, ActionThrottleTest, AddReplicaTest, AsyncCallRequestStatusResponseTest, ChaosMonkeyNothingIsSafeWithPullReplicasTest, CleanupOldIndexTest, CollectionStateFormat2Test, CollectionsAPISolrJTest, ConfigSetsAPITest, ConnectionManagerTest, CreateCollectionCleanupTest, DeleteInactiveReplicaTest, DeleteNodeTest, DeleteReplicaTest, DeleteShardTest, DeleteStatusTest, DistribDocExpirationUpdateProcessorTest, DistributedQueueTest, DistributedVersionInfoTest, HttpPartitionOnCommitTest, HttpPartitionTest, LeaderFailoverAfterPartitionTest, LeaderFailureAfterFreshStartTest, LegacyCloudClusterPropTest, MigrateRouteKeyTest, MissingSegmentRecoveryTest, MoveReplicaHDFSFailoverTest, MoveReplicaHDFSTest, NodeMutatorTest, OverseerRolesTest, OverseerTaskQueueTest, PeerSyncReplicationTest, RecoveryAfterSoftCommitTest, RemoteQueryErrorTest, ReplicationFactorTest, RestartWhileUpdatingTest, RollingRestartTest, SSLMigrationTest, SolrCLIZkUtilsTest, SolrCloudExampleTest, TestCloudDeleteByQuery, TestCloudInspectUtil, TestCloudPivotFacet, TestCloudPseudoReturnFields, TestCloudSearcherWarming, TestConfigSetsAPI, TestConfigSetsAPIExclusivity, TestDownShardTolerantSearch, TestLeaderElectionWithEmptyReplica, TestRandomRequestDistribution, TestSizeLimitedDistributedMap, TestSolrCloudWithKerberosAlt, TestSolrCloudWithSecureImpersonation]
   [junit4]   2> NOTE: reproduce with: ant test  -Dtestcase=TestSolrCloudWithSecureImpersonation -Dtests.seed=2765261D870EBA06 -Dtests.slow=true -Dtests.locale=pl -Dtests.timezone=AST -Dtests.asserts=true -Dtests.file.encoding=UTF-8
   [junit4] ERROR   0.00s J1 | TestSolrCloudWithSecureImpersonation (suite) <<<
   [junit4]    > Throwable #1: com.carrotsearch.randomizedtesting.ThreadLeakError: 3 threads leaked from SUITE scope at org.apache.solr.cloud.TestSolrCloudWithSecureImpersonation: 
   [junit4]    >    1) Thread[id=37666, name=jetty-launcher-7298-thread-2-SendThread(127.0.0.1:36314), state=TIMED_WAITING, group=TGRP-TestSolrCloudWithSecureImpersonation]
   [junit4]    >         at java.lang.Thread.sleep(Native Method)
   [junit4]    >         at org.apache.zookeeper.client.StaticHostProvider.next(StaticHostProvider.java:105)
   [junit4]    >         at org.apache.zookeeper.ClientCnxn$SendThread.startConnect(ClientCnxn.java:1000)
   [junit4]    >         at org.apache.zookeeper.ClientCnxn$SendThread.run(ClientCnxn.java:1063)
   [junit4]    >    2) Thread[id=37596, name=jetty-launcher-7298-thread-1-EventThread, state=TIMED_WAITING, group=TGRP-TestSolrCloudWithSecureImpersonation]
   [junit4]    >         at sun.misc.Unsafe.park(Native Method)
   [junit4]    >         at java.util.concurrent.locks.LockSupport.parkNanos(LockSupport.java:215)
   [junit4]    >         at java.util.concurrent.locks.AbstractQueuedSynchronizer.doAcquireSharedNanos(AbstractQueuedSynchronizer.java:1037)
   [junit4]    >         at java.util.concurrent.locks.AbstractQueuedSynchronizer.tryAcquireSharedNanos(AbstractQueuedSynchronizer.java:1328)
   [junit4]    >         at java.util.concurrent.CountDownLatch.await(CountDownLatch.java:277)
   [junit4]    >         at org.apache.curator.CuratorZookeeperClient.internalBlockUntilConnectedOrTimedOut(CuratorZookeeperClient.java:323)
   [junit4]    >         at org.apache.curator.RetryLoop.callWithRetry(RetryLoop.java:105)
   [junit4]    >         at org.apache.curator.framework.imps.GetDataBuilderImpl.pathInForeground(GetDataBuilderImpl.java:288)
   [junit4]    >         at org.apache.curator.framework.imps.GetDataBuilderImpl.forPath(GetDataBuilderImpl.java:279)
   [junit4]    >         at org.apache.curator.framework.imps.GetDataBuilderImpl.forPath(GetDataBuilderImpl.java:41)
   [junit4]    >         at org.apache.curator.framework.recipes.shared.SharedValue.readValue(SharedValue.java:244)
   [junit4]    >         at org.apache.curator.framework.recipes.shared.SharedValue.access$100(SharedValue.java:44)
   [junit4]    >         at org.apache.curator.framework.recipes.shared.SharedValue$1.process(SharedValue.java:61)
   [junit4]    >         at org.apache.curator.framework.imps.NamespaceWatcher.process(NamespaceWatcher.java:67)
   [junit4]    >         at org.apache.zookeeper.ClientCnxn$EventThread.processEvent(ClientCnxn.java:531)
   [junit4]    >         at org.apache.zookeeper.ClientCnxn$EventThread.run(ClientCnxn.java:506)
   [junit4]    >    3) Thread[id=37667, name=jetty-launcher-7298-thread-2-EventThread, state=WAITING, group=TGRP-TestSolrCloudWithSecureImpersonation]
   [junit4]    >         at sun.misc.Unsafe.park(Native Method)
   [junit4]    >         at java.util.concurrent.locks.LockSupport.park(LockSupport.java:175)
   [junit4]    >         at java.util.concurrent.locks.AbstractQueuedSynchronizer$ConditionObject.await(AbstractQueuedSynchronizer.java:2039)
   [junit4]    >         at java.util.concurrent.LinkedBlockingQueue.take(LinkedBlockingQueue.java:442)
   [junit4]    >         at org.apache.zookeeper.ClientCnxn$EventThread.run(ClientCnxn.java:502)
   [junit4]    > 	at __randomizedtesting.SeedInfo.seed([2765261D870EBA06]:0)Throwable #2: com.carrotsearch.randomizedtesting.ThreadLeakError: There are still zombie threads that couldn't be terminated:
   [junit4]    >    1) Thread[id=37666, name=jetty-launcher-7298-thread-2-SendThread(127.0.0.1:36314), state=TIMED_WAITING, group=TGRP-TestSolrCloudWithSecureImpersonation]
   [junit4]    >         at java.lang.Thread.sleep(Native Method)
   [junit4]    >         at org.apache.zookeeper.client.StaticHostProvider.next(StaticHostProvider.java:105)
   [junit4]    >         at org.apache.zookeeper.ClientCnxn$SendThread.startConnect(ClientCnxn.java:1000)
   [junit4]    >         at org.apache.zookeeper.ClientCnxn$SendThread.run(ClientCnxn.java:1063)
   [junit4]    > 	at __randomizedtesting.SeedInfo.seed([2765261D870EBA06]:0)
   [junit4] Completed [574/777 (3!)] on J1 in 63.80s, 12 tests, 2 errors <<< FAILURES!

[...truncated 50876 lines...]

Mime
View raw message